##TITLE=1H_SL17-SPh(old)
 CDCl3, 8 sc, 
 3.3.2020
##JCAMPDX= 6.0         $$ Bruker NMR JCAMP-DX V2.0
##DATA TYPE= NMR FID
##DATA CLASS= NTUPLES
##ORIGIN= UXNMR, Bruker Analytische Messtechnik GmbH
##OWNER= root
$$ XWIN-NMR		Version 3.5
$$ Tue Mar  3 14:24:16 2020 Russian Standard Time (UT+4h)  she@DPX200
##.OBSERVE FREQUENCY= 200.1315
##.OBSERVE NUCLEUS= ^1H
##.DELAY= (6, 6)
##.ACQUISITION MODE= SIMULTANEOUS
##.ACQUISITION SCHEME= undefined
##.AVERAGES= 8
##.DIGITISER RES= 18
##SPECTROMETER/DATA SYSTEM= spect
##.PULSE SEQUENCE= zg30
##.SOLVENT NAME= CDCl3
##.SHIFT REFERENCE= (INTERNAL, CDCl3, 0, 15.7039)
##AUDIT TRAIL= $$ (NUMBER, WHEN, WHO, WHERE, WHAT)
$$ ##TITLE= Audit trail, XWIN-NMR		Version 3.5
$$ ##JCAMPDX= 5.01
$$ ##ORIGIN= Bruker BioSpin GmbH
$$ ##OWNER= she
$$ F:/spectra/data/she/nmr/H-F/1/audita.txt
$$ ##AUDIT TRAIL=  $$ (NUMBER, WHEN, WHO, WHERE, WHAT)
(   1,<2020-03-03 14:23:06.40 +0400>,<she>,<DPX200>,
      <created by zg, POWCHK disabled, PULCHK disabled
       configuration hash MD5:
       00 E9 B6 7A A2 85 ED C7 34 08 36 98 17 FE 4E 26
       data hash MD5: 16K
       BA 71 89 36 64 69 79 18 15 7A 7E 7C FB 1C 62 B7>)
$$ ##END=
$$ 
$$ hash MD5
$$ F8 0E D5 83 DB F6 3F A2 75 DA E7 FC 2A 19 57 E6
##$RELAX= 
##$RELAX= 
##$RELAX= 
##$RELAX= 
##$RELAX= 
##$RELAX= 
$$ Bruker specific parameters
$$ --------------------------
##$DU= <F:/spectra>
##$EXPNO= 1
##$NAME= <H-F>
##$PROCNO= 1
##$TYPE= <nmr>
##$USER= <she>
##$AMP= (0..31)
100 100 100 100 100 100 100 100 100 100 100 100 100 100 100 100 100 100 
100 100 100 100 100 100 100 100 100 100 100 100 100 100 
##$AQSEQ= 0
##$AQ_mod= 1
##$AUNM= <au_zg>
##$AUTOPOS= <>
##$BF1= 200.13
##$BF2= 200.13
##$BF3= 200.13
##$BF4= 200.13
##$BF5= 200.13
##$BF6= 200.13
##$BF7= 200.13
##$BF8= 200.13
##$BYTORDA= 1
##$CFDGTYP= 0
##$CFRGTYP= 5
##$CHEMSTR= <none>
##$CNST= (0..31)
1 1 145 1 1 1 1 1 1 1 1 1 1 1 1 1 1 1 1 1 1 1 1 1 1 1 1 1 1 1 1 1 
##$CPDPRG= <>
##$CPDPRG1= <>
##$CPDPRG2= <>
##$CPDPRG3= <>
##$CPDPRG4= <mlev>
##$CPDPRG5= <mlev>
##$CPDPRG6= <mlev>
##$CPDPRG7= <mlev>
##$CPDPRG8= <mlev>
##$CPDPRGB= <>
##$CPDPRGT= <>
##$D= (0..31)
0 1.2 0 0 0 0 0 0 0 0.06 0 0.03 0 0 0 0 0.0002 0 0 0 0 0 0 0 0 0 0 0 0 
0 0 0 
##$DATE= 1583230985
##$DBL= (0..7)
120 120 120 120 120 120 120 120 
##$DBP= (0..7)
150 150 150 150 150 150 150 150 
##$DBP07= 0
##$DBPNAM0= <>
##$DBPNAM1= <>
##$DBPNAM2= <>
##$DBPNAM3= <>
##$DBPNAM4= <>
##$DBPNAM5= <>
##$DBPNAM6= <>
##$DBPNAM7= <>
##$DBPOAL= (0..7)
0.5 0.5 0.5 0.5 0.5 0.5 0.5 0.5 
##$DBPOFFS= (0..7)
0 0 0 0 0 0 0 0 
##$DE= 6
##$DECBNUC= <off>
##$DECIM= 24
##$DECNUC= <off>
##$DECSTAT= 4
##$DIGMOD= 1
##$DIGTYP= 9
##$DL= (0..7)
0 120 120 120 120 120 120 120 
##$DP= (0..7)
150 150 150 150 150 150 150 150 
##$DP07= 0
##$DPNAME0= <>
##$DPNAME1= <>
##$DPNAME2= <>
##$DPNAME3= <>
##$DPNAME4= <>
##$DPNAME5= <>
##$DPNAME6= <>
##$DPNAME7= <>
##$DPOAL= (0..7)
0.5 0.5 0.5 0.5 0.5 0.5 0.5 0.5 
##$DPOFFS= (0..7)
0 0 0 0 0 0 0 0 
##$DQDMODE= 0
##$DR= 18
##$DS= 0
##$DSLIST= <SSSSSSSSSSSSSSS>
$$ [...]
##$SUBNAM2= <"">
##$SUBNAM3= <"">
##$SUBNAM4= <"">
##$SUBNAM5= <"">
##$SUBNAM6= <"">
##$SUBNAM7= <"">
##$SUBNAM8= <"">
##$SUBNAM9= <"">
##$SW= 24.9337058887773
##$SWIBOX= (0..15)
0 0 2 0 0 0 0 0 0 0 0 0 0 0 0 0 
##$SW_h= 4990.01996007984
##$TD= 16384
##$TD0= 1
##$TE= 0
##$TE2= 300
##$TE3= 300
##$TEG= 300
##$TL= (0..7)
0 120 120 120 120 120 120 120 
##$TP= (0..7)
150 150 150 150 150 150 150 150 
##$TP07= 0
##$TPNAME0= <>
##$TPNAME1= <>
##$TPNAME2= <>
##$TPNAME3= <>
##$TPNAME4= <>
##$TPNAME5= <>
##$TPNAME6= <>
##$TPNAME7= <>
##$TPOAL= (0..7)
0.5 0.5 0.5 0.5 0.5 0.5 0.5 0.5 
##$TPOFFS= (0..7)
0 0 0 0 0 0 0 0 
##$TUNHIN= 0
##$TUNHOUT= 0
##$TUNXOUT= 0
##$USERA1= <user>
##$USERA2= <user>
##$USERA3= <user>
##$USERA4= <user>
##$USERA5= <user>
##$V9= 5
##$VALIST= <valist>
##$VCLIST= <CCCCCCCCCCCCCCC>
##$VD= 0
##$VDLIST= <DDDDDDDDDDDDDDD>
##$VPLIST= <PPPPPPPPPPPPPPP>
##$VTLIST= <TTTTTTTTTTTTTTT>
##$WBST= 1024
##$WBSW= 4
##$XGAIN= (0..3)
0 0 0 0 
##$XL= 0
##$YL= 0
##$YMAX_a= 149979
##$YMIN_a= -75134
##$ZGOPTNS= <>
##$ZL1= 120
##$ZL2= 120
##$ZL3= 120
##$ZL4= 120
##$ABSF1= 10
##$ABSF2= 0
##$ABSG= 5
##$ABSL= 3
##$ALPHA= 0
##$AQORDER= 0
##$ASSFAC= 0
##$ASSFACI= 0
##$ASSFACX= 0
##$ASSWID= 0
##$AUNMP= <proc_1d>
##$AZFE= 0.1
##$AZFW= 0.1
##$BCFW= 1
##$BC_mod= 2
##$BYTORDP= 1
##$COROFFS= 0
##$CY= 11.3945322036743
##$DATMOD= 1
##$DC= 2
##$DFILT= <>
##$DTYPP= 0
##$F1P= 16.9975609425685
##$F2P= -3.02152046262296
##$FCOR= 0.5
##$FTSIZE= 0
##$FT_mod= 4
##$GAMMA= 1
##$GB= 0.15
##$INTBC= 1
##$INTSCL= 1
##$ISEN= 128
##$LB= 0.24
##$LEV0= 0
##$LPBIN= 0
##$MAXI= 10000
##$MC2= 0
##$MEAN= 0
##$ME_mod= 0
##$MI= 1.114404
##$NCOEF= 0
##$NC_proc= 0
##$NLEV= 6
##$NOISF1= 3.799351
##$NOISF2= 2.8
##$NSP= 1
##$NTH_PI= 0
##$NZP= 0
##$OFFSET= 15.70392
##$PC= 1
##$PHC0= -9786.829
##$PHC1= 15.40082
##$PH_mod= 1
##$PKNL= yes
##$PPARMOD= 0
##$PSCAL= 0
##$PSIGN= 0
##$REVERSE= no
##$SF= 200.130013532006
##$SI= 16384
##$SIGF1= 3
##$SIGF2= 2
##$SINO= 400
##$SIOLD= 16384
##$SREGLST= <1H.CDCl3>
##$SSB= 0
##$STSI= 0
##$STSR= 0
##$SW_p= 3612.71676300578
##$SYMM= 0
##$S_DEV= 0
##$TDeff= 0
##$TDoff= 0
##$TI= <>
##$TILT= no
##$TM1= 0
##$TM2= 0
##$TOPLEV= 0
##$USERP1= <user>
##$USERP2= <user>
##$USERP3= <user>
##$USERP4= <user>
##$USERP5= <user>
##$WDW= 1
##$XDIM= 8192
##$YMAX_p= 0
##$YMIN_p= 0
$$ End of Bruker specific parameters
$$ ---------------------------------
##NTUPLES= NMR FID
##VAR_NAME=  TIME,          FID/REAL,        FID/IMAG
##SYMBOL=    X,             R,               I
##VAR_TYPE=  INDEPENDENT,   DEPENDENT,       DEPENDENT
##VAR_FORM=  AFFN,          ASDF,            ASDF
##VAR_DIM=   8192,          8192,            8192
##UNITS=     SECONDS,       ARBITRARY UNITS, ARBITRARY UNITS
##FACTOR=    0.0002004,     1,               1
##FIRST=     0,             0,               0
##LAST=      1.6414764,     0,               0
##MIN=       0,             -75134,          0
##MAX=       1.6414764,     149979,          0
$$ Real data points
##PAGE= N=1
##DATA TABLE= (X++(R..R)), XYDATA
0@%%%%%%%%%%qJ6j6J6j6K4l2L6m4N2o0P2q4R5j10J27j45J64j87K13k39K69l03
$$ 0 0 0 0 0 0 0 0 0 0 0 -8 8 -8 8 -8 16 -16 20 -24 28 -32 40 -44 51 -59 68 -77 87 -100 113 -126 143 -160
33a60L39l80M24m70N23n82O45p15P93q78R70j072J189j321J470j640J832k059
$$ -160 179 -201 223 -247 276 -306 339 -376 417 -461 509 -563 626 -695 775 -865 967 -1092
51a092K330k655L056l570M254n210O657r139J4602n2103L7256L8445r1235j6730
$$ -1092 1238 -1417 1639 -1931 2323 -2887 3770 -5369 9233 -42870 -5614 32831 -58404 -75134
65g5134N2834K1477n2588q844M1163J9297k7890o23K4085N163k3281n916J4145
$$ -75134 -22300 -823 -53411 -62255 -21092 -1795 -29685 -30308 -6223 -1060 -24341 -30257 -16112
78a6112J4486L81l096k722P205P609n775j2950R406K2936J040j9273j734J2453
$$ -16112 -1626 -1245 -4341 -7063 142 7751 1976 -10974 -1568 21368 22408 3135 1401 13854
92A3854j942q556J2591J8139n969j7811j164R051L192N44J5o908N95J7291P775
$$ 13854 11912 3356 15947 34086 28117 10306 9142 18193 21385 21929 21944 15036 15631 32922 40697
107D0697k0562j5315J4221R760j4416m031K2147M652k6244q965K3752P741k3897
$$ 40697 20135 4820 19041 28801 14385 10354 32501 37153 10909 1944 25696 33437 9540
120I540j0251J7241O555j2888l831Q889n19o030Q73l929j1619N37J4812P64j2699
$$ 9540 -711 16530 23085 10197 6366 15255 14736 8706 9579 5650 -5969 -5432 9380 10144 -2555
135b555n62Q347o859j2297O093Q627j1740j2231J1130J4888n645j4467m224j02
$$ -2555 -3117 5230 -1629 -13926 -7833 794 -10946 -23177 -12047 2841 -2804 -17271 -21495 -21597
149b1597J686P550J622j2261q413J0696P658r073o383P338Q05r888J059R785o318
$$ -21597 -19911 -12361 -10739 -23000 -31413 -20717 -13059 -22132 -28515 -21177 -20372 -30260 -29201 -19416 -25734
164b5734j2880R234J7024q124j9162M547J6552l836j4861O64J0008K105r99K436
$$ -25734 -38614 -29380 -12356 -20480 -39642 -35095 -18543 -22379 -37240 -36576 -26568 -24463 -25462 -23026
178b3026k046o698J029L862k155o07Q053K085r910k39J4009K351j4903o298J0574
$$ -23026 -25072 -31770 -30741 -26879 -29034 -29641 -21588 -19503 -29413 -29652 -15643 -13292 -28195 -34493 -23919
193b3919N500l899K846P143k897n844L895K557o049j585Q073L372j995L673L806
$$ -23919 -18419 -22318 -19472 -12329 -15226 -21070 -17175 -14618 -20667 -22252 -14179 -10807 -12802 -9129 -5323
208e323q693p467J0065Q474r571o029J4734J0114j2937j0901Q714P900n811n85
$$ -5323 -14016 -21483 -11418 -2944 -12515 -18544 -3810 6304 -6633 -17534 -8820 -920 -6731 -7316
222g316R173r29j0849n54Q692J495k860L558K200n033l82M298m743r194O996J5845
$$ -7316 1857 928 -9921 -10475 -1783 -288 -3148 410 2610 -2423 -2805 1493 -3250 -12444 -5448 10397
238A0397J11j1518L47N045p755q718Q129J1137l367m686O800K922j0145p837L991
$$ 10397 10508 -1010 -663 4382 -3373 -12091 -3962 7175 3808 -878 5922 8844 -1301 -9138 -5147
253e147M931J987K991k69n220j004M909k444q586K661J0613j253r406K628P504
$$ -5147 -216 1771 4762 4493 -727 -1731 3178 734 -7852 -5191 5422 4169 -5237 -2609 4895
268D895n792q844P956J0698p041j1270L407O743l025k101N281K3n716K844N331
$$ 4895 -897 -9741 -1785 8913 1872 -9398 -5991 752 -2273 -4374 907 930 -4786 -1942 3389
283C389p474r186P176R968m673o851O817M494r158m778Q897L511q885k117Q469
$$ 3389 -4085 -13271 -6095 3873 -800 -7651 -834 3660 -5498 -10276 -1379 2132 -6753 -8870 -401
298d01J837o210l70M695q65l406J333N37l863O53O551N76k945K166J595p292m266
$$ -401 1436 -4774 -5144 -449 -1314 -4720 -3387 -2850 -6713 -6060 491 1067 -1878 288 1883 -5409 -9675
315i675P910M527p752j898J2439N077j2356p479O522L946n147J156P845K03o273
$$ -9675 -1765 2762 -4990 -6888 5551 10628 -1728 -9207 -2685 1261 -3886 -2730 5115 5318 -955
330i55N97L096k940k592N235J804m646J849O607m591q978M568J1387k745j0372
$$ -955 -358 2738 -202 -2794 2441 4245 -401 1448 8055 3464 -5514 -946 10441 7696 -2676
345b676K197Q618k798p862L093P006p85k935J439Q7l314n38J034j54J467N346
$$ -2676 -479 8139 5341 -2521 572 7578 6793 3858 5297 5384 2070 1532 2566 2412 3879 9225
361I225q23o503l0N853k566q005K281Q570j429n120M549M510q474p123Q324O233
$$ 9225 8402 1899 1869 7722 5156 -2849 -568 8002 6573 1453 6002 10512 2038 -5085 3239 9472
377I472q942o216R423P301o726n847L820Q74n209M89M684k024k364N846K831q879
$$ 9472 530 -5686 3737 11038 4312 -1535 2285 3159 -2050 -1561 3123 1099 -1265 4581 7412 -1467
393a467o125P210M894p065l577P198L455o495l703M056J804k847m80Q51j002O45
$$ -1467 -7592 -382 4512 -2553 -6130 1068 4523 -1972 -5675 -1619 185 -2662 -3142 -2291 -3293 -2648
409b648J791k886m259L364O675k030n747J008K419m383l095N775N140l998k496
$$ -2648 -857 -3743 -8002 -4638 2037 7 -5740 -4732 -2313 -6696 -9791 -4016 1124 -2874 -5370
424e370M111j9o394j369M251Q98q67K988K582m314k194K816j295n224L153Q561
$$ -5370 -1259 -1278 -7672 -9041 -4790 -3892 -4759 -1771 811 -3503 -5697 -2881 -4176 -9400 -6247 2314
440B314j564p403L116O825m859q148O085Q373n690p102O324P296n699n320O043
$$ 2314 750 -6653 -3537 3288 -1571 -9719 -3634 4739 -951 -8053 -1729 5567 -132 -5452 591
455E91M617n510m162M584K771k396J15K767j509q52L640M47o374j79P498J438
$$ 591 5208 -302 -4464 120 2891 495 610 3377 1868 1016 4656 5103 -1271 -1450 6048 7486
471G486o778M53P122k51p043j32N851M79m065m1K350n33O63K405p22k429J217
$$ 7486 708 1161 8283 8032 989 857 6708 7187 3122 3081 5431 4898 5561 7966 7244 4815 6032
488F032J407l173k650M097L368k787o18M665j182p574J34O453j191o214L483Q102
$$ 6032 7439 4266 1616 5713 9081 6294 5676 10341 9159 1585 1719 8172 6981 767 4250 12352
504A2352j009q446q74L778j766k743L853L056k633j751K450j501m506J685L651
$$ 12352 11343 2897 2023 5801 4035 1292 5145 8201 5568 3817 6267 4766 260 1945 5596
519E596k194l495M065L030n261m290N018L497m613k626L513K7m393l8L972j132
$$ 5596 3402 -93 3972 7002 1741 -2549 2469 5966 1353 -1273 2240 2267 -2126 -2164 1808 676
535F76k886K263K753l439l371J516M69k608K416M956k876o735K789O128m057p464
$$ 676 -2210 53 2806 -633 -4004 -2488 -2019 -4627 -2211 2745 -131 -6866 -4077 2051 -2006 -9470
551i470L223O377k456l789L576L013m848k294K849J322l182j30L366L95j178P06
$$ -9470 -6247 130 -2326 -6115 -2539 474 -4374 -6668 -3819 -2497 -5679 -5809 -2443 -2048 -3226 -2520
567b520M91l295p95L069J159l096Q20M524m57k869P40J743l004j591M821L122
$$ -2520 -2029 -5324 -6119 -3050 -1891 -4987 -4167 357 -100 -2969 -2229 -486 -3490 -5081 -260 2862
583B862l409k102K976J161k046N80K633j739j441L781K392n120j851O272L229
$$ 2862 -547 -2649 327 1488 -558 22 2655 916 -525 3256 5648 528 -1323 4949 8178
598H178m940j382N545O28o353MP415P80n825Q84P583q29o240q42L402Q17L11K599
$$ 8178 3238 1856 7401 8029 1676 1680 9095 9875 4050 4934 12517 11688 5448 4606 8008 8825 9136 11735
616A1735O01k980K41K935j640l334K199K916j301r06L523J677m911k154L838J614
$$ 11735 12336 9356 9597 12532 10892 7558 9757 12673 11372 10466 13989 15666 10755 8601 12439 14053
632A4053l275n65L389N5k667J938J275l557j629L961J544m824j009L786O49k966
$$ 14053 10778 10213 13602 13657 10990 12928 14203 10646 9017 12978 14522 9698 8689 12475 13124 10158
648A0158N45K430m079l511M744M120n224m879M051M587m310l415L335J470m896
$$ 10158 10703 13133 9054 5543 10287 14407 9183 4304 8355 12942 8632 5217 8552 10022 5126
663E126j367L621N39l429o35K407n03j162Q96j341m017P74M391j035m548R57N452
$$ 5126 3759 7380 7919 4490 3855 6262 5759 4597 5493 4152 135 909 5300 4265 -283 674 6126
680F126j900n860o58L069j055j378L136J365l836j443K847k78l577k10K831q25
$$ 6126 4226 -1634 -2292 777 -278 -1656 1480 2845 -991 -2434 413 135 -3442 -3652 -821 -1646
696a646j170L572R04m774k917M191K321l693j119L807l06l829J816M290k586m397
$$ -1646 -2816 756 1660 -3114 -6031 -1840 481 -3212 -4331 -524 -830 -4659 -2843 1447 -1139 -5536
712e536K595N069k503m609J770L879j036j546J723Q6k028J465K007k414k461K928
$$ -5536 -2941 2128 -375 -4984 -3214 665 -371 -1917 -194 -108 -2136 -671 1336 -1078 -3539 -611
728f11L376j780j268K229L33l622p47M539J144l491l54K770P18p67Q5k30l223
$$ -611 2765 985 -283 1946 2279 -1343 -2090 2449 3593 102 -252 2518 3236 2469 2554 2324 -899
745h99N89M152M73l149Q11L631j306l690J526K240k636k010M301K562m093k166
$$ -899 -310 3842 4315 1166 1977 5608 4302 612 2138 4378 1742 -268 4033 6595 2502 336
761C36L905J180m694o21L547J02k504J902K604l112l686L061L282k624k551K237
$$ 336 4241 5421 727 106 3653 3755 1251 3153 5757 2645 -1041 2020 5302 2678 127 2364
777B364R06k806M02L757j102n055J303N031j138n111P8L484n34j885K066J404
$$ 2364 3270 464 866 4623 3521 -1534 -231 4800 3662 -1449 -1371 2113 1579 -306 1760 3164
793C164k487j213P83o4j038P18J318r30j14K070q24m223J65M118p8l841P78L520
$$ 3164 677 -536 247 183 -855 -137 1181 251 137 2207 1383 -2840 -2675 1443 1365 -2476 -1698 1822
811A822k27l015P73J100k722j170L541K157l334j528K921N11k436J90K018j950
$$ 1822 1595 -1420 -647 453 -2269 -3439 102 2259 -1075 -2603 318 829 -1607 -1417 601 -1349
827a349k446L259L433l137l155L223J746l898q20M297j56m097L24M443k05m574
$$ -1349 -3795 -536 2897 -240 -3395 -172 1574 -2324 -3144 1153 997 -3100 -2776 1667 1462 -3112
843c112Q01L867q56l096J080J266j530l50K903k10l268O26L507r45l967O83K319
$$ -3112 -2311 1556 700 -2396 -1316 -50 -1580 -1930 973 763 -2505 -1879 1628 683 -3284 -2601 -282
860b82r11j297L359J013m615j665L552J213l264p99K538Q88j518O66J212k629
$$ -282 -1193 -2490 869 1882 -2733 -4398 -846 367 -2897 -3696 -1158 -270 -1788 -1122 90 -2539
876b539k099K199J240j772k75K393k52k804L40K202j599k353K114K757k496k367
$$ -2539 -4638 -2439 -1199 -2971 -3246 -853 -1105 -3909 -3569 -1367 -2966 -5319 -3205 -448 -2944 -5311
892e311K336J309k192j134K370kk645J298K516j651k459J444K285j830j180K301
$$ -5311 -2975 -1666 -3858 -4992 -2622 -2624 -5269 -3971 -1455 -3106 -5565 -4121 -1836 -3666 -4846 -2545
908b545l70l468O19L982J72l639M25L403j470k635J536K029k632j535L590K242
$$ -2545 -2915 -6383 -5764 -1782 -1610 -5249 -4824 -1421 -2891 -5526 -3990 -1961 -4593 -6128 -2538 -296
924b96l401j486K780M29k715L4K808o70k097K271K564k958k558L075J952k822
$$ -296 -3697 -5183 -2403 -1974 -4689 -4655 -1847 -2517 -4614 -2343 221 -2737 -5295 -2220 -268 -3090
940c090j641K805J686k318O85J552j120j977R21K222q81j393J351K29o30R53J696
$$ -3090 -4731 -1926 -240 -2558 -1873 -321 -1441 -3418 -2497 -275 -1156 -2549 -1198 -969 -1599 -646 1050
957A050k097k305J807L455k142k159J995J681k380j233L298M61l091o3K876l75
$$ 1050 -1047 -3352 -1545 1910 -232 -2391 -396 1285 -1095 -2328 970 1431 -1660 -1723 1153 778
973G78k380O84K978j024k408J289J259j601r49K466j49k113L34L100o69l214J379
$$ 778 -1602 -918 2060 1036 -1372 -83 1176 -425 -1374 1092 943 -1170 -836 2264 1595 -1619 -240
990b40J919k062j801K844K877l126k570K144J956k257j388K214J53j367N60J663
$$ -240 1679 -383 -2184 660 3537 411 -2159 -15 1941 -316 -1704 510 663 -704 -144 1519
1006A519p37j604N66N2j452R17K321j020k072Q02K197j663k208K187J400k249
$$ 1519 782 -822 -256 -204 -1656 -739 1582 562 -1510 -708 1489 -174 -2382 -195 1205 -1044
1022a044j474K503J096k149q64K091K15k923N19L318p20l361N47K630j000j273
$$ -1044 -2518 -15 1081 -1068 -1932 159 374 -2549 -2030 1288 568 -2793 -2246 384 -616 -1889
1038a889J900N88k454j476K574P43j927l43K217k51k007M53K249j263k495J143
$$ -1889 11 599 -1855 -3331 -757 -14 -1941 -2284 -67 -318 -2325 -1872 377 -886 -3381 -2238
1054b238J393k57n11J700q61j703j52K074o57j176J901M32j899q43K166J049k716
$$ -2238 -845 -1102 -1613 87 -774 -2477 -2629 -555 -1212 -2388 -487 -55 -1954 -2797 -631 418 -2298
1071b298p23K110N43j701N49K018r24k554J219J787r92j272J799J07k429K07L207
$$ -2298 -3021 -911 -368 -2069 -1520 498 -426 -2980 -1761 26 -966 -2238 -439 -332 -2761 -2554 653
1088F53k04k532K45K220j097k372J937K213j545k364J927K093k026r27J597J38
$$ 653 449 -2083 -1838 382 -715 -3087 -1150 1063 -482 -2846 -919 1174 -852 -1779 -182 -44
1104d4j752MK261J89j174m57Q75p54j9R80j57j635N65K042o13j794J317J437j772
$$ -44 -1796 -1792 469 658 -516 -973 -98 -852 -871 109 -48 -1683 -1118 924 311 -1483 -166 1271 -501
1123e01k026K208J579j876m31J511P72j984l95J910J25k219N28J675k84j169J445
$$ -501 -2527 -319 1260 -616 -1047 464 1236 -748 -1143 767 892 -1327 -799 876 592 -577 868
1140H68M62k312o77K218R79j673l94J578l60j999J085J920j152j857R31J670j075
$$ 868 1330 -982 -1659 559 1538 -135 -529 1049 689 -1310 -225 1695 543 -1314 -383 1287 212
1157B12r62J360M9j367J02J581j67j512K05Q70p83q88J819J033j958p81J630L38
$$ 212 -750 610 659 -708 -606 975 808 -704 -499 371 -412 -1300 519 1552 -406 -1187 443 781
1175G81k303P9K166l9j643J00J522o36j694N98J020q88m51J373M68j686j06N27
$$ 781 -1522 -1443 723 684 -959 -859 663 27 -1667 -1069 -49 -937 -1388 -15 453 -1233 -1339 -812
1193h12l2j063J038J177j937r43J682J305j577j295J756L70j743qJ366k66j523
$$ -812 -844 -1907 -869 308 -1629 -2572 -890 415 -1162 -2457 -701 -331 -2074 -2082 -716 -982 -2505
1210b505Q73J357j163j088J356O53j482o71J534K78j596O76J760j559j328R66
$$ -2505 -1632 -275 -1438 -2526 -1170 -517 -1999 -2670 -1136 -858 -2454 -1778 -18 -1577 -2905 -1939
1226a939J876j258j616J085J397j274l23J411K07j982q2J842o3j139K04J361j096
$$ -1939 -63 -1321 -2937 -1852 -455 -1729 -2052 -641 -434 -2416 -2498 -656 -719 -1858 -1654 -293 -1389
1243a389n47J309Q56k258k90K095N07j804L36J542l27k141O28J950n85j528P29
$$ -1389 -1936 -627 229 -2029 -2319 -224 283 -1521 -1185 357 30 -2111 -1483 467 -118 -1646 -917
1260i17J641r63r31R28Q42q64j60L50k54o03R50P96q20p04J216M51j021l14J115
$$ -917 724 -239 -1170 -242 600 -264 -424 -74 -328 -931 19 815 -5 -709 507 958 -63 -377 738
1279G38m77j052L83J774l04j560L10J059p78l59J405q8j795N1J983j39j867N35
$$ 738 261 -791 -408 1366 1062 -498 -188 871 93 -266 1139 1051 -744 -693 1290 1151 -716 -181
1297a81J533j047j068J003J341j598n56J483N71k153l37J683N80j680j7J238j39
$$ -181 1352 305 -763 240 1581 -17 -573 910 1481 -672 -1009 674 1254 -426 -443 795 656
1314F56r22O05J067j411j557J520J783j390p82R68pr16J14J468m49j342Q19P44
$$ 656 -266 339 1406 -5 -1562 -42 1741 351 -431 537 530 -386 -272 1196 747 -595 224 968
1332I68o94l00M55J73m79J06M18o9j083Q43P71r62j78J174m0j052n69J451O4j100
$$ 968 274 -26 429 602 123 229 647 578 -505 338 1109 147 -31 1143 1103 51 -518 933 997 -103
1352a03K49J890l38k126L93J398J01r51N56M89r52j37J057K76j017m29J049l20
$$ -103 146 2036 1698 -428 -35 1363 1464 513 1069 1558 606 469 1526 1802 785 356 1405 1085
1370A085o36P50M70q31q59J508O10j136p46J207L19j452r5J251J16q00j03O85
$$ 1085 449 1199 1669 838 -21 1487 2097 961 215 1422 1741 289 194 1445 1561 761 658 1343
1388A343n40r01R80N45m92m25N58m15m28J57N59m97j351J052J267q81q30O79L09
$$ 1343 803 -98 882 1427 935 510 1068 653 225 382 941 444 -907 145 1412 531 -299 380 689
1407F89j245J15J155n6j583n6J068J54j111M59R22q44q58P07N45j057j01J117
$$ 689 -556 -441 714 658 -925 -981 87 241 -870 -411 511 -333 -1191 -484 61 -996 -1097 20
1425B0K32j463L51Q04j03j209M57Q28p45l68Q18Q60j123j103J049Q27r88J77O93
$$ 20 252 -1211 -860 -56 -159 -1368 -911 -83 -828 -1196 -378 482 -641 -1744 -695 132 -856 -679 14
1444A4p01o24J100M69m60p22O57L82q91j2J255l59j078P16J164n89q70N86M99
$$ 14 -687 -1311 -211 258 -202 -924 -267 115 -776 -788 467 108 -970 -254 910 321 -549 37 536
1463E36l78n32R38N71j008m3P56L26j570J158J304n86j022P28L61o77l50J292
$$ 536 158 -374 564 1135 127 84 840 1166 -404 754 2058 1472 450 1178 1539 862 512 1804
1481A804O74j305o29J054M67q35j93J009l7j141Q43M77m02l76J09O37q17J41P23
$$ 1804 2478 1173 544 1598 2065 1230 1037 2046 2009 868 1711 2188 1786 1410 1519 2156 1339 1480 2203
1500B203m92o90J60R46m96q56J125J83o08q51J190J36q39j38Q77m08o85L03P69
$$ 2203 1711 1021 1181 2127 1631 775 1900 2083 1475 624 1814 1950 1111 973 1850 1442 757 1060 1829
1519A829n37n91M85K42p05m97J054j2j117n0J033r2r03M8P50k74r08L94O87p59
$$ 1829 1292 701 1186 1428 723 226 1280 1268 151 101 1134 1042 139 187 937 663 -245 149 836 77
1539G7k57J47O06j037l82J103L33j267O7O98o09q9K54J82p71q3Q13J88j053K8
$$ 77 -180 -33 573 -464 -846 257 590 -677 -610 88 -521 -610 -356 -174 -945 -1028 -215 -27 -1080 -1052
1559a052J221j019o23J048Q20j138j000P85J134q47n08Q24N88j559K60O20K95
$$ -1052 169 -850 -1473 -425 395 -743 -1743 -958 176 -671 -1179 -355 233 -1326 -1066 -446 -151
1576a51p08MQ77m17p18M68Q09k02q24P39J05r03N27Q33n49o63N71L77m87j05L93
$$ -151 -859 -855 22 -395 -1113 -645 164 -38 -862 -123 -18 -921 -394 439 -110 -773 -202 175 -312 -417 -24
1597b4K01m46j24M94M21o86J13N35n80j60O69O38o37m47L82N33j176L53J060k30
$$ -24 177 -269 -393 101 522 -164 -51 484 -96 -256 413 1051 414 -33 349 882 -294 59 1119 889
1617H89q94J8J227j37j182Q13O65q07n02M86R69p51p94Q79N10q05j73J222m38
$$ 889 -5 13 1240 1103 -79 734 1399 592 90 576 1545 794 0 879 1389 584 411 1633 1195
1636A195q34O16N09l71k83K81O17p66l59L72K48k23M00P2k25m58N87N5m94j49
$$ 1195 361 977 1486 1115 832 1113 1730 964 605 977 1225 1002 1402 1474 1249 791 1378 1433 939 790
1656G90O02J22o14M2L60l46k23k02O45L96o59L98J64r22J25J203l50o97o0N24
$$ 790 1392 1514 900 942 1302 956 733 531 1176 1572 913 1311 1475 553 678 1881 1531 834 774 1298
1676A298O1j059O21R00m07j138O80L09o54NP41k84o29P0R69l73n69J26L52m27
$$ 1298 1359 300 921 1821 1414 276 956 1265 611 616 1357 1073 444 514 1483 1110 541 667 1019 592
1696E92n20P62R3k08q56N41M45q92K97N38j51q54L93Q76n21j173Q18N45q67k38
$$ 592 72 834 927 719 -137 404 849 -43 254 792 641 -213 180 1056 535 -638 180 725 -142 -380
1716c80P06L3o62j57N33k22NN11K41r76m18N64L52o67k10O48j94o28K31R70l30
$$ -380 326 359 -303 -460 73 -149 -144 367 608 -368 -786 -222 130 -537 -747 -99 -293 -921 -690 280 -50
1737e0n97k01M94m11j89O27L18p83m53R98M33j126l79Q91k51l25J53R40m20j071
$$ -50 -647 -848 -354 -765 -954 -327 -9 -792 -1245 -247 186 -940 -1319 -428 -679 -1004 -851 89 -331 -1402
1757a402P42M59m58m28J035j95o91j0L26L00o42P05M12p09k93K51O08l67J03M8
$$ -1402 -660 -201 -659 -1087 -52 -247 -938 -948 -622 -322 -964 -259 153 -556 -849 -598 10 -357 -254 -206
1777b06j48n09O82O85j005l81P28N40m84n33P61k11l62Q7R47k07l87l85O89j50
$$ -206 -354 -863 -181 504 -501 -882 -154 386 -98 -631 130 -81 -443 -356 591 384 -3 -388 301 151
1797A51o12P58N57o48k36N76k35n85l85J487K04r07l30Q28J35n49K1L76m31j8
$$ 151 -461 297 854 206 -30 546 311 -274 -659 828 1032 125 -205 623 758 209 230 606 175 157
1817A57O60j35k00o40N20o7j54N94K68q26K2L24L45m76l37R58j52m99r7O38k16
$$ 157 817 682 482 -158 362 295 141 735 1003 177 199 523 868 392 55 1013 861 362 265 903 687
1838F87m53j99J373p71j23K31J47k37n25Q32on61j7P40k0j288M07Q65j3o87M40
$$ 687 234 35 1408 637 514 745 892 655 130 962 956 395 378 1118 1098 -190 217 1082 1069 382 822
1859H22K28o51n3O68K05m73q14R76K07j72j84M07m24j80M73J53m53L0L70k27k85
$$ 822 1050 399 346 1014 1219 746 -68 908 1115 943 759 1166 742 562 1035 1188 735 765 1135 908 623
1880F23J87N15l59m20M80N28n43m99O64K51p29m21L64N04m03j11N26j99l65Q7
$$ 623 810 1325 966 546 1026 1554 1011 512 1176 1427 698 277 641 1145 742 631 1157 958 593 680
1900F80M16l05o27N45L26k52L9o0K55j110r3J103q8p44L06M62o24l30M72L59m95
$$ 680 1096 791 164 709 1035 783 822 762 1017 -93 -186 917 829 85 391 853 229 -101 371 730 235
1921B35k77O8M35m75k71Q4K22n91M39Q0r9j68L03k6p61j39J201m71o62l19O82
$$ 235 -42 26 461 -14 -285 -201 21 -570 -131 -51 -150 -318 -15 -41 -802 -941 260 -211 -873 -1192 -510
1942e10J27l71L80K83p24l59L08N61l21l78J94r0n28N84P18n24p00J95O23l32
$$ -510 -383 -754 -374 -91 -815 -1174 -866 -305 -626 -1004 -810 -900 -1428 -844 -126 -650 -1350 -1155 -532 -864
1962h64n90L97N39n91p4N18K15n47n2N50K2m36m5O97Q4j083O82l6j77K25L91j15
$$ -864 -1454 -1057 -518 -1109 -1183 -665 -450 -997 -1049 -499 -477 -913 -958 -261 -177 -1260 -578 -614 -791 -566 -175 -290
1984b90R5J07J83m59j67N91J48p33Q9Q06K68p41k85M15K58k58J81K81n19k15L65
$$ -290 -195 -88 95 -364 -531 60 208 -525 -436 370 638 -103 -388 27 285 27 208 489 -30 -245 120
2005A20J035r40n50J081o0m44j27Q57l20n05n1Q70k51m53N21J6m06m36P86q8j74
$$ 120 1155 215 -335 746 686 242 115 972 652 147 96 966 715 262 783 799 393 -43 743 655 481
2026D81j46M33l4o47J23O60J55p64k8JQ1q9K34k56l04k0J86K24l96k7J76l80j27
$$ 481 335 768 734 87 210 870 1025 261 233 234 315 226 460 204 -100 -120 66 290 -106 -133 43 -337 -464
2049d64J92O22q40j05j77L53n7j85N29l79o49L87K15q45q1Q54J76n09o52K40L20
$$ -464 -272 350 -490 -595 -772 -419 -476 -661 -132 -511 -1160 -773 -558 -1403 -1484 -630 -454 -963 -1615 -1375 -1055
2070a055l17L3M8M2o55O59L36n04l74p6L74k99K29L72m52l69j87P29O9m03N8M24
$$ -1055 -1372 -1339 -1291 -1249 -1904 -1245 -909 -1413 -1787 -1863 -1489 -1788 -1559 -1187 -1639 -2008 -2195 -1466 -1397 -1800 -1742 -1318
2092a318k21p4K0K54l71kM12k01o2k55L61K56j91k2M60m44m0M87M1l94k4N19L48
$$ -1318 -1539 -1613 -1593 -1339 -1710 -1712 -1300 -1501 -1563 -1818 -1457 -1201 -1392 -1414 -954 -1398 -1438 -951 -910 -1304 -1328 -809 -461
2115d61n45m26P57L7j08M30P1k23l40j74P92K14m49K93J33q6p8L63j2j75J82L26
$$ -461 -1006 -1432 -675 -638 -746 -316 -245 -468 -808 -982 -190 24 -425 -132 1 -85 -163 200 188 13 195 521
2137E21o1m26O84j46R3o7K86q9j71k16L60K01l67k1L71p7K05k83R2l17L98P7j40
$$ 521 460 34 718 572 665 598 884 795 624 408 768 969 602 581 952 875 1080 797 889 572 970 1047 907
2160I07k62Q7K81l44J41k0K69l87j8N3L60j68k56J69K29j60l11N92n02j45j3L80
$$ 907 645 732 1013 669 810 790 1059 672 654 707 1067 899 643 812 1041 881 570 1162 660 515 502 882
2182H82m74k16N32k42j21M1R8j43l29K37N23n79j81k15P41k40n41k42M67K08k57
$$ 882 408 192 724 482 361 402 500 357 28 265 788 209 28 -187 554 314 -227 -469 -2 206 -51
2203e1K25j49m01k4L51l74J06J29Rl65R6J93L54m47j83L71j51m56J68L51Mm16
$$ -51 174 25 -376 -400 -49 -423 -317 -188 -179 -544 -448 -255 99 -348 -531 -160 -311 -767 -599 -248 -244 -660
2225f60Q7N11m20j42J85J15L8j78R0j53m0K49J45m61KO62Qk83m41L46J50k39m6
$$ -660 -573 -62 -482 -624 -439 -324 -286 -464 -374 -527 -567 -318 -173 -634 -632 30 38 -245 -686 -340 -190 -429 -475
2248d75L58N0k49O2J49J52k92j29L50Q6M8K5k52J4m9L21k51J11K53L12l53l25
$$ -475 -117 -67 -316 -254 -105 47 -245 -374 -24 62 110 135 -117 -103 -152 169 -82 29 282 594 241 -84
2270h4K57P7j71n2K89P2l64o8J08M84l04j23K37k12O5K32j04l72J2L23J01m39
$$ -84 173 250 79 27 316 388 24 -44 64 548 244 121 358 146 211 443 339 -33 -21 302 403 -36
2292c6mJ77J69m20L01K27k49j72K44J80J7j17P4k91K16N6J97m04k93J60J0K49
$$ -36 -40 137 306 -114 187 414 165 -7 237 417 434 317 391 100 316 372 569 165 -128 32 42 291
2314B91j70J0j0O0k2J36jl70J61K6J12k83J71J01p2m89N75q7j86j20m1K02k59
$$ 291 121 131 121 181 159 295 294 -76 85 111 223 -60 111 212 140 -349 226 139 -47 -167 -208 -6 -265
2337b65K85k1R2M8J23m13J88k31K79K26l70j11L54J29k51q2J97k58N5o5J90j02
$$ -265 20 -1 91 139 262 -151 37 -194 85 311 -59 -170 184 313 62 -20 177 -81 -26 -91 99 -3
2359cJ08K03m9l36Q9J32J59r1K02k18J5M8k9j09K14l31M52j04Pn5n2k72q9M70
$$ -3 105 308 259 -77 12 144 303 212 414 196 211 259 230 121 335 4 456 352 359 304 252 -20 -109 361
2383C61L59n80o9j24M08k95j08J57j11O8n8L2K77n18J32K56k62j10Q2M21l37k39
$$ 361 720 140 71 -53 355 60 -48 109 -2 66 8 40 317 -201 -69 187 -75 -185 -103 318 -19 -258
2405b58J86K21k71j0J25K0l40j14K75n9j61M22J08o39J4R2r3l1j89K56J50n01
$$ -258 -72 149 -122 -132 -7 13 -327 -441 -166 -225 -386 36 144 -495 -481 -389 -482 -513 -702 -446 -296 -797
2427g97K72K40k88l50P8K77j25J25n66N13m69N2J08K41l84K88J21l27l59J76j32
$$ -797 -525 -285 -573 -923 -845 -568 -693 -568 -1134 -621 -1090 -1038 -930 -689 -1073 -785 -664 -991 -1350 -1174 -1306
2448a306J17K1L2M7k93K00L92l83l56r9K90K82L1k48j43K11r5r1K09r4Q6o9L6
$$ -1306 -1189 -1168 -1136 -1089 -1382 -1182 -790 -1173 -1529 -1628 -1338 -1056 -1025 -1273 -1416 -1205 -1300 -1391 -1182 -1276 -1190 -1259 -1223
2471a223K15j16J50lm42K20J19M3l0j95K49r8j52K30L9Q4k85J41J20j50J5N60
$$ -1223 -1008 -1124 -974 -977 -1419 -1199 -1080 -1037 -1067 -1262 -1013 -1111 -1263 -1033 -994 -910 -1195 -1054 -934 -1084 -1069 -509
2493e09k04r6K30j75j14N2L79k24KR5K18j73k45J55O48j42k61K13Qn5r8Q2J42
$$ -509 -713 -809 -579 -754 -868 -816 -437 -661 -659 -564 -346 -519 -764 -609 39 -103 -364 -151 -143 -198 -296 -214 -72
2516g2M6J73j06J20k43R1k5r6J95O2j82J9L21j28J65Ll24K63L48k92J5J82k59
$$ -72 -26 147 41 161 -82 9 -16 -112 83 145 -37 -18 303 175 340 343 19 282 630 338 353 535 276
2539B76J75P9m7M00Qk88n7J83J42k18p4j16K30K5j40mL98k80j28K6K68J89n26
$$ 276 451 530 483 883 891 603 546 729 871 653 579 463 693 718 578 574 972 692 564 590 858 1047 521
2562E21J10o3K21J58j45q1k23J21O2j36j69J40J71p1j47L6M16n78K4L1K47j56
$$ 521 631 568 789 947 802 721 498 619 681 545 376 516 687 616 469 505 921 343 367 398 645 489
2584D89j50J05o4k78R1J09J71j95%J1k2Nl51N0N6j8K52l8m88M08J34m26j85K49
$$ 489 339 444 380 102 193 302 473 278 278 289 267 272 -79 -29 27 9 261 223 -265 143 277 -149 -334 -85
2608h5l8J37l48L35O0k86K13l30L57m12K15J48J0l51K58j12n43K23L49J45l21
$$ -85 -123 14 -334 1 61 -225 -12 -342 15 -397 -182 -34 -24 -375 -117 -229 -772 -549 -200 -55 -376
2629c76J42K26k43j76k48L55J58l12N37k44M2j38J47J37R0m32L25P9k84K68K15
$$ -376 -234 -8 -251 -427 -675 -320 -162 -474 63 -181 -139 -277 -130 7 97 -335 -10 69 -215 53 268
2650B68n31K35n7K06k17k6M83o94L33J93j47P6m7n8J75k03J83o8L01j21n4L0J35
$$ 268 -263 -28 -85 121 -96 -122 361 -333 0 193 46 122 75 17 192 -11 172 104 405 284 230 260 395
2673C95k04PK38j74J63L38M6l65k58M5L43jk61L65k74n7k7K38Q2k9J3J67o55J78
$$ 395 191 198 436 262 425 763 809 444 186 231 574 573 312 677 403 346 319 557 639 610 623 790 135 313
2697C13L41k3j40J62J82l75J05k13M29j93l47M99k12l16J38j9K4j32J54K49l23
$$ 313 654 631 491 653 835 460 565 352 781 588 241 740 528 212 350 331 355 223 377 626 303
2718C03j58J4J33L1M7j37j16M8k02O9J78l51K25K74j06p2k76q3K14j10J34p4k27
$$ 303 145 159 292 323 370 233 117 165 -37 32 210 -141 84 358 252 180 -96 -179 35 -75 59 -15 -242
2741b42J74j66M35l24r6O7j36RK60j38O3L20m40j9Q4k12l2L18j89P8J90k27j5
$$ -242 -68 -234 201 -123 -219 -152 -288 -279 -19 -157 -94 226 -214 -233 -149 -361 -393 -75 -264 -186 4 -223 -238
2764b38M9p4k7J34j46J06p1J18P7j17p4j52J92j4J11K35j38q4j6J91l27qj18M25
$$ -238 -189 -263 -290 -156 -302 -196 -267 -149 -72 -189 -263 -415 -223 -237 -126 109 -29 -113 -129 62 -265 -273 -391 34
2788C4J43k08j12J27K3j29J56O5M31m17J28j55r4J33M1l41L8L90R1j7j58j04K39
$$ 34 177 -31 -143 -16 7 -122 34 99 530 113 241 86 -8 125 166 -175 -137 253 344 327 169 65 304
2811C04j64j39K90O5k5n2M1n4k31J94M9L5J32l13K00K05l26n0L82Lm17N03j2m88
$$ 304 140 1 291 356 331 279 320 266 35 229 278 313 445 132 332 537 211 161 543 546 129 632 620 132
2835A32P9O31m92K3m5N9k89K79j11M01l73N0J96J50k97N1j9N8j2p6K34m04M6J82
$$ 132 211 842 350 373 328 387 98 377 266 667 294 344 540 690 393 444 425 483 471 395 629 225 271 453
2859D53jk13L67j94R3j56L7J65j63j13o0K05j09l54M8J83J28M1k46L75l56k34
$$ 453 452 239 606 412 505 349 386 551 388 275 215 420 311 -43 5 188 316 357 111 486 130 -104
2881a04K14l5L8k12M15k46j14j62K01k14J83J16q2j77p9L54j85q5o8K90j08k23
$$ -104 110 75 113 -99 316 70 -44 -206 -5 -219 -36 80 -2 -179 -258 96 -89 -174 -242 48 -60 -283
2903b83N37m98L4q3M21l62m7l8L12j82O3K9L0k91J87N5p7J05k94J9J24j17K23
$$ -283 254 -244 -210 -293 128 -234 -281 -319 -7 -189 -126 -97 -67 -358 -171 -116 -193 -88 -382 -363 -239 -356 -133
2926a33k15K59L1j92M26k28m0L43l06L3P7m0m7J73j87O9L27l03j67M40p4q1p2
$$ -133 -348 -89 -58 -250 176 -52 -92 251 -55 -22 55 15 -32 141 -46 23 350 47 -120 320 246 165 93
2949I3K91l61L86N3l25J81N54k55k48J53k12K84j28r0J64j23P2J69j35J30r5K9
$$ 93 384 23 409 462 137 318 872 617 369 522 310 594 466 376 540 417 489 658 523 653 558 587
2971E87J0j1j16O73o00o1j39M94R3k23K18k53k94j31P3M63%k81M2Q1q4o1P9k7
$$ 587 597 586 470 1143 543 482 343 837 930 707 925 672 378 247 320 783 783 502 544 625 541 480 559 532
2995E32L29p11M35l20J21Q2K8J12l30o8j20j38K97M27l93r9K37m24L67j41k32
$$ 532 861 150 585 265 386 468 496 608 278 210 90 -48 249 676 283 184 421 -3 364 223 -9
3016iK27j84k2M24k88J16j12m0K17j63j51J34k71r2L42l9Rm4P1J31j94j31Q1K63
$$ -9 218 34 12 436 148 264 152 112 329 166 15 149 -122 -214 128 89 98 54 125 256 62 -69 12 275
3040B75n1k54J68j96K56l49L42Kj59M4J89lK03l35n5J9j59N05j09k5m38Q2M37
$$ 275 224 -30 138 -58 198 -151 191 193 34 78 267 264 467 132 77 96 -63 442 333 308 -130 -48 389
3063C89k2l43L31k65p4N75l60j54K27j41K51k09K67J46m28K69J07j03l03l8K13
$$ 389 367 24 355 90 16 591 231 77 304 163 414 205 472 618 190 459 566 463 160 122 335
3084C35o9J43j32L0k14M8J84j1j16k69K38K82l95J08j44J27L6j39N51l56o8L5
$$ 335 266 409 277 307 93 141 325 314 198 -71 167 449 54 162 18 145 181 42 593 237 169 204
3106B04l7k86K48j30J81K0Q5q9k61K37K0m77K71m9o4l3J43K3J19l29m5l50N55
$$ 204 167 -119 129 -1 180 200 285 196 -65 172 192 -285 -14 -63 -127 -160 -17 6 125 -204 -249 -599 -44
3129d4k0j51K73l11%r3j19P1jk8P3N8O4m10j16L78j54J67j10j69j5J77j03Q6j66
$$ -44 -64 -215 58 -253 -253 -346 -465 -394 -395 -423 -350 -292 -228 -638 -754 -376 -530 -363 -473 -642 -657 -480 -583 -497 -663
3154f63k14L61K9j70R9J9j96N6J31pJ43j10j1K57j81K5l16K92l54K77O4k57j40
$$ -663 -877 -516 -487 -657 -558 -539 -735 -679 -548 -555 -412 -522 -533 -276 -457 -432 -748 -456 -810 -533 -469 -726 -866
3177h66K55L6L42m60O4Q7l8K25k21l7j28M84j6K8k74r5K81j75R7K12N3m41K96
$$ -866 -611 -575 -233 -693 -629 -542 -580 -355 -576 -613 -741 -257 -273 -245 -519 -614 -333 -508 -411 -199 -146 -587 -291
3200b91Q4k20m2J33L42l33J78k62M43k39j92J91o6j57J85L27l65k1K24k82L67
$$ -291 -207 -427 -469 -336 6 -327 -149 -411 32 -207 -399 -208 -274 -431 -246 81 -284 -305 -81 -363 4
3221DM5L7j37k57N5K71n0j82K8J91k53j43K82m8P0J43m2k39P1M2l3Q2m22L05J11
$$ 4 49 86 -51 -308 -253 18 -32 -214 -186 5 -248 -391 -109 -157 -87 56 14 -225 -154 -112 -145 -63 -485 -180 -69
3246f9J47l01MJ61l19n9O20m67j29J15J81o9k27o3n9K06j47K30j0N0k33j28l8
$$ -69 78 -223 -219 -58 -377 -436 184 -283 -412 -297 -116 -185 -412 -475 -534 -328 -475 -245 -255 -205 -438 -566 -604
3269f04R7J65K31p15M55k14K26o8k83M42l14O1K59l08J24m5l67J67j23J71J37
$$ -604 -507 -342 -111 -826 -371 -585 -359 -427 -710 -268 -582 -521 -262 -570 -446 -491 -858 -691 -814 -643 -506
3290e06O5k99K61l08Nj0L74p1O2q2j56Q8r3J47j44k4J98j86K61k26L30l82J50
$$ -506 -441 -740 -479 -787 -782 -792 -418 -489 -427 -509 -665 -577 -670 -523 -667 -691 -493 -679 -418 -644 -314 -696 -546
3313e46M6j10J13K64l33Q3J43K5L0j59K5J90j7P6n1K76j31nL3J15n0j14P9J66
$$ -546 -500 -610 -497 -233 -566 -483 -340 -315 -285 -444 -419 -229 -246 -170 -221 55 -76 -81 -48 67 17 -97 -18 148
3337A48j84L45r2j92L60j45K13l46L93o25n1L70k8J60j55K19k67N4m2pJ2m4J91
$$ 148 -36 309 217 25 385 240 453 107 500 -125 -176 194 166 326 171 390 123 177 135 128 140 96 287
3360B87LK2p6L54q9j52O3k01o0J65k63K99J16j79k7K30j84m31K17J50o2K18j34
$$ 287 290 312 236 590 501 349 412 211 151 316 53 352 468 289 262 492 308 -123 94 244 182 400 266
3383B66k79j08L06Q0O8k47j40J3J39l8m8j39K2K2P0O6k74K46j90j52J29J50l69
$$ 266 -13 -121 185 265 333 86 -54 -41 98 60 12 -127 -105 -83 -13 53 -221 25 -165 -317 -188 -38 -407
3406d07K57Q2q1K56k84n1j47J22j70K70r1J5o6l5l8K2j50K53Jq3N0J8k01n7L67
$$ -407 -150 -68 -149 107 -177 -228 -375 -253 -423 -153 -244 -229 -295 -330 -368 -346 -496 -243 -242 -325 -275 -257 -458 -515 -148
3431a48m19J95j20K87K07l41R5mj10L7K8N8k66L90j80n1q1m8M5o4K06p5L60l63
$$ -148 -567 -372 -492 -205 2 -339 -244 -248 -358 -321 -293 -235 -501 -111 -291 -342 -423 -471 -426 -490 -284 -359 1 -362
3455c62N2nql6K63j97k61N32K2l14K67p0p1o3J11l2M1j1J47k57K77Lq2o8K0J26
$$ -362 -310 -315 -323 -359 -96 -293 -554 -22 0 -314 -47 -117 -188 -251 -140 -172 -131 -142 5 -252 25 28 -54 -122 -102 24
3481B4j16k06L42J19j31l5L31o95N33l94M46p4Q7l75J23K6J07q9J20P7j53j0o
$$ 24 -92 -298 44 163 32 -3 328 -367 166 -228 218 144 231 -144 -21 5 112 23 143 220 67 57 51
3504E1L72n73J77j66J26K92n2l99K1N04l58%K45k78j00R4Q6K23j33J01K5l18l37
$$ 51 423 -150 27 -139 -13 279 227 -172 -151 353 -5 -5 240 -38 -138 -44 42 265 132 233 258 -60 -397
3527c97L44J05j72J27j07K88r6J80k24M09q7n69J02L62l28J60j53K1K33q2l30
$$ -397 -53 52 -120 7 -100 188 92 272 48 457 370 -199 -97 265 -63 97 -56 -35 198 116 -214
3548b14N73m94J39J28k95K75j42L38l25J47m4j34K44l03J21K10n12N14l39K22
$$ -214 359 -135 4 132 -163 112 -30 308 -17 130 86 -48 196 -107 14 224 -288 226 -113 109
3568A09k56M60j09k43J99L4k25K03l60L62l2K30k64J27k11M26k47k13J28j77J42
$$ 109 -147 313 204 -39 160 194 -31 172 -188 174 142 372 108 235 24 450 203 -10 118 -59 83
3589H3O3j64m8J22R5L26m58q6K32J96J3j47p5K23J9j34K73m22J38K0J66q1q8n1
$$ 83 146 -18 -66 56 151 477 19 -67 165 361 374 227 152 375 394 260 533 111 249 269 435 354 266 215
3613B15j29L69k31k85O80k98k01J11J07O6p0k13k24K69k2O6N4Ml23O38l67k28
$$ 215 86 455 224 -61 619 321 120 231 338 404 334 121 -103 166 144 210 264 268 -55 583 216 -12
3635a2J38L98l11qJ05Q3k71M99p03K00M09n91L00mP9l05L73j71k47J51J88k6n3
$$ -12 126 524 213 205 310 393 122 621 -82 118 527 -64 236 232 311 6 379 208 -39 112 300 274 221
3658B21O5j75k27K09K43k17j75J68J33o8j96J89q9%J54j08m8kk01L91j10k20j6
$$ 221 286 111 -116 93 336 119 -56 112 245 177 -19 170 81 81 235 127 79 77 -124 267 157 -63 -79
3681g9K17J13k74J19J85j85K33l56N36l09k5n3J02N9k3l39K46L5K03j21l34L93
$$ -79 138 251 -23 96 281 96 329 -27 509 200 175 122 224 283 260 -79 167 202 405 284 -50 343
3703C43J00k07J01j15L75k19j23K93j72q5R4j11k8j13J26J61J05j55k26J18l39
$$ 343 443 236 337 222 597 378 255 548 376 291 385 274 246 133 259 420 525 370 144 262 -77
3724g7M11j20J74r2K24n6J3KJ18n16J26Q8J59r9l92J70M4j6N6K12l7k89n2L37
$$ -77 334 214 388 296 520 464 477 479 597 81 207 295 454 355 -37 133 177 161 217 429 392 103 51 388
3748C88N9k61j42K11J67l19P2j83J65qp3M9j46O4J95n2k24M04l27R7K90l06k8
$$ 388 447 186 44 255 422 103 175 -8 157 149 76 125 -21 43 238 186 -38 366 39 136 426 120 92
3771I2K40m48K02Mn8j47L63l95k9L82q5k64J19p7J38J96j39J35k82qK23k5k44
$$ 92 332 -116 86 90 32 -115 248 -147 -176 206 121 -143 -24 -101 37 233 94 229 -53 -61 162 137 -107
3794a07l9J85k56J09K3R3p4nK95l45J85l71L77j1m63M75k70M4J77n7O5n6r3J45
$$ -107 -146 39 -217 -108 -85 8 -66 -71 224 -121 64 -307 70 59 -404 71 -199 -155 22 -35 30 -26 -119 26
3818B6K43l6k55K8Jk03P9L70m06K29J09M7j05o6L58k51J27pm78L17J18l0lj73
$$ 26 269 233 -22 6 7 -196 -117 253 -153 76 185 232 127 61 419 168 295 288 -190 127 245 215 212 39
3842C9J31L83l34n7J37l54K12j8k2j55K84J64j16k02L34k23K77k64N5M6o6k05
$$ 39 170 553 219 162 299 -55 157 139 117 -38 246 410 294 92 426 203 480 216 271 317 251 46
3864D6K03q7q9J05L38l97j63J49O0k31R4J39r1J40j51J36k57o1P7J17N8k76k8
$$ 46 249 162 73 178 516 119 -44 105 165 -66 28 167 76 216 65 201 -56 -117 -40 77 135 -141 -169
3887a69J4K90k82K77j8j16k1J28J09j58j97O7rL03k60QL3k80j14N01k52k85J26
$$ -169 -155 135 -147 130 112 -4 -25 103 212 54 -143 -76 -85 218 -42 -34 -1 -281 -395 106 -146 -431 -305
3910c05K61m70L82l1k58K00j5J45j39k77L23m8j31L92Ml54J94l36J80K21j47k75
$$ -305 -44 -514 -132 -163 -421 -221 -236 -91 -230 -507 -184 -232 -363 29 33 -321 -127 -463 -283 -62 -209 -484
3932d84L66j85J42K8P9j29l1k0n0M1l61P04J2j08j72j8l99L38O5K81k54K6K40
$$ -484 -118 -303 -161 -133 -54 -183 -214 -234 -284 -243 -604 100 112 4 -168 -186 -585 -247 -182 99 -155 -129 111
3955A11j87j1k36N28j81o1K50j09k40K96k01J52j02k3J65P1j93j01J91j4n7K91
$$ 111 -76 -87 -323 205 24 -37 213 104 -136 160 -41 111 9 -14 151 222 29 -72 119 105 48 339
3977C39k35q7k42N39o8k44J97K14m61J4L03L2k38P9N0L17o72L04Jj55J78r0R5
$$ 339 104 17 -225 314 246 2 199 413 -48 -34 269 301 63 142 192 509 -163 141 142 -13 165 75 170
4000A70P1k12J27p7P5k45M46J6m11M49mp14K92j6L5J50k0N1k46J83j67J42K04
$$ 170 241 29 156 79 154 -91 355 371 -40 409 405 -309 -17 -33 2 152 132 183 -63 120 -47 95 299
4023B99k58j80J30J90l50J03k61K95L8j74J5L34l2l32J41L0l3N8j64j11L94l95
$$ 299 41 -139 -9 181 -169 -66 -327 -32 6 -168 -153 181 149 -183 -42 -12 -45 13 -151 -262 132 -263
4045b63P8mQR7J0J72k63O3j2J14j54k3K43n3L16j96j04j40lJ28J32j74J38j10
$$ -263 -185 -189 -181 -84 -74 98 -165 -102 -114 0 -154 -177 66 13 329 133 29 -111 -114 14 146 -28 110 0
4069@j41L28k90K08Pm40N12j54j72K02l2R9j25m7J25lj26j50q7L45R3l62L91k89
$$ 0 -141 187 -103 105 112 -328 184 30 -142 60 28 127 2 -45 80 77 -49 -199 -286 59 152 -210 181 -108
4093a08QK05l33K00q9K01k19K03p8J56j6J16l03J18l15J79n5L93l71K16l21J74
$$ -108 -100 105 -228 -28 -117 84 -135 68 -10 146 130 246 -57 61 -254 -75 -130 263 -108 108 -213 -39
4115c9K07j95k42J91k04M1O0J66J4k39K09j81M10j19k28K38n16L95j56j14J53
$$ -39 168 -27 -269 -78 -282 -241 -181 -15 -1 -240 -31 -212 198 79 -149 89 -427 -32 -188 -302 -149
4136a49p2J74j86J71k7k05m3K79k31J10J36p3k80J06J04k8k87L42l35K21N7j14
$$ -149 -221 -47 -233 -62 -89 -294 -337 -58 -289 -179 -43 -116 -396 -290 -186 -214 -501 -159 -494 -273 -216 -330
4158c30K48j7k66O2nL5jL44J69k64j03j1k0J87k3n71J81L69j60L5J28Q0np0l80
$$ -330 -82 -99 -365 -303 -308 -273 -274 70 239 -25 -128 -139 -159 28 5 -566 -385 -16 -176 -141 -13 67 62 -8 -388
4183c88j22K61L3J09j23J11qk56M04l7j84K51l13J51j21J98k7l7O7J25j33o1K10
$$ -388 -510 -249 -216 -107 -230 -119 -127 -383 21 -16 -200 51 -262 -111 -232 -34 -61 -98 -31 94 -39 -100 110
4206A10n57L29R4k15q9K33K52m96K23K8j2J68k71N7J32j93K71k6k04J75P4J3J18
$$ 110 -447 -118 -24 -239 -328 -95 157 -339 -116 -88 -100 68 -203 -146 -14 -207 64 38 -166 9 83 96 214
4229B14k35pnk96K19K45K7j81O9K31j69j53j50L45j59K94k24r5j04K07k18j83
$$ 214 -21 -28 -33 -329 -110 135 162 -19 50 281 112 -41 -191 154 -5 289 65 -30 -134 73 -145 -328
4251c28K31J43j03k13M89m33J68K37m93L02lj20J67p8J63k31l81N02L2o6k3k61
$$ -328 -97 46 -57 -270 219 -214 -46 191 -302 0 -3 -123 44 -34 129 -102 -483 19 51 -15 -38 -299
4273b99P7J59k84l2J09J25o4k03K52k8l79O33l97K76j75k38L26j45k35J61J17
$$ -299 -222 -63 -347 -379 -270 -145 -209 -412 -160 -188 -567 66 -331 -55 -230 -468 -142 -287 -522 -361 -244
4294b44P6J02j64M15o47l5J6L76Q2J16j56p6k35M35l34K02J6l08j02L33o8p7J13
$$ -244 -168 -66 -230 185 -462 -497 -481 -105 -23 93 -63 -139 -374 61 -273 -71 -55 -363 -465 -132 -200 -277 -164
4317a64q4r8p1M63k38N5m8K7R6l43K90j9K72j86k15L59J64k7j62J34k28R0J31
$$ -164 -248 -346 -417 46 -192 -137 -185 -158 -62 -405 -115 -134 138 -48 -263 96 260 233 71 205 -23 67 198
4340A98j97J52j71J33j90M29j84j62k07N43m23K50J69m35L25j10L62k57p3K0l51
$$ 198 1 153 -18 115 -75 354 170 8 -199 344 -79 171 340 -95 230 120 482 225 152 172 -179
4361a79K51j2O0R1O8Q4l61M35l77J08Jr5K32l14K04JQ8J0j08N3J13j28J69K4k64
$$ -179 72 60 120 211 279 363 2 437 60 168 169 74 306 -8 196 197 285 295 187 240 353 225 394 418 154
4386A54l02K39K5j56L98j47j55k13K84Q2q4j02l5K26m04r0R1L27k09K44J8j94
$$ 154 -148 91 116 -40 358 211 56 -157 127 209 125 23 -12 214 -190 -280 -189 138 -71 173 191 -3
4408cJ22j75k22Q3L69m08J35L23l54K24j86N5p3j85R0PL25j56J61j96J44j40l7
$$ -3 119 -56 -278 -195 174 -234 -99 224 -130 94 -92 -37 -110 -295 -205 -198 127 -29 132 -64 80 -60 -97
4431i7O7M3j35j28LK14k38K17j26J04j06L6J29j36l1J71r9k92K15R1j49L38l75
$$ -97 -30 13 -122 -250 -247 -33 -271 -54 -180 -76 -182 -146 -17 -153 -184 -13 -112 -404 -189 -98 -247 91 -284
4454b84K23K20l24k03K39K98k65K4N9L36k93k54L63J25q6l68K45j7Q9J98l26J95
$$ -284 -61 159 -165 -368 -129 169 -96 -72 -13 323 30 -224 139 264 178 -190 55 38 127 325 -1 194
4476A94l96J98j09j70J92j33L15o5J95k72L03K3M6q5j7k2p0q3j24M20j41l5J02
$$ 194 -202 -4 -113 -283 -91 -224 91 26 221 -51 252 275 321 236 219 197 127 44 -80 340 199 164 266
4499B66r3L3j47j4l6J2J61Nj53J38j68M7l6J49J05n6n1l4p0p3R6J07M5q6j5j24
$$ 266 173 206 59 45 9 21 182 187 34 172 4 51 15 164 269 213 162 128 58 -15 81 188 233 147 132 8
4525Hj28M65m45m3M02j52j06n6K80Q5j56j56J87k55M03m87O2J33rK60l36p1K91
$$ 8 -120 345 -100 -143 259 107 1 -55 225 310 154 -2 185 -70 333 -154 -92 41 32 292 -44 -115 176
4548A76k00K05J11m52L5J63j83K09o0J57k41K04p7l99L96j14j04K72O4l76J48
$$ 176 -24 181 292 -160 -125 38 -145 64 4 161 -80 124 47 -352 44 -70 -174 98 162 -214 -66
4569f6K4P3j68J23K5J17m20L46J77m17K70mk59j4L00k5l10L33l9j59J75n6JN8
$$ -66 -42 31 -137 -14 11 128 -292 54 231 -186 84 80 -179 -193 107 82 -228 105 66 -93 82 26 27 85
4593H5k22L79m59L23m5j87J61n6k15M39j91J29l36L69j58P4j23N9J30j78L99l49
$$ 85 -137 242 -217 106 61 -126 35 -21 -236 203 12 141 -195 174 16 90 -33 26 156 -22 377 28
4615B8q9K23j05k25P9M23k69m06L04N7j33M04m96K34N2Q5k46J90J32j57R6p2l3
$$ 28 -61 162 57 -168 -89 334 65 -341 -37 20 -113 291 -205 29 81 166 -80 110 242 85 181 109 76
4638G6l40N40n3k14K4J26M6l22J04k08L35k6j25O8K00j91r4J45p6M1J08Ml52J33
$$ 76 -264 276 223 9 33 159 205 -117 -13 -221 114 88 -37 31 231 40 -54 91 15 56 164 168 -184 -51
4662e1k81J48M38k39p6J1L52k63r9L00j50l59O35m29p8Q9K5M6m2L03l32J1K85
$$ -51 -332 -184 254 15 -61 -50 302 39 -60 240 90 -269 366 -63 -141 -52 -27 19 -23 280 -52 -41 244
4685B44ln6n8K0O8j06K39o9j10Q2j00j44N3k54K73j12K3n7R6R4k24J88K00m28
$$ 244 241 185 127 147 215 109 348 279 169 251 151 7 60 -194 79 -33 -10 -67 29 123 -101 87 287 -141
4709a41K28k44J23L45j04J20m49K34p8L64l50K8o5J46P8l22p8O5K0J64J42j84
$$ -141 87 -157 -34 311 207 327 -122 112 34 398 48 76 11 157 235 -87 -165 -100 -80 84 226 42
4731D2k22L78j26j36J80k07M36N8k12l29J23M1K11m35K52K38k73j36M10j24k48
$$ 42 -180 198 72 -64 116 -91 345 403 191 -138 -15 26 237 -198 54 292 19 -117 293 169 -79
4752g9R7J14j69N8J03j17oL29j92J57j76l6j08N6j15L9K19j68L3k14L69k37j64
$$ -79 18 132 -37 21 124 7 1 330 138 295 119 83 -25 31 -84 -45 174 6 39 -175 194 -43 -207
4775b07J48j86M38j42O3K8k24J43Q0l11K24p5Nk8j24j07J59J36j93j01J73j41
$$ -207 -59 -245 193 51 114 142 -82 61 141 -170 54 -21 -16 -44 -168 -275 -116 20 -173 -274 -101 -242
4797b42J96P8l12K73j90L6j63M0J43J87j35K75j47O0k25K25k72J76l00J51K65
$$ -242 -46 32 -280 -7 -197 -161 -324 -284 -141 46 -89 186 39 99 -126 99 -173 3 -297 -146 119
4818A19J8j32Q3o4J30k9qk53K81o4m07M83m10M77m36J32L29k37K1J84l20R9J94
$$ 119 137 5 88 24 154 125 117 -136 145 81 -326 157 -253 224 -212 -80 249 12 33 217 -103 -4 190
4841A90k02jJ00j40R1j71l2O4j09N9l4J55N3Q8L8k00L69m38j70N58k25K48l79
$$ 190 -12 -13 87 -53 38 -133 -165 -101 -210 -151 -185 -30 23 111 149 -51 318 -120 -290 268 43 291 -88
4864h8K65r1J25k38k48L37J37n2N5l16O40p24j38M49L66l37q5Qr2q0K93k64K2
$$ -88 177 86 211 -27 -275 62 199 147 202 -114 526 -198 -336 113 479 142 57 65 -27 -107 186 -78 -56
4887e6K57o2l09J79R3k61P7m3M79l55L3j41L13K35l84k01l95O54k30J7J74J35
$$ -56 201 139 -170 9 102 -159 -82 -125 354 -1 32 -109 204 439 55 -146 -541 113 -117 -100 74 209
4909B09k74j16N7J36L65k00l73J51R0j29l6m7L90k77k13K39J88j64j60J23j29
$$ 209 -65 -181 -124 12 377 177 -196 -45 45 -84 -120 -167 223 -54 -267 -28 160 -4 -164 -41 -170
4930a70J95j08J09j08j32K72k8j49k05K87K75l36R4j14K98j9k95J75j7k08j3J21
$$ -170 25 -83 26 -82 -214 58 30 -119 -324 -37 238 -98 -4 -118 180 161 -134 41 24 -184 -197 -76
4952g6j42J37L12l36JK41k74j3K51o1n8J89n4j24o9L5j65k5K59N1K42k84j98K09
$$ -76 -218 -81 231 -105 -104 137 -137 -150 101 40 -18 171 117 -7 -76 -41 -206 -231 28 79 321 37 -161 48
4976D8k30L68l0n69K70r6Q3K38j19K27j76n4Q9l2j43K28j34k39K45J37M5j0m7
$$ 48 -182 186 156 -413 -143 -239 -156 82 -37 190 14 -40 49 17 -126 102 -32 -271 -26 111 156 146 99
4999I9j29q0r8L56q3j7l09K72j23R8R6J48l62j04L43j31J56j25n7J47%j25J84
$$ 99 -30 -110 -208 148 65 48 -261 11 -112 -14 82 230 -132 -236 107 -24 132 7 -50 97 97 -28 156
5022A56j76o2K34k62k22J56N0n3L29k92o1K34k41N8L69q7o8Q7q4m6m8J54k26J23
$$ 156 -20 -82 152 -110 -332 -176 -126 -179 150 -142 -203 31 -210 -152 217 130 62 149 65 19 -29 125 -101 22
5046B2j18K36l38J21k50P0L00J39k86L6M1j72J50j08M00n1k56J28l47L91r0j46
$$ 22 -96 140 -198 -77 -327 -257 43 182 -104 -68 -27 -199 -49 -157 243 192 -64 64 -283 108 18 -128
5068a28k04K36J22l53Q7M38m12J87l14K28J09j67M14j15l39K13k8p3K21m0N3p2
$$ -128 -332 -96 26 -327 -240 198 -214 -27 -341 -113 -4 -171 243 128 -211 2 -26 -99 122 82 135 63
5090F3nk74J03L57m53K46k3j48K08j47k7L19l01k8J17J14j18J05rJ01j67l46L70
$$ 63 58 -216 -113 244 -209 37 14 -134 74 -73 -100 219 -82 -110 7 121 3 108 99 200 33 -313 57
5113E7r1K45k60L92l28P3N8n5j60R9j11K5R2J00K15l35J02n2j52K38k07N8P0P2
$$ 57 -34 211 -49 343 15 88 146 91 -69 30 -81 -56 36 136 351 16 118 66 -86 152 -55 3 73 145
5137A45k55J15O4j53J78k25J1J08J85j00p7J02r2n2k13J65j08L73k10k6P4j9j13
$$ 145 -110 5 69 -84 94 -131 -120 -12 173 73 -4 98 6 -46 -259 -94 -202 171 -39 -65 9 -10 -123
5160a23R6j72J26j32J94M7J0J0l54R6L58o2p1J6j44N1M2Q2nj04j20K19K7m7l01
$$ -123 -27 -199 -73 -205 -11 36 46 56 -298 -202 156 94 23 39 -105 -54 -12 70 65 -39 -159 60 87 40 -261
5185b61K01Q3l70M94k94j57K79j89N84o05K61j68Nj04J93J57j70J92k03K39l94
$$ -261 -60 23 -347 147 -147 -304 -25 -214 370 -235 26 -142 -137 -241 -48 109 -61 131 -72 167 -227
5206b27J21K01k55M16j80p1J53r9J74m61K63k48K49m8j85M48j69Pj28j41K48J6
$$ -227 -106 95 -160 256 76 5 158 59 233 -228 35 -213 36 -12 -197 251 82 89 -39 -180 68 84
5228H4j7m0K08n0n1r2j74R0R9m0J31k05J68Q4j15l64M14q0l9L7J39j72J32k50
$$ 84 67 27 235 185 134 42 -132 -42 57 17 148 -57 111 195 80 -284 130 50 11 48 187 15 147 -103
5252a03j15K07J23j1m68O8M76j84k7J17k32Qn4L15j90J98j76j3K19k94K20k60
$$ -103 -218 -11 112 101 -367 -299 177 -7 -34 83 -149 -141 -195 120 -70 128 -48 -61 158 -136 84 -176
5274a76L72l47j71L15m5J49j58J50l8M07n57k2J38K55l05n0R1k63N2L56l14l8
$$ -176 196 -151 -322 -7 -52 97 -61 89 51 458 -99 -121 17 272 -33 -83 8 -255 -203 153 -161 -199
5296a99J19NP2l7J07k34J29l39J23JJ43K10l02J55lR5k1j62k8K12k9j70K15n6
$$ -199 -80 -75 -3 -40 67 -167 -38 -377 -254 -253 -110 100 -202 -47 -50 45 24 -138 -166 46 17 -153 62 6
5320FlMJ63J28q32K89L17mk87J52R3j02K38k34L09l37l03M06k75L55j30J81Ok14
$$ 6 3 7 170 298 -534 -245 72 68 -219 -67 26 -76 162 -72 237 -100 -403 3 -272 83 -47 134 140 -74
5344g4J02J21l7k8j17J64j10j59J60J60o9j58J65L0k11J30J5k89L82l58K29J07
$$ -74 28 149 112 84 -33 131 21 -138 22 182 113 -45 120 150 -61 69 84 -205 177 -181 48 155
5366A55k11k83K98J44l16J7J01L03l57R0J53l40L94j65J03m5J5k29j9Q6J96j2
$$ 155 -56 -339 -41 103 -213 -196 -95 208 -149 -59 94 -246 148 -17 86 41 56 -173 -192 -106 90 78
5388G8j25Q4n7L4n9J54RO3N1N5m57J55J93QJo3k17L67l71M39m21K7K32j72j26
$$ 78 -47 37 -20 14 -45 109 118 181 232 287 -170 -15 178 186 187 124 -93 274 -97 342 -79 -52 180 8 -118
5413a18M04M9j21n1P3j19k05K69k19L41j06l88J49L55r0J04k53q9J33M6o9L3Q1
$$ -118 286 335 214 163 236 117 -88 181 -38 303 197 -191 -42 313 223 327 74 -15 118 164 95 128 209
5436B09j63j97K83l02j35L11k06K50l11J44L48P0k48j27L8l7J15k25K53mk19J0
$$ 209 46 -151 132 -170 -305 6 -200 50 -261 -117 231 301 53 -74 -36 -73 42 -183 70 66 -153 -143
5458a43Q1pJ32K32r5l30J95j88q3J86K73r1o2j76j09L04p3K0NK0j6J84k83J21
$$ -143 -62 -69 63 295 200 -130 65 -123 -206 -20 253 162 100 -76 -185 119 46 66 71 91 75 259 -24 97
5482I7k18K28O1m47L34l21L61J46m40k7m9M72M1l58L2K55k08L07k5k8k4N5l49
$$ 97 -121 107 168 -279 55 -266 95 241 -199 -226 -275 197 238 -120 -88 167 -41 266 241 213 189 244 -105
5505a05J8L29l91j14M63L9j65J15j46l8L9k83J88L8J1J79k72n8J04L4L79n15K19
$$ -105 -87 242 -149 -263 200 239 74 189 43 5 44 -239 -51 -13 -2 177 -95 -153 -49 -15 364 -151 68
5528F8p9l6p3J25rL03m11J92J44k88M02k84j57R6L2k9MJ85l43M83l67n3L6R6o7
$$ 68 -11 -47 -120 5 -4 299 -112 80 224 -64 338 54 -103 -7 25 -4 0 185 -158 325 -42 -95 -59 37 -30
5553c0p4n9K70k59J04J29p7j81L12j63q3K90k35L3J85j79J88k28K49l0M2j95J47
$$ -30 -104 -163 107 -152 -48 81 4 -177 135 -28 -111 179 -56 -23 162 -17 171 -57 192 162 204 9 156
5576A56l09J82K5P3J05Pl14R3K17k01k3K55k80MJ36N3k11P0J54r4J12o5O1q0J39
$$ 156 -153 29 54 127 232 239 -75 18 235 34 11 266 -14 -10 126 179 -32 38 192 98 210 145 206 126 265
5601B65J46j59k38L5k16J38J8n2J44p9m4J36j51J05r2j63L38O0m02J97p3j40L88
$$ 265 411 252 14 49 -167 -29 -11 -63 81 2 -42 94 -57 48 -44 -207 131 191 -211 -14 -87 -227 161
5624A61j15Q0k39J94l18M17l51K02M6j96J23j22N9L73k26k64K18J31j51N6J05
$$ 161 46 126 -113 81 -237 180 -171 31 77 -119 4 -118 -59 314 88 -176 42 173 22 78 183
5645A83k73J48p6Q7O2j40K48r1k81Q8K47k95lq4J31J02l15l3M15j17J06j45J35
$$ 183 -90 58 -18 69 131 -9 239 148 -133 -45 202 -93 -96 -180 -49 53 -262 -295 120 3 109 -36 99
5668I9r8m9J66j19K9l3L0J09j16j10k29O1L53k89J94J63m27LK77r8j99L02j11
$$ 99 1 -48 118 -1 28 -5 25 134 18 -92 -321 -260 93 -196 -2 161 -266 -263 14 -84 -283 19 -92
5691i2K40l13M80m37K29m6m00K49j28L05K14j11k18p9k84R4N97l91N6oJ12m23
$$ -92 148 -165 315 -122 107 61 -339 -90 -218 87 301 190 -28 -107 -391 -297 300 -91 -35 -41 71 -352
5713c52M09j27K69j04J0j35m7k35K69o6p2P8r5J83M1K7n1J1j60P3J66J86l39K65
$$ -352 57 -70 199 95 105 -30 -77 -312 -43 -109 -181 -103 -198 -15 26 53 2 13 -147 -74 92 278 -61 204
5737B04q6p3j6N6l18M93k75M9K58j41j62l94L08OL6J87l44K82k3O7J00j47J52
$$ 204 118 45 29 85 -233 260 -15 34 292 151 -11 -405 -97 -91 -55 132 -212 70 47 114 214 67 219
5760B19j85r4K08k76R8L6j78K67p9K58j93K5O1n9k19J0J5J94j37o0M75l76Q1J81
$$ 219 34 -60 148 -128 -30 6 -172 95 16 274 81 106 167 108 -111 -101 -86 108 -29 -89 386 10 91 272
5784B72j82q8J09j10P2K4m4j77K91k13J59k99l3L76j75Q9j92R3K2M8k26M66k39
$$ 272 90 2 111 1 73 97 53 -124 167 -46 113 -186 -219 157 -18 71 -121 -28 -6 42 -184 282 43
5807D3j94J88l4J1oJ4j33N8J26k07J51j62K91k37K94L54l94j18m35N14k97M38
$$ 43 -151 37 3 14 8 22 -111 -53 73 -134 17 -145 146 -91 203 557 163 45 -390 124 -173 265
5829B65o03J28M18q8l41R4o9L82k48J4j1K5j84J74J7%K2q3QJ35k25K38J39j82
$$ 265 -338 -210 208 120 -221 -127 -196 186 -62 -48 -59 -34 -218 -44 -27 -27 -5 -88 -80 55 -170 68 207 25
5853B5n8m0P6k36L60q3l17L67J72m93M77k71k1J0L96n88K38L9l9n0k34L53k84
$$ 25 -33 -73 3 -233 127 44 -273 94 266 -227 250 -21 -42 -32 364 -224 14 53 14 -36 -270 83 -201
5876b01K96R8k89l22L27K05j01j06K52L35o09j83M08j48K68l50J49K22l75K02
$$ -201 95 193 -96 -418 -91 114 13 -93 159 494 -115 -298 110 -38 230 -120 29 251 -124 78
5896G8j94J88N1j78N4J56R4m02M7l31O02o8K4J91l96Q8K13m28J58N8J94l58K82
$$ 78 -116 72 123 -55 -1 155 249 -153 -106 -437 165 97 121 312 -84 4 217 -211 -53 5 199 -159 123
5919A23Q7j55j03K28k50J55j50PP2j4J5j86K03K6p5j5K08j26ql73M58k74K45k64
$$ 123 210 55 -48 180 -70 85 -65 -58 14 0 15 -171 32 58 -17 -32 176 50 42 -331 127 -147 98 -166
5943a66L31o0j46J23Q8n21K51O2nO3r7l1nM2m3K71m64L91l0j31o7K86J40m50M6
$$ -166 165 105 -41 82 170 -351 -100 -38 -43 20 -77 -108 -113 -71 -114 157 -307 84 54 -77 -144 142 282 -168 -122
5968a22P2N4j00M5J83j12m1j19j86M71j86l05N16j60R4j86P0K30k91Qk38Q9K17
$$ -122 -50 4 -96 -51 132 20 -21 -140 -326 145 -41 -346 170 10 104 -82 -12 218 -73 -65 -303 -214 3
5991Cj09L05M8j63j16R3p4o9J02n1J13j14N91l50j76j84J8k9p9K29J20Nq3k8K10
$$ 3 -106 199 247 84 -32 61 -13 -82 20 -31 82 -32 559 209 33 -151 -133 -162 -241 -12 108 113 30 2 212
6016B12m54K68j36K95l24L9K67n11N90q0l02Q3R3l36K73l8j19L60k70J94j28j63
$$ 212 -242 26 -110 185 -139 -100 167 -344 246 166 -136 -53 40 -296 -23 -61 -180 180 -90 104 -24 -187
6038a87O3r1K50j6P7Km8l81L63r5q2j8J40K39j99J52l10L01j83R8J23q7j97R5
$$ -187 -124 -215 35 19 96 98 50 -331 32 -63 -145 -163 -23 216 17 169 -141 160 -23 75 198 111 -86 9
6062IL8k33M99n10J22Nl4J34q3p8J36J59n5qk25N92k46j52J36o7j27J5O7j88K71
$$ 9 47 -186 313 -197 -75 -70 -104 30 -53 -131 5 164 109 101 -124 468 222 70 206 139 12 27 94 -94 177
6087A77k43J46K86r7l87K12k75L10J2L4n42K58L45r3kJ58j73k09R2r0L33k69n5
$$ 177 -66 80 366 269 -118 94 -181 129 141 175 -367 -109 236 143 141 299 126 -83 9 -81 252 -17 -72
6110g2K47J67j48o8j14k13M82k98J00K8J56l86J32k17K41k53M01q8N3r6m74N82
$$ -72 175 342 194 126 12 -201 281 -17 83 111 267 -119 13 -204 37 -216 185 97 150 54 -420 162
6132A62O0n20L02k5j69L20j35K30m81M48j26J85p9k70j27K43k5lJ75j57K37k60
$$ 162 222 -298 4 -21 -190 130 -5 225 -256 192 66 251 172 -98 -225 18 -7 -10 165 8 245 -15
6154a5j47J45rj29M19j11k56J87k90L28n1o6m0L11k83j46K17Oq4P2K8K43k96j94
$$ -15 -162 -17 -26 -155 264 153 -103 84 -206 122 71 5 -35 276 -7 -153 64 70 -14 58 86 329 33 -161
6178a61j06M20J5k98QJ58l9m9N6m1L54n75M5M28k53J21M4o8l6m1N7j2Q9j39J2
$$ -161 -267 153 168 -130 -122 36 -3 -52 4 -37 317 -258 -213 215 -38 83 127 59 23 -18 39 27 116 -23 -11
6203a1k17J51L23j86k5k0j13J47j27n8L62l51L09L9j43n3j32J72n0K41m39q5M75
$$ -11 -228 -77 246 60 35 15 -98 49 -78 -136 226 -125 184 223 80 27 -105 67 17 258 -181 -266 209
6226B09k53R0Q0q5R6m4o4k15J61k55M60k12J12j58m3M4N8j62L57j95N1rr6q0M14
$$ 209 -44 46 126 41 137 93 29 -186 -25 -280 180 -32 80 -78 -121 -77 -19 -181 176 -19 32 23 -73 -153 261
6251B61l65J39r5O9l5k31J25K41j75L45j38K62j25n25J98Jjj8J52J24k8k82J84
$$ 261 -104 35 -60 9 -26 -257 -132 109 -66 279 141 403 278 -247 -49 -48 -49 -67 85 209 181 -101 83
6274H3j92Q5Q8k44K29k04L57l25P8Q5k69J9K71N4r3j01K20j39K1j14k03L52r0
$$ 83 -109 -24 64 -180 49 -155 202 -123 -45 40 -229 -210 61 115 22 -79 141 2 23 -91 -294 58 -32
6297c2N9j17J71p6q1J21O7l63q3N51m16K42k85K30m19L89p0K9P4J93k98n5K68
$$ -32 27 -90 81 5 -76 45 112 -251 -334 217 -199 43 -242 -12 -431 -42 -112 -83 -9 184 -114 -169 99
6320I9M1l20K29p7p9o9L19j14O6j0k38K95k04K4j30o7K82q2J8K48n58J02J87J93
$$ 99 140 -180 49 -28 -107 -176 143 29 95 85 -153 142 -62 -38 -168 -235 47 -35 -17 231 -327 -225 -38 155
6344A55k37J91P3m54o8L36n5k6JM29n49Q8L48j09k35J40j78Q2j73P5K24J68r6
$$ 155 -82 109 182 -272 -340 -4 -59 -85 -84 345 -204 -116 232 123 -112 28 -150 -68 -241 -166 58 226 130
6367A30j67j15K25l7J56m9j65J24K6k49J43j13J24j27M9J86l9k45L46l81K42K0
$$ 130 -37 -152 73 36 192 143 -22 102 128 -121 22 -91 33 -94 -45 141 102 -143 203 -178 64 84
6389H4j53J36M8l08K30OK46p3l88K98j51j11K47j04j92P7j06L11n4l56M74m2k88
$$ 84 -69 67 115 -193 37 43 289 216 -172 126 -25 -136 111 7 -185 -108 -214 97 43 -313 161 119 -169
6412a69K97Q2l31l17L87J05l15J33K17j78O6J44k84R3n5K29j45nK45l15J83j52
$$ -169 128 210 -121 -438 -51 54 -261 -128 89 -89 -23 121 -163 -70 -125 104 -41 -46 199 -116 67 -85
6434h5j42N19n31R6J5J64K43l51J05K09k53K57k42P0j03l96M09L16l09O1k60J7
$$ -85 -227 292 -239 -143 -128 36 279 -72 33 242 -11 246 4 74 -29 -425 -16 300 -9 52 -208 -191
6456a91L6J40r9N2k06M82l33l3K5J32q8m9K85j74P3j56O4l5L35l36L8J13j35k87
$$ -191 -155 -15 -114 -62 -268 214 -119 -152 -127 5 -83 -132 153 -21 52 -104 -40 -75 260 -76 -38 75 -60 -347
6480c47K47M6K73k28R5J5L4o2j91j56K49k44L31K1m65K84K44k71j40K59J54m8
$$ -347 -100 -54 219 -9 86 101 135 73 -118 -274 -25 -269 62 83 -382 -98 146 -125 -265 -6 148 100
6502A00q0k24L57p3j95K51j61j99K18J57r3K17l65J70P7k01K42k23o3M60m26M0
$$ 100 20 -204 153 80 -115 136 -25 -224 -6 151 58 275 -90 80 157 -44 198 -25 -88 372 -54 -14
6524a4O8L8q6j01j69M08jj54P6j31J33O1n7j00O7l30M01l01L50k66Q1J02j79J46
$$ -14 54 92 6 -95 -264 144 143 -11 65 -66 67 128 71 -29 38 -292 109 -192 158 -108 -27 75 -104 42
6548D2J8J04LK42k41M6k12j86L72J2m18J58q2JK61m12J59P2K5j02J76k46L66j17
$$ 42 60 164 167 409 168 214 2 -184 188 200 -218 -60 -142 -141 120 -292 -133 -61 -36 -138 38 -208 158 41
6572D1M3J2J85k80q4L74j75o3OO8k47M8k13L40r2J70j82k04L31l73J21L14k95
$$ 41 84 96 281 1 -83 291 116 53 59 127 -120 -72 -285 55 -37 133 -49 -253 78 -295 -174 140 -155
6595a55N1R8J03qk63K61m8m9O1L8j27m5R8J52j77q5p2N3P2qJ66j72K02k75J28
$$ -155 -104 -6 97 89 -174 87 39 -10 51 89 -38 -83 15 167 -10 -95 -167 -114 -42 -50 116 -56 146 -129 -1
6620aPj37j05l9L20P0J9j42L02l55q0OJ44r6M14l70K54k26K44R3l03O8l41k2M67
$$ -1 6 -131 -236 -275 45 115 134 -8 294 -61 -141 -135 9 -87 327 -43 211 -15 229 322 19 87 -254 -276 191
6645A91m76J2L00k92L32R2L8m49K20J03L09l22o5J01K3q4j91N1L02l00L0L5J4
$$ 191 -285 -273 27 -265 67 159 197 -252 -32 71 380 58 -7 94 117 33 -158 -107 195 -105 -75 -40 -26
6668b6K16J87l26q1m5k17K21J84l25K32l66M77p9R7m14K01K5j02L01k60L0k46
$$ -26 190 377 51 -30 -75 -292 -71 113 -212 20 -346 131 52 149 -265 -64 -39 -141 160 -100 -70 -316
6690c16K02k94L92M9J09j66j16K39l01L50l5j27J96l45K01j05J41Mp2L4J94k01
$$ -316 -114 -408 -16 33 142 -24 -140 99 -202 148 113 -14 182 -163 38 -67 74 78 6 40 234 33
6712C3L8l06K32J33k87j16K76J94k26KN9j65N4Q6q9k04L09k36O09m53J2l2M1J40
$$ 33 71 -235 -3 130 -157 -273 3 197 -29 -27 32 -133 -79 7 -82 -286 23 -213 396 -57 -45 -77 -36 104
6736A04o5J35k33J43J46k50n7J28K4j00J33j40K89k37m0q0K27l86L70l36L46Q
$$ 104 39 174 -59 84 230 -20 -77 51 75 -25 108 -32 257 20 -20 -100 127 -259 111 -225 121 129
6758A29L9J3r5k96L98j11m3j42j95M23MLJ4l61R7O7K1k0K19m5j74L6J00l76N39
$$ 129 168 181 86 -210 188 77 34 -108 -303 120 124 127 141 -220 -123 -56 -35 -55 164 119 -55 -19 81 -295 244
6783B44l07j06j19q3O87k09k01k4N5n5o0K9J33j8j33J00K64k82j34J86K59j69
$$ 244 -63 -169 -288 -371 316 107 -94 -118 -63 -118 -178 -149 -16 -34 -167 -67 197 -85 -219 -33 226 57
6805E7J76k8j07j71j34J64Q0pr9j37K25k37M96l42J6J22n9Jl94J24J48r6J48r9
$$ 57 233 205 98 -73 -207 -43 37 30 -69 -206 19 -218 278 -64 -48 74 15 16 -378 -254 -106 -202 -54 -153
6829a53r4N94k21j36j54R0Q0P6r9K09k05J11P1k09K3J28M5k18j2J2K20j00k07
$$ -153 -247 347 126 -10 -164 -74 6 82 -17 192 -13 98 169 -40 -17 111 156 -62 -74 -62 158 58 -149
6852a49M0J87q4r2J23K75j79J15k27P0j6M8j74o2J21Q9k03J75J70k18j4L9KK4
$$ -149 -109 78 -6 -98 25 300 121 236 9 79 63 111 -63 -125 -4 85 -118 57 227 9 -5 34 36 60
6876F0j44Q0K44k82l71M39R6Rj1K6L7p3k47n6L6J10J39L5l3j19l6J80p3j27J14
$$ 60 -84 -4 240 -42 -413 26 122 131 120 146 183 110 -137 -193 -157 -47 92 127 94 -25 -61 119 46 -81 33
6901C3Q4n8K63l96J19M5j46%K54j5k88j46L59j85j0L74n52p5J51j57M51q%n9j84
$$ 33 117 59 322 -74 45 90 -56 -56 198 183 -105 -251 108 -77 -87 287 -265 -340 -189 -346 105 97 97 38 -146
6926a46M67p41N03l06J53j23M6K31P3l12J72j22K91j32p9L40l30K04m01P4j48
$$ -146 321 -420 83 -223 -70 -193 -147 84 157 -155 17 -105 186 54 -25 315 -15 189 -212 -138 -286
6947b86J47J44J47k54J22K3%j24L66k78R0J29l79j02L87J38j08o8k17J16q2K27
$$ -286 -139 5 152 -102 20 43 43 -81 285 7 97 226 -153 -255 132 270 162 94 -123 -7 -89 138
6969A38k6mj08J22J21n20L20l32K47j37K1M6j93K87J54k46j9j8K33J60j12j59
$$ 138 112 108 0 122 243 -277 43 -289 -42 -179 -158 -112 -305 -18 136 -110 -129 -147 86 246 134 -25
6991b5j0K28j21j72m6J18J4N0m3j35j00J62N4R4j22L43k02J61k22N0j64K41m20
$$ -25 -35 193 72 -100 -146 -28 -14 36 -7 -142 -242 -80 -26 68 -54 289 87 248 26 76 -88 153 -267
7014b67K84j3J90l5J74m19k0K03j19J8%K26k04N4j90K51m8j37j0J61k07M72M3
$$ -267 17 4 194 159 333 -86 -106 97 -22 -4 -4 222 18 72 -118 133 85 -52 -62 99 -108 364 407
7037D07l61K3k9K21l3j91k3J81%l11L52l62R4p2J69q0J23k00J39L17l08k22K34
$$ 407 46 69 40 261 228 37 14 195 195 -116 236 -126 -32 -104 65 -15 108 -92 47 364 56 -166 68
7060F8j7R7j90J90n5l53K20K09J0k83L8j6P9J51j5J81k02m82L15J6R5J9O6j7j64
$$ 68 51 148 -42 148 93 -260 -40 169 179 -104 -66 -82 -3 148 133 314 112 -370 -55 -39 56 75 141 124 -40
7085d0j31J59j05K14m67N59l07K35K3p5J32j98PL24m13J52J29p9n6j19J15j63
$$ -40 -171 -12 -117 97 -370 189 -118 117 140 65 197 -1 6 330 -83 69 198 119 63 -56 59 -104
7107a04J5J86J71l87J76k30J24K3j79J70m4J26O5Q2l41K50k67K93l57N49j92m36
$$ -104 -89 97 268 -119 57 -173 -49 -26 -205 -35 -79 47 112 194 -147 103 -164 129 -228 321 129 -307
7129c07K42K33j21O9m9Q2L0m18K75n0rJ2K63k42J16K10l13Q6o3k9L6j62J16L43
$$ -307 -65 168 47 116 67 149 179 -239 36 -14 -23 -11 252 10 126 336 23 109 46 17 53 -109 7 350
7153C50k69k89J88J77l97j56L60L1m4J7K2j11J93j07k7J30M4k19O0K63k04K5j68
$$ 350 81 -208 -20 157 -240 -396 -36 -5 -49 -32 -10 -121 72 -35 -62 68 112 -107 -47 216 12 37 -131
7176a31L29j50J08Kk67K14j47K37j95k27M83l08N6j8R1J57k25j06P2q3P0K44l23
$$ -131 198 48 156 158 -109 105 -42 195 0 -227 256 -52 4 -14 77 234 9 -97 -25 -108 -38 206 -117
7199a17J77k3k89L15o0J88k06J46O7l49r3N9J88L9P2j21J84k2l10j47K79K3P0
$$ -117 60 37 -252 63 3 191 -15 131 198 -151 -244 -185 3 42 114 -7 177 155 -155 -302 -23 0 70
7222G0l8N1k05J38M1o4j16J83Qj95R9k2M02m06M78l47k16j6L06K8j32k26K57l38
$$ 70 32 83 -122 16 57 -7 -123 60 68 -127 -28 -50 352 -54 424 77 -139 -155 151 179 47 -179 78 -260
7246b60M48q1n3j18L48l08O3R8Rj90k08K50m64L61K15k18m1L24j08m4Q0l36l2
$$ -260 188 107 54 -64 284 -24 39 137 146 -44 -252 -2 -466 -105 110 -108 -149 175 67 23 103 -233 -265
7269b65M16n4l62L55J83m33O0J85KR0k79j32L35k1M5ql70L03j9m3%p7Q2J66l81
$$ -265 151 97 -265 90 273 -160 -100 85 87 177 -102 -234 101 80 125 117 -253 50 31 -12 -12 -89 -7 159 -222
7294b22J55J14j03r5L36m2r9o2k5k0M6K47j28j14k45K93P9m07J92R5j20N37n62
$$ -222 -67 47 -56 -151 185 143 44 -18 -43 -63 -17 230 102 -12 -257 36 115 -292 -100 -5 -125 412 -150
7317a50J79m1l3L4q0N26n51n4P1J52mP4k34N3j70p0M40m69J84J89j45k2J30N9
$$ -150 29 -12 -45 -11 -91 435 -116 -170 -99 53 49 123 -111 -58 -228 -298 142 -327 -143 46 -99 -121 9 68
7341F8K17o20L12J68m3k32j7n1J40p6j14M25k69K83N2J4k31N5k39n2J64j74K47
$$ 68 285 -335 -23 145 102 -130 -147 -198 -58 -134 -248 177 -92 191 243 257 26 81 -158 -210 -46 -220 27
7364B7L3j97J46J46j55l6K0j42k24M27l93M31j50J73n8RQ6pk38k17L31l9J09j28
$$ 27 60 -137 9 155 0 -36 -16 -158 -382 45 -348 83 -67 106 48 57 143 136 -102 -319 12 -27 82 -46
7388d6K5M3K8j42J7p0K02k00M37k84r7J62j7%o1K87l40K36l96K49N6m9L8O4mj82
$$ -46 -21 22 50 -92 -75 -145 57 -143 294 10 -87 75 58 58 -3 284 -56 180 -216 33 89 40 78 142 138 -44
7414d4J79K03l89j57J35K22R2k98k07K12K2K96J4l55J33p5q1J93J5k56q3m0L00
$$ -44 135 338 -51 -208 -73 149 241 -57 -264 -52 -30 266 280 -75 58 -17 -98 95 110 -146 -229 -269 31
7437C1K52l90J20J25j05J5J91j70Mr5l63M10n9j39J86k13L52Q6n1p9k0k47K39
$$ 31 283 -107 13 138 33 48 239 69 73 -22 -385 25 -34 -173 13 -200 152 238 187 108 88 -159 80
7460H0l30O59k93l13L28j14j23K89j23O2j95M0J71r7n51M64j27q4L36l05j45J13
$$ 80 -250 409 116 -197 131 17 -106 183 60 122 -73 -33 138 41 -510 -46 -173 -257 79 -226 -371 -258
7482b58R1J10K73j45j31K45k92K37j67j9j95K80k21L52m75M35l08K15j25J02q7
$$ -258 -167 -57 216 71 -60 185 -107 130 -37 -56 -251 29 -192 160 -315 120 -188 27 -98 4 -83
7503h3r1L20l80m2K48M61l88J79l85K10l3k01L72k60J97k5J29%j6k51q9j2L53
$$ -83 -174 146 -234 -276 -28 433 45 224 -161 49 16 -185 187 -73 124 99 228 228 212 -39 -128 -140 213
7526B13n3k16K20j77P8k30J65L34L0k17Q8k01j12m0J33K93m01R3P2N7o7m6J25
$$ 213 160 -56 164 -13 65 -165 0 334 364 147 235 34 -78 -118 15 308 -93 0 72 129 62 16 141
7549A41l3k21r7J02P0J3J42j90jL1L97j82j03l1Q5l64K03R6k42Q8J14L06n31J06
$$ 141 108 -113 -210 -108 -38 -25 117 -73 -74 -43 354 172 69 38 123 -241 -38 58 -184 -96 18 324 -207 -101
7573a01J82p8j50j8K19l14K19O0m9q5N3L1r1l53N71p8k0L35q27L26Q8J74m12J69
$$ -101 81 3 -147 -165 54 -260 -41 19 -30 -115 -62 -31 -122 -475 96 18 -2 333 -494 -168 -80 94 -318 -149
7597a49L11j10R1KN2j5j20R9k56J4L10l23k1K82m15R9L30j10j2Q4p8r6J97o2l49
$$ -149 162 52 143 145 197 182 62 161 -95 -81 229 -94 -115 167 -248 -149 181 71 59 143 65 -31 166 104 -245
7622b45J1L27j5l22J11n5k8J89Q9r2K5j31P9O1j60M77k00j55j82M18j72l47L61
$$ -245 -234 93 78 -244 -133 -188 -216 -27 62 -30 -5 -136 -57 4 -156 321 121 -34 -216 202 30 -317 44
7645D4R7j37J22J22J7k61j97j5K91qk03N04l95j2M7J13J62j57K3r0j07k11K08
$$ 44 141 4 126 248 265 4 -193 -208 83 75 -128 376 -19 -31 16 129 291 134 157 67 -40 -251 -43
7668d3k15M13k61j30J34M08l27J08J16J5k82l4M4J8Oj19J01J1J58o7J94j58k07
$$ -43 -258 155 -106 -236 -102 306 -21 87 203 218 -64 -98 -54 -36 -30 -149 -48 -37 121 54 248 90 -117
7691a17K37k78m9K8L96j34J5J78r9l29M6N9J13j39J78j69k05O6K52k4J27L0P3
$$ -117 120 -158 -207 -179 217 83 98 276 177 -152 -106 -47 66 -73 105 -64 -269 -203 49 25 152 182 255
7714B55k52l01K14K92m99L44q5k28J60j30K23n1J45R0L9m31J16K0K35k3l97J06
$$ 255 3 -298 -84 208 -291 53 -32 -260 -100 -230 -7 -58 87 177 216 -215 -99 -79 156 133 -264 -158
7736a58Q7l1L27J8l25r7L2L02N5k08rL1j61L68o12L25n1l11K79K11k55J20K15
$$ -158 -71 -102 225 243 -82 -179 -147 155 210 2 -7 24 -137 231 -381 -56 -107 -418 -139 72 -183 -63 152
7759A52l33M55m00J45p4P5k5K50l7j25r2j12L85k40k6M10m15j61L57k49K38j70
$$ 152 -181 274 -126 19 -55 20 -5 245 208 83 -9 -121 264 24 -2 408 -7 -168 189 -60 178 8
7781HJp5j7J8J48l0j46K9m3P7J05q4R3K91m12l4M03k32J05j64j3K27k88j88J92
$$ 8 9 -66 -83 -65 83 53 -93 -64 -107 -30 75 -9 84 375 -37 -71 332 100 205 41 28 255 -33 -221 -29
7806b9J81o5j8n4k55K56j78l1K4j34J35L44l30J75j67K42l3o0k3Rk14J24K01N9
$$ -29 152 87 69 15 -240 16 -162 -193 -169 -303 -168 176 -154 21 -146 96 63 3 -20 -11 -225 -101 100 159
7830A59m8k09K37l55L33m10J63O2P0q2K70l2k47qK00k32o3m1L18l9J51l50J33
$$ 159 111 -98 139 -216 117 -293 -130 -68 2 -80 190 158 -89 -97 103 -129 -192 -233 85 46 197 -153 -20
7853b0K44l12j21L03j95K07J57r9j5l75L24O6ll42K54j59n4L03l80L80q2j19J39
$$ -20 224 -88 -209 94 -101 106 263 164 149 -226 98 164 161 -181 73 -86 -140 163 -217 163 81 -38 101
7876A01n09K12l3J92m09N51j72J2L7M2pn1J66n7k65J95l00J92k6JP1q1L54j76
$$ 101 -408 -196 -229 -37 -446 105 -67 -55 -18 24 17 -34 132 75 -190 5 -295 -103 -129 -128 -57 -138 216 40
7900D0j52J10L1n1M9l42M96n3j46P0J49k54N8k09K69pO4l33J0K48r3J47K5j79
$$ 40 -112 -2 29 -22 27 -315 181 128 -18 52 201 -53 5 -204 65 58 122 -211 -201 47 -46 101 126 -53
7924e3L94j79k89J43l58L43j55Q6J9M1mO9J6k45K00L33p00O90j53k70J00K78j32
$$ -53 341 162 -127 16 -342 1 -154 -68 -49 -8 -12 57 73 -172 28 361 -339 351 198 -72 28 306 174
7947A74N4k65P5j07J82m33L23P8k89L23ok30m0J87j64o9L20k8k27L8J08J71l65
$$ 174 228 -37 38 -69 113 -320 3 81 -208 115 109 -121 -161 26 -138 -207 113 85 -142 -104 4 175 -190
7970a90K18k36N42n16K32j1k98J54K50k60K8M29j98k56J02N3k17P3O6R6p3J12
$$ -190 28 -208 334 -182 50 39 -259 -105 145 -115 -87 342 144 -112 -10 43 -174 -101 -35 61 -12 100
7992A00l00L04j6k06p4L19j41q2J6n0L19L9l08Q1k75J40j47K92N1J00q3J04j81
$$ 100 -200 104 88 -118 -192 127 -14 -96 -80 -130 189 228 -80 1 -274 -134 -281 11 62 162 79 183 2
8015BQ6j2n0K07l63o2J2K21q3J97j64m14N30j70Q6o0J55j43p1J44K06Pl06O8J26
$$ 2 88 76 26 233 -130 -192 -180 41 -42 155 -9 -423 107 -63 23 -37 118 -25 -96 48 254 261 -45 23 149
8040A49q7l31K23j54P8J29j39o3K49P4j15o2N0L33m86L3J25Q4k4p3K2j13r0J02
$$ 149 62 -269 -46 -200 -122 7 -132 -195 54 128 13 -49 1 334 -152 -119 6 90 66 -7 15 -98 -188 -86
8064h6K58m02nJ38r7J58j1p7L28R1l39K46j28k83N06m50J44O3k39k2K14r8J19
$$ -86 172 -230 -235 -97 -194 -36 -47 -124 204 295 -44 202 74 -209 297 -153 -9 54 -185 -207 7 -91 28
8087B8L3k99K05J05j15N8P0J08N7k19L6pl20L97j32N1j17O0l0M8N6l4l09J46M31
$$ 28 61 -238 -33 72 -43 15 85 193 250 31 67 60 -260 137 5 56 -61 -1 -31 17 73 39 -270 -124 307
8112C07m90M35l48O5Q3j45K35j94J48j97J6O9r9o3J67K51q7l33J84K19n39N81
$$ 307 -183 252 -96 -31 52 -93 142 -52 96 -101 -85 -16 -115 -178 -11 240 153 -180 4 223 -316 265
8134B65k27nJ38M0j12K0k69JL37j48n4l5k14L53p3J92O4j67K52o07J17R8L26m29
$$ 265 38 33 171 211 99 119 -150 -149 188 40 -14 -49 -263 90 17 209 273 106 358 -249 -132 -34 292 -137
8158a37K46k04J20J15j86J93j05k94M56q0k12J22J84j5k27j33J77L8J23k16J89
$$ -137 109 -95 25 140 -46 147 42 -252 204 124 -88 34 218 203 -24 -157 20 58 181 -35 154
8179A54j09K78j82L4j82J53o7J97k68P8N3j63
$$ 154 45 323 141 175 -7 146 79 276 8 86 139 -24
8191b4
$$ Imaginary data points
##PAGE= N=2
##DATA TABLE= (X++(I..I)), XYDATA
0@%%%%%%%%Qj6J6j6J6k4L2l4M2n0N8p2Q5r6J10j28J51j72J96k25K53k86L24l63
$$ 0 0 0 0 0 0 0 0 0 8 -8 8 -8 8 -16 16 -18 24 -26 32 -40 45 -51 59 -69 82 -90 106 -119 134 -152 172 -191
32a91M06m55N10n68O32p04P81q66R58j061J176j302J443j600J776j975K202k470
$$ -191 215 -240 270 -298 334 -370 411 -455 503 -558 618 -684 759 -841 935 -1040 1162 -1308
50a308K783l155L610m180M917n911P335r561J3571k3045Q5436P9487j20253j2802
$$ -1308 1475 -1680 1930 -2250 2667 -3244 4091 -5470 8101 -14944 70492 149979 29726 16924
64A6924N8038K8452n7889p519M3867J9220l6880p838K1622L777k7556l873J8241
$$ 16924 74962 103414 45525 38006 81873 101093 64213 56375 77997 81774 54218 50345 68586
77F8586J2148p976q397m451M280K529p063j1513Q335J6247n788k3911l795J4085
$$ 68586 80734 72758 64361 59910 64190 66719 59656 48143 56478 72725 66937 43026 39231 53316
91E3316k82j0670O720J0553j2439k1272J18J1826J849n088l208n819j348J0591
$$ 53316 53034 42364 49084 59637 47198 25926 26044 37870 39719 34631 31423 25604 24256 34847
105C4847L91k2457j4621J5523J2694j4789p683J6337J352k7217q632K3500O202
$$ 34847 35238 12781 -1840 13683 26377 11588 3905 20242 21594 -5623 -14255 9245 15447
118A5447k5515r818J9301P741j5989o786R365J24r518j433M6o812K328J3731l77
$$ 15447 -10068 -19886 -585 7156 -8833 -15619 -6254 -6130 -15648 -17081 -17035 -23847 -21519 -7788 -8165
133h165j5017k298R329m335j0537O205J0373q973j0134J2367J3790r661j6233
$$ -8165 -23182 -25480 -16151 -20486 -31023 -24818 -14445 -23418 -33552 -21185 -7395 -17056 -33289
146c3289l58P789M459M213K87r903n537J2256Q981r438p060Q298L734p985M99
$$ -33289 -33647 -25858 -21399 -17186 -16899 -26802 -32339 -20083 -11102 -20540 -27600 -19302 -15568 -23553 -23054
161b3054J0315k714j0837Q993J5770q692j8291O527J8549l690j4680K750J4377
$$ -23054 -12739 -15453 -26290 -17297 -1527 -10219 -28510 -21983 -3434 -7124 -21804 -19054 -4677
174d677K085n318K31j591m550K381O116j06j640O032J719q723q06J1547J067j4365
$$ -4677 -2592 -7910 -7679 -9270 -13820 -11439 -5323 -5429 -7069 -1037 682 -8041 -8847 2700 3767 -10598
190a0598m171J3811P437n942j060N208l771o715K839M019m114j454Q178L056n072
$$ -10598 -14769 -958 6479 537 -523 4685 914 -5801 -2962 1057 -3057 -4511 3667 6723 1651
205A651q05K664p415n709R254Q797q724p455J2014P062j4373j1414J0826R732
$$ 1651 846 3510 -3905 -9614 -360 8437 -287 -7742 4272 11334 -3039 -14453 -3627 6105
219F105p151l787O901j439j0824J24J0385J007n848K96J978n198k128M341k301
$$ 6105 -1046 -4833 2068 629 -10195 -10071 314 1321 -4527 -4231 -2253 -7451 -9579 -5238 -7539
234g539o403P119J3069l968j5638j591O885m492n754R262J0688n630q422L602
$$ -7539 -13942 -6823 6246 2278 -13360 -14951 -8066 -12558 -18312 -9050 1638 -3992 -12414 -8812
248h812K031r435n321P909P780n67j367j430n293j207M799n45o672L040R948j772
$$ -8812 -6781 -16216 -21537 -13628 -5848 -6415 -7782 -9212 -14505 -15712 -10913 -11458 -18130 -15090 -5142 -6914
264f914j0355J238Q802m499p518O694J0061p827j1400N187R486k485l922M595
$$ -6914 -17269 -16031 -7229 -11728 -19246 -12552 -2491 -10318 -21718 -16531 -7045 -9530 -13452 -8857
278h857O67n784J150M849m770o814Q252J0547n687q278N188N302q023m277R169
$$ -8857 -8190 -13974 -12824 -7975 -12745 -19559 -11307 -760 -6447 -14725 -9537 -4235 -12258 -16535 -7366
293g366M820q134k694Q774K790p609j140N609Q8m310J534J831j793P87O114O26
$$ -7366 -2546 -10680 -13374 -4600 -1810 -9419 -10559 -4950 -4862 -9172 -7638 -5807 -7600 -6813 -699 -73
309g3n280J1K116n122k189Q307N463p260k765J0197K882j3447o743J0023O573
$$ -73 -5353 -5342 -3226 -8348 -10537 -2230 3233 -4027 -6792 3405 6287 -7160 -13903 -3880 2693
324B693n130n55O683n21p528k34M729k047k436M995K142m741J92N096l424p871
$$ 2693 -2437 -2992 3691 3170 -4358 -4592 137 -1910 -4346 649 2791 -1950 -1758 3338 -86 -7957
340g957M846J0347l858j1272K593R426k415q056L157P932k080n610K05J080k565
$$ -7957 -3111 7236 3378 -7894 -5301 4125 1710 -6346 -3189 4743 2663 -2947 -2742 -1662 -4227
355d227k77K610R07N90K205j765o286K56N074j137o493K258Q860j496o833K494
$$ -4227 -4504 -1894 -987 -397 1808 43 -6243 -5987 -913 -2050 -8543 -6285 2575 1079 -5754 -3260
371c260M047p437o126Q558P035q464n857R096P022q741p057M870L138m512O41
$$ -3260 787 -6650 -12776 -4218 2817 -5647 -11504 -2408 4614 -4127 -11184 -6314 -3176 -7688 -7047
386g047N027r87l666L819J825p671m520Q254N352o715m010P585L610p394l478
$$ -7047 -2020 -3007 -6673 -2854 -1029 -8700 -13220 -4966 386 -6329 -10339 -2754 856 -6538 -10016
401a0016N306K929l600j016K173j63q4J305j162k542L015N843k699o591J283L810
$$ -10016 -4710 -1781 -5381 -6397 -4224 -4387 -4471 -3166 -4328 -6870 -3855 1988 -711 -7302 -6019 -2209
417b209k099j821N584M674m833l887L291J105n215k84O214K068k043R32J128l891
$$ -2209 -4308 -6129 -545 4129 -704 -4591 -1300 -195 -5410 -5694 520 2588 545 1477 2605 -1286
433a286k665L139J379l809L133P627k217q253J707O968m120p151N862Q229n303
$$ -1286 -3951 -812 567 -3242 -109 7518 5301 -2952 -1245 5723 1603 -5548 314 8543 3240
448C240p798N768P607n828o572N496M719n815m211N200L364l435q61K190j049
$$ 3240 -4558 1210 8817 2989 -3583 1913 6632 817 -3394 1806 5170 1735 874 3064 2015
463B015j912K189L44n331J60O800R28p218j005O588j28p525p42O746P2m926p31
$$ 2015 103 2292 2636 -2695 -2535 4265 5193 -2025 -3030 3558 3430 -4095 -4837 1909 1981 -2945 -3676
480c676L331n62j271J515r14l048K41J592k435j772L700K666l381k514L208j100
$$ -3676 -345 -907 -2178 -663 -1577 -4625 -4384 -2792 -5227 -6999 -3299 -633 -4014 -6528 -3320 -4420
496d420o613L75O913O0o377K301O777k823r235n36N478J71k863K961K445l559
$$ -4420 -11033 -10658 -3745 -3685 -10062 -7761 -984 -3807 -13042 -13578 -8100 -7929 -10792 -7831 -5386 -8945
512h945k399J657l60l468J798M257j868l830L057L192n026l719N247L879m980
$$ -8945 -11344 -9687 -10047 -13515 -11717 -7460 -9328 -13158 -10101 -6909 -11935 -15654 -10407 -6528 -11508
527a1508k964L746J254l781J69M351m49l268K140K126l427k971L386K263k208
$$ -11508 -14472 -10726 -9472 -13253 -13084 -8733 -9182 -12450 -10310 -8184 -11611 -14582 -11196 -8933 -11141
542a1141J568M563l114o222L465O219l564o300L964P665j971n246L210L105l654
$$ -11141 -9573 -5010 -8124 -14346 -10881 -4662 -8226 -14526 -10562 -2897 -4868 -10114 -6904 -3799 -7453
557g453k965M372K304k706P0M131R72l024O4J326k112k23M008J527k810L29L876
$$ -7453 -10418 -6046 -3742 -6448 -6378 -2247 -1275 -4299 -4235 -2909 -5021 -5244 -1236 291 -2519 -2190 1686
574A686J8l466j00K641j352r84M606K684l920k954L631J924k142k99K647j348
$$ 1686 1704 -1762 -1862 779 -573 -1557 3049 5733 1813 -1141 2490 4414 2272 1973 4620 3272
590C272j844L264K158m688j791N664L089n539k703N259J301n980j67P266J09o650
$$ 3272 1428 4692 6850 2162 371 6035 9124 3585 882 6141 7442 1462 1295 8561 8670 2020
606B020P10O037j653o977m21N551R62j037R49k81l440o77K481r86l149J697L397
$$ 2020 2730 8767 7114 137 -284 5267 6229 5192 6141 5860 2420 1743 4224 3238 89 1786 5183
623E183j694k037K341L42m985j903M689J291l413j125L212J8l389M04J568k706
$$ 5183 3489 1452 3793 4135 -850 -2753 1936 3227 -186 -1311 1901 1919 -1470 -1066 502 -2204
639b204j660L363J444m575j666M303R39l827l56K393k639k966M468M101n344m790
$$ -2204 -3864 -501 943 -3632 -5298 -995 -56 -3883 -4239 -1846 -4485 -7451 -2983 1118 -4226 -9016
655i016M694M766m482m220L842K115m014j445L931J532l219r25L090j69j676M95
$$ -9016 -4322 444 -4038 -8258 -4416 -2301 -6315 -7760 -3829 -2297 -5516 -6441 -3351 -3520 -5196 -4701
671d701k33k246J444M599m68m086R42M985j909n573Q76N241n8j505K250J749l635
$$ -4701 -4934 -7180 -5736 -1137 -1605 -5691 -4749 236 -1673 -7246 -6370 -1129 -1187 -2692 -442 1307 -2328
688b328j022L190R28l378J184L554o7j478K473J352m496j842M853L110l094j833
$$ -2328 -3350 -160 768 -2610 -1426 2128 2061 583 3056 4408 -88 -1930 2923 6033 2939 1106
704A106M149J83l118J393M212j949m368K981M988k323m857K726M582j021k852
$$ 1106 5255 5438 2320 3713 7925 5976 1608 4589 9577 7254 2397 5123 9705 8684 5832
719E832J770O64j788N66K565k036j945L073L152k208k720K087P18l393k37M893
$$ 5832 7602 8266 6478 7044 9609 7573 5628 8701 11853 9645 6925 9012 9730 6337 6100 10993
735A0993P36m028p66L387M19k193k41k56j490Q14L720m1l885m2L399j561l849
$$ 10993 11729 7701 6935 10322 10741 8548 8307 8051 6561 7375 11095 11054 7169 7127 10526 8965 5116
752E116J339K863k000k132L552K139m484k656L944J112m241q03L911O62l003M98
$$ 5116 6455 9318 7318 5186 8738 10877 6393 3737 7681 8793 4552 3749 7660 8322 5319 5817
768E817K030k685l390L320L381k938l195K504J381k471J09L493j438m856J346
$$ 5817 7847 5162 1772 5092 8473 5535 2340 4844 6225 3754 3863 7356 5918 1062 2408
783B408N319j932m800Q05M468o43k273O49J434k078j429J460M57p18O84R66p94
$$ 2408 7727 5795 995 1800 6268 5625 3352 4001 5435 3357 1928 3388 3845 3127 3811 4777 3983
800C983p81J571o31l540O96M257r4l578L02L828q81l677O54J645j576j186L579
$$ 3983 3202 4773 4142 602 1298 5555 5461 1883 2185 6013 5132 1455 2109 3754 2178 992 4571
817D571J927l723k030L087O54k237m58K397j427k166K948L347l956l136K644K331
$$ 4571 6498 2775 745 3832 4486 2249 1791 4188 2761 595 3543 6890 2934 -202 2442 4773
833D773l457j144L616N17m573P33M201k78m746J41M307r91l692R40K393j546q65
$$ 4773 1316 172 3788 4305 -268 465 4666 4388 -358 -217 4090 3099 -593 347 2740 1194 329
850C29K442m02l329M54L552j108m002P79L189q26j290K128O60m337j917M252J913
$$ 329 2771 2369 -960 -506 3046 1938 -2064 -1285 1904 1078 -212 1916 2576 -1761 -3678 574 2487
867B487l611r54K955P82k430R3P99k235q00K083K236k122m76J873j15l456P18
$$ 2487 -1124 -2078 877 1659 -771 -678 121 -2114 -2914 -831 1405 -717 -1193 680 565 -2891 -2173
884b173K300q70k181K240K215k468k134K213J688k423j230K610L61k124N73K605
$$ -2173 127 -743 -2924 -684 1531 -937 -3071 -858 830 -1593 -2823 -213 148 -1976 -1403 1202
900A202j196k654J936K108j510j985J826N12k643Q41M354l80l820J03L296j256
$$ 1202 6 -2648 -712 1396 -114 -2099 -273 239 -2404 -1563 2791 2411 -1409 -1306 1990 734
916G34k861J931K199j972j670L635K119m331j555K757J052k507n6K803m60k050
$$ 734 -2127 -196 2003 31 -1639 1996 4115 -216 -1771 986 2038 -469 -525 2278 1818 -232
932b32J272K198k583k243K576K401k777j759K720K071k439o19J439r18j814J296
$$ -232 1040 3238 655 -1588 988 3389 612 -1147 1573 3644 1205 586 2025 1107 -707 589
948E89K268j092j389Q97M92r12L02J055j717k141K168L260j865k721J872J457
$$ 589 2857 1765 376 1273 1765 853 1155 2210 493 -1648 520 3780 1915 -806 1066 2523
964B523k131j480K948O62l237l17K793k67k647P73K983j180k989J154J853j569
$$ 2523 392 -1088 1860 2522 -715 -1032 1761 1494 -1153 -380 2603 1423 -1566 -412 1441 -128
980a28j405K209N78k470K78K720j191k914N24K754j464j955K932K460l434k899
$$ -128 -1533 676 1254 -1216 -938 1782 591 -2323 -1799 955 -509 -2464 468 2928 -506 -3405
996c405K321K427k222j547K057R08j618J02J230p93j740M94J013l49q6J528k42
$$ -3405 -1084 1343 -879 -2426 -369 539 -1079 -977 253 -540 -2280 -1786 -773 -1122 -1208 320 78
1013G8k558M18K645j233j993J431J902k000j596K328J379k222j188K213K29k568
$$ 78 -2480 -2062 583 -650 -2643 -1212 690 -1310 -2906 -578 801 -1421 -2609 -396 -167 -2735
1029b735P49K854k67l652O30K991l66j900R12J145k464q11K822J261k422n70K503
$$ -2735 -1986 868 601 -3051 -2421 570 204 -1696 -784 361 -2103 -2914 -92 1169 -1253 -1823 680
1046F80l25j981M77K100j303j894J162J946l61q41L67j7j305O6J876l48r47R86
$$ 680 355 -1626 -1149 951 -352 -2246 -1084 862 501 -340 27 10 -1295 -1229 647 299 -648 338
1064C38R71k017q07K151J130k115j203K348J115k204L83J605q02k107J160J644
$$ 338 1309 -708 -1515 636 1766 -349 -1552 796 1911 -293 90 1695 893 -1214 -54 1590
1080A590o76j243J383J07j711K80K413l0k859J19K455j038j942J802J858j560
$$ 1590 914 -329 1054 1161 -550 -270 2143 2113 -746 -627 1828 790 -1152 650 2508 948
1096I48k028J839J986k154j700J775J119j669m98K458o0j730l78P53k3j11M24
$$ 948 -1080 759 2745 591 -1109 666 1785 116 -382 2076 2016 286 -92 661 638 527 951
1113I51N29j500J28J379l3j509N40J188j465j764K098J811k215p69J494O40j709
$$ 951 1480 -20 108 1487 1454 -55 485 1673 208 -1556 542 2353 138 -631 863 1503 -206
1130b06j019K569k01k120K73K028m36j168N99Q46k057q78K279P75j915q01J751
$$ -206 -1225 1344 1143 -977 -704 1324 888 -280 319 1165 -892 -1770 509 1284 -631 -1432 319
1147C19j97j443L36J801m23k687J210J578j133j066J194N91j786j42J682O6k259
$$ 319 122 -1321 -985 816 393 -2294 -1084 494 -639 -1705 -511 80 -1706 -1848 -166 -100 -2359
1164b359N62J501p10j352J718Q83j852j479K117K39j772O49J715j51k218J99J572
$$ -2359 -1797 -296 -1006 -2358 -640 243 -1609 -3088 -971 -732 -2504 -1855 -140 -291 -2509 -2310 -738
1181g38l05j498L67J269p63n24J260L08j869k66J323K11q76L67J000j379r46J855
$$ -738 -1043 -2541 -2174 -905 -1668 -2192 -932 -624 -2493 -2759 -1436 -1225 -2101 -1734 -734 -2113 -3059 -1204
1199a204R28j311j424J814N07j207m1J189k73j373P58J209o96j139J523J99j235
$$ -1204 -276 -1587 -3011 -1197 -690 -1897 -1938 -749 -1022 -2395 -1637 -428 -1124 -2263 -740 -541 -1776
1216a776p15J831M41j837P53J649j120j794J238J917q51k067J120J557j233m74
$$ -1776 -2491 -660 -219 -2056 -1303 346 -774 -2568 -1330 587 -264 -2331 -1211 346 -887 -1361
1232a361J159L00j827R4K243j92j389J76J081q81r07J425J249k123l59K134J62
$$ -1361 -202 98 -1729 -1635 608 416 -973 -797 284 -597 -1504 -79 1170 -953 -1312 822 984
1249I84j574l46J722j42k006M62J875m74j756P91J315r73j078R27Q25p29m74O11
$$ 984 -590 -936 786 644 -1362 -900 975 501 -1255 -464 851 -122 -1200 -273 552 -177 -651 -40
1267d0o8n44Q73K53q62r33J272K69r45r5Q47j5j478J141J407j003j657L68J163
$$ -40 -108 -652 221 474 -388 -1321 -49 220 -725 -820 27 12 -1466 -325 1082 79 -1578 -1210 -47
1286d7m76m24Q36Oj492J60J341kj621N84J271q22j163J193R05j138r32J624J96
$$ -47 -523 -947 -111 -105 -1597 -1437 -96 -98 -1719 -1135 136 -686 -1849 -656 249 -889 -1821 -197 -1
1305aj669k62J799M98k079J32J293L8j029L96P75j419p32J641J244j262j034Q32
$$ -1 -1670 -1932 -133 365 -1714 -1582 -289 -251 -1280 -884 -109 -1528 -2260 -619 625 -637 -1671 -839
1323h39K08n12L27R07j83j834Q81J056k99n74L54K08n69P5Q55j45j044K69Q71
$$ -839 -631 -1143 -816 91 -92 -1926 -1045 11 -288 -862 -508 -300 -869 -794 61 -84 -1128 -859 12
1342A2l25n95P92M44j159n57J124M00j455M41J760m45k091L09J514o1r16k7J045
$$ 12 -313 -908 -116 328 -831 -1388 -264 136 -1319 -878 882 437 -1654 -1345 169 108 -808 -835 210
1361B10q89k54O11M33r99p97J302j90k72K77Q12j573m51J006Q43j254q85J268
$$ 210 -679 -933 -322 111 -888 -1685 -383 -573 -845 -568 244 -1329 -1780 -774 69 -1185 -2070 -802
1379h02M83j224k27J154p0j339O9Q00q4j060O35R17n26q13O53M21q87N9Q81n99
$$ -802 -319 -1543 -1770 -616 -686 -2025 -1956 -1156 -1240 -2300 -1665 -748 -1274 -2087 -1434 -1013 -1900 -1841 -960 -1559
1399a559r24R06J119q95j232Q12Q56j142R3J116O7j477n9J256L19q67k80J283
$$ -1559 -2483 -1577 -458 -1353 -2585 -1773 -917 -2059 -1966 -850 -783 -2260 -2319 -1063 -744 -1611 -1891 -608
1417f08o73p77R75R27j019m90J218p8p71n2J169k89r58N19J056n56p70Q91N15
$$ -608 -1281 -2058 -1083 -156 -1175 -1665 -447 -525 -1296 -1348 -179 -468 -1426 -907 149 -407 -1177 -286 229
1436B29r93m69J439J58l86j25L37k14p16J173P37p83o30P16M94m26j62J010k52
$$ 229 -764 -1233 206 364 -22 -147 190 -24 -740 433 1170 387 -243 473 967 541 379 1389 1137
1455A137j109L74Q05l69j013N17J045n23q49J199K99j021k65Q45q5o99L34J222
$$ 1137 28 402 1207 838 -175 342 1387 864 15 1214 1513 492 227 1072 987 288 622 1844
1473A844m46j438O09R35r61n96J054M70j224n17J030M48j140k79R54O1j208M79
$$ 1844 1398 -40 569 1504 543 -53 1001 1471 247 -270 760 1208 68 -211 743 804 -404 75
1491G5P33o19p37L76N39q03k3L82j19p28K71O86n35k54N25Q2q90m59J233J78r63
$$ 75 808 189 -548 -172 367 -436 -459 -77 -196 -924 -653 33 -502 -756 -231 -149 -1039 -1498 -265 -87 -1050
1512a050l30P56jq49J72O93j17j203M91M84l68l09P62mq06J34P69j1j223L07Q58
$$ -1050 -1380 -624 -625 -1474 -1302 -609 -726 -1929 -1438 -954 -1322 -1631 -869 -873 -1679 -1545 -776 -787 -2010 -1703 -845
1533h45m28m78M61O66o63o91O86N81p20k50J107j20q02L22N16j28j87L95L10r61
$$ -845 -1273 -1751 -1290 -624 -1287 -1978 -1292 -711 -1431 -1681 -574 -694 -1496 -1174 -658 -786 -973 -578 -268 -1229
1553a229l1Q18M43r34k12J207l14p66O27Q12o83j370J252J249o81m53O15M22j159
$$ -1229 -1260 -442 1 -933 -1145 62 -252 -1018 -391 421 -262 -1632 -380 869 188 -265 350 772 -387
1572c87M2J138o8o10M3L65j77l54N02O05m21n19O10L72p55K65O53l7p82J71N61
$$ -387 -345 793 725 115 158 523 346 -8 494 1099 678 159 769 1141 386 651 1304 1267 485 656 1217
1593A217l22k87P18j48o83M15N98m94n85O36R6l3n17R02M18j262pM66L94r93J00
$$ 1217 895 608 1326 1178 495 910 1508 1014 429 1065 1161 1128 611 1513 1931 669 662 1128 1522 529 629
1614F29J307n14q96J46J124m65r85L76J451r53q72N82O77p62j018J276J43l24
$$ 629 1936 1422 526 672 1796 1331 346 722 2173 1220 348 930 1607 845 -173 1103 1246 922
1632I22k53N27j44j165L69J083m08l84J53M17o12l56N78M11o53p5M61k94m80L29
$$ 922 669 1196 1052 -113 256 1339 931 547 700 1117 505 149 727 1138 485 410 871 577 97 426
1652D26O21r56q0L74M16n47k23N34M7j152N87P22k23m42k64M6n47J65R87j77j047
$$ 426 1047 91 11 385 801 254 31 565 612 -540 47 769 546 104 -160 -114 -661 -496 491 314 -733
1673g33L0Q58j43p18J65Q01l37q24K96O29l61l21O40Q6j271L9Q85L02j007O0M95
$$ -733 -703 155 12 -706 -541 260 -77 -901 -605 24 -337 -658 -18 68 -1203 -1164 -279 23 -984 -924 -429
1694d29J32p40N89L71r15m28P58M23k67o66P37j49q27N57J043n90p85K13Q33o14
$$ -429 -297 -1037 -448 -77 -992 -1420 -662 -239 -506 -1172 -435 -584 -1411 -854 189 -401 -1186 -973 -140 -754
1714g54o15M69L03m44L23K4J70k49K91L6n73k2M10O24p06m05O73l1n61M43P19
$$ -754 -1369 -900 -597 -1041 -718 -694 -524 -773 -482 -446 -1019 -1041 -631 -7 -713 -1118 -445 -476 -1037 -594 125
1735A25k46n86j92O38Jk44L46M07m80q12J171J50j095J25N61N36n58m5O75p0p42
$$ 125 -121 -707 -899 -261 -260 -504 -158 249 -231 -1043 128 278 -817 -692 -131 405 -153 -198 477 407 -335
1756c35k6Q11k89k40O52K58q67k07P91J46m74L18K67l06m66M67L03k73j36L35
$$ -335 -361 450 161 -79 573 831 -36 -243 548 694 220 538 805 499 33 500 803 530 394 729
1776G29k66k86M76N45o08n88Q06L76m35o44N55K09m45k34P58M85j071j61R90m08
$$ 729 463 177 653 1198 590 2 808 1184 749 105 660 869 424 190 948 1433 362 201 1191 783
1796G83l71M22O50q13m22P95O9n94l05P49K05q80o1Q94k6p98%L92J19l91N43K44
$$ 783 412 834 1484 671 249 1044 1113 519 214 963 1168 288 227 1121 1095 297 297 689 808 417 960 1204
1818A204p13l51K96L66m1j74L61l32p96Q92N63o46n30R00k02l85J4O46N6r55K24
$$ 1204 491 140 436 802 761 587 948 616 -180 712 1275 629 99 999 797 412 426 1072 1128 173 397
1839C97Q06m10k07J51L90m10m75M16L25j87l07N30m99n08M31O46k4j164R00jj42
$$ 397 1203 793 586 737 1127 717 242 658 983 796 489 1019 520 12 443 1089 1065 -99 801 800 658
1860F58n05O13L33q50m2L89M88m74j77q7rr0K78L40n76j37J57L43n34N06J88o12
$$ 658 153 766 1099 249 207 596 1084 610 433 346 337 247 525 865 289 152 309 652 118 624 812 200
1882B00l54L41P52p50j93M70K55m66p38M83O14n35j19K16R7n31J10L59L4q24K79
$$ 200 -154 187 939 189 -4 466 721 255 -483 0 614 79 -40 176 273 -258 -148 211 245 -579 -300
1903c00N64m63J39J69m32j85J47Q69l44p00P9N89m02l38M92J37o5r68P45M03l30
$$ -300 264 -199 -60 109 -323 -508 -361 508 164 -536 -457 132 -270 -608 -116 21 -44 -1012 -267 136 -194
1924a94l16M68l78L11k22M85m56j82P09k27o07L40P10K64r80p8L01L81n42K69
$$ -194 -510 -42 -420 -109 -331 154 -302 -484 225 -2 -609 -269 441 705 -275 -353 -52 329 -213 56
1944E6O29o57n50P65P51o00j71J5J89m05N71K33K0r84N49N39ol03K7K49l62J75
$$ 56 685 28 -522 243 994 394 223 238 427 22 593 826 846 -138 411 950 944 641 668 917 555 730
1966G30M43L93o85j89Q17l19o8l5O03l49k52Q3J33mJ33K36j30j60M8K50k59k07
$$ 730 1173 1566 881 692 1509 1190 1122 1087 1690 1341 1089 1172 1305 1301 1434 1670 1540 1380 1428 1678 1419 1212
1988A212K22O7n50K86P52j7p01o94R21J73p11K03J42j30p12L31N86m30m08M86
$$ 1212 1434 1501 951 1237 1989 1972 1271 577 1498 1671 960 1163 1305 1175 463 794 1380 950 542 1028
2008A028J98n94J06J99P5o17K07M07j35n15J99K12Q0m67j69K33j10k80m5L11r19
$$ 1028 1226 632 738 937 1012 395 602 1009 874 359 558 770 850 383 214 447 337 57 12 323 -596
2029e96K88P35n4m94o66M48J77k66Q7k4n34m7L38M54n67j07K14m27J71P9L11j65
$$ -596 -308 427 373 -121 -787 -339 -162 -428 -341 -365 -899 -946 -608 -154 -721 -828 -614 -1041 -870 -791 -480 -645
2051f45o61M97rk22R8j00l6k03K77J92l71k29N30K14m05n30N92P17m62m77M08
$$ -645 -1306 -809 -818 -1040 -942 -1042 -1078 -1281 -1004 -812 -1183 -1412 -882 -668 -1073 -1603 -1011 -294 -756 -1233 -825
2072h25o4k09N65L37m82k87L03M33j27j84J00l3k25k15J140k13l69Q9P19o27r0
$$ -825 -889 -1098 -533 -196 -678 -965 -662 -229 -356 -540 -440 -473 -698 -913 227 14 -355 -266 453 -174 -264
2093b64K01O03j80k43L50R1k32RJ79J6l53K20L01l89L84j38M30o02J64P04O5q23
$$ -264 -63 540 360 117 467 558 326 335 514 530 177 397 698 309 693 555 985 383 547 1251 1316 493
2115D93k05N15K75j79L4K09j54n62L77O20jr41j63L41J89j03L01j9o89M82j36
$$ 493 288 803 1078 899 933 1142 988 426 803 1423 1422 481 318 659 848 745 1046 1027 338 820 684
2136F84k15k27J24L64j23o41L99K68o78M32O8m3n96M87R4k96K1Nk44k27k7M83
$$ 684 469 242 366 730 607 -34 365 633 -45 387 455 412 -184 303 397 101 122 127 -117 -344 -371 112
2158A12l40k59K6L67l90k84L06j08%k90L54P3l70n84M88K21j76o7K16n33J33j91
$$ 112 -228 -487 -461 -94 -484 -768 -462 -570 -570 -860 -506 -433 -803 -1387 -899 -678 -854 -921 -705 -1238 -1105 -1296
2180a296M15k12j53N46J30o48m46N25J16k6k2k44K0j92K05M21j78p00L46L10n
$$ -1296 -881 -1093 -1246 -700 -570 -1218 -1664 -1139 -1023 -1049 -1071 -1315 -1295 -1487 -1282 -861 -1039 -1739 -1393 -1083 -1088
2201a088k48L20j55j85K28L28j56j6j06J99r6J5R2n8J7n3M10L39r07J76N52J38
$$ -1088 -1336 -1016 -1171 -1356 -1128 -800 -956 -972 -1078 -879 -975 -960 -868 -926 -909 -962 -552 -213 -1120 -944 -392 -254
2223b54m01PL32P9l93K4L98o3r5J12L2p1J74l8k28J87K26l9R4k09j15O72k61J56
$$ -254 -655 -648 -316 -237 -630 -606 -208 -271 -366 -254 -222 -293 -119 -157 -385 -198 28 -11 83 -126 -241 431 170 326
2247C26k8N6m56O16J31l99n0K13K30k22j03P5j70P1J79J0K83k94l49O70n11n4
$$ 326 298 354 -102 514 645 246 196 409 639 417 314 389 219 290 469 479 762 468 119 789 278 224
2269B24L86j00j57j26L92L34n93m1K40Q8j52j6P5k56K48r4M02m60KM57j08l13
$$ 224 610 510 353 227 619 953 360 319 559 647 495 479 554 298 546 452 854 394 396 853 745 432
2291D32k39M97j1l81k51J029o57Pk4L45l84J43k0j15J20L73k14j78j45L33J9m21
$$ 432 193 690 679 298 47 1076 419 426 402 747 363 506 486 371 491 864 650 472 327 660 679 258
2313B58J51M3J36j64N2J56R8r4j15M46k48m40L89J48R2o46L98n1L75l72r6J20
$$ 258 409 452 588 424 476 632 730 636 521 967 719 279 668 816 908 262 660 609 984 612 516 636
2335F36J28m01M30MP1j92O6j73j70N45J31k15m86N12L46m48l04L64lo7j46K48
$$ 636 764 363 793 797 868 676 742 569 399 944 1075 860 374 886 1232 784 480 844 841 774 628 876
2357H76L4j25k65nj97K48J79j38J31k75J07lj24J50K01l77N0J41J23l56k2K03
$$ 876 910 785 520 515 318 566 745 607 738 463 570 567 443 593 794 417 467 608 731 375 353 556
2379E56l7n6j14K86l57k0J12j08L3k65M28m27k2j6J18J45j21j7O6j06n06J78N40
$$ 556 519 463 349 635 278 258 370 262 295 30 458 31 9 -7 111 256 135 118 184 78 -428 -250 290
2402B90m97j09QO20l09k09k11J00l5j41J93p4O1J52j58m1j75J58N0Q2l78k6L12
$$ 290 -207 -316 -308 312 3 -206 -417 -317 -352 -493 -300 -374 -313 -161 -319 -360 -535 -377 -327 -245 -623 -649 -337
2425c37k79K18P9j03m78L96lM47l44R6L5l41M64m78O7K17k26K0k2K56k66K84j89
$$ -337 -616 -398 -319 -422 -900 -504 -507 -60 -404 -308 -273 -614 -150 -628 -561 -344 -570 -550 -572 -316 -582 -298 -487
2448d87l78L48L32j42l5L77j93j62k01L65r5j63KM96j70n9l2N7K76j91j90J40
$$ -487 -865 -517 -185 -327 -362 15 -178 -340 -541 -176 -271 -434 -432 64 -106 -165 -197 -140 136 -55 -245 -105
2470a05R7J92J07m46j34M78N8k63m4K70q9K22l36K74K3M6k06P1K39l70N5K13k04
$$ -105 -8 184 291 -155 -289 189 247 -16 -60 210 121 343 7 281 304 350 144 215 454 84 139 352 148
2493A48K6m5L52m45K92O3Q6m27J09J99R9M3j42K28k20j72l1K33l21K31j34J79
$$ 148 174 129 481 36 328 391 477 50 159 358 457 500 358 586 366 194 163 396 75 306 172 351
2515C51MR7l31j10m6M63p0J36m74J17j91O5M7N2J00l23J47J86m60J7M14k03O3
$$ 351 355 452 121 11 -35 428 358 494 20 137 -54 11 58 110 210 -113 34 220 -240 -223 191 -12 51
2538E1k76J13J81j93K79k50J18k97J38P5k09l54N81m12k82L2K31l9p4J6k8O9k15
$$ 51 -225 -112 69 -124 155 -95 23 -274 -136 -61 -270 -624 -43 -455 -737 -705 -474 -513 -587 -571 -599 -530 -745
2561g45j1j28O9PJ87m28J39K00J93Lo40nL67o8p3J98m36k19L37K03n3K10m34J09
$$ -745 -756 -884 -815 -808 -621 -1049 -910 -710 -517 -514 -1154 -1159 -792 -860 -933 -735 -1171 -1390 -1053 -850 -903 -693 -1127 -1018
2585a018n8l78L88kJ7j76k9Q7j23K10j50L40k79L8J41j88M2Q6J81k18k00L01K08
$$ -1018 -1076 -1454 -1066 -1068 -1051 -1227 -1256 -1169 -1292 -1082 -1232 -892 -1171 -1133 -992 -1180 -1138 -1052 -871 -1089 -1289 -988 -780
2608g80j86k08L85Mo9J04k24L21j82k9j46J27K20O3j79J7N5L74j81J51l21R4j20
$$ -780 -966 -1174 -789 -785 -854 -750 -974 -653 -835 -864 -1010 -883 -663 -600 -779 -762 -707 -333 -514 -363 -684 -590 -710
2631g10K22J08j5K04j70L1K23LJ36k94N0J78J43k03m0N9Q3K91qj06k99J42K44
$$ -710 -488 -380 -395 -191 -361 -330 -107 -104 32 -262 -212 -34 109 -94 -134 -75 8 299 291 185 -114 28 272
2654B72m37N26l63L47l15j5L02o23M93K05j7k21Q6R9j51l3J8K53J50j42l57J52
$$ 272 -165 361 -2 345 30 15 317 -306 187 392 375 154 240 339 188 155 173 426 576 434 77 229
2676B29l74N19L5j11r7j5J5J65J6n00L47l89L99J14l85J69Oj19j19J54j24L46
$$ 229 -145 374 409 298 201 186 201 366 382 -118 229 -160 239 353 -32 137 143 24 -95 59 -65 281
2698B81l45k5L01r6l69J52J71k89L47k37J9o6j5J8L72m91j03N87j62l80K21j51
$$ 281 -64 -89 212 116 -253 -101 70 -219 128 -109 -90 -156 -171 -153 219 -272 -375 212 50 -330 -109 -260
2720b60K82k41J96n0J9n6o7j34M2j8K04O0m38J91J54J90k81mNK09m71M99m8k96
$$ -260 22 -219 -23 -73 -54 -110 -177 -311 -269 -287 -83 -23 -461 -270 -116 74 -207 -211 -206 3 -468 31 -17 -313
2744c13N2o8M80k14k3K10k87J18K57r7p7J41o1l7mJ51k26L9j60K24K14k33k1j6
$$ -313 -261 -329 151 -63 -86 124 -163 -45 212 115 38 179 118 81 77 228 2 41 -119 105 319 86 65 49
2768D9J88J22l09j7J56l12N11j32k50J63r4R1J35j83L0Q4K23m92O67K8k54j00
$$ 49 237 359 50 33 189 -123 388 256 6 169 75 166 301 118 148 232 455 -37 630 658 404 304
2790C04r4L14M7k07j92L15p7q8j03J04m11M25j3k17J38K05k54j64N20j69j74j95
$$ 304 210 524 571 364 172 487 410 322 219 323 -88 337 324 107 245 450 196 32 552 383 209 14
2812A4N09k40j37O6k57nL50j04J8J37k43j9J24n3j06l2l4J91m11J01J72k61J73
$$ 14 523 283 146 212 -45 -50 300 196 214 351 108 89 213 160 54 22 -12 179 -232 -131 41 -220 -47
2835d7L47j48j61j63J12q8p4k8J98j25l9o3L3J94j29n10P8N0J92K38l88j15J57
$$ -47 300 152 -9 -172 -60 -148 -222 -250 -52 -177 -216 -279 -246 -52 -181 -691 -613 -563 -371 -133 -521 -636 -479
2858d79K45l82k19L43l8l0q1J05n6j54j01K78n3J44l89J72K59k21j52J70k45K55
$$ -479 -234 -616 -835 -492 -530 -560 -641 -536 -592 -746 -847 -569 -622 -478 -867 -695 -436 -657 -809 -639 -884 -629
2880f29m2mr0N6j68J84j03J62K32l45j9L60M9k96J28k5J53m4k4pR5ol01k3K44
$$ -629 -671 -675 -765 -709 -877 -693 -796 -634 -402 -747 -766 -406 -357 -653 -525 -550 -397 -441 -465 -472 -377 -383 -684 -707 -463
2905d63j22J12J91Q0j39L42k14k11K73Q6l00J34L42J95m39J02j95K67k89O08l17
$$ -463 -585 -473 -282 -202 -341 1 -213 -424 -151 -65 -365 -231 111 306 -133 -31 -226 41 -248 360 43
2926D3j23K3L08L31k43l96j1N12m45M13j26l05J54K3K22J54L6l34L07l6j97KJ6
$$ 43 -80 -57 251 582 339 -57 -68 444 -1 412 286 -19 135 158 380 534 570 236 543 507 310 312 328
2949C28L87l20j08J47L02k54K0N3j76k7R9j62K46J60o56M46k95K05j21J35j31
$$ 328 715 395 287 434 736 482 502 555 379 352 451 289 535 695 39 485 190 395 274 409 278
2970B78J00MlJ68k45K40m88J64J36n2j90p6J70j98oK52j6k6J61j14j43pj99J51
$$ 278 378 382 379 547 302 542 54 218 354 302 112 36 206 8 2 254 238 212 373 259 116 109 -90 61
2994F1j76j58L67K46k55K04l39q1M4J64o7J07o9J49j65K6j75J36J08J31j34j94
$$ 61 -115 -273 94 340 85 289 -50 -131 -87 77 10 117 48 197 32 58 -117 19 127 258 124 -70
3016g0L18J52n9n9k55j24K22O0J81r1P0q0J89p0j05K06k36jL26l42K50K59q6J0
$$ -70 248 400 341 282 27 -97 125 185 366 275 345 265 454 384 279 485 249 248 574 232 482 741 655 665
3040F65k73L97j13k58K03L18n79K74J69J71k78j03N3j67j8K48n8K52k31J31j29
$$ 665 392 789 676 418 621 939 360 634 803 974 696 593 646 479 461 709 651 903 672 803 674
3061F74m0J63k79K55m93K75M13J45m88p4K07p8J43m4k45K7K59l09K55j42J21j00
$$ 674 634 797 518 773 280 555 968 1113 625 551 758 680 823 779 534 561 820 511 766 624 745 645
3083F45k06L28k87m30O64L1M0l35J74k82J85O6k37j50o7k03M18J67J39j79l97
$$ 645 439 767 480 50 714 745 785 450 624 342 527 593 356 206 139 -64 354 521 660 481 84
3104H4K88r4Q8k98K99Q4m40L44K5r2j96R0P5j15J72k26J56k85L49j36k37J72j31
$$ 84 372 278 366 68 367 451 11 355 380 288 92 182 257 142 314 88 244 -41 308 172 -65 107 -24
3127b4K21n05J43J81J82l5l11K37o5j15J89m1J82l1j16m6j5J62k72J05j48J94
$$ -24 197 -308 -165 16 198 163 -148 89 24 -91 98 57 239 208 92 46 31 193 -79 26 -122 72
3149G2K66j36J51J04m90L28R7k16J39n1k1J07p6J68k00r3J21Lq1K24j02K3J32
$$ 72 338 202 353 457 -33 295 392 176 315 264 243 350 274 442 242 149 270 273 192 416 314 337 469
3172D69J25k84K38J04j17N9l38J89O9K20k93J87o73N19J4j55K47m15j32M13j34
$$ 469 594 310 548 652 535 594 256 445 514 734 441 628 -45 474 488 333 580 165 33 446 312
3193C12k2R8J05k50L09J4k52q2m0R7j07J54k4K2j71R7P4Pn03N25j97J31P4j29
$$ 312 290 388 493 243 552 566 314 232 192 289 182 336 312 334 163 260 334 341 -162 363 166 297 371 242
$$ [...]
8191A44
##END NTUPLES=NMR FID
##END=
