##TITLE=1H_SL16a-SPh-f5(1y)
 CDcl3, 8 sc, 
 31.1.2020
##JCAMPDX= 6.0         $$ Bruker NMR JCAMP-DX V2.0
##DATA TYPE= NMR FID
##DATA CLASS= NTUPLES
##ORIGIN= UXNMR, Bruker Analytische Messtechnik GmbH
##OWNER= root
$$ XWIN-NMR		Version 3.5
$$ Fri Jan 31 14:07:56 2020 Russian Standard Time (UT+4h)  she@DPX200
##.OBSERVE FREQUENCY= 200.1315
##.OBSERVE NUCLEUS= ^1H
##.DELAY= (6, 6)
##.ACQUISITION MODE= SIMULTANEOUS
##.ACQUISITION SCHEME= undefined
##.AVERAGES= 8
##.DIGITISER RES= 18
##SPECTROMETER/DATA SYSTEM= spect
##.PULSE SEQUENCE= zg30
##.SOLVENT NAME= CDCl3
##.SHIFT REFERENCE= (INTERNAL, CDCl3, 0, 15.7039)
##AUDIT TRAIL= $$ (NUMBER, WHEN, WHO, WHERE, WHAT)
$$ ##TITLE= Audit trail, XWIN-NMR		Version 3.5
$$ ##JCAMPDX= 5.01
$$ ##ORIGIN= Bruker BioSpin GmbH
$$ ##OWNER= she
$$ F:/spectra/data/she/nmr/H-F/1/audita.txt
$$ ##AUDIT TRAIL=  $$ (NUMBER, WHEN, WHO, WHERE, WHAT)
(   1,<2020-01-31 14:06:33.85 +0400>,<she>,<DPX200>,
      <created by zg, POWCHK disabled, PULCHK disabled
       configuration hash MD5:
       00 E9 B6 7A A2 85 ED C7 34 08 36 98 17 FE 4E 26
       data hash MD5: 16K
       26 B0 4A 1C 00 41 D0 87 70 F7 19 FB 08 FE 42 79>)
$$ ##END=
$$ 
$$ hash MD5
$$ C0 D2 8B 76 CF 2A D5 EA 52 3D 8B 2D 5B 3E 20 E4
##$RELAX= 
##$RELAX= 
##$RELAX= 
##$RELAX= 
##$RELAX= 
##$RELAX= 
$$ Bruker specific parameters
$$ --------------------------
##$DU= <F:/spectra>
##$EXPNO= 1
##$NAME= <H-F>
##$PROCNO= 1
##$TYPE= <nmr>
##$USER= <she>
##$AMP= (0..31)
100 100 100 100 100 100 100 100 100 100 100 100 100 100 100 100 100 100 
100 100 100 100 100 100 100 100 100 100 100 100 100 100 
##$AQSEQ= 0
##$AQ_mod= 1
##$AUNM= <au_zg>
##$AUTOPOS= <>
##$BF1= 200.13
##$BF2= 200.13
##$BF3= 200.13
##$BF4= 200.13
##$BF5= 200.13
##$BF6= 200.13
##$BF7= 200.13
##$BF8= 200.13
##$BYTORDA= 1
##$CFDGTYP= 0
##$CFRGTYP= 5
##$CHEMSTR= <none>
##$CNST= (0..31)
1 1 145 1 1 1 1 1 1 1 1 1 1 1 1 1 1 1 1 1 1 1 1 1 1 1 1 1 1 1 1 1 
##$CPDPRG= <>
##$CPDPRG1= <>
##$CPDPRG2= <>
##$CPDPRG3= <>
##$CPDPRG4= <mlev>
##$CPDPRG5= <mlev>
##$CPDPRG6= <mlev>
##$CPDPRG7= <mlev>
##$CPDPRG8= <mlev>
##$CPDPRGB= <>
##$CPDPRGT= <>
##$D= (0..31)
0 1.2 0 0 0 0 0 0 0 0.06 0 0.03 0 0 0 0 0.0002 0 0 0 0 0 0 0 0 0 0 0 0 
0 0 0 
##$DATE= 1580465193
##$DBL= (0..7)
120 120 120 120 120 120 120 120 
##$DBP= (0..7)
150 150 150 150 150 150 150 150 
##$DBP07= 0
##$DBPNAM0= <>
##$DBPNAM1= <>
##$DBPNAM2= <>
##$DBPNAM3= <>
##$DBPNAM4= <>
##$DBPNAM5= <>
##$DBPNAM6= <>
##$DBPNAM7= <>
##$DBPOAL= (0..7)
0.5 0.5 0.5 0.5 0.5 0.5 0.5 0.5 
##$DBPOFFS= (0..7)
0 0 0 0 0 0 0 0 
##$DE= 6
##$DECBNUC= <off>
##$DECIM= 24
##$DECNUC= <off>
##$DECSTAT= 4
##$DIGMOD= 1
##$DIGTYP= 9
##$DL= (0..7)
0 120 120 120 120 120 120 120 
##$DP= (0..7)
150 150 150 150 150 150 150 150 
##$DP07= 0
##$DPNAME0= <>
##$DPNAME1= <>
##$DPNAME2= <>
##$DPNAME3= <>
##$DPNAME4= <>
##$DPNAME5= <>
##$DPNAME6= <>
##$DPNAME7= <>
##$DPOAL= (0..7)
0.5 0.5 0.5 0.5 0.5 0.5 0.5 0.5 
##$DPOFFS= (0..7)
0 0 0 0 0 0 0 0 
##$DQDMODE= 0
##$DR= 18
##$DS= 0
##$DSLIST= <SSSSSSSSSSSSSSS>
$$ [...]
##$SUBNAM2= <"">
##$SUBNAM3= <"">
##$SUBNAM4= <"">
##$SUBNAM5= <"">
##$SUBNAM6= <"">
##$SUBNAM7= <"">
##$SUBNAM8= <"">
##$SUBNAM9= <"">
##$SW= 24.9337058887773
##$SWIBOX= (0..15)
0 0 2 0 0 0 0 0 0 0 0 0 0 0 0 0 
##$SW_h= 4990.01996007984
##$TD= 16384
##$TD0= 1
##$TE= 0
##$TE2= 300
##$TE3= 300
##$TEG= 300
##$TL= (0..7)
0 120 120 120 120 120 120 120 
##$TP= (0..7)
150 150 150 150 150 150 150 150 
##$TP07= 0
##$TPNAME0= <>
##$TPNAME1= <>
##$TPNAME2= <>
##$TPNAME3= <>
##$TPNAME4= <>
##$TPNAME5= <>
##$TPNAME6= <>
##$TPNAME7= <>
##$TPOAL= (0..7)
0.5 0.5 0.5 0.5 0.5 0.5 0.5 0.5 
##$TPOFFS= (0..7)
0 0 0 0 0 0 0 0 
##$TUNHIN= 0
##$TUNHOUT= 0
##$TUNXOUT= 0
##$USERA1= <user>
##$USERA2= <user>
##$USERA3= <user>
##$USERA4= <user>
##$USERA5= <user>
##$V9= 5
##$VALIST= <valist>
##$VCLIST= <CCCCCCCCCCCCCCC>
##$VD= 0
##$VDLIST= <DDDDDDDDDDDDDDD>
##$VPLIST= <PPPPPPPPPPPPPPP>
##$VTLIST= <TTTTTTTTTTTTTTT>
##$WBST= 1024
##$WBSW= 4
##$XGAIN= (0..3)
0 0 0 0 
##$XL= 0
##$YL= 0
##$YMAX_a= 339326
##$YMIN_a= -230490
##$ZGOPTNS= <>
##$ZL1= 120
##$ZL2= 120
##$ZL3= 120
##$ZL4= 120
##$ABSF1= 10
##$ABSF2= 0
##$ABSG= 5
##$ABSL= 3
##$ALPHA= 0
##$AQORDER= 0
##$ASSFAC= 0
##$ASSFACI= 0
##$ASSFACX= 0
##$ASSWID= 0
##$AUNMP= <proc_1d>
##$AZFE= 0.1
##$AZFW= 0.1
##$BCFW= 1
##$BC_mod= 2
##$BYTORDP= 1
##$COROFFS= 0
##$CY= 11.3945322036743
##$DATMOD= 1
##$DC= 2
##$DFILT= <>
##$DTYPP= 0
##$F1P= 16.9975609425685
##$F2P= -3.02152046262296
##$FCOR= 0.5
##$FTSIZE= 0
##$FT_mod= 4
##$GAMMA= 1
##$GB= 0.15
##$INTBC= 1
##$INTSCL= 1
##$ISEN= 128
##$LB= 0.24
##$LEV0= 0
##$LPBIN= 0
##$MAXI= 10000
##$MC2= 0
##$MEAN= 0
##$ME_mod= 0
##$MI= 1.114404
##$NCOEF= 0
##$NC_proc= 0
##$NLEV= 6
##$NOISF1= 3.799351
##$NOISF2= 2.8
##$NSP= 1
##$NTH_PI= 0
##$NZP= 0
##$OFFSET= 15.70392
##$PC= 1
##$PHC0= -9804.521
##$PHC1= 38.60081
##$PH_mod= 1
##$PKNL= yes
##$PPARMOD= 0
##$PSCAL= 0
##$PSIGN= 0
##$REVERSE= no
##$SF= 200.130013532006
##$SI= 16384
##$SIGF1= 3
##$SIGF2= 2
##$SINO= 400
##$SIOLD= 16384
##$SREGLST= <1H.CDCl3>
##$SSB= 0
##$STSI= 0
##$STSR= 0
##$SW_p= 3612.71676300578
##$SYMM= 0
##$S_DEV= 0
##$TDeff= 0
##$TDoff= 0
##$TI= <>
##$TILT= no
##$TM1= 0
##$TM2= 0
##$TOPLEV= 0
##$USERP1= <user>
##$USERP2= <user>
##$USERP3= <user>
##$USERP4= <user>
##$USERP5= <user>
##$WDW= 1
##$XDIM= 8192
##$YMAX_p= 0
##$YMIN_p= 0
$$ End of Bruker specific parameters
$$ ---------------------------------
##NTUPLES= NMR FID
##VAR_NAME=  TIME,          FID/REAL,        FID/IMAG
##SYMBOL=    X,             R,               I
##VAR_TYPE=  INDEPENDENT,   DEPENDENT,       DEPENDENT
##VAR_FORM=  AFFN,          ASDF,            ASDF
##VAR_DIM=   8192,          8192,            8192
##UNITS=     SECONDS,       ARBITRARY UNITS, ARBITRARY UNITS
##FACTOR=    0.0002004,     1,               1
##FIRST=     0,             0,               0
##LAST=      1.6414764,     0,               0
##MIN=       0,             -230490,         0
##MAX=       1.6414764,     339326,          0
$$ Real data points
##PAGE= N=1
##DATA TABLE= (X++(R..R)), XYDATA
$$ [...]
$$ plain form
2055 1515 1100 -850 -1083 1563 1046 -1520 -598 1626 873 -1446 -708 1490 878 -1261 -681 1655 1101
2072 1101 -1562 -769 1460 778 -1778 -842 1865 767 -1888 -394 2128 276 -2862 -898 1929 480
2088 480 -2425 -940 2195 360 -2389 -764 2342 456 -2866 -1043 2316 753 -2259 -659 1708
2103 1708 128 -2287 -518 1602 30 -2405 -253 2382 -482 -2598 -344 2349 -342 -2742 -204
2118 -204 1867 -483 -2716 -134 2262 -383 -2462 403 2083 -782 -2441 362 2487 -520 -2431
2133 -2431 546 2416 -993 -2247 1187 2332 -1130 -2389 1316 2714 -990 -2424 1053 2389 -892
2148 -892 -1947 904 1962 -1098 -1674 1396 2019 -957 -1761 1492 2066 -964 -1369 1365 1638 -967 -1065
2165 -1065 1767 1473 -1239 -1326 1730 1912 -1039 -1368 1783 1508 -700 -1368 1347 1511 -972 -619 1642
$$ packed form
2055A515m15j950k33K646n17k566R22K224p53k319P38K198o12k139N80K336n54
2072A101k663P93K229o82k556R36K707j098k655J494K522j852l138J964K827j449
2088D80k905J485L135j835k749J625L106j886l322J823L359j563l012J600K367
2103A708j580k415J769K120j572k435K152K635k864k116K254K693k691k400K538
2118b04K071k350k233K582K396k645k079K865J680k865j659K803K125l007j911
2133b431K977J870l409j254L434J145l462j259L705J398l704j434L477J336l281
2148h92j055K851J058l060n76L070O23k976q04L253N74l030m05K734K73k605r8
2165a065K832k94k712q7L056J82k951l29L151k75k208o68K715J64k483L53K261
$$ plain form
2182 1642 1075 -1324 -948 1505 1339 -1117 -773 1226 1274 -948 -768 767 520 -1332 -594 1618 557
2199 557 -1263 -719 1555 868 -1299 -1035 1004 639 -1040 -497 1192 353 -1316 -797 1474 581 -1408
2216 -1408 -959 732 444 -1112 -533 404 -105 -1253 -689 242 533 -928 -617 708 388 -945 -1076 363
2234 363 528 -779 -863 181 494 -963 -634 311 53 -781 -639 474 491 -709 -1259 -221 316 15 -542
2253 -542 53 213 37 -501 430 224 -647 -950 256 803 -186 -1075 -281 643 58 -432 -13 428 75 -332
2273 -332 338 858 -174 -587 216 720 238 -609 232 740 141 -248 190 732 100 -537 497 924 248
2292 248 -715 604 1165 112 -820 166 1057 114 -662 315 1080 24 -1051 362 999 106 -849 -22
2310 -22 1144 140 -607 287 453 82 -651 326 659 -194 -787 319 908 -171 -869 25 649 -116 -730
$$ packed form
2182A642n67k399L76K453j66k456L44J999M8k222J80J535k47j852P38K212j061
2199E57j820N44K274o87k167K64K039l65j679N43J689q39j669N19K271q93j989
2216a408M49J691k88j556N79R37n09j148N64R31K91j461L11J325l20j333j31J439
2234C63J65j307q4J044L13j457L29R45k58q34J42J113J7j200n50J038N37l01n57
2253e42N95J60j76n38R31k06q71l03J206N47r89q89P94R24n85m90M19M41l53m07
2273c32O70N20j032m13Q03N04m82q47Q41N08n99l89M38N42o32o37J034M27o76
2292B48r63J319N61j053r32R86Q91r43p76R77P65j056j075J413O37q93r55Q27
2310b2J166j004p47Q94J66l71p33R77L33q53n93J106N89j079o98Q94O24p65o14
$$ plain form
2329 -730 -145 912 -317 -984 -242 562 -58 -925 -69 285 -609 -1100 -100 584 -80 -968 -189 112 -418
2348 -418 -734 33 71 -373 -749 74 201 -451 -740 -115 157 -516 -575 37 208 -724 -769 312 667 -784
2368 -784 -1024 7 234 -361 -855 -60 112 -322 -567 -18 217 -348 -693 147 606 -221 -532 -53 226 1
2388 1 -415 -77 330 258 -441 114 180 170 -282 174 281 -240 -401 -155 472 170 -523 -70 504 -217 -251 217
2410 217 476 182 -198 282 763 94 12 -16 435 137 2 498 440 271 -491 -209 159 270 -324 -58 513
2431 513 402 -388 5 439 178 -201 -429 518 275 -394 -144 447 657 -336 186 498 318 -221 -182 771
2451 771 -30 -552 17 375 138 -688 -254 406 120 -865 -340 875 363 -629 -271 220 -189 -903 -65 298
2471 298 58 -845 -382 360 -16 -627 -306 355 -282 -784 -204 696 -188 -947 -302 592 -17 -780 -354 606
$$ packed form
2329g30N85J057j229o67P42Q04o20q67Q56L54q94m91J000O84o64q88P79L01n30
2348d18l16P67L8m44l76Q23J27o52k89O25K72o73n9O12J71r32m5J081L55j451
2368g84k40J031K27n95m94P95J72m34k45N49K35n65l45Q40M59q27l11M79K79k25
2388Am16L38M07p2o99N55O6j0m52M56J07n21j61K46O27l02o93M53N74p21l4M68
2410B17K59k94l80M80M81o69q2k8M51k98j35M96n8j69p62K82L68J11n94K66N71
2431E13j11p90L93M34k61l79k28R47k43o69K50N91K10r93N22L12j80n39L9R53
2451G71q01n22N69L58k37q26M34O60k86r85N25J215n12r92L58M91m09p14Q38L63
2471B98k40r03M63P42l76o11L21O61o37n02N80R00q84p59O45Q94o09p63M26R60
$$ plain form
2491 606 -344 -817 -120 669 83 -829 -258 468 57 -586 -192 427 -377 -695 176 547 -464 -989 71
2510 71 228 -492 -516 -198 199 -337 -718 47 221 -136 -607 244 253 -395 -347 442 480 -640 -228 223 380 -378
2532 -378 -317 363 290 -320 -204 556 102 -66 -296 279 160 -114 33 357 10 -12 -84 466 -36 -90 274 328
2554 328 14 80 365 280 -13 -160 347 346 -148 -544 294 527 -8 -240 498 50 -451 35 307 218 -561 247
2576 247 617 -325 -453 89 456 -196 -272 -107 420 -28 -682 48 278 -235 -491 8 324 -406 -624 79
2596 79 343 -81 -563 242 561 -533 -735 295 368 -427 -378 194 326 -686 -809 185 420 -394 -769 416
2616 416 618 -907 -535 785 376 -729 -876 756 335 -892 -847 821 378 -877 -708 647 525 -824
2634 -824 -719 395 274 -665 -359 981 83 -904 -552 1021 617 -1007 -434 1045 277 -1206 -135 1254
$$ packed form
2491F06r50m73O97P89n86r12N71P26m11o43L94O19q04l18Q71L71j011n25J060
2510G1J57p20k4L18L97n36l81P65J74l57m71Q51Ro48M8P89L8j120M12M51J57p58
2532c78O1O80p3o10J16P60m54j68k30N75j19k74J47L24l47k2p2N50n02n4L64N4
2554C28l14O6K85q5k93j47N07jm94l96Q38K33n35k32P38m48n01M86K72q9p79Q08
2576B47L70r42j28N42L67o52p6J65N27m48o54P30K30n13k56M99L16p30k18P03
2596G9K64m24m82Q05L19j094k02J030P3p95M9N72J32j012j23R94K35q14l75J185
2616D16K02j525L72J320m09j105j47J632m21j227M5J668m43j255J69J355j22j349
2634h24J05J114j21r39L06J340q98r87L52J573m04j624N73J479p68j483J071J389
$$ plain form
2652 1254 168 -1054 -485 1047 287 -1048 -113 1236 14 -978 -381 1288 3 -945 307 1150 414
2669 414 -1332 323 1474 49 -1206 470 1160 -348 -1123 508 1251 -78 -909 400 1529 -187
2685 -187 -946 251 1039 -201 -1126 412 1181 -157 -921 434 778 -306 -1030 547 913 -425 -972
2702 -972 264 857 -521 -897 698 1020 -434 -884 167 868 -134 -571 332 647 -421 -787 230
2719 230 689 -633 -568 532 428 -492 -795 441 228 -779 -351 545 415 -587 -923 655 437 -754
2737 -754 -790 13 270 -758 -779 142 147 -744 -580 448 181 -709 -412 456 -302 -840 -351 146 279 -366 -387
2758 -387 6 154 -542 -346 144 136 -499 -330 480 64 -140 -304 114 -115 -159 201 278 -138 -459 -20 368
2779 368 47 -193 -60 -72 -108 19 -47 2 24 220 120 279 135 15 -21 118 345 332 -339 -269 257 533 36
$$ packed form
2652A254j086j222N69J532p60j335R35J349j222r92N97J669j285r48J252Q43p36
2669D14j746J655J151j425j255J676O90j508p75J631P43j329q31J309J129j716
2685a87p59J197P88j240r25J538P69j338p64J355L44j084p24J577L66j338n47
2702i72J236N93j378l76J595L22j454m50J051P01j002m37R03L15j068l66J017
2719B30M59j322O5J100j04r20l03J236k13j007M28Q96j30j002l36J578k18j191
2737g54l6Q03K57j028k1R21Nq91J64J028k67q90K97Q68p58n38M89M97J33o45k1
2758c87L93J48o96J96M90qo35J69Q10m16k04j64M18k29m4L60P7m16l21M39L88
2779C68l21k40J33j2l6J27o6M9K2J96j00J59j44j20l6J39K27j3o71P0N26K76m97
$$ plain form
2802 36 -291 187 240 209 -143 146 616 -65 199 407 397 -2 124 439 396 85 -74 615 104 -399 -120 660
2824 660 511 -556 -192 599 716 -451 -384 452 372 -110 -152 625 207 -210 -363 500 85 -823 -181 571
2844 571 338 -441 -412 429 0 -557 -323 585 340 -671 -471 607 503 -914 -660 579 404 -722 -440
2863 -440 460 244 -710 -540 436 30 -1046 -101 594 198 -1195 -188 700 60 -1042 -731 407 -79
2881 -79 -889 -291 750 -176 -1307 -436 728 32 -1060 -413 573 47 -699 77 880 -285 -775 292
2899 292 642 -224 -746 114 787 188 -1140 -247 620 53 -678 178 607 66 -859 368 1047 -294 -891
2918 -891 517 1080 88 -837 -96 909 -144 -406 227 681 -286 -897 189 762 41 -492 53 686 256
2937 256 -544 414 710 -54 -405 514 523 121 -656 264 764 -198 -487 110 664 -72 -131 208 532 58 -275
$$ packed form
2802C6l27M78N3l1l52K89M70o81K64K08j0l99J26L15m3l11j59O89n11n03K79P80
2824F60j49j067L64P91J17j167O7Q36q0m82m2P77m18m17j53Q63m15r08O42P52
2844E71k33p79K9Q41m29n57K34R08k45j011K00J078j04j417K54J239j75j126K82
2863d40R00k16r54J70R76m06j076R45O95l96j393J007Q88o40j102L11J138m86
2881g9q10N98J041r26j131Q71J164o96j092O47R86n26p46P76Q03j165m90J067
2899B92L50q66n22Q60O73n99j328Q93Q67n67p31Q56M29n41r25J227O79j341n97
2918h91J408N63r92r25P41J005j053k62O33M54r67o11J086N73p21n33N45O33m30
2937B56q00R58K96p64l51R19Rm02p77R20N00r62k89N97N54p36n9L39L24m74l33
$$ plain form
2958 -275 423 334 -130 -588 61 309 294 -692 277 366 -65 -528 309 516 -228 -490 418 624 -204 -557 -273
2979 -273 432 -348 -497 11 365 -69 -102 11 146 -234 -555 143 245 9 -446 -395 39 -5 -451 -139 239
3000 239 24 -478 -99 295 -258 -607 100 173 -77 -332 18 30 -233 -336 266 183 -479 -384 -66 373 -213
3021 -213 -220 175 244 -36 -106 -87 442 -75 -199 94 405 -240 -295 86 418 -158 -444 -21 138 -32 -306 173
3043 173 176 75 -219 248 328 -433 -548 -23 380 -168 -26 234 149 74 -45 275 354 124 -239 266 228 18
3065 18 -142 59 313 -38 -296 21 488 42 -163 255 210 85 -182 235 186 -78 -103 142 346 -208 155
3086 155 767 367 -292 138 -82 83 -440 -176 253 34 -147 -212 376 -93 -290 -71 215 -91 -485 -269
3106 -269 179 80 -565 -448 161 89 -213 -128 127 233 -187 -230 -197 -113 -104 -188 -61 270 -178 -100 -85 -295 -195 -154
$$ packed form
2958b75O98q9m64m58O49K48j5r86R69Q9m31m63Q37K07p44k62R08K06q28l53K84
2979b73P05p80j49N08L54m34l3J13J35l80l21O98J02k36m55N1M34m4m46L12L78
3000B39k15n02L79L94n53l49P07P3k50k55L50J2k63j03O02q3o62R5L18M39n86
3021b13pL95O9k80p0J9N29n17j24K93L11o45n5L81L32n76k86M23J59j70k74M79
3043A73Lj01k94M67Q0p61j15N25M03n48J42K60q5p5j19L20P9k30l63N05l8k10
3065A8j60K01K54l51k58L17M67m46k05M18m5j25k67M17m9k64k5K45K04n54L63
3086A55O12m00o59M30k20J65n23K64M29k19j81o5N88m69j97K19K86l06l94K16
3106b69M48r9o45J17O09p2l02Q5K55J06m20m3L3Q4Rq4J27L31m48P8J5k10J00M1
$$ plain form
3130 -154 161 -82 34 -24 -38 -192 57 -195 -31 -83 -38 -231 -394 -119 -287 -52 20 -189 -56 -112 -23 22 207
3153 207 292 -262 -208 156 392 -266 -132 129 311 183 -472 -84 243 -45 -520 80 490 -44 59 -67 222
3174 222 323 -193 -202 348 -92 -105 6 304 -41 -202 407 358 -140 -66 169 214 -214 26 383 19 -244 326
3196 326 591 227 203 108 253 225 87 161 394 148 73 -5 327 -48 -388 88 508 -44 -167 411 242 32
3218 32 -29 -142 242 311 -243 -118 347 -180 -45 267 291 48 -90 204 181 -109 -62 -132 -101 -22 -116 169 136 -226
3242 -226 -429 -334 -55 -121 -410 25 36 -344 -403 -159 -40 -149 -361 81 -372 -334 29 414 167 -476 -24 56
3264 56 -333 -229 -318 450 -131 -148 -316 91 181 167 -259 -82 -42 -107 17 9 -21 142 65 61 -119 100 -22 310
3288 310 119 -91 -74 227 223 -179 146 68 -52 -221 347 202 -139 -192 311 345 69 -117 50 42 -208 -247 -66
$$ packed form
3130a54L15k43J16n8j4j54K49k52J64n2M5j93j63K75j68K35P2k09J33n6Q9M5J85
3153B07Q5n54N4L64K36o58J34K61J82j28o55L88L27k88m75O00M10n34J03j26K89
3174B22J01n16rN50m40j3J11K98l45j61O09m9m98P4K35M5m28K40L57l64k63N70
3196C26K65l64k4r5J45k8j38P4K33k46p5p8L32l75l40M76M20n52j23N78j69k10
3218C2o1j13L84O9n54J25M65n27J35L12K4k43j38K94k3k90M7p0L1P9r4K85l3l62
3242b26k03R5K79o6k89M35J1l80n9K44J19j09k12M42m53L8L63L85k47o43M52Q0
3264E6l89J04q9P68n81j7j68M07R0j4m26J77M0o5J24ql0J63p7mj80K19j22L32
3288C10j91k10J7L01mm02L25p8j20j69N68j45l41n3N03L4k76j86J67qk50l9J81
$$ plain form
3311 -66 197 227 230 148 198 -199 -43 163 -58 -124 122 332 -12 -226 157 36 125 -47 393 447 -71 4 301
3334 301 159 -269 26 337 108 -10 30 319 192 -103 49 172 -16 -313 -49 425 -181 -564 -151 303
3354 303 191 -33 -426 289 -126 -366 -240 99 -114 -560 -41 69 -72 -453 1 271 52 -442 -54 178
3374 178 -269 57 -299 266 -180 -172 64 374 -101 -435 -306 347 39 -242 -389 -220 -389 -1440 393 396 -53
3395 -53 -562 192 498 -418 -680 19 40 -174 -486 68 388 -217 -488 75 785 -133 -627 -90 450 -310 -414
3416 -414 86 576 82 -588 1541 310 -111 -113 512 442 -200 -431 403 407 -286 -172 507 384 -582 -170 531
3437 531 413 -121 -261 625 284 -241 -93 506 20 -436 47 722 271 -282 85 427 235 -579 -117 516
3457 516 35 -40 -208 635 -30 -149 -69 235 333 -374 19 538 297 -246 -30 62 89 -497 218 377 -238 -270
$$ packed form
3311f6K63L0Lq2N0l97J56K06k21o6K46K10l44k14L83j21Q9j72M40N4n18P5K97
3334C01j42m28K95L11k29j18M0K89j27k95J52J23j88k97K64M74o06l83M13M54
3354C03j12k24l93P15m15k40J26L39k13m46N19J10j41l81M54K70k19m94L88K32
3374A78m47L26l56N65m46QK36L10m75l34J29O53l08k81j47J69j69j051J833Lm49
3395e3n09P54L06r16k62O99K1k14l12N54L20o05k71N63P10r18m94N37N40p60j04
3416d14N00M90m94o70K129j231m21kO25p0o42k31Q34Mo93J14O79j23r66M12P01
3437E31j18n34j40Q86l41n25J48N99m86m56M83O75m51n53L67L42j92q14M62O33
3457E16m81p5j68Q43o65j19Q0L04R8p07L93N19k41n43K16R2K7n86P15J59o15l2
$$ plain form
3479 -270 223 541 95 -455 46 458 -8 -364 131 385 -113 -519 -43 235 -276 -557 82 221 151 -386
3499 -386 -164 241 173 -324 255 154 -82 -113 -31 217 -95 -268 6 -42 53 -335 -199 275 -7 -184 -62 221
3521 221 -58 -245 71 -3 -58 -126 136 358 -103 -296 -4 -94 -51 -203 -96 90 22 -153 -14 301 67 -221
3543 -221 -244 450 381 13 330 -31 3 176 -39 298 -89 -377 53 266 170 0 85 -86 129 68 154 -30
3565 -30 92 -151 4 -141 149 -202 27 98 -2 -323 -49 -401 132 -9 -170 -162 193 -166 -105 -56 118 -20
3587 -20 131 0 313 72 -349 305 272 -117 210 155 320 218 128 303 137 -105 -88 -36 206 -129 -207 -33
3609 -33 9 -100 -17 61 -79 232 -138 179 -172 -306 -297 -160 -113 14 -24 163 71 -235 -228 -52 74 -48 -164 387
3633 387 -3 -197 -149 221 76 -423 176 113 -117 -64 30 143 -27 -269 -335 -112 48 -153 -233 -41 54 56 -49
$$ packed form
3479b70M93L18m46n50N01M12m66l56M95K54m98m06M76K78n11k81O39J39p0n37
3499c86K22M05o8m97N79j01k36l1Q2K48l12j73K74m8R5l88J36M74k82j77J22K83
3521B21k79j87L16p4n5o8K62K22m61j93K92r0M3j52J07J86o8j75J39L15k34k88
3543b21k3O94o9l68L17l61L4J73k15L37l87k88M30K13r6j70Q5j71K15o1Q6j84
3565c0J22k43J55j45K90l51K29P1j00l21K74l52N33j41j61QL55l59O1M9J74j38
3587b0J51j31L13k41m21O54l3l89L27n5J65j02r0J75j66k42J7N2K42l35p8J74
3609c3M2j09Q3P8j40L11l70L17l51j34RJ37M7J27l8J87r2l06PJ76J26j22j16N51
3633C87l90j94M8L70j45m99N99o3k30N3R4J13j70k42o6K23J60k01q0J92R5Kj05
$$ plain form
3656 -49 367 -107 46 -101 364 -14 -370 -88 -7 186 110 -34 85 85 -69 -193 32 77 122 258 -70 247
3678 247 61 -21 -92 -7 -276 -73 20 -90 -122 94 209 197 272 152 466 76 32 110 298 60 71 177 23
3701 23 42 -79 410 -18 169 -52 -298 325 -91 -51 100 29 276 114 291 16 -109 -193 44 105 -5 153
3723 153 32 97 -154 -27 35 46 25 -123 53 -131 307 44 115 291 -93 165 17 311 16 -110 26 -84
3745 -84 98 78 -182 -149 44 -314 -69 -29 -339 34 -178 -62 349 34 30 139 -60 -2 -120 134 9 -220
3767 -220 -235 11 206 20 31 10 27 -441 137 -10 222 -160 -1 122 154 94 -10 254 24 -273 111 229
3789 229 187 -105 -184 -34 272 -145 -270 34 -108 -367 -7 -127 64 -167 -132 90 -104 -231 50 -67 -142
3810 -142 -247 -141 219 -93 -122 22 197 -3 89 41 127 -34 -233 -61 334 419 -23 -156 429 35 -189 113
$$ packed form
3656d9M16m74J53j47M65l78l56K82Q1J93p6j44J19%j54j24K25M5M5J36l28L17
3678B47j86q2p1Q5k69K03R3j10l2K16J15j2P5j20L14l90m4P8J88k38J1J06j54
3701B3J9j21M89m28J87k21k46O23m16M0J51p1K47j62J77k75j25q4K37O1j10J58
3723A53j21O5k51J27O2J1k1j48J76j84M38k63P1J76l84K58j48K94k95j26J36j10
3745h4J82k0k60L3J93l58K45M0l10L73k12J16M11l15mJ09j99N8j18K54j25k29
3767b20j5K46J95j86J1k1J7m68N78j47K32l82J59J23L2o0j04K64k30k97L84J18
3789B29m2k92p9J50L06m17j25L04j42k59L60j20J91k31L5K22j94j27K81j17p5
3810a42j05J06L60l12k9J44J75k00R2m8Q6j61j99J72L95Q5m42j33N85l94k24L02
$$ plain form
3832 113 185 122 -46 -171 -23 -129 168 -73 265 75 -261 196 128 -83 -215 -12 414 107 -174 105 77
3853 77 44 358 31 -111 140 472 80 277 -336 67 202 206 -174 -141 291 106 73 -200 210 149 -199 289
3875 289 -48 -100 -273 -88 -195 -75 -296 -109 30 -59 -22 55 -26 129 -97 -97 198 -55 -17 21 176 -40 -24
3898 -24 0 -328 -237 -73 223 204 6 -87 -123 -279 -240 22 -127 -23 -359 -261 -1 -2 -68 -169 -55 -257 -132 29
3922 29 70 102 -158 -127 286 -107 45 31 -383 -104 153 -92 -22 76 -23 116 315 146 379 -295 43 160 -399
3945 -399 -163 130 121 -59 -186 147 -171 -66 48 306 91 -93 -309 -117 254 -8 9 198 -60 -75 -118 350
3967 350 -77 -129 -80 134 -284 -117 -178 5 -307 -176 219 24 -321 -96 253 -14 5 36 278 -161 -61 155
3989 155 149 152 33 3 148 -109 75 -112 -137 38 -245 -131 -138 67 150 -112 271 41 -160 -7 -144 32 -156
$$ packed form
3832A13P2o3j68j25J48j06K97k41L38j90l36M57o8k11j32K03M26l07k81K79k8
3853G7l3L14l27j42K51L32l92J97o13M03J35Ml80L3M32j85l3k73M10o1l48M88
3875B89l37n2j73J85j07J20k21J87J39q9L7P7q1J55k26%K95k53L8L8J55k16J6
3898b4K4l28R1J64K96j9j98r3l6j56L9K62j49J04l36R8K60jo6j01J14k02J25J61
3922B9M1L2k60L1M13l93J52j4m14K79K57k45P0R8r9J39J99j69K33o74L38J17n59
3945c99K36K93rj80j27L33l18J05J14K58k15j84k16J92L71k62J7J89k58j5m3M68
3967C50m27n2M9K14m18J67o1J83l12J31L95j95l45K25L49k67J9L1K42m39J00K16
3989A55oLj19l0J45k57J84j87k5J75k83J14pK05Q3k62L83k30k01J53j37J76j88
$$ plain form
4012 -156 122 58 -78 -83 -68 271 -201 -104 -39 -13 161 -49 -301 82 -181 -67 1 -26 -17 -38 -109 -2 197 -241
4036 -241 56 -21 71 -335 35 179 -174 43 -137 207 136 -60 6 -44 -132 -67 -6 -74 -74 -272 157 53 -218 44
4060 44 433 -20 101 84 -12 255 153 238 -173 20 -82 42 -57 256 69 -158 -96 -65 53 278 -145 496
4082 496 -84 49 237 -251 51 -96 130 51 173 45 -35 36 128 -14 -37 13 88 173 233 -39 -16 363 -149
4105 -149 243 92 180 137 60 -211 -91 -191 -109 115 -180 436 96 -8 -140 -197 -112 60 264 -49 28 201
4127 201 -184 30 -64 -162 161 -296 247 130 40 -401 89 -23 -28 -381 223 39 -253 -60 -154 8 -294 173
4149 173 55 -35 63 -277 -206 -65 46 -64 134 -37 -279 -286 214 140 53 -264 -103 244 -56 -80 -40 126 35
4172 35 -296 117 -6 -205 79 -196 263 -115 -107 216 -210 -134 -268 22 233 -220 -29 -139 -47 -201 51 -9
$$ packed form
4012a56K78o4j36nJ5L39m72R7O5K6J74k10k52L83k63J14O8k7Rk1p1J07J99m38
4036b41K97p7R2m06L70J44l53K17j80L44p1j96O6n0q8O5O1o8%j98M29j04k71K62
4060D4L89m53J21j7r6K67j02Q5m11J93j02J24r9L13j87k27O2L1J18K25m23O41
4082D96n80J33J88m88L02j47K26p9J22j28q0P1R2j42k3N0P5Q5O0k72K3L79n12
4105a49L92j51Q8m3p7k71J20j00Q2K24k95O16l40j04j32n7Q5J72K04l13P7J73
4127B01l85K14r4r8L23m57N43j17r0m41M90j12nl53O04j84k92J93r4J62l02M67
4149A73j18r0R8l40P1J41J11j10J98j71k42pN00p4q7l17J61L47l00k4M0J66r1
4172C5l31M13j23j99K84k75M59l78QL23m26P6j34K90K11m53J91j10R2j54K52o0
$$ plain form
4194 -9 323 -46 91 -13 -14 -45 -10 118 60 -269 -74 -128 -146 -123 383 470 11 67 -61 131 139 38 -82 208 229
4219 229 54 137 105 -102 -141 -144 81 35 191 -312 -199 55 69 15 180 157 -242 166 163 174 -43 65 208 13
4243 13 97 -150 4 100 -75 17 -129 79 -144 -82 178 -9 -110 -76 -5 -26 -163 -233 41 189 -12 164 269
4266 269 -94 207 101 -5 -23 -240 60 -127 -132 -59 155 66 41 -77 1 145 237 -212 -34 162 -91 -169 -74
4289 -74 -225 -93 274 249 250 128 -193 23 178 78 -310 -68 -200 69 -16 -50 100 10 -166 -287 186 27
4311 27 -191 -238 85 -29 94 130 327 63 -83 -30 103 20 30 135 -37 63 119 -25 46 247 -24 -20 -99 -5
4335 -5 -247 17 291 80 28 -56 -74 -141 80 -295 -4 -77 -108 -170 -32 -109 113 -181 11 -38 203 60 -269 0
4359 0 113 -110 -179 15 -38 30 303 -279 -117 103 -26 98 -22 -135 194 116 -186 9 123 -84 -186 -155
$$ packed form
4194iL32l69J37j04jl1L5J28n8l29J95n4j8K3N06Q7m59N6j28J92Qj01j20K90K1
4219B29j75Q3l2k07l9lK25m6J56n03J13K54J4n4J65k3l99M08lJ1k17J08J43j95
4243A3Q4k47J54R6j75R2j46K08k23O2K60j87j01L4P1k1j37p0K74J48k01J76J05
4266B69l63L01j06j06j8k17L00j87nP3K14q9k5j18P8J44R2m49J78J96k53p8R5
4289g4j51J32L67k5Jj22l21K16J55j00l88K42j32K69q5l4J50r0j76j21M73j59
4311B7k18m7L23j14J23L6J97k64j46N3J33q3J0J05j72J00N6j44P1K01k71Mp9R4
4335ek42K64K74k11n2q4j8o7K21l75K91p3l1o2J38p7K22k94J92m9K41j43l29K69
4359@J13k23o9J94n3O8K73n82J62K20j29J24j20j13L29p8l02J95J14k07j02L1
$$ plain form
4381 -155 138 -191 -140 -143 20 -85 160 -2 24 105 -31 -21 20 14 259 348 -229 112 -62 110 109 -126 -151 100
4405 100 193 119 -33 190 -25 -108 167 70 -28 -152 -202 -216 -19 -256 -198 -81 254 -3 22 -24 -28 -103 -67 2 -117
4430 -117 269 247 -183 -42 -80 -20 -74 -3 -289 293 -290 25 -20 71 123 136 -1 16 55 -128 53 -252 -2 92
4454 92 -110 88 48 -109 -298 54 82 14 -74 -26 -31 -28 -2 4 216 -122 36 -111 -25 -80 -76 138 -88 -2 -39 -97 59
4481 59 -56 -31 -108 28 -276 69 5 -4 170 68 97 -107 -88 -77 362 43 -60 -313 154 -27 46 -31 175 -74
4505 -74 240 208 -168 -68 29 -29 34 -143 -137 -11 -4 -111 -233 134 -125 -353 5 -71 52 185 -19 -206 -182 -235
4529 -235 132 285 160 312 -20 108 190 -143 84 228 -277 -21 129 -84 40 68 -103 -153 119 -119 42
4550 42 225 261 -64 -18 2 115 79 36 -48 66 406 15 207 -190 -177 -113 -423 -70 95 117 -332 -101 311
$$ packed form
4381a55K93l29N1lJ63j05K45j62K6Q1j36J0M1oK45Q9n77L41j74J72jk35k5K51
4405A00R3p4j52K23k15q3K75r7r8j24n0j4J97k37N8J17L35k57K5m6mp5L6O9j19
4430a17L86k2m30J41l8O0n4P1k86N82n83L15m5R1N2J3j37J7L9j83J81l05K50R4
4454I2k02J98m0j57j89L52K8o8q8M8nLK6OK12l38J58j47Q6n5MK14k26Q6l7n8J56
4481E9j15K5p7J36l04L45o4rJ74j02K9k04J9J1M39l19j03k53M67j81P3p7K06k49
4505g4L14l2l76J00R7n8O3j77OJ26Pj07j22L67k59k28L58p6J23J33k04j87K4n3
4529b35L67J53j25J52l32J28Q2l33K27J44n05K56J50k13J24K8j71n0K72k38J61
4550D2J83L6l25M6K0J13l6m3q4J14L40l91J92l97J3O4l10L53J65K2m49K31M12
$$ plain form
4573 311 14 24 28 100 176 -35 55 104 232 -38 -11 140 145 28 57 118 57 -20 -75 280 -13 57 61 130 -90 143
4599 143 -94 -269 5 -14 -63 196 5 185 192 191 247 -267 46 71 63 8 -148 109 30 121 -115 101 155 -69 -63
4624 -63 188 -225 -277 218 -1 151 -116 -209 -140 -202 244 31 -119 -163 -164 77 21 3 -105 152 -80 81 87 -60
4648 -60 -185 -266 -183 117 -189 -90 5 168 -50 -90 116 -179 371 101 -31 227 -55 -33 81 429 43 33 138
4671 138 156 307 -227 -281 -127 86 -95 -53 -83 -162 -340 -15 -98 -58 -165 162 105 61 240 58 -112 54 -56
4694 -56 115 -45 103 -46 141 171 -328 -160 139 -170 -10 -63 -296 -23 -4 61 204 -98 -49 125 -9 -111
4716 -111 220 114 272 29 -268 106 -13 -271 -75 30 -12 -248 87 221 206 -23 52 116 224 3 -137
4737 -137 210 79 -342 39 209 94 -79 17 54 -270 -68 123 124 -43 -128 -254 -56 42 108 219 -70 -193
$$ packed form
4573C11k97J0MP2P6k11R0M9J28k70K7J51Nj17K9O1o1p7n5L55k93P0MO9k20K33
4599A43k37j75K74j9m9K59j91J80PjN6n14L13K5qn5j56K57p9R1k36K16N4k24O
4624f3K51m13n2M95k19J52k67r3O9o2M46k13j50m4jK41n6j8j08K57k32J61Oj47
4648f0j25q1Q3L00l06R9R5J63k18m0K06k95N50k70j32K58k82K2J14L48l86j0J05
4671A38J8J51n34n4J54K13j81M2l0p9j78L25q3M0j07L27n7m4J79j82j70J66j10
4694e6J71j60J48j49J87L0m99J68K99l09J60n3k33K73J9O5J43l02M9J74j34j02
4716a11L31j06J58k43k97L74j19k58J96J05m2k36L35J34j5k29P5O4J08k21j40
4737a37L47j31m21L81J70j15j73R6L7l24K02J91Jj67q5j26J98R8O6J11k89j23
$$ plain form
4759 -193 -175 -86 96 -42 79 -10 20 172 39 199 -13 -203 -160 158 197 87 323 46 40 -33 0 9 178 -99
4783 -99 -184 53 7 111 62 -157 -136 -265 396 66 -89 195 23 17 208 102 25 27 -23 -236 -53 -86 151 -25
4807 -25 349 238 149 -9 45 178 209 -2 -48 27 180 -11 -79 14 483 3 13 -24 392 80 -166 -139 -108 55
4831 55 154 -12 57 4 -163 201 243 -45 -194 -68 -52 43 -28 339 174 -40 94 -156 -87 67 -85 161 94
4854 94 -22 -217 191 204 -27 151 472 171 -135 -186 -162 -15 149 125 -83 -268 -96 -98 -31 -27 47 71 -83 12
4878 12 -282 -151 22 -121 -108 -62 -46 -247 156 -196 96 203 -46 178 26 -108 -119 26 88 13 60 -196 75
4901 75 -45 124 -192 -244 -136 79 14 -120 34 5 -30 -201 150 53 6 35 -35 -199 -286 -265 118 83 -217 25
4925 25 19 462 -65 -368 -44 -6 -8 115 -105 313 255 -40 295 45 -102 -356 242 265 65 -334 106 11 140
$$ packed form
4759a93J8Q9J82j38J21q9L0J52j33J60k12j90M3L18L9j10K36k77op3L3RJ69k77
4783i9q5K37m6J04m9k19K1j29O61l30j55K84j72oJ91j06p7Kn0k13J83l3K37j76
4807b5L74j11q9j58N4J33L1k11m6P5J53j91o8R3M69m80J0l7M16l12k46K7L1J63
4831E5R9j66O9n3j67L64M2k88j49J26J6R5p1L67j65k14J34k50O9J54j52K46o7
4854I4j16j95M08J3k31J78L21l01l06n1K4J47J64k4k08j85J72kO7MP4K4j54R5
4878A2k94J31J73j43J3M6J6k01M03l52K92J07k49K24j52j34j1J45O2p5M7k56K71
4901G5j20J69l16n2J08K15o5j34J54k9l5j71L51r7m7K9p0j64q7K1L83l5l00K42
4925B5oM43n27l03L24L8kJ23k20M18n8k95L35k50j47k54N98K3k00l99M40r5J29
$$ plain form
4948 140 20 13 122 -118 -60 -19 346 -196 127 -73 247 -221 65 98 160 -227 148 -70 65 -65 133 -22
4970 -22 127 -12 -71 112 -16 32 25 111 328 -154 -310 205 105 124 -3 165 77 28 -156 339 -15 -247 -195
4993 -195 325 -102 24 239 377 47 -94 -49 200 80 -58 2 -54 148 167 -307 -17 35 -298 -74 167 64
5015 64 81 -174 371 202 17 -141 -221 144 -144 151 -48 157 -275 64 -31 -103 -51 -240 140 252 95 16
5037 16 86 30 -80 -159 89 11 -52 -88 132 77 -161 -156 164 168 32 -250 269 110 235 16 -69 154 -151 70
5061 70 250 45 -48 -230 -49 4 -33 106 33 78 -188 -295 65 -40 371 192 162 79 -135 -142 110 44 92 -106
5085 -106 19 194 -58 134 82 -269 -9 97 90 121 165 -98 34 297 -361 -87 14 186 -118 -30 196 -69
5107 -69 -91 -307 -111 137 -6 20 75 210 141 0 187 -105 -166 189 -19 44 -164 -77 -119 -159 164 104 -163 -3
$$ packed form
4948A40j20pJ09k40N8M1L65n42L23k00L20m68K86L3O2l87L75k18J35j30J98j55
4970b2J49j39n9J83j28M8pQ6K17m82j56N15j00J9j27J68q8m9j84M95l54k32N2
4993a95N20m27J26K15J38l30j41M5K49j20j38O0n6K02J9m74K90N2l33K24K41j03
5015F4J7k55N45j69j85j58q0L65k88K95j99K05m32L39r5p2N2j89L80J12j57p9
5037A6P0n6j10p9K48p8o3l6K20n5k38NL20Mj36k82N19j59J25k19q5K23l05K21
5061G0J80k05r3j82J81N3l7J39p3M5k66j07L60j05M11j79l0q3k14pK52o6M8j98
5085a06J25J75k52J92n2l51K60J06pL1M4k63J32K63o58K74J01J72l04Q8K26k65
5107f9k2k16J96K48j43K6N5J35o9j41J87k92o1L55k08O3k08Q7m2m0L23o0k67J60
$$ plain form
5131 -3 112 -229 291 59 -434 -131 -243 62 -236 52 297 22 63 -248 215 -140 -406 -171 141 131 -99
5152 -99 -246 252 -110 -47 -85 47 44 -48 -6 130 85 -4 -241 -156 102 -68 58 206 -163 -61 18 40 -32 -45 -174
5177 -174 12 55 -3 87 -156 11 231 110 363 108 -77 68 -240 344 50 -33 141 98 -16 -311 83 104
5199 104 -83 17 -77 95 47 27 12 -176 -69 212 94 348 158 321 -163 82 85 37 139 -44 -95 -345 47
5222 47 -202 -261 -152 48 196 -61 -73 -1 -73 146 -314 -77 181 71 -110 -309 224 -110 -42 -66 190 -31
5244 -31 -20 56 206 -215 155 -39 60 -102 -130 143 -62 -181 156 222 -158 47 -324 -49 -72 137 -99 -48 -59
5267 -59 4 46 122 209 -81 -113 5 114 55 -62 -46 119 33 -106 -15 -72 15 -1 -8 -107 2 59 172 -122 -23 -220
5293 -220 -35 134 -22 131 198 234 167 -106 -188 178 -32 12 -74 24 178 -306 31 263 -27 -151 115 135 201
$$ packed form
5131cJ15l41N20k32m93L03j12L05k98K88K45k75M1l11M63l55k66K35L12j0k30
5152i9j47M98l62O3l8J32lr2M2J36m5q9k37Q5K58j70J26J48l69J02P9K2p2j3j29
5177a74J86M3n8R0k43J67K20j21K53k55j85J45l08N84k94q3J74m3j14k95L94K1
5199A04j87J00r4J72m8k0j5j88J07K81j18K54j90J63m84K45Lm8J02j83n1k50L92
5222D7k49n9J09K00J48k57j2P2p2K19m60K37K58j10j81j99N33l34O8k4K56k21
5244c1J1P6J50m21L70j94R9j62k8K73k05j19L37O6l80K05l71K75k3K09k36N1j1
5267e9O3M2P6Q7k90l2J18J09n9j17J6J65q6j39R1n7Q7j6pr9J09N7J13k94R9j97
5293b20J85J69j56J53O7L6o7k73q2L66k10M4q6R8J54m84L37K32k90j24K66K0O6
$$ plain form
5316 201 132 25 309 -249 -97 -207 110 84 -9 51 312 -181 95 111 258 276 33 184 -197 136 -214 353
5338 353 -53 0 -84 142 -43 -153 16 -81 -1 -242 9 -90 -73 -54 48 564 140 179 -16 397 167 46 -202
5361 -202 29 -114 -172 -107 -42 -8 -93 -103 175 -300 -98 249 71 132 -310 61 33 -205 -29 -140 -11 20 90
5384 90 4 158 -185 -138 -218 -161 -298 -3 -94 122 39 -379 19 -319 188 -151 12 49 -52 211 246 -199 -32
5407 -32 0 -262 -37 -32 21 -82 -64 -408 40 19 -80 91 59 9 134 2 -248 135 73 146 203 -219 120 -96
5431 -96 133 285 -24 142 41 333 79 -356 77 175 117 -62 -71 -284 -9 200 -59 -251 -66 -346 204 279
5453 279 -118 249 -39 96 -49 399 40 18 201 -174 -144 266 -226 -265 -37 -36 491 161 -149 -89 27 54
5475 54 292 74 -23 -93 65 -203 79 -115 13 130 -268 205 389 135 -112 -73 18 -137 -143 160 205 225 -199
$$ packed form
5316B01o9j07K84n58J52j10L17k6r3O0K61m93K76J6J47J8k43J51l81L33l50N67
5338C53m06N3q4K26j85j10J69r7Q0k41K51r9J7J9J02N16m24L9j95M13k30j21k48
5361b02K31j43n8O5O5L4q5j0K78m75K02L47j78O1m42L71k8k38J76j11J29L1P0
5384I0q6J54l43M7q0N7j37K95r1K16q3m18L98l38N07l39J63L7j01K63L5m45J67
5407c2L2k62K25NN3j03J8l44M48k1r9J71l2n0J25j32k50L83o2P3N7m22L39k16
5431i6K29J52l09J66j01K92k54m35M33R8n8j79rk13K75K09k59j92J85k80N50P5
5453B79l97L67k88J35j45M48l59k2J83l75L0M10m92l9K28JN27l30l10O0J16K7
5475E4K38k18r7p0J58k68K82j94J28J17l98M73J84k54k47L9R1j55oL03M5K0m24
$$ plain form
5498 -199 -49 155 -224 -7 40 30 -54 25 -100 545 55 -157 50 -129 0 -175 126 13 -128 -150 66 75
5520 75 -111 39 119 418 68 -177 55 136 -340 91 -92 97 189 132 346 -88 172 -221 -337 41 -159 -32
5542 -32 358 206 335 -10 312 65 -24 30 160 139 -322 -129 68 -74 -140 -217 111 -59 -151 40 5 144 -207
5565 -207 232 -16 287 226 -118 290 -21 -16 47 -61 -85 -238 -32 293 159 -159 -170 266 94 -134 -110 -32 141
5588 141 -129 -207 231 -10 133 21 279 180 -361 35 133 -35 -130 21 177 -45 156 49 114 17 191 -179
5610 -179 -29 148 -148 5 -33 -111 -154 -181 -131 -66 -184 -45 149 93 -78 -39 -102 118 -109 26 86 332 -92
5633 -92 -131 101 -411 -76 -5 120 361 -310 -126 -342 156 -38 -304 -130 0 -630 -241 -7 102 -110 -203
5654 -203 133 -168 -135 -51 221 16 -118 -169 -29 7 -127 18 37 106 -66 -322 61 31 -229 -208 -5 168 -143
$$ packed form
5498a99J50K04l79K17M7j0q4P9j25O45m90k12K07j79J29j75L01j13j41k2K16R
5520G5j86J50Q0K99l50k45K32Q1m76M31j83J89R2n7K14m34K60l93j16L78k00J27
5542c2L90j52J29l45L22k47q9N4J30k1m61J93J97j42o6p7L28j70r2J91l5J39l51
5565b07M39k48L03o1l44M08l11NO3j08k4j53K06L25j34l18j1M36j72k28K4P8J73
5588A41k70p8M38k41J43j12K58r9n41L96R8j68r5J51J56k22K01j07O5r7J74l70
5610a79J50J77k96J53l8p8m3k7N0O5j18J39J94n6j71L9o3K20k27J35O0K46m24
5633i2l9K32n12L35P1J25K41o71J84k16M98j94k66J74J30o30L89K34J09k12r3
5654b03L36l01L3Q4K72k05j34n1J40L6j34J45J9O9j72k56L83l0k60K1K03J73l11
$$ plain form
5677 -143 -31 -147 90 -76 -123 486 59 163 -46 168 224 -195 75 32 54 77 -34 129 -33 -160 -121 329
5699 329 57 130 -129 152 5 -323 246 -23 120 -213 -4 50 132 367 -122 -36 258 140 -39 78 180
5720 180 79 -365 191 51 173 -136 293 -159 -180 169 327 86 -180 253 151 55 185 39 -117 100 -33
5741 -33 -137 264 -157 -27 -100 -24 26 -54 -8 89 -199 -262 -74 34 -34 -138 -122 186 -349 139 61 -142 -29 -18
5765 -18 -266 35 16 -353 -77 104 48 60 73 -42 305 -32 -119 -255 -29 -35 -50 -96 -109 -238 55 184 -32 0
5789 0 -91 -32 101 -179 -199 104 40 -140 -104 -151 -203 186 -38 159 -40 45 236 -10 -113 124 -67 13 -16 22
5813 22 -112 61 171 53 66 -5 227 -86 -165 241 63 26 -47 149 142 61 -153 -2 243 -218 69 107 300
5836 300 142 -271 233 254 -43 147 90 219 91 -123 98 301 -4 -37 15 -126 -275 110 9 -35 98 -190
$$ packed form
5677a43J12j16K37j66m7O09m27J04k09K14N6m19K70m3K2K3j11J63j62j27L9M50
5699C29k72P3k59K81j47l28N69k69J43l33K09N4Q2K35m89Q6K94j18j79J17J02
5720A80j01m44N56j40J22l09M29m52k1L49J58k41k66M33j02r6J30j46j56K17j33
5741c3j04M01m21J30p3P6N0q0M6R7k88o3J88J08o8j04J6L08n35M88p8k03J13J1
5765a8k48L01j9l69K76J81n6J2J3j15L47l37q7j36K26oj5m6j3j29K93J29k16L2
5789@r1N9J33k80k0L03o4j80L6m7n2L89k24J97j99Q5J91k46j03K37j91Q0k9L8
5813B2j34J73J10j18J3p1K32l13p9M06j78l7p3J96pq1k14J51K45m61K87L8J93
5836C00j58m13N04K1k97J90n7J29j28k14K21K03l05l3N2j41j49L85j01m4J33k88
$$ plain form
5858 -190 -40 -79 -136 -80 313 227 60 -367 92 88 92 -152 335 259 -152 -266 -80 297 -92 -35 390 55 -13 -141
5882 -141 -60 -62 -196 -358 113 69 -100 -209 58 101 -178 -167 -124 128 -173 114 207 134 -135 61 45 74 -159 -77
5906 -77 -26 -198 -187 105 -52 -170 149 -175 -59 1 -267 158 -102 -130 -452 -159 -8 -16 -64 186 48 -86 -73
5929 -73 -63 127 179 -78 -101 105 51 -174 28 -26 96 -167 -48 -104 151 -264 338 192 -272 76 -75 264
5951 264 118 -170 -264 146 136 -195 -316 27 -34 -119 400 206 -35 125 -55 -32 -139 -174 145 52 130 33 96
5974 96 -7 123 193 100 158 -175 -28 -122 166 -278 -13 116 273 284 -137 42 -57 167 -208 -183 324 -79 40
5997 40 247 123 -140 -39 -169 -78 -18 38 132 -283 153 -137 84 79 -422 -15 32 -24 -263 -86 -74 -72 -94 -240
6021 -240 -124 -11 69 -219 -152 -115 -141 -70 266 -142 -195 -48 -52 -100 -79 -178 -371 -1 -12 84 -68 18 -220 -249 6
$$ packed form
5858a90J50l9n7N6L93q6j67m27M59mMk44M87p6m11j14J86L77l89N7M25l35o8j28
5882a41Q1kj34j62M71m4j69j09K67M3k79J1M3K52l01K87R3p3k69J96j6K9k33Q2
5906g7N1j72J1K92j57j18L19l24J16O0k68M25k60k8l22K93J51qm8K50j38j34J3
5929g3J0J90N2k57k3K06n4k25K02n4J22k63J19n6K55m15O02j46m64L48j51L39
5951B64j46k88r4M10j0l31j21L43o1q5N19j94k41J60j80K3j07l5L19r3P8r7O3
5974I6j03J30P0r3N8l33J47r4K88m44K65J29J57J1m21J79r9K24l75K5N07m03J19
5997D0K07j24k63J01j30R1O0N6R4m15M36k90K21nn01M07M7n6k39J77J2Kk2j46
6021b40J16J13Q0k88O7L7k6P1L36m08n3J47mm8K1r9j93L70j1R6j52Q6k38k9K55
$$ plain form
6046 6 -235 2 48 54 23 55 219 -134 66 -201 41 -44 47 -180 40 -242 -130 -85 -98 107 63 -36 528 -119
6070 -119 -330 -14 213 -117 400 -105 59 66 -153 93 -124 -100 159 89 -25 52 9 201 -105 190 -151 237
6092 237 228 -102 314 125 246 -121 80 -42 -224 30 219 36 92 -25 -126 65 157 -67 216 -63 191
6113 191 -181 233 68 -49 50 4 205 297 51 -21 -227 -82 -28 -184 486 -99 220 172 2 -297 -41 -109
6135 -109 246 118 -253 -116 111 193 -105 -74 -99 112 -129 8 -89 134 -151 -61 -22 -9 -277 4 45 127 142
6158 142 -2 26 209 11 77 -78 49 -190 114 -132 109 47 14 -319 42 -333 -56 -79 -124 271 -65 -272
6180 -272 -273 94 97 -12 -129 318 28 38 -368 60 115 -113 320 287 -165 -208 39 66 -25 -136 16 -9 106 150
6204 150 -44 118 40 155 -141 -2 -17 -66 -68 282 -194 83 -140 130 104 -61 9 102 103 66 183 38 -105 164
$$ packed form
6046Fk41K37M6Ol1L2J64l53K00k67K42q5R1k27K20k82J12M5j3K05m4r9N64o47
6070a19k11L16K27l30N17n05J64Pk19K46k17K4K59p0j14P7m3J92l06K95l41L88
6092B37rl30M16j89J21l67K01j22j82K54J89j83N6j17j01J91R2k24K83k79K54
6113A91l72M14j65j17R9m6K01R2k46p2k06J45N4j56O70n85L19m8j70k99K56o8
6135a09L55j28l71J37K27Q2k98L1k5K11k41J37r7K23k85R0L9J3k68K81M1Q2J5
6158A42j44K8J83j98O6j55J27k39L04k46K41o2l3l33L61l75K77k3m5L95l36k07
6180b72jL67Lj09j17M47k90J0m06M28N5k28M33l3m52m3K47K7r1j11J52k5J15M4
6204A50j94J62p8J15k96J39j5m9kL50m76K77k23K70k6j65P0R3Jl7J17j45j43K69
$$ plain form
6228 164 -20 258 37 137 326 286 314 11 -81 295 -43 -139 -97 45 -74 482 196 -120 -7 -143 316 153
6250 153 -147 -205 172 12 67 16 -161 89 21 92 217 -21 -4 -172 104 49 -110 -200 -36 -161 -7 23 49
6273 49 -280 -151 -163 -200 -211 -206 -263 -255 125 4 34 -83 -78 -57 6 238 119 -115 -102 76 144 -314 -85 -111 133 -227
6299 -227 -148 -246 152 17 64 113 -201 17 206 -216 106 228 165 -9 99 162 -32 -100 -85 81 159 112 -132
6322 -132 -179 272 -34 -149 90 -7 -12 64 19 73 19 207 43 96 216 -231 86 220 50 216 46 -11 82 44
6346 44 236 -80 -111 86 95 146 -7 3 26 -103 -125 61 -55 -4 -8 96 -189 -474 166 115 -90 -31 -38 -86 -196
6371 -196 180 214 117 214 -20 191 -165 -54 116 -139 42 -277 -85 155 59 -165 -193 89 -59 94 -72 -81
6393 -81 -241 -167 113 286 -113 -357 -46 174 49 28 146 64 -227 -44 35 80 15 -489 89 20 -75 -433 -143
$$ packed form
6228A64j84K78k21J00J89m0K8l03r2L76l38r6M2J42j19N56k86l16J13j36M59j63
6250A53l00n8L77j60N5n1j77K50o8P1J25k38J7j68K76n5j59r0J64j25J54L0K6
6273D9l29J29j2l7j1Nn7QL80j21L0j17NK1O3K32j19k34J3J78O8m58K29k6K44l60
6299b27P9r8L98j35M7M9l14K18J89m22L22J22o3j74J08O3j94o8J5J66P8m7k44
6322a32m7M51l06j15K39r7nP6m5N4n4J88j64N3J20m47L17J34j70J66j70n7R3l8
6346D4J92l16l1J97RN1j53J0K3j29k2J86j16N1mJ04k85k85O40n1k05N9pm8j10
6371a96L76L4r7R7k34K11l56J11J70k55J81l19J92K40r6k24k8K82j48J53j66r
6393h1j60P4K80J73l99k44L11K20j25k1J18q2k91J83P9M5o5n04N78o9r5l58K90
$$ plain form
6416 -143 -192 -306 -215 -63 -7 -195 72 78 -100 34 -123 96 -37 -116 -155 -55 69 -113 26 61 322 8 99
6439 99 -58 -1 -223 -64 48 189 7 -121 173 386 -187 -241 -1 120 83 -203 198 145 -263 -280 69 -140
6461 -140 13 -250 117 86 298 -97 -349 292 213 -29 -7 103 -425 278 356 195 -117 -194 -242 -247 152 298 122
6484 122 -70 -111 292 -16 -64 195 26 174 -99 129 276 78 61 -133 143 232 -147 208 -125 34 -166
6505 -166 13 127 39 -68 252 136 450 140 -231 217 -72 -81 -205 20 -30 222 -26 -63 -35 -172 -53 88
6527 88 46 -146 73 -239 39 -299 -196 -200 125 -185 -84 2 17 -82 21 -4 47 -393 63 -181 -205 -90 -397
6550 -397 86 206 59 -263 -30 71 303 -232 27 41 -67 86 -47 -184 402 151 116 132 -84 -44 115
6571 115 -157 -323 120 86 -57 -123 -330 54 81 -54 173 -27 -376 -299 124 11 -191 140 -308 68 -290
$$ packed form
6416a43m9j14R1J52N6j88K67Oj78J34j57K19j33p9l9J00J24j82J39L5K61l14R1
6439I9j57N7k22J59J12J41j82j28K94K13n73n4K40J21l7k86M01n3m08j7L49k09
6461a40J53k63L67l1K12l95k52O41p9k42K2J10n28P03P8j61l12p7m8nL99J46j76
6484A22j92m1M03l08m8K59j69J48k73K28J47j98j7j94K76Q9l79L55l33J59k00
6505a66J79J14q8j07L20j16L14l10l71M48k89rj24K25n0K52k48l7K8j37J19J41
6527H8m2j92K19l12K78l38J03mL25l10J01Q6J5r9J03k5N1m40M56k44k4J15l07
6550c97M83J20j47l22K33J01K32n35K59J4j08J53j33j37N86k51l5J6k16M0J59
6571A15k72j66M43l4j43o6k07L84K7j35K27k00l49P7M23j13k02L31m48L76l58
$$ plain form
6592 -290 154 19 -167 -18 -195 59 -10 163 70 -117 412 -102 79 7 -16 -99 101 127 -23 -140 -237 33
6614 33 -112 7 -20 -30 13 142 277 139 19 -118 -43 -16 147 114 364 434 116 -384 31 112 26 -37 180 151
6638 151 -75 48 -147 61 72 112 246 -365 -209 41 -9 -65 -18 45 -111 -229 -191 87 278 -226 -54 96
6660 96 27 154 -165 41 -153 -161 -142 28 -186 -104 162 -123 -311 -49 -167 -190 139 -167 -101 11 -130 33 -231
6683 -231 36 54 -12 130 135 10 -210 117 120 -36 -172 -232 24 -205 -148 -90 540 -201 -95 -242 21 166 -238
6706 -238 -72 63 -133 -130 237 -134 -66 -3 15 282 -155 -180 10 108 -181 -141 -70 181 69 -84 173 458 -188
6729 -188 -161 27 86 -70 -129 124 -66 235 -24 164 27 -134 -280 -115 73 -70 121 137 257 -200 -50
6750 -50 220 80 6 -191 391 -124 96 -44 6 192 -275 -105 227 -36 -185 -142 103 77 187 359 245 -106
$$ packed form
6592b90M44j35j86J49j77K54o9J73r3j87N29n14J81p2k3q3K00K6j50j17r7K70
6614C3j45J19k7j0M3J29J35j38j20j37P5K7J63l3K50P0l18n00M15Q1q6o3K17k9
6638A51k26J23j95K08J1M0J34o11J56K50n0n6M7O3j56j18L8K78J91n04J72J50
6660I6o9J27l19K06j94qJ9J70k14Q2K66k85j88K62j18k3L29l06O6J12j41J63k64
6683b31K67J8o6J42Nj25k20L27Lj56j36o0K56k29N7N8O30p41J06j47K63J45m04
6706b38J66J35j96LL67l71O8O3J8K67m37k5J90R8k89M0P1K51j12j53K57K85o46
6729a88K7J88N9j56n9K53j90L01k59J88j37j61j46J65J88j43J91J6J20m57J50
6750e0K70j40p4j97N82n15K20j40N0J86m67J70L32k63j49M3K45k6J10J72j14l51
$$ plain form
6772 -106 -120 -61 272 34 -172 -453 25 191 -424 -12 41 -408 -521 77 -105 -46 105 143 16 23 -367 -305 421
6795 421 56 -183 19 140 -31 -356 -436 65 -35 89 41 299 50 -165 118 -62 76 -108 33 146 104
6816 104 -271 -7 -190 50 51 -306 -197 184 -198 57 -102 -243 -207 -132 -78 22 -138 98 288 19 25 32 -331
6839 -331 39 -282 -105 -318 60 415 14 117 69 -147 -159 134 53 279 91 151 -178 -486 -76 -185 -207 178
6861 178 135 491 -198 289 193 46 105 -180 303 322 -34 -1 6 168 -147 20 64 37 15 -64 -179 262 156 91
6885 91 143 -127 160 -247 42 195 280 39 -4 -60 120 -109 -111 35 -24 74 228 -190 24 -273 -137 44 -118
6908 -118 95 -127 -51 26 -336 3 -121 -22 -252 -129 -85 291 45 141 66 -258 -83 -85 -173 74 216 -284 79
6931 79 -328 146 190 21 51 -125 -282 -3 -203 -78 -226 56 -78 -267 102 90 -67 -154 -15 48 89 -188
$$ packed form
6772a06j4N9L33k38k06k81M78J66o15M12N3m49j13N98j82N9J51L8j27Pl90O2P26
6795D21l65k39K02J21j71l25q0N01j00J24m8K58k49k15K83j80J38j84J41J13m2
6816A04l75K64j83K40Jl57J09L81l82K55j59j41L6P5N4J00j60K36J90k69OPl63
6839c31L70l21J77k13L78L55m01J03m8k16j2K93q1K26j88O0l29l08M10j09k2L85
6861A78m3L56o89M87r6j47N9k85M83J9l56L3PJ62l15J67M4k7k2p9j15M41j06o5
6885I1N2k70K87m07K89J53Q5k41m3n6J80k29kJ46n9R8J54m18K14k97J36J81j62
6908a18K13k22P6P7l62L39j24R9k30J23M4L76k46R6p5l24J75kq8K47J42n00L63
6931G9m07M74M4j69L0j76j57K79k00J25j48K82j34j89L69j2j57q7J39O3M1k77
$$ plain form
6953 -188 -255 -217 76 -326 -61 -200 -154 -8 -8 160 22 -29 243 259 -122 -313 -158 -78 -71 -239 160 155 -188 -348
6977 -348 115 147 -85 -25 69 -51 44 -43 86 217 -13 266 115 228 163 94 146 240 315 28 118 170 279 -8
7001 -8 299 237 102 -32 38 157 154 -188 343 355 421 115 -81 17 95 129 -120 399 41 -272 238 326 -152 22
7025 22 -128 97 -218 -48 -78 162 -67 59 -98 124 19 -352 5 190 -136 1 -124 81 17 96 -69
7046 -69 -159 11 135 38 16 -137 4 204 -162 -136 72 83 182 -35 33 -249 -51 -71 109 32 215 -17 -206
7069 -206 59 -148 -71 85 392 41 202 -157 179 -1 205 -23 94 -80 10 -113 23 127 -67 254 -150
7090 -150 -97 82 -171 187 -179 -9 218 -154 89 56 102 -95 337 2 69 196 31 28 -60 249 -61 -103 -58
7113 -58 -6 247 -222 90 140 134 12 47 39 221 173 72 198 -9 33 91 212 85 -82 62 -138 54 0 -143
$$ packed form
6953a88o7L8K93m02K65j39M6J46%J68j38n1K72J6l81j91J55Q0Pj68L99nl43j60
6977c48M63L2k32O0R4j20R5q7J29J31k30K79j51J13o5o9N2R4P5k87R0N2J09k87
7001hL07o2j35j34P0J19ll42N31J2O6l06j96R8P8L4k49N19l58l13N10Q8m78J74
7025B2j50K25l15J70l0K40k29J26j57K22j05l71L57J85l26J37j25K05o4P9j65
7046f9r0J70J24r7k2j53J41K00l66K6K08J1R9k17O8k82J98k0J80p7J83k32j89
7069b06K65k07P7J56L07l51J61l59L36j80K06k28J17j74R0j23J36J04j94L21m04
7090a50N3J79k53L58l66J70K27l72K43l3M6j97M32l35O7J27j65lq8L09l10m2M5
7113e8N2K53m69L12N0oj22L5qJ82m8j01J26k07M2N8J21j27j67J44k00J92n4j43
$$ plain form
7137 -143 86 261 -183 0 269 64 -101 -31 -4 422 -164 -12 111 107 113 0 -118 12 -137 82 312 -15
7159 -15 -38 -190 -200 235 211 8 -186 -65 -122 -25 207 35 -349 -108 -20 61 -59 105 -168 243 -382 -105 -41
7182 -41 -362 -145 -428 -211 160 10 -85 -32 -49 99 -284 377 -188 78 -252 178 -177 142 -28 159 -130
7203 -130 35 -138 -159 -41 -114 -278 331 192 -241 151 144 -87 -15 18 -39 -60 103 -308 -90 -127 -112 408 36
7226 36 -278 -220 175 133 129 137 426 296 -20 -157 -172 -182 -59 -23 92 530 300 -149 185 -117 29 -39 90 124
7250 124 -277 -61 21 78 -176 55 110 -140 -127 -496 168 191 109 242 45 161 108 -115 105 160 184 16 43
7273 43 195 -347 63 61 -18 -96 137 16 76 55 124 85 8 75 147 55 116 356 -71 -29 -284 31 131 91 -161
7298 -161 328 -206 305 16 -78 -237 -21 -90 -195 -75 56 14 -54 113 -324 -204 -503 -285 -80 -37 -153 46
$$ packed form
7137a43K29J75m44J83K69k05j65P0K7M26n86J52J23mOj13j18J30j49K19K30l27
7159a5k3j52j0M35k4k03j94J21n7R7K32j72l84K41Q8Q1j20J64k73M11o25K77O4
7182d1l21K17k83K17L71j50r5N3j7J48l83O61n65K66l30M30l55L19j70J87k89
7203a30J65j73k1J18p3j64O09j39m33L92pk31P2L3n7k1J63m11K18l7J5N20l72
7226C6l14N8L95m2mQK89j30l16j37j5j0J23L6J15M38k30m49L34l02J46o8J29L4
7250A24m01K16Q2N7k54K31N5k50J3l69O64K3q2J33j97J16n3k23K20N5K4j68K7
7273D3J52n42M10kp9p8K33j21O0k1O9l9p7O7P2r2O1K40m27M2k55L15J00m0k52
7298a61M89n34N11k89r4j59K16o9j05J20J31m2o8J67m37J20k99K18K05M3j16J99
$$ plain form
7320 46 200 -189 -359 136 38 -238 -67 43 -63 -41 -19 66 4 6 318 211 -399 -122 -213 -203 -12 -31 -8 -162
7344 -162 103 -142 -261 -5 144 -216 143 150 -24 -82 52 -142 166 -68 153 192 -208 94 167 88 176 113 -5
7367 -5 193 -160 201 369 340 -52 147 452 119 -256 113 -1 -108 94 -90 159 206 9 -68 183 116 167
7389 167 32 188 90 30 31 439 147 7 -167 -4 367 234 154 36 229 28 -154 81 164 86 78 221 83
7412 83 -10 214 -220 7 81 39 222 10 69 206 -205 221 -182 119 111 -161 -51 -171 -118 77 52 -176 -40
7435 -40 119 -253 -30 -179 104 -219 -183 143 175 -55 -149 -89 76 126 -246 -139 -18 124 246 112 -135 -188
7457 -188 -134 -160 27 -51 7 -78 -196 -235 -35 159 124 -10 -44 21 -55 -270 -2 372 -234 85 47 232 -69 122
7481 122 120 53 134 -85 108 -80 -259 -2 -50 69 -68 -203 345 112 -95 0 -128 67 272 161 214 9
$$ packed form
7320D6J54l89j70M95r8k76J71J10j06K2K2Q5o2KL12j07o10K77r1J0J91j9K3j54
7344a62K65k45j19K56J49l60L59Pj74n8J34j94L08k34K21L9m00L02P3p9Q8o3j18
7367eJ98l53L61J68k9l92J99L05l33l75L69j14j07K02j84K49M7j97p7K51o7N1
7389A67j35J56r8o0JM08k92j40j74J63L71j33q0j18J93k01j82K35Q3p8qJ43j38
7412H3r3K24m34K27P4m2J83k12N9J37m11M26m03L01qk72J10j20N3J95k5k28J36
7435d0J59l72K23j49K83l23L6L26L2k30r4O0J65N0l72J07J21J42J22j34k47n3
7457a88N4k6J87p8N8q5j18l9K00J94l5j34l4O5p6k15K68L74o06L19l8J85l01J91
7481A22ko7Q1k19J93j88j79K57m8J19j37j35N48k33k07R5j28J95K05j11N3k05
$$ plain form
7503 9 73 -132 -54 -27 274 128 62 -108 54 -88 197 193 138 -206 -35 326 199 141 108 201 135 16 106 229 215
7528 215 -258 85 20 63 146 -182 28 -10 -3 159 6 191 58 117 421 122 217 113 -155 -91 -88 -145 14 -118
7552 -118 103 -106 -312 38 151 -175 74 -231 145 53 -81 -308 88 81 -300 75 61 -144 -140 -92 48 -194
7574 -194 126 39 -32 39 147 187 148 10 -161 -243 51 -233 39 -5 -56 -107 33 -59 -208 -215 248 54 150 -89
7598 -89 -53 277 -134 16 -65 -183 -120 -19 62 -100 -102 15 14 59 352 56 208 54 29 54 -185 59 -148 -150 156
7623 156 181 47 218 -16 211 44 271 308 170 236 69 46 122 37 243 -1 228 -128 -75 55 -132 82
7645 82 -135 -134 280 124 -149 -26 178 122 67 186 206 257 -51 80 118 -168 450 128 195 24 -111 -42 -51 59
7669 59 -470 44 69 139 -71 158 297 278 -70 -132 181 61 -169 293 427 94 71 81 3 124 -423 4 -169
$$ packed form
7503IO4k05P8K7L01j46o6j70J62j42K85mn5l44J71L61j27n8l3R3o6j19R0J23j4
7528B15m73L43o5M3Q3l28K10l8PJ62j53J85j33N9L04k99R5j04k68O4Ln7J59j32
7552a18K21k09k06L50J13l26K49l05L76r2j34k27L96pl81L75j4k05MM8J40k42
7574a94L20q7p1P1J08M0l9j38j71q2K94k84K72m4n1n1J40r2j49pM63j94R6k39
7598h9L6L30m11J50q1j18O3J01Q1j62kJ17jM5K93k96J52j54k5K5k39K44k07kL06
7623A56K5j34J71k34K27j67K27L7j38O6j67k3P6q5K06k44K29l56N3J30j87K14
7645H2k17JM14j56k73J23K04n6n5J19K0N1l08J31L8k86O18l22O7j71j35O9rJ10
7669E9n29N14K5P0k10K29J39j9l48o2L13j20k30M62J34l33k3J0p8J21n47M27j73
$$ plain form
7692 -169 -120 -41 125 -81 61 -167 107 167 -291 -42 164 143 -66 52 -214 -193 21 -206 41 138 -75 -308
7714 -308 -51 282 -89 68 -115 65 -1 35 -87 4 -36 109 -75 -24 135 -194 -234 135 78 -157 110 -12
7736 -12 -127 13 299 227 -116 -181 243 52 72 -90 -7 -11 -175 136 95 327 -26 -27 -71 -204 -93 -55 194 180
7760 180 -82 -299 269 18 -164 -83 -49 202 8 163 137 448 -247 -294 5 -111 182 -62 184 125 -44 -60
7782 -60 150 -33 347 -205 505 -74 -275 607 -581 -187 181 -82 144 151 41 -414 -402 298 468 -13 9
7803 9 49 -92 -302 90 6 -6 -89 -30 -80 -391 -36 -111 -22 112 11 344 128 24 263 -7 -163 106 116 -8
7827 -8 -58 188 105 -222 -219 -243 27 -278 -46 -130 -171 -114 -425 -19 -106 -117 45 -189 -48 -93 60 143 129 117 232
7852 232 -9 104 87 -327 -50 93 66 -74 62 -116 -112 276 -160 -152 -221 47 49 -28 -237 -163 -65 -1 -187 -93 29
$$ packed form
7692a69M9P9J66k06J42k28K74O0m58K49K06k1k09J18k66K1K14k27K47R7k13k33
7714c08K57L33l71J57j83J80o6L6j22R1m0J45j84N1J59l29m0L69n7k35K67j22
7736a2j15J40K86p2l43o5M24j91K0j62Q3mj64L11m1K32l53jm4j33J11L8K49j4
7760A80k62k17N68k51j82Q1L4K51j94J55k6L11o95m7K99j16K93k44K46n9j69j6
7782f0K10j83L80n52P10n79k01Q82j188L94L68k63K26Pj10m55J2P00J70m81K2
7803IM0j41k10L92q4j2q3N9n0l11L55p5Q9J34j01L33k16j04K39k70j56K69J0j24
7827hn0K46q3l27Lk4K70l05K32q4m1N7l11M06q7j1J62k34J41m5J53Q3j4j2J15
7852B32k41J13j7m14K77J43k7j40J36j78ML88m36Qo9K68Kp7k09P4R8O4j86R4J22
$$ plain form
7877 29 118 -16 -171 -106 136 100 13 157 10 199 369 39 30 42 26 40 -191 7 132 26 122 -103 201 31
7901 31 46 250 -22 61 76 -215 250 153 224 186 100 53 -332 170 -130 -200 225 62 191 -1 160 154 -27 150
7925 150 -35 -185 161 -135 173 80 314 134 -38 -100 461 -208 -216 376 22 -25 -117 -244 89 -16 -73 -91 -388
7948 -388 35 -97 233 -35 -57 -116 -263 117 123 -21 145 -98 -279 -105 48 -263 58 -265 -15 6 -95 42
7970 42 37 -256 -108 -19 -107 -66 -95 -146 -124 -173 -100 -262 -116 116 -268 35 -145 6 121 -83 11 19 -81 -130 -32
7995 -32 43 63 137 -98 173 89 164 23 -89 155 53 236 118 -15 -284 94 14 33 231 178 84 -309 -187
8018 -187 8 119 115 -162 66 110 -5 -79 -38 -101 -273 124 52 -11 113 4 350 8 -134 -98 163 -46 384
8041 384 -58 -45 330 411 -164 62 -51 -3 -244 -145 183 -94 -54 -66 235 -19 -353 100 11 133 -33 -292
$$ packed form
7877B9Q9j34j55O5K42l6q7J44j47J89J70l30rJ2j6J4k31J98J25j06R6k25L04j70
7901C1J5K04k72Q3J5k91M65r7P1l8q6m7l85N02l00p0M25j63J29j92J61oj81J77
7925A50j85j50L46k96L08r3K34j80j72o2N61o69qN92l54m7r2j27L33j05n7j8k97
7948c88M23j32L30k68k2n9j47L80Oj44J66k43j81J74J53l11L21l23K50K1j01J37
7970D2nk93J48Q9q8M1k9n1K2m9P3j62J46K32l84L03j80J51J15k04R4Qj00m9R8
7995c2P5K0P4k35K71q4P5j41j12K44j02J83j18j33k69L78q0J9J98n3r4l93J22
8018a87J95J11mk77K28M4j15p4M1o3j72L97p2o3J24j09L46l42j42L6K61k09M30
8041C84m42J3L75Q1n75K26j13M8k41R9L28k77M0j2L01k54l34M53q9J22j66k59
$$ plain form
8063 -292 57 90 123 162 -273 219 -121 30 -85 -50 -289 -46 -117 -75 32 -166 -237 28 -236 -25 -248 18
8085 18 -8 -235 -167 -18 48 -11 10 39 -59 -48 -124 262 118 28 24 -515 -154 -44 -53 34 -86 -178 -221 -227 81 -176 -73
8112 -73 0 53 93 24 191 -219 -91 -90 -37 56 43 -115 156 9 73 -241 251 117 -200 160 175 -23 149 -170
8136 -170 22 -93 186 164 74 -137 13 225 -220 126 -98 155 349 -55 -234 -19 11 -24 285 59 -80
8157 -80 153 103 130 99 310 -80 40 83 41 111 213 285 117 -47 -10 90 -67 209 16 -193 -23 209 -76
8180 -76 -18 -28 19 -319 154 -75 55 21 -83 -41 -159
$$ packed form
8063b92L49L3L3L9m35M92l40J51j15L5k39K43p1M2J07j98p1K65k64K11k23K66
8085A8k6k27O8J49O6n9K1K9r8J1p6L86j44r0mn39L61J10rQ7j20r2m3oL08k57J03
8112g3P3N3M0o9J67m10J28JN3R3j3j58K71j47O4l14M92j34l17L60J5j98J72l19
8136a70J92j15K79k2r0k11J50K12m45L46k24K53J94m04j79K15L0l5L09k26j39
8157h0K33n0K7l1K11l90J20M3m2P0J02P2j68j64L7J00j57K76j93k09J70K32k85
8180g6N8j0M7l38M73k29J30l4j04M2j18
8191a59
$$ Imaginary data points
##PAGE= N=2
##DATA TABLE= (X++(I..I)), XYDATA
$$ plain form
0 0 0 0 0 0 8 0 8 -8 16 -16 16 -24 32 -32 40 -50 64 -72 87 -103 120 -136 159 -183 211 -240 273 -311 353
29 353 -399 448 -504 566 -630 704 -784 871 -968 1073 -1191 1318 -1459 1617 -1788 1982
45 1982 -2199 2445 -2725 3048 -3424 3869 -4405 5068 -5907 7015 -8545 10807 -14494 21534
59 21534 -39762 182403 339326 -193499 -230490 150067 241328 -129283 -196212 105001 191984
70 191984 -73618 -109407 127376 158970 -85728 -121860 77914 114764 -60539 -72202 82564
81 82564 94920 -41580 -40338 69289 52500 -54182 -29492 65912 41978 -44335 -19133 50290
93 50290 23181 -29724 8353 49190 -1774 -40856 17801 54804 -11632 -54096 13021 57931
105 57931 578 -32066 28599 45923 -37995 -66112 24285 60896 -32088 -71039 36069 96639
$$ packed form
0@%%%%QqQj6K4l2L2m0N6o4P2r0J14j36J59j90K23k56K95l42L94m51N13n84O64
29C53p52Q47r52J070j196J334j488J655j839K041k264K509k777L076l405L770
45A982m181M644n170N773o472P293q274R473j0975J2922j5560J9352k5301L6028
59B1534o1296K22165J56923n32825l6991L80557R1261l70611o6929L01213Q6983
70A91984k65602l5789K36783L1594k44698l6132J99774L6850j75303j1663J54766
81H2564J2356j36500J242J09627j6789j06682K4690R5404k3934q6313K5202O9423
93E0290k7109n2905L8077M0837n0964l9082N8657L7003o6436m2464O7117M4910
105E7931n7353l2644O0665J7324q3918k8117R0397L6611r2984l8951J07108O0570
$$ plain form
117 96639 -6417 -87762 -10170 62291 -9735 -77234 -4124 68611 7252 -54078 8020 60133
129 60133 -18113 -83415 -11497 56618 -6561 -66891 3124 72684 6099 -71293 -19061 54798
141 54798 9401 -64403 -28380 44125 24211 -36602 -25051 22985 13648 -25875 -16968 15030
153 15030 7901 -19988 -17303 3051 2459 -7554 -1771 9636 7769 355 -3170 -7975 -14972 -10796
167 -10796 2516 6236 -767 885 12811 12936 -5802 -17915 -9029 3302 -2000 -8766 5354 25589
181 25589 17951 -8444 -12858 6081 8042 -12649 -14530 9403 17880 1587 -186 16710 9179
194 9179 -19529 -14507 20193 19405 -17571 -17049 27185 34009 -11254 -25783 12277 25015 -9825
207 -9825 -17669 20481 23630 -21120 -24733 26397 37064 -14240 -29413 19765 35991 -12460 -31747
$$ packed form
117I6639j03056q1345P7592P2461p2026o7499P3110P2735o1359o1330O2098N2113
129F0133p8246o5302P1918O8115o3179o0330P0015O9560o6585p7392N2232P3859
141E4798m5397p3804L6023P2505j9914o0813J1551M8036r337l9523Q907L1998
153A5030p129k7889K685K0354n92j0013N783J1407j867p414l525m805o997M176
167a0796J3312L720p003J652J1926J25j8738j2113Q886J2331n302o766J4120K0235
181B5589p638k6395m414J8939J961k0691j881K3933Q477j6293j773J6896p531
194I179k8708N022L4700p88l6976N22M4234O824m5263j4529L8060J2738l4840
207i825p844L8150L149m4750l613N1130J0667n1304j5173M9178J6226m8451j9287
$$ plain form
220 -31747 11555 28070 -15072 -25877 24977 42492 -8588 -33422 8951 28866 -14220 -35019
232 -35019 6871 30116 -3748 -17843 20184 30856 -15248 -34740 4850 23086 -13232 -27022
244 -27022 14438 32820 -3617 -22602 6566 15150 -18297 -24451 12812 20260 -15795 -19775 18572
257 18572 21344 -19495 -23168 15372 16480 -22616 -19531 22284 16099 -29712 -23007 28520 23675
270 23675 -30209 -27648 26356 24125 -31940 -31110 24501 25538 -27135 -24854 31235 29236 -29428
283 -29428 -33065 21864 23626 -30173 -29573 26340 30294 -21619 -22677 27434 23954 -33262 -35548 21006
297 21006 29993 -18936 -23851 25829 33073 -15728 -29256 11566 22565 -14496 -24289 11268 24920
310 24920 -2232 -11956 10376 15059 -6712 -11357 6852 8937 -5203 -1471 12810 5600 -7199
$$ packed form
220c1747M3302J6515m3142j0805N0854J7515n1080k4834M2373J9915m3086k0799
232c5019M1890K3245l3864j4095L8027J0672m6104j9492L9590J8236l6318j3790
244b7022M1460J8382l6437j8985K9168Q584l3447o154L7263P448l6055l980L8347
257A8572K772m0839l673L8540J108l9096L085M1815o185m5811O705N1527m845
270B3675n3884K561N4004k231n6065Q30N5611J037n2673K281N6089j999n8664
283b9428l637N4929J762n3799O00N5913L954n1913j058N0111l480n7216k286N6554
297B1006Q987m8929m915M9680P244m8801j3528M0822J0999l7061r793L5557J3652
310B4920k7152r724K2332M683k1771m645J8209K085j4140L732J4281p210j2799
$$ plain form
323 -7199 4109 18344 3423 -15256 -1288 17129 3602 -14790 626 20153 6202 -11888
335 -11888 4964 23708 3660 -20316 -3647 19787 4252 -16723 2220 27073 9056 -17911
347 -17911 -2448 21619 3094 -26475 -8445 25827 14224 -17648 -6484 26765 16678 -20761
359 -20761 -19231 13594 14998 -14024 -14050 15533 18908 -8238 -14830 7963 12469 -9824 -16705 2763
373 2763 10718 -3746 -7547 8146 10637 -6473 -11647 3048 6993 -8031 -13560 1230 8065 -3550
387 -3550 -9156 2923 9117 -2096 -11374 -4804 1524 -3445 -8275 -1378 4153 1253 -1547 1262 379
402 379 -5983 -6779 -2165 -3706 -8764 -1850 9629 5697 -8057 -7177 6912 4455 -12727 -13766 4382
417 4382 9966 -4476 -8443 7216 11936 -5619 -13859 1257 8535 -5704 -12033 3193 11763 -58
$$ packed form
323g199J1308J4235j4921j8679J3968J8417j3527j8392J5416J9527j3951j8090
335a1888J6852J8744k0048k3976J6669K3434j5535k0975J8943K4853j8017k6967
347a7911J5463K4067j8525k9569J8030L4272j1603l1872J1164L3249j0087l7439
359b0761J530L2825J404k9022k6K9583L375k7146o592K2793M506k2293o881J9468
373B763P955j4464l801J5693K491j7110n174J4695L945j5024n529J4790O835j1615
387c550n606J2079O194j1213r278O570O328m969m830O897N531k900k800K809q83
402C79o362p96M614j541n058O914J1479l932j3754Q80J4089k457j7182j039J8148
417D382N584j4442l967J5659M720j7555q240J5116P278j4239o329J5226Q570j1821
$$ plain form
431 -58 -6237 5973 8432 -7099 -10981 5745 10928 -6046 -10493 8271 15592 -2479 -9831 6663
445 6663 12589 -6254 -13817 4074 13797 -759 -7788 6229 14111 470 -6116 5194 7686 -5629
459 -5629 -8139 6750 11039 -1300 -3211 9553 9784 -5729 -7583 6785 8625 -6426 -8101 7781
473 7781 12541 754 -2939 6146 6287 -5040 -6319 3595 5398 -3050 -2722 6018 5797 -2060 -548
488 -548 5425 984 -8101 -3769 6182 3636 -4750 -1134 7940 4310 -6057 -4571 3405 1363 -7174
503 -7174 -6192 2492 4075 -1213 -2504 1938 2089 -3148 -5029 -2538 -1148 -1800 -2027 -573 627 1074
519 1074 -804 -3003 -2899 -1921 -2389 -4479 -2843 480 442 -1913 -466 1840 -1589 -6549 -3597 1970
535 1970 -863 -6217 -3058 4011 1747 -3949 -1540 3424 -1077 -8336 -3893 3889 333 -5978 -807
$$ packed form
431e8o179J2210K459j5531l882J6726N183j6974m447J8764P321j8071p352J6494
445F663N926j8843p563J7891R723j4556p029J4017P882j3641o586J1310K492j3315
459e629k510J4889M289j2339j911J2764K31j5513j854J4368J840j5051j675J5882
473G781M760j1787l693R085J41j1327j279R914J803q448L28Q740k21p857J512
488e48N973m441r085M332R951k546q386L616R074l630j0367J486P976k042q537
503g174R82Q684J583n288j291M442J51n237j881K491J390o52k27J454J200M47
519A074j878k199J04R78m68k090J636L323l8k355J447K306l429m960K952N567
535A970k833n354L159P069k264n696K409M964m501p259M443P782l556o311N171
$$ plain form
550 -807 7072 1566 -6187 -1999 4621 -361 -7826 -1734 5859 1086 -4727 2565 8297 -336 -7789
565 -7789 225 7082 -1237 -7535 1767 9298 553 -4349 5425 9132 -4163 -9311 4625 11012 -2762
580 -2762 -9056 5848 12678 -1635 -7700 6500 10922 -5581 -9585 8466 13140 -5673 -10094 9600
594 9600 15263 -4483 -10413 8656 12976 -6923 -11018 9222 13815 -6273 -9977 10567 14373 -6428
608 -6428 -10444 8878 11173 -8352 -9493 10225 11628 -6224 -6804 10036 7994 -9527 -6789 10965
622 10965 6163 -12408 -6572 14850 9875 -10950 -7597 10389 5400 -12466 -6038 11972 4679
635 4679 -13804 -5425 14102 6317 -13141 -8044 9817 4330 -11591 -4796 9688 1854 -12143
648 -12143 -2277 12100 1312 -14767 -4671 11423 1216 -14658 -4900 11044 2542 -11857 -2913
$$ packed form
550h07P879n506p753M188O620m982p465O092P593m773n813P292N732q633p453
565g789Q014O857q319o298R302P531q745m902R774L707j3295n148J3936O387j3774
580b762o294J4904O830j4313o065J4200M422j6503m004J8051M674j8813m421J9694
594I600N663j9746n930J9069M320j9899m095K0240M593k0088l704K0544L806k0801
608f428m016J9322K295j9525j141J9718J403j7852n80J6840k042j7521K738J7754
622A0965m802j8571N836K1422m975k0825L353J7986m989j7866O428J8010p293
635D679j8483Q379J9527p785j9458N097J7861n487j5921O795J4484p834j3997
648a2143R866J4377j0788j6079J0096J6094j0207j5874R758J5944q502j4399Q944
$$ plain form
661 -2913 9801 -441 -13031 -1982 10574 -1161 -14636 -2818 11860 2725 -10807 -3049 7280
674 7280 -1304 -10131 -4 8598 -3437 -11186 2008 11996 -692 -12376 -1496 8383 -124 -8347
688 -8347 1092 7478 -2161 -7127 3609 8486 -3223 -8673 1772 8020 -851 -6007 1305 5690
702 5690 -428 -2513 3897 3806 -3760 -3113 5595 5049 -3668 -3969 4736 6799 -90 -2802 1003 2237
718 2237 765 2020 2608 -1440 -2413 2255 5997 2443 -1483 -116 1393 161 953 3375 1754 -2332
734 -2332 -523 4890 4520 -788 -2438 797 1809 627 1170 1130 -631 -492 2832 2887 -1632 -2441 1458
751 1458 2490 -1612 -1564 2235 1258 -3238 -689 4555 1419 -6271 -3344 4773 3118 -5103 -3543 3807
767 3807 2061 -5122 -2059 4773 365 -7299 -1978 6364 693 -8894 -3174 7238 2674 -8356 -4262
$$ packed form
661b913J2714j0242j2590J1049J2556j1735j3475J1818J4678r135j3532P758J0329
674G280q584q827J0127Q602j2035p749J3194R988j2688j1684J0880R879q507q223
688h347R439O386r639m966J0736M877j1709n450J0445O248q871n156P312M385
702E690o118k085O410r1p566O47Q708n46q717l01Q705K063o889k712L805J234
718B237j472J255N88m048r73M668L742l554l926J367J509j232P92K422j621m086
734b332J809N413l70n308j650L235J012j182N43m0j761J39L324N5m519q09L899
751A458J032m102M8L799r77m496K549N244l136p690K927Q117j655q221J560P350
767C807j746p183L063O832m408p664N321Q342n671r587N720J0412m564j1030M094
$$ plain form
782 -4262 5281 2045 -7106 -3179 5556 505 -7837 -1635 7269 827 -9499 -3464 7349 1679 -7588
797 -7588 -2378 5461 -311 -7663 59 7892 -864 -9046 -264 8268 -120 -8366 439 7839 -902
812 -902 -7545 2161 7458 -2905 -7890 4150 9470 -3559 -9422 4255 10582 -2853 -8913 4666
826 4666 9956 -3892 -8284 6239 9962 -5641 -9169 7468 11592 -4761 -9809 6203 10619 -3922
840 -3922 -7191 6916 8553 -5732 -6607 8311 9269 -6042 -6750 8697 9125 -5798 -5706 7803 6673
855 6673 -6878 -4410 9449 7145 -7620 -4869 9300 6155 -7358 -3626 9769 4685 -8860
868 -8860 -3851 9968 5323 -8222 -3581 9251 3879 -8988 -3150 9831 4223 -9076 -4158 9287
882 9287 4502 -8190 -4313 7542 2958 -8354 -2919 7834 2077 -8811 -3500 8074 2971 -8390
$$ packed form
782d262R543l236r151L927Q735n051q342O202Q904o442j0326O035J0813n670r267
797g588N210P839n772p352P722P833q756q182Q782Q532q388q246Q805P400q741
812i02o643R706N297j0363m985J2040N320j3029n863J3677O327j3435o060J3579
826D666N290j3848m392J4523L723j5603l528J6637M124j6353n048J6012M416j4541
840c922l269J4107J637j4285q75J4918R58j5311p08J5447M28j4923R2J3509j130
855F673j3551K468J3859k304j4765K751J4169l145j3513L732J3395n084j3545
868h860N009J3819m645j3545M641J2832n372j2867N838J2981n608j3299M918J3445
882I287m785j2692L877J1855m584j1312N435J0753n757j0888N311J1574n103j1361
$$ plain form
896 -8390 -3976 6370 1607 -8131 -2735 7072 1285 -8316 -2594 6681 1085 -8787 -3466 5615 825
911 825 -7763 -2109 6048 582 -7712 -2092 6127 133 -7882 -2557 5705 110 -6960 -1972 5615
926 5615 528 -6523 -1915 4575 -314 -6827 -1493 5265 689 -5737 -1093 4983 571 -5255 -993
941 -993 4523 44 -5183 -870 4724 960 -4402 -498 4519 1000 -4151 -1252 3817 1253 -2542
956 -2542 197 4158 1318 -2637 318 3916 920 -2655 202 3755 985 -2219 891 4290 752
971 752 -2406 532 3984 852 -2735 645 4005 1652 -1924 936 4070 790 -2688 195 3401
986 3401 472 -2779 746 4397 873 -2569 479 4600 400 -3906 -793 4478 1774 -3410 -878
1001 -878 4426 2273 -2811 -1831 2847 1042 -3516 -1754 3147 2046 -2519 -1580 2851 1544 -2892 -1620
$$ packed form
896h390M414J0346m763r738N396R807n787r601N722R275n596r872N321R081m790
911H25q588N654Q157n466q294N620Q219n994q015N325Q262n595p070M988P587
926E615n087p051M608O490m889o513N334O758m576o426M644O076m412n826M262
941i93N516m479n227M313N594l764n362L904N017l519n151K899N069k564l795
956b542K739L961k840l955K955L598k996l575K857L553k770l204L110L399l538
971G52l158K938L452l132l587L380L360k353l576K860L134l280l478K883L206
986C401k929l251L525L651l524l442L048M121m200m306L113N271k704n184K532
1001h78N304k153n084R80M678j805m558J762M901j101m565R39M431j307m436J272
$$ plain form
1017 -1620 1997 378 -3335 -842 3310 774 -4201 -1504 3334 875 -4614 -2685 2394 670 -4239
1032 -4239 -1950 2973 1120 -3714 -2048 2506 277 -4151 -2078 2090 -220 -3907 -676 2628 -382
1047 -382 -3954 -430 2390 -1812 -5128 -407 3876 -571 -4839 -312 4397 169 -4648 -1734 2388
1062 2388 -487 -3756 157 3540 -627 -3570 -255 3274 -425 -3301 109 2542 -1183 -3007 2002
1077 2002 4507 -1040 -4311 718 4462 -443 -4345 95 3973 327 -2419 1301 4132 363 -2990
1092 -2990 329 3522 243 -2380 703 3123 556 -1235 1973 3612 75 -2097 1077 2963 -781
1107 -781 -2139 1422 4363 994 -1929 400 2795 759 -1664 -584 1930 943 -209 1350 1897 818
1123 818 -507 -123 769 148 -321 92 290 278 976 1779 1060 -1347 -1124 709 959 -323 -1182 -394 817
$$ packed form
1017a620L617j619l713K493M152k536m975K697M838k459n489J929N079j724m909
1032d239K289M923j853m834J666M554k229m428K073M168k310l687L231L304l010
1047c82l572L524K820m202l316M721M283m447m268M527M709m228m817K914M122
1062B388k875l269L913L383m167k943L315L529l699k876L410K433l725j824N009
1077B002K505n547l271N029L744m905l902M440L878l646k746L720K831l769l353
1092b990L319L193l279k623L083K420k567j791L208J639l537k172L174J886l744
1107g81j358L561K941l369k923K329K395k036k423J080K514r87j152J559N47j079
1123H18j325L84Q92o21m69M13J98j2O98Q03p19k407K23J833K50j282q59P88J211
$$ plain form
1142 817 328 -386 115 409 -384 -1460 -484 847 345 -1242 -1142 940 1125 -259 -1013 -457 -388 -1396
1160 -1396 -1407 159 -617 -1956 -1072 1667 1316 -2329 -2933 -173 1169 -2027 -2521 586 1393 -1183 -1896
1177 -1896 985 1578 -2444 -4277 -537 1667 -1021 -2381 19 1710 -522 -2039 -90 382 -1625
1192 -1625 -2446 750 1970 -1099 -2103 1249 2088 -651 -1980 21 583 -1381 -1297 934 843 -1449 -700
1209 -700 2117 1692 -1624 -1259 1290 64 -1764 532 2872 817 -2504 145 4269 1227 -3601 -1628
1225 -1628 3161 1144 -2679 72 5086 2303 -3723 -1230 4317 1798 -3861 -1441 3779 1940 -2161
1240 -2161 -11 4708 1638 -3498 -1208 3655 1031 -3261 -396 4320 1642 -2486 427 3817 272
1255 272 -3618 -101 3358 -211 -3523 1095 3768 -257 -3252 1253 3705 -1603 -4262 1036 3815
$$ packed form
1142H17m89p14N01K94p93j076R76J331n02j587J00K082J85j384p54N56O9j008
1160a396j1J566p76j339Q84K739l51l645o04K760J342l196m94L107Q07k576p13
1177a896K881N93m022j833L740K204k688j360K400J691k232j517J949M72k007
1192a625q21L196J220l069j004L352Q39k739j329K001N62j964Q4K231r1k292P49
1209g00K817m25l316L65K549j226j828K296K340k055l321K649M124l042m828J973
1225a628M789k017l823K751N014k783o026K493N547k519n659K420N220j839m101
1240b161K150M719l070n136K290M863k624m292K865M716k678m128K913L390l545
1255B72l890L517L459l569l312M618K673m025k995M505K452n308k659N298K779
$$ plain form
1270 3815 -1597 -3505 2009 4502 -1517 -3910 1047 3322 -2691 -4538 1485 3056 -2519 -3308 3046
1285 3046 3553 -3465 -5275 1717 3340 -3379 -4575 1795 3180 -2553 -3175 2838 2515 -4382 -5223 1835
1301 1835 2915 -3031 -4067 1502 3019 -1837 -2289 2069 973 -3603 -2651 2576 1471 -3576 -1870
1316 -1870 3158 1921 -3410 -2037 2389 454 -3977 -1519 2994 991 -3146 -728 3464 877 -3006
1331 -3006 -857 2306 -326 -2998 862 3190 -862 -2984 2237 4492 -1422 -4968 717 4496 105
1346 105 -3431 743 4158 521 -2493 1456 3404 -1007 -3335 1627 3738 -58 -1884 2489 3407
1361 3407 -980 -1148 2248 1966 -2485 -1457 3372 3131 -2366 -1574 3839 3646 -1905 -2461 2352 2312 -1867
1378 -1867 -1522 2435 1925 -1250 174 2590 1000 -2392 -136 3132 537 -2555 383 3628 483
$$ packed form
1270C815n412j908N514K493o019k393M957K275o013j847O023J571n575p89O354
1285C046N07p018j810O992J623o719j196O370J385n733o22O013l23o897q41P058
1301A835J080n946j036N569J517m856m52M358j096m576R52N227j105n047J706
1316a870N028j237n331J373M426j935m431K458M513k003m137K418M192k587l883
1331c006K149L163k632k672L860K328m052k122N221K255n914l546N685L779m391
1346A05l536M174L415l637l014L949J948m411k328M962K111l796j826M373R18
1361C407m387j68L396k82m451J028M829k41n497P92N413j93n551n56M813m0m179
1378a867L45L957n10l175J424K416j590l392K256L268k595l092K938L245l145
$$ plain form
1393 483 -2864 677 3613 -466 -4186 -857 3931 985 -3107 -1206 2759 930 -2002 -529 886
1408 886 -1149 -2075 813 1918 -1081 -2798 765 1969 -987 -2630 -430 1086 -1469 -2075 505 1523
1424 1523 -972 -2206 227 1231 -1086 -2149 -474 -478 -1061 -348 463 -701 -1914 -36 1240 -1343
1440 -1343 -3117 -552 1895 -809 -3377 -236 2920 -56 -3092 -640 1816 -195 -3131 -674 1969
1455 1969 -216 -2273 65 1651 -216 -1688 -328 963 -1714 -2303 1665 2660 -1314 -2567 1120
1470 1120 2818 -557 -2082 97 1530 -495 -1540 717 1946 18 -549 943 1186 -411 -156 909
1486 909 -121 -985 588 2029 415 -825 968 2822 -96 -2360 -20 2573 532 -1303 612
1501 612 2574 823 -1356 636 1924 -381 -1984 842 2643 662 -1369 575 1638 -137 -1201
$$ packed form
1393D83l347L541K936m079l720L329M788k946m092J901L965j829k932J473J415
1408H86k035r26K888J105k999j717L563J204k956j643K200J516k555o06K580J018
1424A523k495j234K433J004k317j063J675mn83P13Q11j164j213J878J276k583
1440a343j774K565K447k704k568L141L156k976l036K452K456k011k936K457K643
1455A969k185k057K338J586j867j472J360J291k677n89L968R95l974j253L687
1470A120J698l375j525K179J433k025j045K257J229j928n67J492K43j597K55J065
1486I09j030q64J573J441j614j240J793J854k918k264K340K593k041j835J915
1501F12J962j751k179J992J288k305j603K826J801j981k031J944J063j775j064
$$ plain form
1516 -1201 1044 1585 -1114 -1471 1342 2624 -81 -1886 27 1632 52 -1043 224 508 -602 -420
1532 -420 547 556 -452 -249 735 162 -1354 -437 399 -799 -1724 236 1568 -148 -1730 114 1471 -937
1550 -937 -2830 -693 1389 -618 -2078 472 1897 -1092 -2799 140 1564 -1468 -2874 0 2101
1565 2101 -513 -2282 596 2096 -1012 -3246 -129 1579 -660 -2402 112 2035 -788 -2166 -214
1580 -214 1458 -355 -1706 26 1061 -284 -933 623 964 -791 -784 807 834 -939 -996 1152 439 -718
1598 -718 70 1891 849 -1319 51 1765 595 -1490 -512 1588 985 -573 346 2293 1077 -1079
1614 -1079 -600 970 473 -570 252 1972 802 -222 761 1774 205 -1402 50 1525 553 -570
1630 -570 482 1814 825 -1011 329 1478 347 -1234 -30 1778 945 -840 -33 488 688 -349
$$ packed form
1516a201K245N41k699l57K813J282k705j805J913J605j580j095J267K84j110J82
1532d20R67Rj008K03R84n73j516R17Q36j198r25J960J332j716j582J844J357k408
1550i37j893K137K082k007j460K550J425k989j707K939J424l032j406K874K101
1565B101k614j769K878J500l108k234L117J708k239j742K514J923k823j378J952
1580b14J672j813j351J732J035j345o49J556L41j755PJ591K7j773n7K148p13j157
1598g18P88J821j042k168J370J714j170k085R78K100o03j558R19J947j216k156
1614a079M79J570m97j043Q22J720j170j024R83J013j569j607J452J475r72j123
1630e70J052J332r89j836J340J149j131j581J204J808q33j785Q07N21K00j037
$$ plain form
1646 -349 248 564 -101 -366 466 839 -278 -393 745 1155 -256 -534 136 225 -791 -652 558 374 -670
1665 -670 -399 689 450 -842 -1410 -1184 -433 -296 107 562 -499 -886 152 419 -423 -1773 -914 521
1683 521 174 -421 -527 222 -296 -1462 -1250 371 560 -1110 -1505 233 1363 615 -1374 -1463 -154 704
1701 704 -46 -679 -279 -280 -327 -384 -260 -213 -49 -433 -38 -39 -118 -825 -654 -440 251 388 551 -56 -239 -257 42
1724 42 218 -384 -659 -155 801 1413 268 -482 -319 652 700 -773 -889 868 1355 867 -228 540 746
1743 746 9 -865 148 1646 1021 -424 -350 1362 1401 13 -1000 -21 718 315 284 1062 352 -472 -33
1762 -33 1057 853 -372 -202 1007 1177 -439 -79 524 457 -379 -163 1361 1350 -522 -1308 12 1139
1780 1139 307 -682 -547 293 796 798 -110 -641 -762 -36 196 -271 -294 1093 382 -681 -475 193 173 -1181
$$ packed form
1646c49N97L16o65k65Q32L73j117j15J138M10j411k78O70Q9j016J39J210j84j044
1665f70K71J088k39j292n68K26P51J37M03M55j061l87J038K67q42j350Q59J435
1683E21l47n95j06P49n18j166K12J621J89j670l95J738J130p48j989q9J309Q58
1701G04p50o33M00jm7n7J24M7J64l84L95jp9p07J71K14O91J37J63o07j83j8K99
1724D2J76o02k75N04R56O12j145p50J63R71M8j473j16J757M87m88j095P68K06
1743G46p37q74J013J498o25j445P4J712L9j388j013R79P39m03l1P78p10q24M39
1762c3J090k04j225J70J209J70j616L60O03o7q36K16J524j1j872p86J320J127
1780A139q32r89J35Q40N03Kr08n31j21P26K32m67k3J387p11j063K06O68k0j354
$$ plain form
1800 -1181 -1088 678 975 -447 -1250 196 858 -252 -1379 -148 242 -1020 -684 996 802 -1621 -1831
1817 -1831 165 761 -1191 -1889 414 619 -1153 -1663 506 1040 -1576 -1627 573 1287 -1070 -1728 -208
1834 -208 1082 -205 -1223 892 288 -1016 -496 909 294 -1886 -1288 750 902 -806 -313 1444 567
1851 567 -1707 -897 1445 714 -1844 -721 1744 1424 -702 -252 1195 177 -1349 -83 1561 355
1867 355 -1502 71 2209 418 -1925 -36 2028 385 -1828 188 2510 452 -1805 305 2869
1882 2869 451 -1966 179 3171 822 -1917 -345 2160 458 -1735 743 2605 423 -2011 332
1897 332 2405 469 -1871 77 2066 522 -1040 901 2006 -630 -2251 609 1899 -283 -1756
1912 -1756 581 1700 -497 -1573 492 1315 -1123 -1650 1203 1721 -839 -1760 640 1602 -1089 -1593
$$ packed form
1800a181R3J766K97j422q03J446O62j110j127J231L90j262L36J680j94k423k10
1817a831J996N96j952o98K303K05j772n10K169N34k616n1K200P14k357o58J520
1834b08J290j287j018K115o04j304N20J405o15k180N98K038J52j708M93J757q77
1851E67k274Q10K342p31k558J123K465l20k126M50J447j018j526J266J644j206
1867C55j857J573K138j791k343J889K064j643k213K016K322k058k257K110K564
1882B869k418k417K145K992k349k739J572K505j702k193K478J862k182k434K343
1897C32K073j936k340J948J989j544j562J941J105k636j621K860J290k182j473
1912a756K337J119k197j076K065Q23k438n27K853N18k560r21K400R62k691n04
$$ plain form
1928 -1593 478 817 -1363 -1259 1071 1167 -1225 -1727 615 676 -1091 -1456 632 735 -1351 -1452 510
1945 510 518 -1257 -1042 802 162 -1179 -1033 675 531 -1512 -980 507 86 -876 -149 564 224 -1610
1963 -1610 -724 1002 263 -1434 -392 1035 117 -1121 -396 604 -109 -1422 70 900 243 -723 -365
1980 -365 753 170 -538 -296 557 48 -124 477 845 -83 -763 338 1109 149 -609 140 838 56 -224
1999 -224 453 963 -113 -242 580 670 405 -59 505 179 221 306 209 207 488 879 398 -74 125 655 637 273
2021 273 386 598 157 -122 630 666 -149 -725 511 1007 9 -448 887 954 -516 -860 757 1315 -683
2040 -683 -1211 818 1496 -419 -796 320 1185 -577 -1053 660 781 -777 -840 667 635 -1586 -1119 1235
2058 1235 748 -1492 -1134 1103 430 -2045 -1754 1394 631 -1542 -1368 1282 803 -1712 -1119 1375 1015
$$ packed form
1928a593K071L39k180J04K330R6k392n02K342O1j767l65K088J03k086j01J962
1945E10Qj775K15J844o40j341J46J708j44k043N32J487m21r62P27P13l40j834
1963a610Q86J726p39j697J042J427r18j238P25J000p13j313J492Q30o57r66L58
1980c65J118n83p08K42Q53n09j72O01L68r28o80J101P71r60p58P49O98p82k80
1999b24O77N10j076j29Q22R0k65m64N64l26M2Q5r7kK81L91m81m72J99N30j8l64
2021B73J13K12m41k79P52L6q15n76J236M96r98m57J335O7j470l44J617N58j998
2040f83n28K029O78j915l77J116Q65j762m76J713J21j558o3J507l2k221M67K354
2058A235m87k240L58K237o73k475K91L148p63k173J74K650m79k515N93K494l60
$$ plain form
2075 1015 -1768 -780 1445 548 -1904 -988 1626 -84 -2689 -808 2154 464 -2328 -1027 2001 671
2091 671 -2485 -839 1977 487 -2623 -819 2369 635 -2482 -735 2060 695 -2304 -485 2115
2106 2115 -54 -2147 343 2580 212 -2589 405 2681 431 -2592 113 2431 -169 -2325 167
2121 167 2728 -290 -2122 676 2301 -347 -2099 335 2774 -134 -2018 737 2483 -690 -1629
2136 -1629 1078 2327 -789 -2246 1514 2617 -896 -1979 1080 2638 -627 -1835 827 1915 -826
2151 -826 -1571 1658 2126 -1047 -1805 1411 1781 -1337 -1683 1178 1487 -980 -1134 1092 1450 -1217 -1364
2168 -1364 1593 1558 -1825 -1593 1547 1420 -1198 -1574 1311 1299 -1008 -733 1176 538 -1372 -1318 1378 616
2186 616 -1393 -1245 1115 877 -1420 -711 841 388 -1519 -760 1214 189 -1586 -724 1254 321 -1645
$$ packed form
2075A015k783R88K225q97k452R16K614j710k605J881K962j690k792J301L028j330
2091F71l156J646K816j490l110J804L188j734l117J747K795j365k999J819K600
2106B115k169k093K490K237k368k801K994K276k250l023K705K318k600k156K492
2121A67K561l018j832K798J625k648j752K434K439k908j884K755J746l173r39
2136a629K707J249l116j457L760J103l513j083L059J558l265j208K662J088k741
2151h26p45L229M68l173p58L216L70l118l46K861L09k467j54K226L58k667j47
2168a364K957l5l383K32L140j27k618l76K885j2k307K75J909o38j910N4K696p62
2186F16k009J48K360k38k297P09J552m53j907P59J974j025j775Q62J978r33j966
$$ plain form
2203 -1645 -1159 669 685 -919 -486 1139 396 -1209 -504 1233 609 -1596 -1019 599 611 -953 -813 363
2221 363 534 -624 -537 718 327 -683 -416 585 586 -827 -467 699 407 -511 -652 586 642 -559 -289
2240 -289 295 458 -297 -491 793 726 -451 -558 604 984 -233 -748 220 618 -126 -166 526 741 189
2259 189 -164 614 1141 -80 -493 52 913 479 -163 264 652 475 -123 423 850 286 -677 315 1131 51
2279 51 -544 88 905 213 -448 177 858 -409 -499 359 792 -117 -611 166 984 147 -729 -57 835 10
2299 10 -654 -22 691 85 -816 -46 748 -176 -1173 -39 782 157 -1099 -142 661 -127 -968 16 409 -476
2319 -476 -997 -52 782 -192 -1075 -369 545 -157 -724 43 537 -179 -1032 25 613 -278 -921 203 543
2338 543 -476 -1009 -31 253 -416 -896 -117 476 -123 -738 135 283 -585 -801 16 677 -158 -729 52 425
$$ packed form
2203a645M86J828J6j604M33J625p43j605P05J737o24k205N77J618J2j564J40J176
2221C63J71j158Q7J255l91j010K67J001Jj413L60J166k92r18j41J238N6j201K70
2240b89N84J63p55j94J284o7j177j07J162L80j217n15R68L98p44m0O92K15n52
2259A89l53P78N27j221m13N45Q61m34o42M27L88j77n98N46M27n64r63R92Q16j080
2279E1n95O32Q17o92o61O25O81j267r0Q58M33r09m94P77Q18q37q76O72Q92q25
2299A0o64O32P13o06r01P70P94r24r97J134Q21o25j256R57Q03p88q41R84L93q85
2319d76n21R45Q34r74q83P06R14p02n67P67M94p16q53J057N88q91o43J124L40
2338E43j019n33R78K84o69m80P79N93n99o15Q73J48q68k16Q17O61q35n71P81L73
$$ plain form
2358 425 -105 -329 70 398 -487 -527 477 733 195 -636 144 790 -74 -437 389 671 -11 -503 127 686
2378 686 -130 -310 257 725 124 -324 134 808 208 -268 282 605 314 -18 312 527 43 -118 415 560
2398 560 185 -172 116 669 533 45 225 448 521 -62 268 324 233 -128 29 607 188 -490 -287 514 236
2419 236 -353 4 258 99 -441 -466 544 93 -528 -332 97 74 -305 -150 226 -76 -665 -182 398 281
2439 281 -355 -110 515 214 -423 -489 66 441 -634 -488 94 -81 -952 -512 246 311 -856 -320 576 118
2459 118 -506 -539 476 112 -819 -240 487 270 -663 -414 435 -4 -781 -398 432 146 -868 -193 310 -21
2479 -21 -558 15 712 -329 -721 -264 786 186 -842 -216 770 -122 -683 346 543 185 -514 -164 842
2498 842 370 -297 -100 380 40 -579 335 537 188 -816 185 798 -257 -197 106 687 30 -430 580
$$ packed form
2358D25n30k24L99L28q85m0J004K56n38q31P80O46q64l63Q26K82o82m92O30N59
2378F86q16j80N67M68o01m48M58O74o00m76N50L23k91l32L30K15m84j61N33J45
2398E60l75l57K88N53j36m88J80K23P3n83L30N6r1l61J57N78m19o78K03Q01k78
2419B36n89L57K54j59n40k5J010m51o21J96M29k3l79J55L76l02n89M83N80j17
2439B81o36K45O25l01o37o6N55L75j075J46N82j75q71M40P58O5j167N36Q96m58
2459A18o24l3J015l64r31N79P27k17r33K49Q49m39p77L83Q30k86j014O75N03l31
2479b1n37N73O97j041l92M57J050o00j028O26R86q92n61J029J97l58o99L50J006
2498H42m72o67J97M80l40o19R14K02l49j004J001O13j055O0L03N81o57m60J010
$$ plain form
2517 580 227 -190 -273 577 657 -149 -76 255 511 -146 10 362 111 -40 -29 533 419 -205 -181 426 343 -72
2539 -72 -45 202 142 -427 152 203 59 -579 -170 374 -145 -126 61 204 102 -101 -33 150 -286 -492 217 453
2561 453 -397 -617 239 246 -646 -121 152 8 -277 -182 169 90 -450 -425 -273 -238 -812 -107 265 -309 -609 -185
2583 -185 384 -466 -635 -230 598 -331 -561 -52 402 -366 -932 375 650 -194 -806 -93 258 -779 -884
2602 -884 284 499 -654 -814 497 486 -286 -627 70 510 -612 -541 556 651 -641 -681 522 537 -596
2621 -596 -597 705 512 -617 -465 812 380 -658 -523 1121 737 -1304 -251 934 903 -836 -206 1095
2639 1095 578 -624 -364 1232 436 -779 -287 982 253 -509 -67 1472 442 -927 -244 1215 326
2656 326 -964 -165 1324 226 -928 118 1087 306 -861 125 1152 75 -1207 151 1393 116
$$ packed form
2517E80l53m17q3Q50Q0q06P3L31K56o57J56L52k51j51J1N62j14o24K4O07q3m15
2539g2K7K47o0n69N79N1j44o38M09N44n19J9J87J43j02k03O8J83m36k06P09K36
2561D53q50k20Q56Pq92N25K73j44k85R5L51p9n40K5J52L5n74P05L72n74l00M24
2583a85N69q50j69M05Q28r29k30N09M54p68n66J307K75q44o12P13L51j037j05
2602h84J168K15j153j60J311j1p72l41O97M40j122P1J097R5j292m0J203J5j133
2621e96jJ302j93j129J52J277m32j038J35J644l84k041J053J185l1j739O30J301
2639A095n17j202K60J596p96j215M92J269p29p62M42J539j030j369O83J459q89
2656C26j290P99J489j098j154J046R69p81j167R86J027j077j282J358J242j277
$$ plain form
2672 116 -1006 319 1154 -270 -1252 376 901 -86 -951 309 1276 -164 -1325 69 1167 -374 -1377
2689 -1377 -35 828 -626 -1241 354 1264 -534 -1129 333 956 -404 -958 380 893 -712 -1193 588
2706 588 898 -823 -1075 252 693 -436 -1082 409 492 -728 -685 398 334 -776 -807 421 474 -667 -636
2725 -636 176 179 -796 -706 519 507 -819 -617 548 264 -752 -578 471 440 -503 -370 354 377 -259 -281 467
2746 467 635 -398 -257 614 95 -294 -364 410 342 -148 -177 518 295 -43 -21 262 270 -306 -106 272 446 -55
2768 -55 -112 -15 143 359 238 407 57 -176 152 723 322 -33 -95 193 160 81 139 13 422 176 212 430 322
2791 322 62 -121 32 547 287 -232 -111 -103 372 -232 -5 -306 125 147 -10 46 -157 -79 -269 367 139 -365
2813 -365 -602 128 206 -232 -639 192 647 -331 -372 347 122 -654 -202 750 189 -635 -802 71 161 -299 -589
$$ packed form
2672A16j122J325Q35j424r82J628N25r87q65J260R67j440j161J394J098j541j003
2689a377J342Q63j454o15J595R10j798n95J462O23j360n54J338N13j605m81J781
2706E88L10j721k52J327M41j129o46J491Q3j220M3J083o4j110l1J228N3j141L1
2725f36Q12Lr75R0J225j2j326K02J165k84j016J74J049l1r43J33P24K3o36k2P48
2746D67J68j033J41Q71n19l89p0P74o8m90k9O95k23l38K2K83Qn76K00L78J74n01
2768e5n7R7J58K16j21J69l50k33L28N71m01l55o2K88l3p9N8j26M09k46L6K18j08
2791C22k60j83J53N15k60n19J21QM75o04K27l01M31K2j57N6k03P8j90O36k28n04
2813c65k37P30P8m38m07Q31M55r78m1P19k25p76M52R52n61q24j67Q73R0m60k90
$$ plain form
2834 -589 172 -148 -760 -421 590 564 -1308 -322 418 385 -521 -468 387 123 -914 -567 685 4 -640 -475
2854 -475 888 82 -960 -348 445 476 -508 -591 487 316 -474 -221 437 111 -962 -126 646 4 -831
2873 -831 -414 462 396 -616 -141 618 256 -701 68 1143 -29 -543 143 966 115 -684 -55 788 117
2892 117 -644 108 787 181 -464 50 973 -258 -682 243 1020 169 -809 131 805 -80 -600 229 838 155
2912 155 -492 504 688 -134 -586 487 988 -98 -706 -219 758 -124 -496 -26 696 -433 -548 360 656
2931 656 -288 -691 -20 813 -151 -257 188 606 -228 -487 497 374 -275 -740 43 566 -93 -680 -160 468
2951 468 -305 -604 45 260 -347 -232 282 331 -431 -251 -81 258 -218 -408 -120 286 -166 -489 -218 44
2971 44 -323 -693 -88 439 -332 -887 -73 488 -15 -607 -37 -32 -421 -345 -171 330 -143 -77 119 325 -282 -669
$$ packed form
2834e89P61l20o12L39J011k6j872R86P40l3r06N3Q55k64j037L47J252o81o44J65
2854d75J363q06j042O12P93L1r84q3J078j71p90K53O58l26j073Q36P72o42q35
2873h31M17Q76o6j012M75P59l62r57P69J075j172n14O86Q23q51p99O29Q43o71
2892A17p61P52O79o06o45N14R23j231m24R25P77q51r78R40O74q85n20Q29O09o83
2912A55o47R96J84q22m52J073N01j086o08M87R77q82l72M70P22j129j15R08K96
2931F56r44m03O71Q33r64j06M45M18q34k59R84j23o49m65P83N23o59n87N20O28
2951D68p73k99O49K15o07J15N14M9p62J80J70L39m76j90K88M06m52l23K71K62
2971D4l67l70O05N27p71n55Q14N61n03n92N70Nl89P6J74N01m73O6J96K06o07l87
$$ plain form
2993 -669 -43 206 -233 -359 195 94 -222 -293 540 108 -57 -348 -47 461 111 -326 157 245 45 -18 -111
3014 -111 159 193 -88 -61 174 1 -123 358 347 138 -186 73 353 44 -173 71 499 -174 -235 31 600
3035 600 77 -153 261 187 1 -115 171 314 156 -225 398 605 -140 -156 454 339 -235 -257 244 718 -53
3056 -53 -188 298 556 214 -167 187 309 -127 -36 26 150 -185 -335 169 195 16 -563 63 236 -179 -117 186
3078 186 12 -142 -298 26 -42 -475 -387 653 297 -807 -218 219 376 -109 -432 525 -205 -461 -498 342
3098 342 51 -384 -128 175 -249 43 -162 69 62 -429 -212 -44 113 -173 -26 209 -49 -389 -49 246 4
3119 4 -239 -230 106 1 -27 61 38 -271 -137 -209 -102 69 -102 -45 130 -123 -253 360 155 -14 215 240 188 -233
3143 -233 92 82 210 317 140 376 87 -55 278 -22 6 -192 296 371 -180 -200 266 343 -102 -97 214 -6
$$ packed form
2993f69O26K49m39j26N54j01l16p1Q33m32j65k91L01N08l50m37M83Q8k00o3r3
3014a11K70L4k81K7K35j73j24M81j1k09l24K59K80l09k17K44M28o73o1K66N69
3035F00n23k30M14p4j86j16K86J43j58l81O23K07p45j6O10j15n74k2N01M74p71
3056e3j35M86K58l42l81L54J22m36R1O2J24l35j50N04K6j79n79O26J73m15O2L03
3078A86j74j54j56L24o8m33Q8J040l56j104N89M37J57m85l23R57p30k56l7Q40
3098C42k91m35K56L03m24K92k05K31pm91K17J68J57k86J47K35k58l40L40K95k42
3119Dk43RL36j05k8Q8k3l09J34p2J07J71j71N7J75k53j30O13k05j69K29K5n2m21
3143b33L25j0J28J07j77K36k89j42L33l00K8j98M88P5n51k0M66P7m45NL11k20
$$ plain form
3165 -6 41 -184 239 174 -124 -270 64 208 165 104 142 -206 -220 -100 208 259 -56 -34 268 38 -46 -85 256 438
3189 438 -175 -94 407 265 -187 95 -31 304 -69 -249 119 -135 6 -148 180 -197 -438 183 103 -36 -295
3210 -295 -61 120 42 -183 19 157 -97 -321 -283 320 -152 -374 53 299 -164 -217 -240 335 11 -663 -96
3231 -96 90 -76 -333 33 249 -327 -472 41 296 118 -465 117 177 -186 -207 -33 -121 -150 -56 103 291 -47
3253 -47 -85 -49 84 149 -199 82 12 -81 -128 374 230 -177 142 284 -8 19 5 381 243 -56 -88 254 147
3276 147 -56 109 -174 324 -82 -65 313 341 23 3 466 153 -151 -214 202 44 -368 128 433 117 -288
3297 -288 226 362 -82 152 210 -4 58 58 209 25 -60 -12 78 94 -66 478 263 -8 23 140 358 164 128
3320 128 103 9 196 -50 101 388 8 -128 -78 146 214 -250 196 129 -328 -175 -149 67 -137 -37 56 39 -356
$$ packed form
3165fM7k25M23o5k98j46L34J44m3o1L8l48j4J20L08N1l15K2L02k30q4l9L41J82
3189D38o13Q1N01j42m52K82j26L35l73j80L68k54J41j54L28l77k41O21q0j39k59
3210b95K34J81p8k25K02J38k54k24L8O03m72k22M27K46m63n3k3N75l24o74N67
3231i6J86j66k57L66K16n76j45N13K55j78n83N82O0l63k1J74q8k9R4J59J88l38
3253d7l8L6J33O5l48K81p0r3m7N02j44m07L19J42k92K7j4L76j38k99l2L42j07
3276A47k03J65k83M98m06J7L78K8l18k0M63l13l04o3M16j58m12M96L05l16m05
3297b88N14J36m44K34N8k14O2%J51j84q5M8R0J6j60N44k15k71L1J17K18j94l6
3320A28k5r4J87k46J51K87l80j36N0K24O8m64M46o7m57J53K6K16k04J00R3j7l95
$$ plain form
3343 -356 -370 367 287 -245 -155 348 29 -199 -106 160 52 -227 -88 -99 -85 -370 -424 9 -338 -247 -44 174 -209
3366 -209 -529 -27 225 65 -585 69 198 1 -386 82 289 -159 -477 -284 407 314 -166 -41 485 -23
3386 -23 -139 293 283 -194 -339 333 492 47 -310 6 315 -68 -268 262 652 -253 -96 254 158 -194 -318
3407 -318 148 372 -26 -439 182 397 22 -152 424 118 -79 -54 502 567 -1050 -582 304 233 -303 -436 597
3428 597 691 -44 -367 187 338 111 -442 310 179 -322 55 347 564 -441 -410 245 116 -319 -123 411
3448 411 -18 -557 -57 502 297 -451 -488 153 65 -341 10 587 -126 -500 -349 278 68 -277 -195 269 221
3469 221 -525 -160 63 14 -574 52 449 33 -323 -209 138 8 -452 32 314 22 -406 -121 12 -12 -193
3490 -193 -119 17 -194 -341 -108 198 -313 -411 -196 116 178 -407 -236 69 55 -607 100 489 -133 -355 96
$$ packed form
3343c56j4P37q0n32R0N03l19k28R3K66j08k79J39j1J4k85n4M33l47R1K03K18l83
3366b09l20N02K52j60o50O54J29j97l87M68K07m48l18J93O91r3m80J25N26n08
3386b3j16M32j0m77j45O72J59m45l57L16L09l83k00N30L90r05J57L50r6l52j24
3407c18M66K24l98m13O21K15l75j74N76l06j97K5N56O5j617M68Q86p1n36j33J033
3428E97R4p35l23N54J51k27n53P52j31n01L77K92K17j005L1O55j29m35J96N34
3448D11m29n39N00N59k05p48l7O41q8m06L51N77p13l74J51O27k10l45Q2M64m8
3469B21p46L65K23m9n88O26L97m16l56J14L47j30m60M84K82k92m28K85J33k4j81
3490a93P4J36k11j47K33L06n11r8K15L12O2n85J71L05j4o62P07L89o22k22M51
$$ plain form
3511 96 479 -63 -302 -16 306 -180 -485 -5 26 93 -229 -256 58 129 -190 -133 417 45 -272 112 -57 8
3533 8 -72 -52 -103 -26 -229 281 220 182 -265 -121 160 -114 -81 322 -186 -3 -100 -178 306 -46 19 79 248 391
3557 391 -48 -179 155 369 -21 277 21 -196 167 32 90 332 -151 7 28 178 -19 -220 -68 173 -13
3578 -13 -51 -327 -10 -62 8 195 246 -138 -578 102 240 -40 -347 109 165 69 -271 -97 32 -278 -101 336
3600 336 -222 -273 -278 132 437 -76 -59 -354 68 -11 -172 48 -205 -35 -201 177 236 -258 -406 -78 304 -141
3622 -141 -48 279 -180 -306 76 285 73 -203 230 362 78 -117 -55 51 -129 -44 -344 -89 -59 -174 -281
3643 -281 -280 -138 -222 -344 337 160 -288 -16 -177 95 -379 -115 270 146 -246 -188 72 304 -179 -101 375 -87
3665 -87 -74 18 305 -41 10 28 -54 176 -112 286 314 193 -1 61 268 -48 -10 -29 258 192 87 61 226 182
$$ packed form
3511I6L83n42k39K86L22m86l05M80L1O7l22k7L14P1l19N7N50l72l17L84j69O5
3533Hq0K0n1P7k03N10o1l8m47J44K81k74L3M03n08J83r7p8M84l52O5O0J69J43
3557C91m39j31L34K14l90K98k56k17L63j35N8K42m83J58K1J50j97k01J52K41j86
3578a3l8k76L17n2P0J87N1l84m40O80J38k80l07M56N6r6l40J74J29l10J77M37
3600C36n58n1nM10L05n13J7k95M22p9j61K20k53J70j66L78N9m94j48L28L82m45
3622a41R3L27m59j26L82K09k12k76M33J32k84j95O2J06j80Q5l00K55L0j15j07
3643b81JJ42q4j22O81j77m48K72j61K72m74K64L85j24l92N8K60K32m83P8M76m62
3665h7J3R2K87l46N1J8q2K30k88L98K8j21j94O2K07l16L8j9K87o6j05k6J65m4
$$ plain form
3689 182 -175 114 228 245 -85 218 107 -1 20 -96 317 -238 236 -255 52 175 -141 -19 212 377 211
3710 211 -179 188 -60 100 -126 14 -168 -133 -158 10 261 103 -147 81 20 39 -29 -121 -142 -87 -128 30 -36
3733 -36 -180 -17 -33 -76 -200 -32 -241 162 -207 -280 24 -236 -251 -218 101 13 -11 -324 65 -142 -105 72 -103
3756 -103 98 -117 -204 230 -49 -224 -181 19 66 140 -147 -130 201 -205 -95 2 -47 -290 -147 69 286 -64
3778 -64 -149 -100 46 -22 79 -10 80 -156 -123 338 6 48 15 199 81 82 113 -244 -190 56 -146 206 147 -118 -104
3803 -104 329 116 89 -233 111 247 -35 268 159 -152 -222 45 -5 109 -247 37 -91 249 -61 -12 73 0
3825 0 89 -101 -81 313 -287 -17 75 136 -68 -27 291 81 -86 89 145 -184 -89 7 -65 -426 43 37 -70 -354
3849 -354 -183 124 39 -280 -62 -6 -140 162 57 115 422 -183 -15 48 85 86 -319 277 -67 -80 96 -210 -28
$$ packed form
3689A82l57K89J14J7l30L03j11j08K1j16M13n55M74m91L07J23l16J22K31J65j66
3710B11l90L67k48J60k26J40j82L5k5J68K51j58k50K28o1J9o8r2k1N5m1J58o6
3733c6j44J63j6m3j24J68k09M03l69p3L04k60j5L3L19q8k4l13L89k07L7J77j75
3756a03K01k15q7M34k79j75M3K00M7P4k87J7L31m06J10R7m9k43J43K16K17l50
3778f4q5M9J46o8J01q9R0k36L3M61l32M2l3J84j18JL1l57N4K46k02L52n9k65J4
3803a04M33k13k7l22L44J36k82L03j09l11p0K67n0J14l56K84j28L40l10M9Q5p3
3825@Q9j90K0L94o00K70R2O1k04M1L18k10j67J75N6l29R5R6p2l61M69oj07k84
3849c54J71L07q5l19K18N6j34L02j05N8L07o05J68O3L7Jm05N96l44j3J76l06J82
$$ plain form
3872 -28 -104 -44 -130 185 -429 -6 -337 -36 -345 -149 351 226 -82 58 191 -30 -131 80 -115 -99 -362 -137
3894 -137 -4 65 -229 118 347 6 -180 164 227 28 -112 -249 -84 -205 -164 43 385 -105 -24 -34 166 15
3916 15 -81 305 265 -326 26 59 254 -96 -44 181 28 11 -55 -53 149 88 144 241 100 -145 -71 479 167 -186
3940 -186 -140 477 71 71 -45 245 348 66 47 -115 -80 -302 -212 329 19 -320 22 278 -142 -62 -26 -39 -86
3963 -86 -55 -4 -32 0 -104 218 -47 -187 -12 -26 -12 129 -61 -73 148 -116 4 -233 85 4 25 126 -146
3986 -146 -174 -156 139 -15 -346 -489 -123 194 15 -89 83 -58 -313 -410 8 -59 85 154 129 174 -196 -190 12
4009 12 -141 18 -7 -147 -147 -274 96 -22 313 -10 -26 -36 -307 -277 -77 231 21 94 -368 -118 41 134 175
4032 175 199 -15 17 210 244 15 182 -12 -58 174 -54 120 349 -246 104 316 201 -75 213 -88 119
$$ packed form
3872b8p6O0q6L15o14M23l31L01l09J96N00j25l08J40J33k21j01K11j95J6k63K25
3894a37J33O9k94L47K29l41j86L44O3j99j40j37J65j21M1K07L42m90Q1j0K00j51
3916A5r6L86m0n91L52L3J95l50N2K25j53j7o6KK02o1N6R7j41k45P4N50l12l53
3940a86M6O17m06%j16K90J03k82j9j62L5k22R0N41l10l39L42K56m20Q0L6j3m7
3963h6L1N1k8L2j04L22k65j40J75j4J4J41j90j2K21k64J20k37L18q1K1J01k72
3986a46k8J8K95j54l31j43L66L17j79j04J72j41k55r7M18o7J44O9k5M5l70OK02
4009A2j53J59k5j40%j27L70j18L35l23j6j0k71L0K00L08k10P3m62K50J59R3M1
4032A75K4k14L2J93L4k29J67j94m6K32k28J74K29n95L50K12j15k76K88l01K07
$$ plain form
4053 119 -229 132 84 253 -93 -237 -16 -28 141 158 -25 -113 156 -12 195 7 -41 133 244 -134 -71 1
4075 1 5 -30 230 -155 209 276 -62 -112 -12 238 155 79 -201 186 450 -219 194 49 86 -168 -30 18 -26 278
4099 278 -147 -268 166 -81 125 -46 133 -24 -3 -155 17 -126 7 -244 273 48 -200 -4 8 -127 -115
4120 -115 -263 -360 61 -93 -313 110 35 90 -192 120 -189 3 168 75 -105 -230 -43 -202 -305 -163 -360
4141 -360 178 13 157 92 51 -37 2 225 65 226 -164 -249 -216 -132 -307 84 -97 62 -93 -50 191 22 -160
4164 -160 -265 -278 -108 -148 -82 -27 -81 -76 213 19 -20 54 -9 242 28 24 218 -109 -80 -116 102 332 3 -34 25
4189 25 237 -67 -264 -128 102 -57 -58 -1 -1 56 12 158 361 119 -132 196 155 -267 -14 432 154 85 44 269
4213 269 -246 -36 -45 218 -122 0 62 -28 35 -34 -182 66 -16 -190 87 63 -20 -106 -73 378 -195 -391 -138 -30
$$ packed form
4053A19l48L61m8J69l46j44K21j2J69J7j83q8K69j68K07j88m8J74J11l78O3P2
4075AMl5K60l85L64O7l38n0J00K50q3p6k80L87K64o69M13j45L7k54J38M8m4L04
4099B78m25j21M34k47K06j71J79j57K1j52J72j43J33k51N17k25k48J96J2j35J2
4120a15j48r7M21j54k20M23p5N5k82L12l09J92J65r3j80j25J87j59j03J42j97
4141c60N38j65J44o5m1q8L9K23j60J61l90q5L3Q4j75L91j81J59j55M3K41j69j82
4164a60j05j3J70m0O6N5n4NK89j94l9P4o3K51k14mJ94l27K9l6K18K30l29l7N9
4189B5K12l04j97J36K30j59jN7%N7m4J46K03k42k51L28m1m22K53M46k78o9m1K25
4213B69n15K10rK63l40J22O2r0O3o9j48K48q2j74K77k4q3q6L3M51n73j96K53J08
$$ plain form
4237 -30 -64 -193 29 152 216 121 0 -305 52 66 -236 90 218 -131 -74 181 -27 39 -26 -128 64 -37 107
4260 107 -182 9 118 -2 114 347 269 -18 48 84 -166 69 -13 -148 -121 43 -90 190 246 196 -307 102
4282 102 9 -75 -129 4 60 -276 146 116 -51 3 -24 178 -306 -219 -214 -383 270 -41 -164 70 67 226 159 -114
4306 -114 -311 32 55 -195 -95 237 -236 112 -130 31 166 -254 -49 -133 -17 -91 67 -137 246 156 -201
4327 -201 173 172 32 238 -211 230 53 -89 -2 49 90 174 -78 174 -122 -84 116 -97 68 60 -120 -13 -79
4350 -79 108 -39 82 -176 62 -115 -129 -31 115 209 -30 155 82 -254 47 -130 -74 -128 93 136 50 75 302
4373 302 76 -100 7 133 -57 114 253 65 75 -174 -69 -1 -297 -199 297 92 146 -32 -136 -51 -36 -478
4395 -478 -37 -205 -33 -82 24 -2 -147 -314 -45 -266 157 45 64 -58 -172 23 -221 -130 -79 33 -81 6
$$ packed form
4237c0l4j29K22J23O4r5j21l05L57J4l02L26J28l49N7K55k08O6o5j02J92j01J44
4260A07k89J91J09j20J16K33p8k87O6L6k50K35q2j35K7J64j33K80N6n0n03M09
4282A02r3q4n4J33N6l36M22l0j67N4k7K02m84Q7Nj69O53l11j23K34lJ59o7k73
4306a14j97L43K3k50J00L32m73L48k42J61J35m20K05q4J16p4J58k04L83r0l57
4327b01L74jj40K06m49M41j77j42Q7N1M1Q4k52K52k96L8K00k13J65qj80J07o6
4350g9J87j47J21k58K38j77j4R8J46R4k39J85p3l36L01j77N6n4K21M3q6K5K27
4373C02k26j76J07J26j90J71J39j88J0k49J05O8k96R8M96k05N4j78j04Q5J5m42
4395d78M41j68J72m9J06k6j45j67K69k21M23j12J9j22j14J95k44R1N1J12j14Q7
$$ plain form
4417 6 -205 -268 -83 -113 -206 124 -90 141 -2 -22 30 106 80 118 77 19 147 101 -22 -240 108 -131 -77 -71 363
4442 363 213 85 143 -102 191 -82 -76 -47 0 19 5 210 21 -82 77 -216 -53 -156 -113 -158 -58 73 -201
4465 -201 -135 -307 -154 -139 -20 86 -146 -486 -165 79 -218 -73 -297 -11 118 -4 -15 -84 76 -49 42 -21
4487 -21 -69 -122 37 -174 -170 120 22 -281 -205 -61 27 219 82 56 -23 204 294 232 -55 292 124 -242 175 51
4511 51 100 -407 -16 -354 -236 517 -146 -186 35 135 -18 35 71 141 -247 166 -181 224 110 141 127 -93 -22
4534 -22 61 151 263 148 85 -131 -59 52 -65 -105 -110 -2 -284 -54 50 53 -50 225 171 12 -58 -55 -93 -29 10 -171
4560 -171 42 -80 -161 -7 228 74 -18 104 -1 374 -260 258 -17 -113 -116 186 -27 67 -233 225 172 -38
4582 -38 70 -269 -76 -338 -131 -167 -156 -188 -137 195 45 -93 77 -94 31 -228 178 121 -145 224 49 -152
$$ packed form
4417Fk11o3J85l0r3L30k14K31j43k0N2P6k6L8m1n8J28m6j23k18L48k39N4OM34
4442C63j50j28N8k45K93k73OK9M7J9j4K05j89j03J59k93J63j03M3m5J00J31k74
4465b01O6j72J53J5J19J06k32l40L21K44k97J45k24K86J29j22j1o9J60j25R1o3
4487b1m8n3J59k11MK90r8l03P6J44Q8J92j37k6p9K27R0o2k87L47j68l66M17j24
4511E1M9n07L91l38J18P53o63m0K21J00j53N3L6P0l88M13l47M05j14L1j4k20P1
4534b2Q3R0J12j15o3k16P2J11j17m0nJ08k82K30J04Lj03K75n4j59p0Ll8O4L9j81
4560a71K13j22q1J54K35j54r2J22j05L75o34N18k75r6lL02k13R4l00M58n3k10
4582c8J08l39J93k62K07l6J1l2N1L32j50j38J70j71J25k59M06n7k66L69j75k01
$$ plain form
4604 -152 174 -390 -37 46 85 101 -75 145 30 -207 76 164 161 -46 9 -55 -144 -43 112 148 -171 -80 97 318
4628 318 25 64 38 61 131 -72 83 -144 -131 -73 119 107 23 -7 159 -226 143 -178 74 68 -28 0 -27 195 127
4653 127 -33 -34 -174 27 -3 190 -315 -233 -160 -100 -116 129 -3 36 -3 -103 476 54 268 564 -71 131 133 166
4677 166 -29 -208 130 169 124 -38 -26 80 120 -74 21 -113 179 81 -42 -144 -196 -37 -162 -156 -180 -21 -214
4700 -214 -80 -40 180 -403 156 -37 -290 -154 -32 149 1 -152 -183 19 -57 -270 -26 -356 288 28 -261
4721 -261 80 -220 146 110 -262 -121 20 205 49 87 -134 78 180 -167 -162 50 46 -121 168 31 190 47
4743 47 20 306 44 -469 -31 185 265 13 -72 -223 3 70 -100 164 -4 54 -81 274 76 -118 94 -4
4765 -4 95 244 176 113 -213 106 -11 -57 222 -67 78 190 -4 90 106 -103 306 95 186 170 24 -111 186
$$ packed form
4604a52L26n64L53Q3L9J6j76K20j15k37K83Q8lk07N5o4q9J01J55L6l19R1J77K21
4628C18k93L9k6K3P0k03J55k27J3N8J92j2q4l0J66l85L69l21K52or6K8k7K22o8
4653A27j60jj40K01l0J93n05Q2P3O0j6K45j32L9l9j00N79m22K14K96o35K02KL3
4677A66j95j79L38L9m5j62J2J06M0j94R5j34K92r8j23j02n2J59j25Ok4J59j93
4700b14J34M0K20n83N59j93k53J36J22J81j48j53l1K02p6k13K44l30O44k60k89
4721b61L41l00L66l6l72J41J41J85j56L8k21K12J02l47NK12mj67K89j37J59j43
4743D7k7K86k62n13M38K16Q0k52q5j51K26O7j70K64j68N8j35L55j98j94K12r8
4765dR9J49o8o3l26L19j17m6K79k89J45J12j94R4J6k09M09k11R1j6j46j35K97
$$ plain form
4788 186 195 272 41 -205 -51 139 29 -133 224 119 -18 112 -86 -60 -111 -79 301 -118 202 90 6 -367
4810 -367 -45 350 8 37 217 28 -50 -136 118 -144 1 57 -231 5 156 -89 44 58 111 -129 -153 -476
4832 -476 170 70 24 -44 -136 -8 -188 145 238 49 283 -13 -302 -68 -123 67 95 0 -517 213 79 109 -1
4855 -1 -68 194 77 -230 -39 -114 -50 -191 160 -192 57 -246 -22 234 10 -14 -262 9 19 -265 -253 150 -209
4878 -209 -130 124 157 194 -26 -134 -19 63 -13 -4 36 120 -57 -33 10 -6 -66 173 -15 -107 -119 -21 1 5 -127 -30 93
4905 93 121 162 131 -39 -150 -233 -150 103 -32 -102 -120 247 49 -5 163 236 207 34 -173 274 180 -158 -239 -166 16
4930 16 -290 -142 66 56 -93 -375 164 -85 -39 247 138 150 -264 -29 167 -156 -154 -76 219 305 -152 119 -241
4953 -241 193 -121 -247 -63 252 -2 -207 249 -16 -342 7 -144 -43 -29 -146 218 99 298 -164 2
$$ packed form
4788A86RP7k31k46J54J90j10j62L57j05j37J30j98K6n1L2L80m19L20j12q4l73
4810c67L22L95l42K9J80j89p8q6K54k62J45N6k88K36J51k45J33J4N3k40k4l23
4832d76O46j00m6o8r2J28j80L33R3j89K34k96k89K34n5J90K8r5n17P30j34L0j10
4855ao7K62j17l07J91p5O4j41L51l52K49l03K24K56k24k4k48K71J0k84J2M03l59
4878b09P9K54L3L7k20j08J15Q2p6RM0Q4j77K4M3j6o0K39j88r2j2R8K2Mj32R7J23
4905I3K8M1l1j70j11q3Q3K53j35p0j8L67j98n4J68P3k9j73k07M47r4l38q1P3J82
4930A6l06J48K08j0j49k82N39k49M6K86j09J2m14K35J96l23KP8K95Q6m57K71l60
4953b41M34l14j26J84L15k54k05M56k65l26L49j51J01J4j17L64j19J99m62J66
$$ plain form
4973 2 -37 -98 -160 75 -26 -259 25 3 -71 5 238 124 -61 -146 -234 -148 161 -110 65 255 141 -76 -132 54
4997 54 -299 -214 -184 -68 269 -209 10 -61 -72 -4 46 286 426 71 -49 -117 190 10 -88 129 105 -96 -65 253
5021 253 359 -114 -196 379 259 -76 -85 -131 262 114 195 40 108 -157 -146 141 99 77 -3 -48 189 48 -109 187
5045 187 -111 -76 -231 -9 261 -67 -31 48 -65 -137 -42 -73 328 -143 -305 -2 -147 -151 -302 165 250 -233 -315
5068 -315 68 -226 -418 -8 147 160 -228 148 57 -59 -82 -5 -94 -2 -153 -40 99 279 186 224 -97 423 -130
5091 -130 -313 -70 -208 -135 -19 8 144 102 -116 157 135 -255 -75 -11 -103 -292 -94 183 -120 104 31 199
5113 199 268 -227 -81 -122 -158 115 -313 61 -291 -167 -179 -94 47 -230 -30 130 199 -399 -30 -97 55 -206
5135 -206 -218 183 12 -122 37 86 -232 41 -61 267 -117 -144 -121 71 1 156 -195 58 25 -65 -101 -14 89
$$ packed form
4973Bl9o1o2K35j01k33K84k2p4P6K33j14j85q5q8Q6L09k71J75J90j14k17n6J86
4997E4l53Q5L0J16L37m78K19p1j1O8N0K40J40l55j20o8L07j80r8K17k4k01L1L18
5021B53J06m73q2N75j20l35rm6L93j48Q1j55O8k65J1K87m2k2q0m5K37j41j57K96
5045A87k98L5j55K22K70l28L6P9j13p2R5l1M01m71j62L03j45mj51M67Q5m83q2
5068c15L83k94j92M10J55J3l88L76r1j16k3P7q9R2j51J13J39J80r3L8l21N20n53
5091a30j83K43j38P3J16K7J36m2k18K73k2l90J80O4r2j89J98K77l03K24p3J68
5113A99O9m95J46m1l6K73m28L74l52J24j2Q5J41k77K00J60O9n98L69o7J52k61
5135b06j2M01j71j34J59M9l18K73j02L28l84k7K3J92p0J55l51K53l3r0l6Q7J03
$$ plain form
5158 89 -316 30 253 -47 -292 48 39 -100 -146 217 143 144 -10 -53 288 154 -59 116 161 150 64 -512 -211 232
5182 232 -259 127 172 92 125 -90 239 -77 -93 -67 -82 -16 -23 32 -37 89 36 31 6 -55 -7 179 260 -189 201 93
5208 93 -32 146 96 -248 -325 -73 -52 -145 76 -273 -153 -450 -191 1 -102 -213 133 120 18 -75 -412 -59
5230 -59 -53 -65 -15 -278 -1 19 -147 -288 -145 10 104 -237 -467 -218 23 23 0 -67 -317 -161 336 -395 81 103
5254 103 -121 -168 -224 1 185 -62 184 242 -143 -279 -119 22 56 123 -190 199 216 37 -6 40 -63 -237 33
5277 33 -28 -1 -32 -109 56 148 -52 72 331 -18 -138 72 23 -146 -89 448 123 -99 -224 -61 106 52 -140
5300 -140 -139 218 132 -422 75 71 -41 -32 -59 30 251 -161 -97 -118 -41 -171 132 78 -10 -314 -476 37 -65 -286 29
5325 29 189 -130 -192 223 121 -68 -66 60 146 24 -152 57 41 -34 -303 -235 131 -147 -147 -11 10 123 -247 -304
$$ packed form
5158H9m05L46K23l00k45L40rj39m6L63p4Jj54m3L41j34k13J75M5j1q6n76L01M43
5182B32m91L86M5q0L3k15L29l16j6K6j5O6pN5o9J26n3nk5o1M8J86Q1m49L90j08
5208I3j25J78n0l44p7K52K1r3K21l49J20k97K59J92j03j11L46j3j02r3l37L53
5230e9Oj2N0k63K77K0j66j41J43J55R4l41k30K49K41%k3o7k50J56M97p31M76K2
5254A03k24m7n6K25J84k47K46N8l85j36J60J41L4O7l13L89J7j79m3M6j03j74K70
5277C3o1K7l1p7J65R2k00J24K59l49j20K10m9j69N7N37l25k22j25J63J67n4j92
5300a40JL57q6n54M97mj12Rk7Q9K21m12O4k1P7j30L03n4q8l04j62N13j02k21L15
5325B9J60l19o2M15j02j89KJ26Q6j22j76K09j6p5k69O8L66k78%J36K1J13l70n7
$$ plain form
5349 -304 54 -80 -71 11 -38 -419 -200 213 -40 -126 -345 -177 21 42 86 148 -109 56 -184 -6 321 -276 -65
5372 -65 69 -393 -43 -117 149 -15 -32 -294 -263 -165 -240 -126 -229 15 -45 2 352 96 -109 -60 213 -64 -195
5395 -195 36 23 -149 89 297 8 -117 131 189 -186 -11 -192 274 177 33 -316 -6 -198 163 -6 340
$$ packed form
5349c04L58j34RQ2m9l81K19M13k53q6k19J68J98K1M4O2k57J65k40J78L27n97K11
5372f5J34m62L50p4K66j64j7k62L1R8p5J14j03K44o0M7L50k56k05M9K73k77j31
5395a95K31j3j72K38K08k89j25K48N8l75J75j81M66r7j44l49L10j92L61j69L46
$$ [...]
8191b37
##END NTUPLES=NMR FID
##END=
