##TITLE=1H_SL1-5ID(A)
 CDCl3
 8 sc, 
 8.12.2021
##JCAMPDX= 6.0         $$ Bruker NMR JCAMP-DX V2.0
##DATA TYPE= NMR FID
##DATA CLASS= NTUPLES
##ORIGIN= UXNMR, Bruker Analytische Messtechnik GmbH
##OWNER= root
$$ XWIN-NMR		Version 3.5
$$ Wed Dec  8 11:21:45 2021 Russian Standard Time (UT+4h)  she@DPX200
##.OBSERVE FREQUENCY= 200.131346
##.OBSERVE NUCLEUS= ^1H
##.DELAY= (6, 6)
##.ACQUISITION MODE= SIMULTANEOUS
##.ACQUISITION SCHEME= undefined
##.AVERAGES= 8
##.DIGITISER RES= 18
##SPECTROMETER/DATA SYSTEM= spect
##.PULSE SEQUENCE= zg30
##.SOLVENT NAME= CDCl3
##.SHIFT REFERENCE= (INTERNAL, CDCl3, 0, 15.7039)
##AUDIT TRAIL= $$ (NUMBER, WHEN, WHO, WHERE, WHAT)
$$ ##TITLE= Audit trail, XWIN-NMR		Version 3.5
$$ ##JCAMPDX= 5.01
$$ ##ORIGIN= Bruker BioSpin GmbH
$$ ##OWNER= she
$$ F:/spectra/data/she/nmr/H-F/1/audita.txt
$$ ##AUDIT TRAIL=  $$ (NUMBER, WHEN, WHO, WHERE, WHAT)
(   1,<2021-12-08 11:20:32.29 +0400>,<she>,<DPX200>,
      <created by zg, POWCHK disabled, PULCHK disabled
       configuration hash MD5:
       00 E9 B6 7A A2 85 ED C7 34 08 36 98 17 FE 4E 26
       data hash MD5: 16K
       05 72 ED D6 59 E1 F7 26 90 FC 0B A5 87 A5 12 3E>)
$$ ##END=
$$ 
$$ hash MD5
$$ B7 1F D9 B4 07 ED E9 84 DE EC DC A8 91 1B 0C FB
##$RELAX= 
##$RELAX= 
##$RELAX= 
##$RELAX= 
##$RELAX= 
##$RELAX= 
$$ Bruker specific parameters
$$ --------------------------
##$DU= <F:/spectra>
##$EXPNO= 1
##$NAME= <H-F>
##$PROCNO= 1
##$TYPE= <nmr>
##$USER= <she>
##$AMP= (0..31)
100 100 100 100 100 100 100 100 100 100 100 100 100 100 100 100 100 100 
100 100 100 100 100 100 100 100 100 100 100 100 100 100 
##$AQSEQ= 0
##$AQ_mod= 1
##$AUNM= <au_zg>
##$AUTOPOS= <>
##$BF1= 200.13
##$BF2= 200.13
##$BF3= 200.13
##$BF4= 200.13
##$BF5= 200.13
##$BF6= 200.13
##$BF7= 200.13
##$BF8= 200.13
##$BYTORDA= 1
##$CFDGTYP= 0
##$CFRGTYP= 5
##$CHEMSTR= <none>
##$CNST= (0..31)
1 1 145 1 1 1 1 1 1 1 1 1 1 1 1 1 1 1 1 1 1 1 1 1 1 1 1 1 1 1 1 1 
##$CPDPRG= <>
##$CPDPRG1= <>
##$CPDPRG2= <>
##$CPDPRG3= <>
##$CPDPRG4= <mlev>
##$CPDPRG5= <mlev>
##$CPDPRG6= <mlev>
##$CPDPRG7= <mlev>
##$CPDPRG8= <mlev>
##$CPDPRGB= <>
##$CPDPRGT= <>
##$D= (0..31)
0 1.2 0 0 0 0 0 0 0 0.06 0 0.03 0 0 0 0 0.0002 0 0 0 0 0 0 0 0 0 0 0 0 
0 0 0 
##$DATE= 1638948031
##$DBL= (0..7)
120 120 120 120 120 120 120 120 
##$DBP= (0..7)
150 150 150 150 150 150 150 150 
##$DBP07= 0
##$DBPNAM0= <>
##$DBPNAM1= <>
##$DBPNAM2= <>
##$DBPNAM3= <>
##$DBPNAM4= <>
##$DBPNAM5= <>
##$DBPNAM6= <>
##$DBPNAM7= <>
##$DBPOAL= (0..7)
0.5 0.5 0.5 0.5 0.5 0.5 0.5 0.5 
##$DBPOFFS= (0..7)
0 0 0 0 0 0 0 0 
##$DE= 6
##$DECBNUC= <off>
##$DECIM= 32
##$DECNUC= <off>
##$DECSTAT= 4
##$DIGMOD= 1
##$DIGTYP= 9
##$DL= (0..7)
0 120 120 120 120 120 120 120 
##$DP= (0..7)
150 150 150 150 150 150 150 150 
##$DP07= 0
##$DPNAME0= <>
##$DPNAME1= <>
##$DPNAME2= <>
##$DPNAME3= <>
##$DPNAME4= <>
##$DPNAME5= <>
##$DPNAME6= <>
##$DPNAME7= <>
##$DPOAL= (0..7)
0.5 0.5 0.5 0.5 0.5 0.5 0.5 0.5 
##$DPOFFS= (0..7)
0 0 0 0 0 0 0 0 
##$DQDMODE= 0
##$DR= 18
##$DS= 0
##$DSLIST= <SSSSSSSSSSSSSSS>
$$ [...]
##$SUBNAM2= <"">
##$SUBNAM3= <"">
##$SUBNAM4= <"">
##$SUBNAM5= <"">
##$SUBNAM6= <"">
##$SUBNAM7= <"">
##$SUBNAM8= <"">
##$SUBNAM9= <"">
##$SW= 18.0517287032376
##$SWIBOX= (0..15)
0 0 2 0 0 0 0 0 0 0 0 0 0 0 0 0 
##$SW_h= 3612.71676300578
##$TD= 16384
##$TD0= 1
##$TE= 0
##$TE2= 300
##$TE3= 300
##$TEG= 300
##$TL= (0..7)
0 120 120 120 120 120 120 120 
##$TP= (0..7)
150 150 150 150 150 150 150 150 
##$TP07= 0
##$TPNAME0= <>
##$TPNAME1= <>
##$TPNAME2= <>
##$TPNAME3= <>
##$TPNAME4= <>
##$TPNAME5= <>
##$TPNAME6= <>
##$TPNAME7= <>
##$TPOAL= (0..7)
0.5 0.5 0.5 0.5 0.5 0.5 0.5 0.5 
##$TPOFFS= (0..7)
0 0 0 0 0 0 0 0 
##$TUNHIN= 0
##$TUNHOUT= 0
##$TUNXOUT= 0
##$USERA1= <user>
##$USERA2= <user>
##$USERA3= <user>
##$USERA4= <user>
##$USERA5= <user>
##$V9= 5
##$VALIST= <valist>
##$VCLIST= <CCCCCCCCCCCCCCC>
##$VD= 0
##$VDLIST= <DDDDDDDDDDDDDDD>
##$VPLIST= <PPPPPPPPPPPPPPP>
##$VTLIST= <TTTTTTTTTTTTTTT>
##$WBST= 1024
##$WBSW= 4
##$XGAIN= (0..3)
0 0 0 0 
##$XL= 0
##$YL= 0
##$YMAX_a= 182548
##$YMIN_a= -361585
##$ZGOPTNS= <>
##$ZL1= 120
##$ZL2= 120
##$ZL3= 120
##$ZL4= 120
##$ABSF1= 10
##$ABSF2= 0
##$ABSG= 5
##$ABSL= 3
##$ALPHA= 0
##$AQORDER= 0
##$ASSFAC= 0
##$ASSFACI= 0
##$ASSFACX= 0
##$ASSWID= 0
##$AUNMP= <proc_1d>
##$AZFE= 0.1
##$AZFW= 0.1
##$BCFW= 1
##$BC_mod= 2
##$BYTORDP= 1
##$COROFFS= 0
##$CY= 11.3945322036743
##$DATMOD= 1
##$DC= 2
##$DFILT= <>
##$DTYPP= 0
##$F1P= 2.36226072786647
##$F2P= -0.459571619588291
##$FCOR= 0.5
##$FTSIZE= 0
##$FT_mod= 4
##$GAMMA= 1
##$GB= 0.15
##$INTBC= 1
##$INTSCL= 1
##$ISEN= 128
##$LB= 0.24
##$LEV0= 0
##$LPBIN= 0
##$MAXI= 10000
##$MC2= 0
##$MEAN= 0
##$ME_mod= 0
##$MI= 1.114404
##$NCOEF= 0
##$NC_proc= 0
##$NLEV= 6
##$NOISF1= 3.799351
##$NOISF2= 2.8
##$NSP= 1
##$NTH_PI= 0
##$NZP= 0
##$OFFSET= 15.70392
##$PC= 1
##$PHC0= -15515.07
##$PHC1= 12.8008
##$PH_mod= 1
##$PKNL= yes
##$PPARMOD= 0
##$PSCAL= 0
##$PSIGN= 0
##$REVERSE= no
##$SF= 200.130013532006
##$SI= 16384
##$SIGF1= 3
##$SIGF2= 2
##$SINO= 400
##$SIOLD= 16384
##$SREGLST= <1H.CDCl3>
##$SSB= 0
##$STSI= 0
##$STSR= 0
##$SW_p= 3612.71676300578
##$SYMM= 0
##$S_DEV= 0
##$TDeff= 0
##$TDoff= 0
##$TI= <>
##$TILT= no
##$TM1= 0
##$TM2= 0
##$TOPLEV= 0
##$USERP1= <user>
##$USERP2= <user>
##$USERP3= <user>
##$USERP4= <user>
##$USERP5= <user>
##$WDW= 1
##$XDIM= 8192
##$YMAX_p= 0
##$YMIN_p= 0
$$ End of Bruker specific parameters
$$ ---------------------------------
##NTUPLES= NMR FID
##VAR_NAME=  TIME,          FID/REAL,        FID/IMAG
##SYMBOL=    X,             R,               I
##VAR_TYPE=  INDEPENDENT,   DEPENDENT,       DEPENDENT
##VAR_FORM=  AFFN,          ASDF,            ASDF
##VAR_DIM=   8192,          8192,            8192
##UNITS=     SECONDS,       ARBITRARY UNITS, ARBITRARY UNITS
##FACTOR=    0.0002768,     1,               1
##FIRST=     0,             0,               0
##LAST=      2.2672688,     0,               0
##MIN=       0,             -361585,         0
##MAX=       2.2672688,     182548,          0
$$ Real data points
##PAGE= N=1
##DATA TABLE= (X++(R..R)), XYDATA
0@%%%%%%%%%%qJ6j6J6k4L2m0M8n6P2q8J04j28J52j76K08k43K83l28L76m31M94
32B63n63O40p23Q14r16J029j153J288j434J596j773J966k179K410k661K934l235
49a697L566l927M327m770N259n804O417p112P904q817R882j1147J2678j4570J6986
64I175k0190K4671l1442M2993o7922K17594j89408k54808L87620m1720j70894
75i4331P5077R7253q0208K264j9318m7792K4709J01343l4049m0400K8919j1282
87B185o3707M2359O7323m5604q2014Q6754N4845j06376J616R0229m0616m390K7947
100C0551o3654j931Q1907j1022m6366K0366P605l2079J9579K1728j4920R083j5675
113E172m3635M40J0726L6310K5985n4906q691M6345l2820k5533N3776L0452l2890
$$ y = [0, 0, 0, 0, 0, 0, 0, 0, 0, 0, 0, -8, 8, -8, 8, -16, 16, -24, 24, -32, 40, -48, 56, -72, 80, -96, 112, -131, 152, -176, 200, -231, 263, -300, 340, -383, 431, -485, 544, -609, 679, -755, 841, -932, 1034, -1145, 1265, -1396, 1538, -1697, 1869, -2058, 2269, -2501, 2758, -3046, 3371, -3741, 4163, -4654, 5228, -5919, 6759, -7811, 9175, -11015, 13656, -17786, 25207, -42715, 174879, -14529, -269337, 118283, 76563, -94331, -19254, 77999, -2209, 55, -19263, -67055, -42346, 58997, 24948, -15452, 13467, 2185, -61522, -19163, 48160, 2556, -79458, 7296, 62141, -44235, -42619, 47610, 6994, 2604, 30551, -33103, -35034, 46873, 35851, -10515, 9851, 17456, -14623, 4956, 26684, 11764, 20847, 5172, -38463, -38023, -27297, 9013, 34998, -19908, -28599, 17746, -15074, -40607, 13169, 43621, 10731]
126A0731m2295K452L8519J1061k8969N716M6054k4783n6743K7224L5451n258o726
139A2434j9922J4883J7025o5721j0265Q6749P388n8984l062K4160o745j4584L382
152a3262K2796K5521k5442n4642J6761M5628l425j5590o120J0864K510l5972J6153
165a4220N6704k1147k9977J7430j1317r790K9555n36j8545J4949r989l7209J9228
178a4864K0140j8197K7419J5107n0820O41L4644k2150j7499L5549K9273l0533
190H710m3924J8956K9354j9406k330K7395p805k2026M184P52P157K6447k6096
203A368l0849N4600P653o6743K9784N8667m9450m7912K7032K6283m950j4783o120
216a5420J2171R788j7578j2497L0241K5356k2135k5212J8366J6492m0249j5540
$$ y = [10731, -31564, -29112, 9407, 20468, -8501, -2785, 43269, 18486, -38257, -11033, 24418, 19160, 12434, -7488, 7395, 24420, -41301, -51566, 35183, 42571, -16413, -19475, 4685, -2060, -16644, -13262, 9534, 35055, 9613, -45029, -28268, 17360, 13935, -1655, -7775, 3089, 5599, -30373, -14220, 42484, 21337, -8640, 8790, -2527, -12317, 17238, 16702, -1843, 13106, 3117, -34092, -14864, 5276, -12921, 14498, 29605, -21215, -20574, 14070, -8080, -25579, 9970, 39243, 8710, -35214, -16258, 13096, -6310, -8640, 18755, 10950, -11076, -6892, -6140, 1017, 27464, 1368, -29481, 25119, 32772, -33971, -4187, 54480, 5030, -42882, -15850, 10433, 5483, -9300, -15420, -3249, 6539, -11039, -23536, 6705, 32061, 9926, -15286, 3080, 19572, -20677, -36217]
228c6217O0941Q160n3940J1114K6063k0280R68J1630m950J5997l786m0928N502
241a9726L6147j4210j3604K0080j2639j8334K2347R433j2489J219N356n123j5555
254a7098K017L1212M842k4733O95J1998m641m873n027O074K4942j4173m4133J9345
268a3553L7508k9311j3660L6459j850k3532j08j601Q692J2525j7631n848J8776
281F866j3715k0977K5701K9405j1660k3931j606J7630K985j8272P540K3779j3087
294A0658k3997N96P990J2107J084j5668R931R774k9971k915L2665p284j8616J7285
308C639L391j3851M600m36l902J5198j216j6466O893O637n867O011K961p247n06
323a61K327K461L10l818M763R45k1922m197K3713L581j0135J848l143j556M428
$$ y = [-36217, 24724, 32884, -21056, -9942, 16121, -4159, -3191, 8439, 3489, 19486, 15700, -25228, -19726, 16421, 2211, -11393, 8687, -3952, -22286, 61, 9494, -2995, -1776, 3580, -1543, -17098, -15081, 16131, 20973, -3760, -3065, 8933, 4292, -581, -5608, 466, 25408, 11235, -32898, -13553, 23955, -5356, -19016, 17443, 15593, -7939, -8047, -9648, -956, 11569, -6062, -11910, 6866, -6849, -27826, -2125, 27280, 15620, -8311, -9917, 7713, 10698, -7574, -34, 23745, 10658, -13339, -12743, -4753, 7354, 8438, -7230, 2701, 12475, -17496, -20411, 12254, 4970, -13646, 3639, 7030, -6821, -2221, -2657, -6559, 8639, 7423, -9043, -2150, 4487, -1380, 4631, 7592, 345, -161, 2166, 4627, 4937, 1119, 5882, 6827, -15095, -19292, 4421, 8002, -2133, -285, -3428, -4984, -556]
338e56j2428P325L3165j7780l9662K5853K6994l0224j0836L0195P928j9793j3019
351a2838O977J6643k5j6042q22J4294J354j8128o087K5516J1937l0604q950K4661
365G886r014k0711K2344J4405j8252l389J822m685J3827N679j1746J0427N039
378A3632k5999k623K3144j228j0458O415R73q249M28P260K207j610K56q97o821
393c570k155O706L3j388K834p559j120J2366j0442j0263K6747L139l4143K794
407a6021K6141q411j0245J1741M353k297m374j1281J0314K0538j4103j9230J4804
420A929J0606j9691r439K3692J3731k4691j4212K1793R489j5065m360N182J789
433G53J842j1043r470K2637J1927k6915k266K3031j0288j2423J7693N269j1558
$$ y = [-556, -12984, -5659, 27506, 9726, -29936, -4083, 22911, -7313, -18149, 12046, 19974, 181, -12838, -5861, 10782, 10757, -5285, -6107, 8187, 9541, -8587, -14674, 10842, 22779, -7825, -16775, 7886, -1128, -21839, 505, 14910, -3342, -6731, -4909, -9594, 4233, 9912, -1834, 8593, 13632, -12367, -14990, 8154, 6926, -3532, 2883, 3856, -4393, -3965, 3295, 5502, 3892, 4148, 3251, -3570, -5725, 981, 1014, -374, 2460, -5099, -6219, 6147, -4295, -14558, 12189, 15328, -18815, -16021, 10120, 1709, -8536, 3205, 7558, 5261, 887, -10394, -80, 20458, 6355, -12875, 1929, 12535, -7156, -16595, 7097, 20828, -3863, -18075, 3718, 13207, -1858, -6218, -1036, 753, 2595, -8448, -17918, 4719, 16646, -10269, -12535, 10496, 208, -12215, 5478, 10747, -811]
446h11L73L194n140n51N474M626O36k723m109k911R44L448j093j829K855p342
462d959j0549J3025Q608j4883L690J4061j2537p964J3113M166k989Mo218J533
476a899P583q847l086J9251L71k1018Q66J4318j616r917J63J2059K057j7899n150
491a2764J4646M969q546m402O586O181j1499j3702J5927J7467j8313j3043J8332
504A839N227j1467K289N637M512L738j4081o083J9337J061j7723L290Q584r683
518c523m333Q347J311l460J817O46l022k147L407L377k946o05K217m523j32N002
534A433m436L672R088j3032o603J8864k427j8356J2647J4325j7384q448J3731
547C074L509k796j142n149K983M349j0353m433J4675M848j6853p222J6635M680
$$ y = [-811, -438, 2756, -2384, -2935, 2539, 7165, 7801, 5078, 969, -1942, -998, 2450, 1357, -472, 2383, -4959, -15508, -2483, 6125, -8758, -5068, 8993, -3544, -11508, 1605, 5771, 2782, 2786, -3432, -1899, 5684, -3163, -6249, 13002, 13373, -7645, -6779, 7539, 5923, -3994, -3831, 8228, 10285, -7614, -12764, 1882, 6851, -1695, -6097, 489, 6670, -4829, -18531, -2604, 14863, -3450, -16493, 1839, 7066, -4401, -2112, 3525, 8037, 11775, -2306, -8389, 10948, 12009, -5714, -2424, 6160, -3523, -7856, 491, 1802, -1658, 159, 805, -2217, -4364, -957, 2420, -526, -1131, 1086, -3437, -3569, 1433, -3003, 669, 9757, -3275, -9878, 8986, 6559, -11797, 850, 15175, -2209, -10657, 3074, 6583, 3787, 2645, -2504, 479, 4828, -5525, -9958, 4717, 9565, -7288, -14510, 2125, 6805]
561F805j6596L982K0869p426j8194P496R599n722j226M42j555Q028n287j6061
575a4846J4478J7226j8310r296J7281N13j5024L192J0198q58n687j803O14K685
589C63J385j764j60K465o51p705l51R457j372o019P131r82j0506R298Q466j0351
605a296j785J0669l437q701J056L812L496o25q968J069J1729m564j0723P887R449
620I068p174j0132L719J0996k834j0578L955Q930n149q487L547R111J796q653
634a885m727R235K578j2401K968J4753n208j1753M844N305j620j463k092L682
648B216L690q993o605J0408N067r247j463P058j287n869K143O554o65m338J090
663b41R76l046J653K690j623K821J134q492J932P680n977p78R247p378r707J0666
$$ y = [6805, -9791, -5809, 15060, 7634, -10560, -3064, 6535, 813, -413, 29, -1526, 6502, 1215, -14846, -368, 16858, -1452, -10748, 6533, 7046, -7978, -4786, 5412, 4554, -1133, -2936, -2322, 363, 1748, -16, -176, 2289, 1638, -6067, -6418, 3039, 1667, -4352, 2779, 1797, -8709, 589, 9055, -1296, -3081, 7588, 4151, -4550, -3494, 318, 3814, 3189, -5779, -4710, 7019, 2455, -8268, -381, 9068, 1894, -8238, -4519, 6477, 3643, -6935, -2980, 5950, 801, -7686, -4139, 4972, 6768, -1885, -6612, 2623, 5201, -7200, -4232, 10521, 5313, -6440, -1596, 3709, 2089, 626, -1466, 2216, 5906, -3087, -9692, 716, 5783, -3464, -4927, 2131, 844, -5025, -2882, 3672, 3007, -1331, -241, 735, -2311, -658, 2032, 409, 3230, 4364, -4128, -2196, 5484, -493, -1271, 7976, 598, -9109, 1557]
679A557L592j2610L011J1637n191q672J716N643K707k798m965J973P161k506j0266
694h011M222J4913m913j6821Q256J4583j0912q974J2178K773r608j68P86M59O284
709E047m771q020R790L133j4035J441J4698l219j1217L540P300m220l829M594
723B32M291k538k460L91q5K040J737l420N68L397o331k571R539j521r098O966
739A137L782j0471J84Q430k085l065K107j372o80P14j506L713M693o010m273O686
755A984K297o587k45Q311J559j0388l426J0149K203p869j064N868N54m990m706
770f350L671R932m337j1853O702R720j0559n522J1145L032o309k778R02L472K795
785C663m527k138P315K57q608K24P937o3n182Q51K862l560j862M699N60m280K407
$$ y = [1557, 5149, -7461, -4450, 7187, 1996, -6676, -4960, 683, 3390, 592, -4373, -2400, 4761, 2255, -8011, -3789, 11124, 6211, -10610, -2354, 12229, 1317, -7657, 4521, 7294, -2314, -2482, -1696, -1237, 5047, 276, -7744, 2046, 5179, -8856, -7415, 7283, 4064, -7153, -3613, 3687, -533, -4362, 232, 4523, 1985, -475, -84, -169, 1871, 3608, 188, 756, 4153, -2178, -4749, 4790, 3269, -5829, 1137, 4919, -5552, -5368, 3062, 977, -2088, 19, -1353, -2033, -1319, -2825, 888, 5581, -429, -4702, 1984, 4281, -2306, -2551, 5760, 7319, -3069, -6495, 3654, 5857, -2012, -3076, 2792, 3346, -1644, -6350, -2679, 7253, 2916, -8937, -2235, 7485, -3074, -8596, 2549, 5581, -728, -3506, -2604, 868, 3663, -864, -3002, 4313, 4570, -4038, -3814, 4123, 4060, -1122, -271, 2591, -969, -2831, 1868, 2428, -1852, 555]
802E55J516n077Q50L667k415J267K031n967J18P316l865m084Q203Q5r677K190
818c287O876l076l103L600J978l380k378J332L500K017k640m015K575M433n871
833a439n183J0097M733j2546k665J0783r87p416L166M476k129k391l349J548P933
848D631k419q370N032P751p397n568Q780N201o921m565M781K102l507q57K080
863G54J435k05l079l398M762L990n049j256M421l819l276N690Lm862M486K945
879C542p239p25N909P85j818o3j091J662J229l520k78O394L56p512m22O814r74
896C049p003K883O404n254o559L916L562j541o65j462J804L802m844l817R068
911C343L950j0182j738Q826j690o504L332M753j548l374j545K646L278j963l650
$$ y = [555, 2071, -3006, -2156, 1511, -904, 363, 2394, -3573, -3455, 3861, -4, -4088, 4115, 4200, -5477, -3287, 3589, 513, -2590, 1010, 2988, -392, -2770, -1438, 2062, 4079, 1439, -2576, -1, 4432, -1439, -6622, 3475, 8208, -4338, -7003, 3780, 2793, -4623, -1457, 3019, 890, -1501, -4850, -3302, 4631, 2212, -6158, -1126, 6625, -772, -6340, 2440, 7641, 720, -3845, 936, 3038, -469, -1326, 754, 2189, 1984, -1095, -4493, 269, 4259, -790, -2046, 2375, -1444, -4720, 970, 973, -3889, 597, 3542, -3697, -4422, 1487, 2272, 454, 391, -700, 962, 2191, -1329, -1607, 4787, 5143, -2369, -2791, 4023, 3049, -3954, -1071, 5333, 79, -6480, -2564, 998, -543, -1208, -2670, -866, 2936, -1908, -5725, 3343, 7293, -2889, -4627, 4199, 2509, -3995, -663, 4090, 2542, -832, -2377, 269, 3547, 1584, -2066]
926b066K387L461m450m733M940N302n443l913N424j35m635K651K431k169J094
941A46Q5l190K104L454k426L62L613l538j811L571r38l016L062K019n513k702
957d718M916K165m051j145L985R21l760j494K702L080L8n726r18P113k99q173
973e364L760Q373n349o392M545L317k221j128k84J842K001m647l007O477L092
988E015o622j769N926q00n427J109M937r10m018L94J921l5N9k5Q91K025j697m311
1006c337L366M428m836j824M722j575m627L444K532l174R49J759l061p79K506
1021D93l4m87P80j172n58J968n63k804K862L699m879m252N818K699o756j24O633
1038C323q56n207L65K651J788O58m248l90N899j811p591L764P927n209o089M005
$$ y = [-2066, 321, 3782, -668, -5401, -461, 4841, -602, -4515, 909, 774, -3861, -1210, 1221, -948, 146, 231, -2959, -855, 2599, 173, 535, 4148, 610, -1201, 2370, 1432, -1584, 1478, 3497, -2016, -4718, 198, 2363, -1688, -2833, 1152, 2073, -1687, -3181, -479, 2601, 2639, -3087, -4005, 3108, 2809, -5364, -1604, 6769, 1420, -4972, -427, 2890, 669, -459, -743, 1099, 3100, -1547, -4554, 1923, 5015, -1607, -3376, 2550, 1750, -3677, -2568, 2369, 1459, -2559, -2165, -244, -279, -220, -245, 646, 2671, 974, -3337, 29, 4457, -379, -2203, 2519, 944, -3683, -239, 2293, -881, 68, 1827, -1234, -2013, 493, 459, -28, 752, -420, -978, 990, 427, -2377, 485, 4184, -695, -4947, 871, 3570, -3186, -3310, 3323, 2467, -2740, -2375, 276, 2064, 2722, -1526, -1916, 3983, 2172, -5419, -1655, 6272, 1063, -5026, -1021]
1054a021L922l264j756K293J922j011k579j039K157K735k511k731L556J686n094
1069b735m1N713j211l837K667J350l724J054K890j890K74R74k304P3K460j488
1085B25o19K133j050l475J690J973k347k24L010m64m135J339L572p71j968J422
1101C11R90j097p97j68J340L271l231l758M386K769n704j078O039j29n538n00
1117b894L070J220j566k430J555L264k542m359L033N525k600m955L031L507k883
1132b4k792L597K275k035j267l34J077J958j590j966K314J331m638J42L600j606
1148D2k120K829o88l056K125K217k603j61K375r20j603P29Q73O35J056j341j757
1165a368K288J866l647n15N025n19n928J136M332k423k316K694L88j828l70o81
$$ y = [-1021, 2901, -363, -2119, 174, 2096, 1085, -1494, -2533, -376, 2359, -152, -2883, 673, 2359, -2735, -2776, 2937, 1726, -2111, 556, 1906, -1818, -764, 2126, 236, 510, 1484, -820, -747, 1713, 225, -394, 1739, 689, -2786, -1096, 877, -1470, -1694, 1316, 852, -3283, -1944, 1628, 857, -1111, 311, 1301, 204, -593, -761, 579, 3850, 619, -3139, 1247, 4016, -1688, -2766, 3273, 3144, -2394, -2894, 176, 1396, -170, -2600, -1045, 2219, -323, -4682, -1649, 3876, 1276, -3679, -648, 2859, -24, -2816, 781, 3056, 1021, -246, -580, 497, 2455, 865, -1101, 1213, 2544, -2094, -1952, 1648, 42, -2078, 751, 63, -2993, -868, 1349, -1254, -1415, 960, 40, -1563, -834, 39, 674, 1730, 389, -1368, 920, 2786, -861, -1376, 3649, 3130, -2798, -1662, 2670, 247, -2069, 625, 1013, -815, -1185, -1866]
1181a866J048L133k446l522L970K258n145j110O846o1n589N69L947k23k714L20
1197e85K071L09j096k369K33M237o82m711J429M309l551l380M437J353l284L32
1213i48J074j523P90J198j371M17J671j535j242K171K9j156J399Q9k097K48K461
1230A675j180k161K794J468l760j163L251R25k176o12O29Q33J68k469k47M175
1246B150j80m884R26M310j856k800K242K080j534k024M14J840N38j721q34K274
1262I41J065l261r66M088J124m315m92L535l56k791J199J573m41q17j333k64K574
1279A063k05l010J525K423l001j538L359N67k339Q33J277j427j18J567o53n46
1295b23J545n11j492N15Q53l12N09k5k122O03K281j904k332L462J989m732j291
$$ y = [-1866, -818, 2315, -131, -3653, 317, 2575, -2570, -3680, 3166, 3105, -2484, -1915, 2032, 1809, -905, -585, 1486, 1795, 699, -1670, -1437, 2800, 2118, -2593, -1164, 3145, -406, -3786, 651, 2004, -1280, -948, 126, -1397, -607, 591, -780, -363, 1308, -227, -1469, 702, 731, -425, 974, 1063, -1034, -786, 1675, 495, -1666, 1128, 2596, -1164, -2327, 924, 1849, -327, -939, -310, 523, 691, -1778, -2025, 2150, 1970, -2914, -1988, 2322, 466, -2334, -92, 1988, 454, -1570, -1156, 684, 1222, -499, -1333, 941, 2006, -1255, -2221, 1867, 2991, -1324, -1816, 1719, 1363, -1428, -229, 1344, 903, 86, -1247, -1511, 1063, 858, -2152, -627, 1796, -1205, -2743, 616, 1183, -1156, -323, 954, -473, -591, 976, 323, -223, 1322, 811, -681, -166, 687, 375, 884, 859, -1263, -660, 1621, -283, -2615, 847, 2836, -1896, -3187]
1312c187M136K21k455Q0J302O26k11k300K13L960N6m594R35M481k066l661K779
1329C15L252k794k738J995J135q57o56l40M96J140k159j916L179J638l428m49
1345b187L570r03k573K227J676j645m10J128n87K5M40o14K78Q93j090j328J649
1362E49N11j351N9J451j740j385K358J75k050Q66J779j751j635K019L59j28J64
1379B50j065M35J932j612j978L484K020l882j518L630N79l330o0K321Q8k266p36
1396a708J179J626n34k607O47L106j200l211J905L553k525k387K141J181j353
1411a87K8M07J76P64j032j575J905J284k117m04J959r36j930J623J395j735j61
1428e36J258j019j012J158M83j029M70L92n40K8M06p60Q26J382j730j346K580
$$ y = [-3187, 949, 1170, -1285, -1205, 97, 723, 512, -1788, -1575, 2385, 2441, -2153, -1218, 3263, 1197, -2464, 315, 3567, 773, -1965, 30, 1165, 308, -348, -688, -192, 948, -1211, -3127, 52, 1690, -1738, -2187, 1383, 480, -2093, 134, 1810, 165, -245, 883, 296, 321, 761, 147, 425, 1318, 228, -1100, 549, 1060, -291, -232, 1219, -521, -1906, 452, 627, -1423, -557, 1222, -529, -2164, -145, 214, 86, 250, -815, -380, 1552, -60, -2038, 1446, 3466, -416, -1934, 1696, 2275, -1055, -1115, 1206, 1294, -972, -1708, -529, 1097, 563, -2044, -1397, 1709, 509, -2702, -797, 2756, 231, -2156, -15, 1166, -187, -159, 248, 424, 1188, 156, -1419, 486, 1770, -347, -751, 1208, 272, -1658, -35, 1360, -375, -536, 722, -297, -1309, -151, 332, -697, -227, 165, -375, -347, 59, -701, 125, 1507, -223, -1569, 1011]
1445A011M28k859Q81K966j951k189J421J412o76o98j50N11R24j489j284K400J795
1462B453l085j485K849J016l255k34L452m10k596k4J378Q00n64j198L81J905n16
1479H67k913J440L207k144k102K097R60j999R0J199j48m57J34p14J82N92m63k78
1497d50P72m16j069J140N30j149m76K153j014j890J819J575j838n45J825l05o01
1514F1l95K45Q38O23j591r47K455L62l076L49L204j205k965J456J486j164j244
1531a508J035O75r2j088j60J360J497j914j560K776R24l151j09L412l68k706M93
1548d84J582n22o39M4j07Q42l66j834P73J778j217j432J720N35j854K05J723q49
1566a02p85J182K05j113M89J075o15j83J80j10l1P78j194J22J671j024k415J637
$$ y = [1011, 1439, -1420, -539, 2427, 476, -1713, -292, 1120, 444, -254, -404, 107, 1031, -458, -1742, 658, 2453, -632, -2117, 732, 1748, -1507, -1741, 1711, 1301, -1295, -1319, 59, 859, 295, -903, -522, 1383, 867, -2046, -606, 2601, 457, -1645, 452, 1412, -587, -497, 702, 554, 97, 231, -483, -301, 291, -172, -450, 322, -94, -1163, -23, 507, -642, -1118, 1035, 21, -1869, -50, 1525, -313, -858, 967, 662, 61, -334, -89, 749, 1372, -219, -1166, 1289, 1651, -1425, -1076, 2128, 923, -2042, -586, 900, -264, -1508, -473, 202, 110, -978, -1138, 222, 1719, -195, -1755, 1021, 1945, -1206, -1315, 2097, 1729, -977, -484, 1098, 576, -63, -19, -126, 716, 350, -1484, -711, 1067, -150, -1582, 138, 673, -1181, -976, 747, -102, -887, 295, 500, -613, -124, 951, 336, 153, 333, 223, 192, 970, -224, -102, 1569, 545, -1870, -233]
1584b33J888k101j170K180L87j744p19J080J158m73j408K47J698Rk127N18K786
1601A976n92k841Q41K424j106j661J324J052r05r50k98J070P09j458j099J610
1617I6Q69k170M3K245o89j803P29J251p11o26O12O04j69j78m07j80J495n77o35
1636b01P62L75j470L1J617j004r06J366K50j796R3J643l35j400Q99j19K59K34
1654B98r83K97J509j034j555J127J980j878j172K258P10k218p86K013N99j412
1670b47n14P93N56J1j703M16K368n50l022J201K553j956j614J775J141j515n91
1687h98Q17K57k46M8m50Q02M22j411m80J847j53j378N23J531j483o49J526K03
1705H28j170K47P63p70Q9L55l33J51L02j052J21R80r72p55J464M45j664j81K037
$$ y = [-233, 1655, -446, -1616, 564, 951, -793, -1512, -432, 726, 253, -1155, -908, 790, 799, -1328, -810, 1976, 1384, -1457, -616, 1808, 702, -959, 365, 1417, 512, -438, -736, 334, 1043, -415, -1514, 96, 965, -1205, -1162, 1083, 394, -1409, -680, 571, -140, -766, -154, 450, 281, 103, -304, -484, 1011, 434, -201, 561, 936, -534, -503, 1114, 110, -796, 570, 820, -976, -883, 760, 425, -975, -76, -195, 64, 298, -685, -388, 1121, 87, -1468, -341, 1639, -239, -1411, 847, 1557, -661, -1447, 566, 1165, -247, -761, 32, 588, 599, -1104, -688, 1680, 1130, -1892, -691, 1862, -94, -1708, 67, 1208, -307, -898, -81, 176, -70, -22, -472, 330, 752, -659, -1139, 708, 555, -823, -300, 1231, -252, -901, 625, 828, -342, -95, 668, -102, -13, 342, 9, 160, 462, -590, -469, 511, -461, -1216, 248, 693, -971, -1152, 885]
1724H85m47j369K95J245k38r44q1J158M76r63o82J225P85j424r58J722R72k442
1742g85n46K242q3j798K72R99L62j013o66L86J686q18j607P06J897j422j100J641
1760C53P21j156m84R52K88n22k4J96M4K04n82k09O97j87p78L14Q19j217m88J246
1780A87Rj075M65J147r28o42J022L37l69j08j50K21Q80r02o12J245P07k034m10
1799a010K287m36j837O72J421q07j324O02P48M3o19p75P81J076j213j098J984
1816D95J116k256n76K148K12j760K03J343k85o24k57M62N46k44j030K33J220p55
1834A91j502J208P11j091m96J419p0j129N55P09p63r4N21l90K78K61n51N17J46
1853D30n73m01J232j45j435P03J435j072j150J233N47q61n12O36J84j53p95L56
$$ y = [885, 438, -931, -636, 609, 371, -573, -654, 504, 980, 17, -665, 560, 1345, -79, -1037, 685, 1657, -785, -1331, 911, 828, -970, -698, 301, 663, -350, -1016, -630, 1056, 238, -1369, -663, 1234, -188, -1288, 353, 1074, -82, -566, 386, 674, 152, 128, 324, 368, 572, -10, -219, 478, 291, -487, -173, 646, -571, -1059, 187, 196, -879, -414, 733, -195, -837, 185, 522, 153, 45, -105, 116, 996, 94, -518, 727, 1434, -600, -1010, 1277, 841, -996, -324, 1097, 290, -1034, -432, 316, 359, -260, -1035, -254, 822, -391, -1489, 495, 1611, -645, -1221, 927, 1139, -621, -418, 925, 640, 16, -241, 221, 767, 523, -507, -274, 946, 191, -1311, -103, 608, -483, -979, 440, 370, -759, -204, 505, -258, -352, 169, -221, 57, 318, -233, 284, 430, -143, -544, 688, 543, -892, -189, 1246, 174, -976, 257, 804, -57, -569, 67, 251, 98, -697, -341]
1871c41Q10P7j336k77J861l4j936O15J841q02j543O76J171o91m11R0L56O04q63
1890a33q45J472N58j522o03J833q0j444M3J616n61q59K25L84Nj19j61j78O17l92
1910a44o37O87P65j113n0J130k99j008P52N65q98q4P87j89m87K08J65O6m9l89
1930b22J61N17l45j104N35J479j056j088J184J028j537p34J242N49o35p41M95
1947b72P09Q6p40l78J572k75j556L24K118j101j481R96J106j082l47K41N29n25
1965g6n67M3Q73K00j199m0J024Mj087L01J222m61q34M90R66q41j17L58N6j00n5
1986A60l11L0O77o08k24R76n29j122R73M75q24p07J231L19j338K67P40J55n18
2005a78k20L21O36m12o27N24J135q44j282J042J144j262q81J602K80j291l76Q15
$$ y = [-341, 469, 546, -790, -1067, 794, 760, -1176, -561, 1280, 478, -1065, -389, 782, 91, -320, -230, 126, 730, -133, -978, 494, 1052, -470, -1073, 760, 680, -764, -721, 895, 334, -525, -300, 84, 89, -30, -191, -369, 248, -144, -781, -94, 671, -442, -492, 638, 339, -669, 83, 648, -250, -334, 453, 264, -223, -15, 150, 216, 167, -222, -61, 456, 111, -993, -458, 1021, -35, -1123, 61, 1089, -448, -1182, 60, 609, -26, -767, -272, 437, 523, -217, -595, 977, 702, -854, -530, 1588, 487, -994, 2, 1108, 26, -321, -80, 449, -76, -643, -600, 273, 473, -726, -766, 258, 262, -825, -524, 698, 237, -597, -107, 859, 18, -99, 259, 315, 215, 160, -151, -121, 556, -52, -276, 700, 171, -951, 22, 497, -327, -1034, 197, 516, -822, -555, 185, 340, -178, -398, -77, 559, 147, -480, 44, 1179, 335, -947, 95, 1239, -23, -904, 698, 978, -313, -689, 126]
2023A26L89n81n47R0Q41%j321N15J224n93j423J063O90n58m91P90K74o52j86N44
2043A94j90R4p3j92O44p0o80Q8R61q96m73O56K86r10k44J280o09j41J9K98O5j97
2065i0j45J32M78l06m80N77N67p07o57J136K99j414J16J225l59n66q7N96j46n00
2085c31k5P3R14m56r89Q20P50j199p08J229O41j088k01O50M82o36m08N37K61j72
2105A44m90K33O25k42q78O30J038q99q55Q93N74r02j44M71K4m06r0N01J68j16
2125B79p71N34M01n74j45M67K53p39k92J157K7q37K97M29n34j36K30M96k74j37
2145A31l62M39M68r18l24J120M16j815K11J042j08j054K54P86K7o27J1M75L5l76
2165a69l07L49Q48r24m22R13N59j019l34J225j08q55M3L26J50l07J42j46K90k86
$$ y = [126, 515, -66, -613, -523, 318, 318, -1003, -488, 736, 143, -1280, -217, 473, -85, -576, 214, 488, -164, -350, 194, 4, 98, 25, -167, 477, 407, -273, -185, 776, -120, -593, 63, 349, -561, -805, 475, -134, -275, -256, 42, 107, -90, -235, -103, 375, 69, -411, 166, 733, 26, -631, 505, 804, -610, -494, 731, 372, -194, -281, 315, 169, -331, -356, -283, 631, 175, -814, 6, 756, -443, -1151, 78, 719, -369, -570, 80, 562, -74, -482, 55, 316, 144, -346, -113, 512, 270, -608, 22, 1060, 161, -694, 199, 773, -129, -273, 198, 222, -184, -274, 227, 395, 279, -492, 42, 443, -131, -276, 191, 444, -295, -587, 570, 597, -240, 57, 486, -48, -184, 46, 542, 268, 131, -231, 208, 676, -242, -566, 554, 970, -845, -634, 408, 300, -754, -500, 286, 313, -314, -303, 172, 207, -169, -476, -127, 721, -203, -625, 288, 847, -172, -506, 719, 611, -244, -201, 125, 275, -32, 110, -36, 254, -32]
2185c2m32N96K76o30k06K14K90l75oM94l37m05N82M57m32j23J93P1j2j31r8M28
2207C82Qo28j32Q59l07n73J80P79n73r04N97M71n09j62L40L58P7m26n53J402k2
2228F64j100j81J225j81r06K88R16l18n79J84L69L3o62R9K3N00n10n72P88L31
2248D11q31j13P63j4m20l34Q56l24j17J09n7L36j76l55N45K23n31k70O68O6p34
2269b99K67N18l24p55N20N44o73j91M79R2l91R5P4M46j59n65J48O08l30o89N81
2290dO11l65q95O53M44l18o36O49L59m61j15n6K29J34p19j7Q54J78j168J32J181
2311F70o35n01K70O44l96k81K98L38l03m33K28J89L46p43j6N62q5m77J50O22l78
2332F9j39j17N51l11j36L71Q3l66K41l40J35J81m02l0M88l00n56N28K39m25k97
$$ y = [-32, -464, 132, 408, -222, -428, -214, 76, -299, -305, 189, -148, -553, 29, 486, 54, -69, 124, 195, 183, 52, -46, 382, 390, -238, -370, 489, 182, -391, -211, 568, -5, -909, -312, 159, -350, -512, -172, 186, 263, -163, -716, 686, 664, -436, -617, 608, 427, -479, -191, 725, 407, -172, 12, 381, 414, -248, -149, -126, 374, -136, -708, 80, 411, -420, -533, 230, 216, -204, -538, 318, -6, -123, -14, -71, 265, 89, -266, 279, 502, -29, -299, 369, 435, -299, -32, 486, 162, -593, -73, 471, -202, -393, 86, 178, -213, -118, -44, 402, 243, -322, -174, 434, 104, -585, -4, 607, 242, -653, 0, 444, 126, -510, 139, 498, 37, -78, -134, 95, 229, -490, -507, 347, 525, -643, -511, 670, 35, -466, -196, 448, 52, -229, 69, 407, 104, -329, -101, 88, 434, -309, -325, 237, 152, -325, -175, 447, 69, -70, -187, 364, 53, -83, 288, 371, 5, 246, -94, 41, 222, -180, -210, 278, -22, -578, -50, 189, -236, -533]
2353e33O03M03n61j74M16K15k43m30L64M74m93m80M77P59q00o04O45N80r00o9
2373c51K33L11l04k74J66M45p4m24q9M59J98q37M70N42n04n98O83N23n82k37M67
2394B23J23l41j84P7OJ1J5M8K37m0p43N16L01m03k18N34nl00r9L81j18k19J68
2417c0L11r7k35q5K42K67n20j52N54J68l98l20N51M14q73j37N06K85p18j00J02
2438b65M44j12n59M49N85p90j45N05N92n59o04O08M7j78k32L40K39j87l24J30
2458a6K76k72j84J58K49j44p26N87K18l39j04K80K27n80j61O62j20k4JK7J40K13
2480C68n55K99L03m20j25K04K26q04L49L72L6m71O3L58k37k79R2L52j42k29o5
2501c05M97K7k64k45L50K94o03j11N38J31o39J59M22k07m5k15J14L33k38m77O50
$$ y = [-533, 70, 473, -88, -262, 154, 369, 126, -304, 60, 534, 41, -439, 38, 797, -3, -607, 38, 618, -282, -351, -118, 193, -111, -385, -219, 226, 152, -272, -361, 98, 296, -541, -71, 471, -33, -631, 52, 575, -7, -244, 223, 346, 5, -179, -102, -96, -85, -70, -22, 215, 175, -568, -52, 249, -154, -372, 162, 157, -143, -242, 139, 21, -198, -30, 281, 184, -51, -136, 106, 373, -147, -299, 255, 423, 25, -295, 256, 670, -203, -340, 166, 451, -267, -367, -265, 179, 67, -492, -43, 542, -248, -393, 112, 704, 145, -459, 149, 196, 18, -214, 126, 365, 178, -146, -16, 260, -12, -196, -38, 211, 67, -659, -72, 146, -193, -297, -17, 210, -370, -531, 131, 11, -13, -12, 15, 155, 368, -187, 112, 415, -5, -130, 74, 300, -504, -155, 217, 253, -218, -155, 203, -34, -313, -221, 131, -11, -240, -305, 192, 219, -45, -290, 60, 354, -249, -360, 178, 309, -330, -171, 251, 44, -1, -216, -102, 231, -7, -484, 166]
2522A66J41p0q37Q81R1m44k32N50q4l88J52K49j14l26K1K25L98k77n74M59J89
2543A76p20L10L64K6m33J33K68j70j67K52K09j33l13j5K77K51k76k29L35J85l92
2564f2q8N95k09o05K80M16l98m1M3L1J51k62j99O49k21j03l61O75P3o66J25M46
2586B69L7l06l01N99m6k81k08J39K57k93k25L26M4j22k76M27L4l51L33r4Ok1n2
2609a05M09j98l28J30O9J82j24l11J87L59l44j14K47j81k42K56K81k56q9J24P7
2630B9O6n3l2K5j9j29J5J88J27l39J52K16j47m37K29N13j66l89K45J71j82k72
2652a89M5K41q1r5j03J45M78n07j66O52l49l85M7O02l8n45J00N77j10k78j27N1
2674c5N1q7j91K69J33j93j5L26j51j75n7L74k95j29qK87k33O5j20J93O4j32J69
$$ y = [166, 307, 237, -600, 281, 372, -72, -304, 246, 162, -226, -74, 175, 61, -265, -244, -19, 379, 102, -472, -13, 176, -544, -234, 130, 156, -277, -144, 124, -46, -213, 39, 248, 115, -198, -213, 64, 315, 39, -190, 145, 330, -62, -150, 445, 236, -369, -89, 327, -71, -112, -69, -38, 113, -149, -348, 301, 80, -23, -384, 291, 364, -302, -177, 269, 306, 0, -301, 298, 252, -29, -237, -98, 159, -134, -359, -33, 11, -111, -387, 40, 74, -277, 56, -38, -32, -53, -105, 304, 106, -222, -92, -23, 159, 35, -276, -89, 270, -74, -188, 59, -122, -364, -108, 173, -83, -172, -48, 29, 95, 42, 10, 35, 16, -113, -98, 90, 217, -122, 30, 246, 99, -338, -109, 404, 238, -151, 94, 265, 83, -189, -144, 97, 16, -79, -182, -37, 441, -66, -232, 420, 71, -314, -267, 335, 297, -248, -148, 429, 319, 41, -86, -35, 16, -71, -262, 7, 140, -53, -68, 258, 107, -68, -125, 249, -46, -175, -183, 104, -129, -64, -184, 9, 73, -59, 110]
2697A10j75L1J08L2K04l24k65N31j49k61l6K04R8k33J9k5M60m25j74J53K72J16
2719B71m18L25J77j99m44K86K43l4n41M64j80J37j59l14M60J60m31J84Q0l3K6
2740F0o1L81r8l66n4O62q20J06J02k9O7r6K11K8P9k52k4K70k48P2R8m6j10n6Q7
2765c7M0Q8o1p0m1j4n8K12K16j56k26j49L06o0k82J03L86q3m82K76K06l3n16L91
2789d4J52k09L4J90j84l2k94J21L87j57l11L49L7P0j91M32j92k43P3n1K75k24
2811a2k79J38J02K6k04K16J39M0l00J95p2q3l3J1O4K47k14J47Q4j55J76k46k0
2834c3J10K8m9K7k30n3M78j75k17j81O14m20n0J39p5L13k89j34K22K55l73N7L21
2857B85m6j73k0n9K84j6k47J21n8J31n43K72K1J20q9l5n0J27k41k2P4L18q9l52
$$ y = [110, -65, -34, 74, 106, 310, -14, -279, 252, 103, -158, -194, 10, 108, -125, -106, -131, 329, -96, -270, -117, 155, 271, -147, 178, 355, 156, -288, -2, 241, 207, -334, 130, -50, 87, -72, -386, 74, 234, -197, -13, 67, 34, 60, -1, 380, 282, -84, -138, 524, -296, -190, -88, -117, -50, -146, 65, 93, 172, -80, -104, 166, -82, -10, 88, 42, -68, -124, -37, 3, 91, 30, -40, -81, -95, -153, 59, 275, 119, -107, -256, 50, -10, -292, -189, 197, 114, -368, -92, 114, 81, -435, -44, 108, -101, -67, 123, -61, -93, -387, -266, 121, -36, -347, 2, 39, 109, -82, 350, 158, -85, -12, -63, 212, -12, -291, -153, -51, -25, -229, -13, 126, 166, -134, 61, -11, -94, -127, -116, -52, 195, -19, 128, 212, 57, 233, -13, -33, 77, 105, 56, 83, -147, -200, 278, 103, -114, -295, 319, -101, -151, -12, -87, 226, -63, -197, 25, 280, -93, -36, 285, 239, 66, 46, -13, 271, 255, 8, 129, 71, 202, -341, -69, -48, 72, -17, -52, -102, 25, -216, -238, -164, 154, 65, -287]
2881b87K59P2k22M12k83K27l36J80O6o2r2p4K42j13P6o4K32l67k7L09J41k61m5
2904a7K42j48k73O5J13J01j91q6J63O9J24n5j05K31m09J7K70J11l26nP6M01m53
2927h5j55M99k08l04K07J06p8R4k30L01%j39l09L54K6j05P8J39l11P9j77J91K52
2950B25j31j32J37R3o0n64L62J76k03P5J61j25j8j2q6M03k38l19K85J6l53K56
2972e2P3M9l75J75N3K27o5m29L59L7l5o9L11k66p7n9K40L0j35M3p3Q1R0k82K38
2997H9K43n33J79K59j24l92K57R2K73l57p8J38mr3J24k7J84k33k55M16j97j9j40
3020a98J12J32k64J74L85l74K57m03J19K05m21K83l04M31k56N9K4J52l98J31K55
3041A01mo6l2j63O1k4L71k96K08j99j10J83J67l45K47RK06k92k31L87o9k27O0
$$ y = [-287, -28, 44, -178, 234, -49, 178, -158, 22, 88, 26, -66, -140, 102, -11, 65, 1, 233, -134, -161, 148, 289, 28, -17, 225, 77, -196, -131, -18, 83, -108, -194, -31, 38, 162, 107, 2, 233, -176, -159, 111, 222, -104, -109, -33, 368, -85, -240, 259, 51, -253, -46, 60, -18, 76, -154, 147, 147, 8, -301, 53, 79, -26, 52, 191, -120, -41, -218, -27, 225, 94, -38, 99, 192, 132, -432, -70, 106, -97, -22, 139, 14, -4, -16, -102, 301, 63, -256, 29, 45, -308, -52, 21, 70, -305, -130, -77, 150, 85, -344, 15, 52, 17, -52, 259, -7, -84, -143, 97, 127, -8, 35, -38, 43, 133, -149, 89, 332, -201, -22, 237, 113, -279, -22, 70, 343, -14, -92, 46, 42, -51, 73, 46, 230, -3, -258, 158, -39, -58, -198, -86, 46, -218, -44, 341, -33, 224, -179, -60, 145, -276, 7, -297, 134, -122, -63, -39, 113, -285, -154, 101, 97, 31, -1, -164, -103, -127, 244, -52, 156, -43, -153, 30, 197, -148, 99, 108, 314, 22, -209, 178, 109, -118, -58]
3064e8NJ59m6r0K0K14l30r6L29J05k40j01K62M5m21K98N1P3R6k50K2o5M8j12j00
3089a82K78J89l93j73M08j51q8L46k06r9Q6J59k18J45Q6j81J05l06L54k49J23
3110C3J02k65K62r3j07pJ23r7K5R8k14N9j04m0K93n2p3J35K16M9l20k34K40R7
3134A26l21lJ48R9R0p8J11M3l48J20J82n9k13M0K22j35l1k17K09P0Q3j49J3j30
3158a28J57j3O5l53K21M5j59J49lQ2m0j57KmJ94kk49l0N27k57j26O4P9L6Km6j52
3185i6K48l60J73LJ54k01P2k41L38l47K15L43l93J18j10n2L42l22K86j28J11j50
3207Cj64J04J30k13K06o8Q8k41J7J34J2k3l13M77j9m4j83j4K93r0k37K60K00k99
3231A6o5K8K30k46L9J37l51J60K17j06j26j65L84r5K41l35J7K51k98l6J10R4p9
$$ y = [-58, -53, 106, 60, -30, -10, 204, -126, -222, 107, 212, -28, -129, 133, 178, -243, 55, 106, 179, 275, 25, 47, -18, 30, -82, -182, 96, 285, -108, -281, 127, -24, -112, 234, 28, -71, 15, 174, -44, 101, 187, 6, 111, -195, 159, -90, 33, 135, -130, 132, 39, -68, -75, 48, -49, -24, 74, -140, -81, -185, -225, 68, 16, -57, 78, 294, 343, 23, -211, 29, 126, -195, -198, -50, 49, 139, 61, 172, 215, -133, -13, 169, 110, -103, -63, 159, 24, -7, -224, -15, 55, 138, -11, 2, -128, 29, 16, 81, -272, -51, -6, -165, -16, -19, 63, 23, -134, -132, -136, 58, 56, -193, -223, 304, 47, -79, -15, 64, 100, 102, 56, -96, 152, -208, -35, -32, 122, -79, -7, -248, 90, -257, -42, 301, -92, 26, -84, -136, 206, -116, 170, 42, 153, 3, -161, -57, 73, -140, 66, -2, 86, -155, -138, -4, 8, -15, -328, 149, 130, 86, -97, -111, 182, 92, -145, 115, 315, 16, -49, -21, 209, -37, 2, 139, -212, -52, 165, 59, -67, -232, 152, 57, 298, -37, -20, 231, -67, -103, 7, 101, 22]
3254B2Q2p8J09r3l44K20N19m01m4L3J43k29K44l03J76O8q5k6j00L86n35J77J11
3277E2L38n34J09J24j04r4L09j27km6o7J96k3j56R6Q1j73j04lK13J19k92K12j59
3301c5J63j50P3r3p1N2M4PJ15ln6J75k19M0J53j64j15J63k33L62j95K04j28j26
3325c7k4j89K2L73j43j93N7L83l98R3Q4l7r9qJ75mr7k1j94O32l06j58N1J08j35
3350f5j40L06Pr8l02L42o2J21j59n2J55o3j94J23N5N9j97J87MJ27m39J80J36J08
3374A39P1k33M8Q4q6J8OpJ47k63K71J28m23j9K22j95P6J1J8N6r2o1J12j96K52
3399H4j87J77m4j41J7K52k44j83L06M9k4j30j04J62K23m59K93L50m91R2K3N9M2
3422A22k81Q6L9J66k31J42J20j34j07n5K89Jk13p7K93j31q3j61L26j4K4n6r7J62
$$ y = [22, 104, 26, 135, 42, -302, -82, 437, 36, -8, 25, 168, -61, 183, -120, 56, 124, 39, 13, -87, 299, -236, -59, 52, 390, -144, -35, 89, -15, -109, 200, 73, 71, 25, -42, 154, 131, -25, 71, 152, -21, -125, -128, 85, 204, -88, 124, -35, 128, -22, 51, -42, -113, -61, -17, -10, 105, 102, 46, 221, 2, 42, 195, 31, -84, 79, -154, 208, 13, 217, 89, -37, -61, -250, -228, 145, 2, -191, -134, 249, -149, -56, 28, -9, -108, -116, 59, 55, -42, -63, -257, 375, 69, -89, -38, 70, -65, -205, 101, 108, 10, -292, 50, -12, 109, -50, -102, 53, -10, -204, -81, -26, 33, -164, 23, 27, 154, -285, -105, 31, 139, 210, -23, 25, 109, 23, 41, 47, 40, 187, -76, 195, 323, -100, -119, 103, -92, -16, -5, 13, 69, -23, -84, 28, -168, 84, -103, 74, 30, -111, -94, 158, -86, -269, 37, 86, 62, -68, -172, -10, 213, -246, 47, 397, -94, -2, 21, 80, 122, -159, -73, -34, 132, -99, 43, 163, 29, -78, -133, 156, 157, -56, -133, 160, 29, -54, -215, 111, 97, 121, 65, -32, 130]
3446A30k57J89q7O3k75N15k19p3j93L43k51K5J18l50K03M1j29J13J17J67j72P3
3468I1N6k95J73O8j20Q3j41k48O64n24o8L25Q8J08k84R2j79K10k33L58Jk29m25
3491d29K66K75j64n2k31M14k85J32o9O9J40l83J62L75Rk2k16J44M8j49o9j3k08
3514b56K01J27n7K76j90k62j5J66Rk13P5J84rJ58Q7m30K8K49R2K5k46Pk66K78
3538A8j04J95K84j71l57j35N06l41K2o1J34j02j44K92r9n2r3K82r2j94L3K98k07
3561h8l7J23l3Q2m9K36j33M5k01o3l5K27m0j63L4K16j4j4j73K1J83j34k06L51
3585A35m87M31L5k45K8j22K72J41o8k94J54J30k1j71R9l3OPm9K71m18J19K27j8
3609A29n40L76M2j43o2J45L9J30j43LM2K38q4j60j59J0m8P4K51l9j38k33L88l
$$ y = [130, -127, 62, -25, 38, -237, 278, 59, -14, -207, 136, -115, -90, 28, -322, -119, -78, -207, -94, 23, 190, 18, 91, 147, -148, 25, 93, -27, 56, -85, -333, 331, -193, -261, 64, 152, 260, -24, 68, -111, 99, -134, 224, 225, -4, -429, -163, 112, -52, -104, -335, 79, -206, -74, -143, -74, 66, -317, -155, 220, 229, 207, -9, 135, 183, 34, -35, -48, -256, -55, 72, 15, 291, 101, -161, -176, -10, -1, -214, -139, 45, 36, 194, 281, -149, -121, 128, 220, 245, -1, 6, -260, 18, -86, 109, 393, 222, -135, -270, 236, -105, -83, -144, -10, -112, -256, 36, -63, -115, -208, 74, -18, -212, -179, 119, -88, -125, -2, -35, 47, -2, 234, 101, 146, -55, -118, -153, 74, 34, -129, -95, 121, 107, 93, -80, -59, 124, -10, -216, 135, -352, 79, 114, -131, -103, -225, 47, 188, 120, -174, -20, 110, 89, -82, 17, -16, -10, -3, -52, 219, -199, -80, 147, 129, -411, -35, 7, -136, -198, -53, -14, 116, -27, -24, 18, 256, 172, 12, -147, -137, -185, -111, 140, 101, -37, -270, 118, 115]
3633A15j17k4K03j64k15K7J52K74k45K6mK22q9l92M34J05m19N9J16j78J70j20
3655f4P5J56j19j30K6o4M02k10k58L83k40L1J25j8j36J65r8k2j88L76k12j56J02
3678g4j21K9J05k77L36R3N6k95Q7J17K22l42kJ80J48m20M5K30o3k03K7M33k55
3701E6q6j43L24J0k19p0J54o0j04K2J08j43K12m01M06j5j98L23j54K25k76J0m1
3724f0L6Q5j12K27Q4n39K24J60J63n29K22J84k51J46j7J86k35m2K0J82j80j61
3746b07K92m5j34J12m7K40j19l25L22K9k4k01M7OK65o8j37K75l07k33K41K20p9
3769A23l14K9J28K03j68J25j12J31m53K35N2R0kj43M9L64m65J44O8n9j90j28N16
3792B23k84K0M0j2J58k69J30R5j30j17K95J93l15j73R7L17l86R4Q0k6q0j54m4
$$ y = [115, -2, -26, 177, 13, -202, -175, -23, 251, 6, 32, 28, 250, 161, -231, 203, 308, -111, -52, 64, -114, 56, -64, 11, 167, 48, -82, -56, -120, 282, 72, -186, 197, -43, -12, 113, 95, -41, 124, 26, 4, -184, 192, -20, -176, -74, -195, -166, -61, -338, -2, 91, 147, -148, -61, 56, 278, -64, -66, 114, 262, -158, -113, 117, 54, -149, -122, 311, 56, -30, -173, 151, 161, -58, -128, 26, -34, -138, -116, -8, -151, 61, -340, 66, 51, -147, 176, 22, 247, -29, -19, -60, -24, 61, -51, 176, 260, -279, -55, 105, 268, -261, -39, 145, -106, 40, 23, 209, -26, -68, -48, 134, -46, -207, 85, 40, -94, 18, -29, 211, 92, -233, 89, 118, 94, -107, -60, -54, 211, 143, 6, 281, -26, -259, -18, 202, 123, -191, -162, -34, 169, 1, 126, 14, 145, -308, -73, -21, 69, 67, -76, -27, 337, -128, 16, 84, 25, -165, -293, 223, -61, -41, -1, -13, 145, -124, 6, 101, -29, -146, 149, 342, 27, -146, -49, 268, -118, -24, 56, 30, -50, -204, -248]
3815b48K15J2K1L2O2j44q2K98M3k09j43M70m46K78k68K12p7J81l03J56J1j36j65
3838b30K66O6Q3l29R7N0j45R0K11%j81k33K05K62k77P9J67Km02K03m7K95j93M7
3862H6r8J40o8l15J55K3K1J32r1K86k08k15M48k83l7J0p3L70k90p3nJ48j81Q3
3886c5J82j32N5m32K52L63l83J89j26L37k12k59L77j20K3k32K33J2l9J3n8J91
3908A99k93Lp6L30p4k06L0J28j07j18K45J59k50j0K32O7l59J01L2j26l3q1K63
3931E6q1n4J21j01L78k57j85J86J7j97J99J14q9p9M2Q9rm47Q4L33R0k66O0J0j22
3956a08K60k41m5J62o0k04L67j42j99L35j10P9j18MJ1P8p4o0K46j31J22l92K66
3979D6N0k61J75J95k47j11o7K93O0j71J08oK2k09j23N37Jl63o0J31Q1l57M29l7
$$ y = [-248, -33, -21, 0, 32, 94, -50, -132, 166, 209, 0, -143, 327, -119, 159, -109, 103, 26, 207, -96, 60, 71, -65, -230, 36, 102, 185, -144, -47, 3, -142, -52, 159, 159, -22, -255, -50, 212, -65, 14, 181, 183, -219, -16, -63, 232, 39, 86, -12, 128, 60, -255, -100, -77, -56, 76, -15, 271, 63, -152, 296, 13, -24, -14, -87, 283, -7, -80, -85, 63, -118, -35, 147, 15, 70, -362, -110, 253, -130, 59, -67, 270, 58, -201, 176, 56, 79, -153, 80, 92, 53, 66, 8, 199, -94, -91, -167, 163, 89, -117, -87, 41, -66, -184, 61, 220, -30, -40, 192, 259, -100, 1, 33, -93, -126, -207, 56, -25, -79, 42, -59, 319, 62, -123, 63, 80, -117, 82, 196, 107, 28, 70, 159, 150, -297, -213, 120, 210, -56, 4, 14, -108, 152, -89, -134, 28, -32, -236, 131, -11, -210, 125, 15, 94, -24, -20, -9, 69, -5, -65, 181, 50, 172, -220, 46, 96, -165, 10, 205, -42, -153, -220, 73, 133, -38, 70, 64, 86, -123, -246, 291, 292, -71, -131, 0, 81, -276, 153, 116]
4003A16J16k18J36j91L8q7O5K22j33k08M2J63J4l61P1M11k24k7j02M7K82k89K60
4026A43m4j66o1k10L35J49n6j77J02J52k90P6K29O3M2j57K52j76j35j66M92l23
4048G4j37K9j14M83m45m6K71J64m57K09P5k0j17j77J21l9J65k32P7L03k17j05
4070a35M04k41j35J58K90l89J0o7J93j11Lr0J30K18l26K82qJ0j56j39K75j70l86
4093c80M15J03m9l77J45K29j15j42J53J62M6l04M42l06R3k48J67J71J53n07K36
4114H7p2j25q5J81N45l89l29l7kM1K25J69j18N5k14J27j04K1l09N6N59j34P2o3
4138A57J38j78j86J08J26r7l05J52J10l7n9k00K75M5j3j21j16R3J1K32J34l53
4160h4m2N6j7K66l25M35m4l32J1k28O48j50j79K35j33n8q1O9J23j38j98j17M48
$$ y = [116, 232, 14, 150, -41, -3, -90, -25, 197, 64, -144, -102, 61, 75, -286, -215, 196, -28, -55, -157, -110, 172, -117, 143, 99, -67, -128, -338, -3, 146, 90, -87, 15, 167, -123, -47, 182, 245, 287, 130, 382, 206, 71, -95, 397, 74, -63, -34, -148, 335, -110, -156, 115, 279, -178, 31, 106, 86, -31, -208, -87, -126, 39, -193, -116, 187, -30, -135, 269, 28, -107, 51, 341, -48, -38, -105, 88, -23, -20, -110, 20, 238, -88, 194, 186, 196, 40, -99, 176, 6, -380, 35, 138, 89, -288, -143, 86, -29, -171, -18, 144, 190, -114, 328, 22, 115, -133, 34, 205, 358, -149, 87, 15, -110, -195, -14, 531, 142, -187, -224, -226, -185, 40, 209, 91, 146, -68, 59, -45, -24, -333, -277, 282, 148, 220, 157, 295, 117, -69, 39, 165, 68, -237, -85, 25, -12, -71, -271, 4, 49, 36, -85, -201, -108, -97, 135, 269, -84, -126, -70, -87, 179, -146, 289, 245, -87, -76, -304, 344, 194, 15, 250, 117, 59, -22, 47, 170, 32, -166, -283, 165]
4183A65j49l50L44KJ6j95J98J98m5j50j03N35j84m72m7M43k74j49J84J40J49l25
4205f9m8L65l30mrM2R1K9k71L60k62q7L46J04r8k94o3J35J6Q6o3J66j32j36k1
4230a47L51k17k2J34j20j10r2L00j04l4j70o6M24r8l8K87m8j40k87QL23k61r9
4253b26K53K3r2R6rK51k99l05K85j8n3lP1J56m05J05O6L38j85k23J27K07k60K79
4277A79j55j22J67M6k02J16j14j6J0%L08l00j79N98n37j33K53K93l35R0J86k09
4299e6K5q3J61J4o8J75k79K39j07l66L17J4j92R6J22p4jl6K37j07l0m6J07J6k12
4324a34NK12m6j72N0L4J40j32j19K60J44k07k19J88J52l73j08K93L5r3m9J11O
4347b2j66j9K94l5l42K91n3J76j64K8M9K61m04K52j44j45K4O8J44k03L18l97K49
$$ y = [165, 16, -334, 10, 12, 28, -167, 31, 229, 184, 34, -69, 466, 282, -190, -237, 206, -68, -217, -33, 107, 256, -69, -117, 248, -82, -86, -95, -53, 38, 67, -204, 156, -106, -193, 153, 257, 159, -135, -198, -63, -47, 39, -24, 142, 10, -126, -147, 204, -13, -35, 99, -21, -131, -223, 77, -27, -61, -231, -297, 127, 29, -9, 278, 230, 90, -197, -189, 134, -127, -226, 27, 50, -42, 54, 45, 296, -3, -308, -23, -41, -94, -97, -26, 130, -275, -170, -104, 234, 49, -174, -47, 160, -100, 179, 24, -98, 69, 115, -87, 29, -85, -101, -91, -91, 217, -83, -262, 336, -201, -334, -81, 212, -123, -33, 153, -56, -31, -114, 47, 61, -7, 168, -111, 128, 21, -345, -28, -14, -206, -110, 12, -62, -63, -99, 138, 31, 1, -45, 62, 78, -134, -129, 83, 37, -135, -85, -51, 89, -43, -162, 98, 242, 35, -184, 4, 156, -217, -325, -32, 3, -90, -139, -28, -22, -188, -207, 87, 52, -290, 1, -52, 124, -40, -12, 37, 298, -106, 146, 2, -143, -119, -51, 93, -110, 208, -189, 60]
4370F0r0p2J0n6J9k92K16L08J7k68j39M90J05n71K43K2J23j54k75M45J4k93N2
4393h6J06q2m0K0J21O0l69K39j47J97j02J22l6K97k47m89M48K21n38K17O8J38
4415A18l26J96N9K77m80q1P57m57P7q2jjj26J3J64j1j98J57L31n58J68j28K16
4438H4p8r6LJ73Q5m29O2M17l82q2K59J87k8k02N7n4j10OL31j15Pk55J22J75p2
4463F5k82J20J93k02J17m0K76j55k73L71m4p5j03K4K87q5m17J58J74k0j49j57
4485b17K96K7n5j02K88k1m24K29J17l72J00O1L10l75j33L77r2p6k09L41o2O2k07
4508a37J50K9l4o2J55k2j01l40M49n1J04k9j81L33n15J38L1J05J3k31R3K59k81
4531a25PO5j58J95k47K83J24M5k90n9K25j44j30J39K02J91k61M5L11k05j64j41
$$ y = [60, -30, -102, -92, -148, -129, -421, -205, 103, 120, -148, -287, 203, 308, -263, -20, 2, 125, -29, -304, 141, 155, -138, -86, 20, -62, -102, -82, 39, 99, -270, -31, -178, 19, -83, 39, 3, 300, 53, -436, 12, 233, -305, -88, -20, 118, -208, -12, 47, 324, -156, -237, 520, 63, 140, 58, 57, 56, -70, -57, 107, 96, -102, 55, 386, -172, -4, -132, 84, 6, -90, -87, 86, 171, -258, -196, 221, -161, -243, 16, 203, 175, -27, 30, -24, -134, -128, 203, 88, 95, -160, -38, 137, 65, -217, -97, 96, -106, 11, -29, 247, 92, -181, 190, 146, 71, -32, -8, 279, 194, -223, -65, 109, 89, -60, -217, 79, 106, 51, -51, 237, 216, -208, 21, 138, -234, -134, -73, 237, -138, -271, 106, 14, -62, -271, 70, 8, 70, -137, 13, 42, 8, -54, 101, 79, -22, -362, 87, 36, 140, 111, -70, 263, -252, -114, -83, 22, 35, -196, -103, 156, -125, -118, -53, -211, -16, -263, 20, 144, 189, -101, -160, 65, -79, -209, -70, 132, 323, 62, 107, 418, 213, 49, -92]
4553i2L62j83m02O0M49k1j83l5J70k07NO2J60j60k54L94m9m9L1Q9L5l57m5K48
4577B8j33Q9j59J45P9k54p2L48K22l25k88J85J60l8k80K59M35o51J25K37j06J16
4599A22k39p4M66j56l02K92r3k46L40j04L46m47J6L4K72j17k00j29L13J08l94
4620a92kK39j03j40L24j65R8M0K8L7k49q7L53p3j44j10J17J92m00J35J60j0L0
4643G8k18j02L02j51m0L30k10J21n6J93j06k99j62N46j88k69L33J76j01l65M6
4664a42L32j49k63L0K20J18j87P9J64k39J80j01n2O9j8n1j39J85o6l01J76J79
4686B4p9k14M60j20j0j02j39R0J38p0J39J22l62kJ79j12j83K86K01qm03j57L66
4709D4O2j39k5LK47m08L72m4k86J47r1K40k80q7j31M47K64n31M9L52j92k55J13
$$ y = [-92, 270, 87, -315, -255, 194, 173, -10, -45, 125, -82, -77, -15, 145, -15, -269, 125, 76, 27, 58, 147, 182, -175, -220, 28, -105, -16, -175, -30, 49, -205, -277, 71, 293, -32, -320, -135, 25, -13, -293, -34, 401, -250, -125, 112, 6, 122, -117, -191, 275, 119, -183, 109, 16, -230, 110, 6, 352, -95, -79, -45, 227, 110, -90, -219, 94, 202, -192, -194, 45, -58, -198, 126, -39, 59, 99, 127, 164, -85, -172, 181, 108, -36, -146, -29, 163, -237, -102, 58, 48, 78, -140, -242, 60, -91, -131, 199, -11, 110, 54, 247, 141, -158, -320, 226, 38, -231, 102, 278, 177, -188, -142, 190, 41, -222, -192, 28, 146, -41, 38, 202, -37, 143, 42, -10, 59, 41, -10, -149, 36, -30, -331, -155, 24, -55, -269, 191, 71, 61, -41, -180, -90, 48, -22, 117, 239, -123, -125, 54, -58, -241, 45, 246, 238, -165, -322, 44, 106, -33, -58, -55, 192, -216, 156, 112, -174, -27, -118, 122, -158, -245, -376, 71, 335, -196, -147, 205, 13, -242, -129]
4732a29K88k00k39K70L00j90l36K99p7n6j44q9L88n3k73L2K40j85j15K00L35j62
4754A04l96K24J66kk73o5L79Oj71J76Nm0p7n3J48j3k40J67j51l1J19n0L28n0n01
4779b91j72K72K68j80M6L35j76j77J83ko2k52M4M09M5n20L88j06L4k07k5L65K1
4802B40l42l6L39j78m67M11M50m49o5o8R9K32k01lL77j67l65J22K1K52k20N9J59
4825B00j44k14m8M71j42l40K24J22k43P8K02k82P2j69J95K72j07m04J87K25m03
4846b48K11P9J23j75k35L52k87K27N5J59p6k36j58K80L33j20k63K77j35o01K51
4867a87L16R1m33J21K47j2k14j76k6M03j76k98K75J75J16l46rM33l89j5K44k30
4889i0J03j98J86K25j45j90Q5M88k86m23J10M00k16j17O8K74l58j08K95M7k60
$$ y = [-129, 159, -41, -280, -10, 290, 100, -236, 63, -14, -70, -214, -303, 85, 32, -241, -209, 31, -154, -269, -69, 266, 104, -292, -68, 98, 96, -177, -242, 137, 143, -28, 148, 153, 113, 36, -17, 131, 118, -122, 45, -106, -137, -18, -68, 260, 210, -291, -463, -191, 77, -103, -57, 278, 102, -75, 108, 106, 44, -208, -164, 245, 290, -230, 158, 52, 86, -121, -146, 219, 240, -102, -138, 201, 23, -444, -33, 417, -32, -97, -165, -66, 166, -35, -38, 339, 172, -193, -71, -50, 202, -18, 41, 200, 56, -158, -206, 265, 123, -217, 7, 129, -114, -36, 166, -116, -44, -213, -18, 254, 147, -257, -70, 155, -248, -37, 42, 165, -10, -245, 107, -180, 47, 102, 261, 185, -51, -209, 71, 404, 284, 21, 298, 163, -438, -187, 129, 220, -213, -92, 155, 143, -71, -247, -273, 130, -46, -344, -69, 106, 222, -124, -133, 300, -89, -104, 140, -90, 13, -185, 1, 226, 81, -109, -24, 464, 178, -245, -135, 265, 49, -68, 0, 274, -84, -192, 103, 150, -110]
4910a10J00p1J49k83j24K02PL73m23K29K85n50n6J96k3J59j86m4L32l24j27N80
4932B91l33J89k49o0P9l09J98K0K40k01m3L94j58j72O7k7K45o8M6J6Q0m63L56
4955A38j64K21k25k86O24k25O4l45L70n2k60m9K00J35j78l23L16K10Ml60J33L18
4977B66k11j93J20L19l07j41M94L1l95Q5J47j36k11rPL08j06j28J35Q3k61K61
4999A58j50J05j36q3L86l8l38j13L74o2j02J19K4K6j92j72M97l19k9l8K24k47
5021a06M5l9M04k86l25J32J13J22l31J76J12k8m2MJ75R3k92O1J64j77K76k74K06
5044A83j72N0J72k85J55l6l8k20L75l62p1N02l40l6N8o1M82m05Qm6J58j80j6J25
5068@K49l02M8K57J48m31j41P4M4m6R2J03L6j16j80M39k08k49J37K08m04j5j12
$$ y = [-110, -10, -81, 68, -215, -339, -137, -130, 243, -180, 49, 334, -216, -272, -76, -99, 60, -126, -170, 162, -162, -289, 291, -42, 147, -102, -162, -83, -392, -194, -174, 66, -135, -178, 216, 58, -114, -47, -74, 171, 103, 149, 165, 245, -218, 138, -26, 195, -30, -316, 308, 83, 147, -198, 172, 120, -140, -189, 11, 146, -32, -355, -39, 171, 175, -185, -52, 266, 55, -138, -18, 301, -6, -147, 347, 378, -17, 68, 215, 79, -132, -141, -134, 174, 68, -60, 75, 158, -103, 158, 8, 113, -23, -106, 280, 242, -96, -209, 165, 103, 1, 120, 144, 170, -22, -194, 303, -16, -45, -83, 141, -106, -61, -100, 304, 18, -307, -175, -62, 60, -271, -95, 17, -11, -53, -49, 126, 219, -73, -12, 152, -25, 251, -23, 183, 11, 61, 233, -52, 103, 67, 29, -191, 184, -178, -249, 253, -87, -123, -65, -126, 356, -49, -41, -87, 71, -109, -125, 0, 249, -53, -5, 252, 400, -31, -172, -98, -54, -100, -8, 95, 131, 15, -165, 274, 66, -183, -46, 162, -242, -257, -369]
5091c69M02J93j99o0J81p2k49m8L57J16n02J66K55k05j34n8M43l3m37M06K78j70
5113B61k61j64K42j2l15J81J20J50l96J60L1j27J23k20Q9n8L69l35Q8k0k52K41
5135a05K03j35j86M1L43K9k63J63J29k14n8K71J8o2k46k45L24J16k70K2m0K58
5157I3l62J74m8L30l23L31K03l85j48J93R8k27NO6Q7K6K6j87J7K80k14j96J92
5180C1j37j82L17N2n0j8p8L5J56l78J77J73r4j17J43l7M83o94K45L2J43m94K16
5203g6L28Qj89n9J24q3j27j16L58k9k68O1M43m3m07j38M59l04n1K05P2k20J75
5226A23j05J59p6L7k57L81j34j04K0J17n7k25k27M13j17QJ29j4j60j60L50N8k16
5249e7k05K94ok28K27j13K09q0k80L23Q0j66R8qJ24k33j08J47l0J4r2k21M04K7
$$ y = [-369, 33, 226, 27, -33, 148, 76, -173, -221, 136, 252, -250, -84, 171, -34, -168, -226, 217, 184, -253, 153, 431, 261, 0, -164, 78, 66, -249, -68, 52, 202, -194, -34, -3, -130, -7, -227, -138, -196, 173, -162, -74, -94, -346, -105, 98, -37, -223, -182, 161, 190, -73, 90, 219, 5, -53, 218, 236, 174, -72, -317, 7, 123, -147, -125, -165, 93, -269, -95, -143, 187, -136, 195, 398, 13, -135, 58, 156, -71, -66, 0, 87, 113, 139, -48, -31, 249, 35, -161, 31, -106, -288, 29, 81, 31, 13, -65, -30, 126, -252, -75, 98, 4, -113, 30, -7, 476, -218, 27, 59, 202, -292, -76, 252, 260, 71, 12, 136, 53, -74, -190, 168, 139, -129, -68, 375, 332, -75, -213, 246, -58, -109, 96, 168, -52, 123, 18, 177, 101, 138, -119, 262, 128, 24, 44, 161, 104, -121, -348, 65, -52, -44, 85, 71, -89, -249, 101, 159, -57, -262, 32, 26, -202, 25, -88, 121, 41, -239, 84, 164, -2, 96, 88, 212, -21, -129, 18, -12, 2, -90, -311, 93, 120]
5273A20l81K26J77k42J84K2j31Q8k31L20P9l14P9J85j9m9k69J31K4J00j41J95
5295A53k1l35P6J59P8k57o9J29L52m11oR1N6k6j58K33M5o9n2K13J01l05L1P9n6
5320C1k6j25P0M37l82k03J05L83k92J77j60k0J43m90N12q5p0p3l8L03r9O8m8J51
5344B69l18k55N26j18j55J57J8J18m69J2L95n9k48j61L08O5K8o0J41j57m2k69
5366b74M28J01m75Q0J26K10l59m9K54j1m9j7N2n1j0k64L90j36m5j7K64M7j77l58
5390c40L95K20l48O5J22L0p8m42M73lj37l0j10K67l60k28M52J24j50k03K70p6
5412h7j3j17K41J53k30K1JL61k95j55K07K5p5k91O04m52N5Q9J40j76j32j61K92
5435EJ20m59K46K45j25k48K30L33k96k42J41RJ64j21M9J32O8n55K12N7M31m34
$$ y = [120, -261, -35, 142, -100, 84, 106, -25, 63, -168, 152, 231, -83, -4, 181, 162, 113, -156, -25, -1, 99, -42, 153, 132, -203, -127, 32, 110, -147, -216, -87, 265, -146, -152, -61, -5, -31, -189, 44, 89, 20, -32, 181, 282, -23, 8, 87, 31, 5, -120, -50, 387, 5, -198, -93, 290, -2, 175, 15, -5, 138, -352, 160, 75, 5, -68, -106, 197, 98, 166, 118, 269, -49, -304, 222, 104, -51, 106, 124, 242, -227, -215, 180, 121, -127, -288, 20, 85, 113, 53, 194, 37, -5, -274, 154, 255, -220, -140, -14, 196, -163, -212, 42, 31, -18, -35, 17, -34, -44, -308, 82, -54, -99, -116, 148, 195, 18, -340, 55, 275, -73, -8, 114, 144, 66, -376, 97, 94, -43, -73, -183, 84, -276, -504, -52, 72, -78, -281, -11, -87, -100, -217, 24, 177, -53, -32, -31, 330, 35, -120, 87, 112, 37, -254, 350, -102, -47, 42, 182, 6, -126, -287, 5, 125, -334, -88, 157, 32, -216, 14, 347, 51, -191, -50, -41, 123, 2, 51, 183, 251, -304, -92, -35, 396, -38]
5457c8o8K79k46N6K7K9J17l15o8M02j04j44K57o3l6k57Q3O2L1q0K54n9J88m73
5481a66L10l20K03j93L7N6KQ0j77K15j15k98M58L30k39m47K22K41k78k19L84K13
5503B99p8l98J15L19j41j40o9K78j67j34j1L24j43l19K24K93k43k28K73q5K1o8
5525g8n2K49j15j14K51J92m60J83q3KL4n0j50O2N0K9J7M28j78m36K58M00l35k73
5549a69L22J52l18k53L31j02J39j14P1n1nl6N5m5J16k72PK91j69r2J45N06m13
5572I6k65L50J75j48l08R1K17l44J88r7J07J14l92L69Oj85j82J78J05j59j51k14
5594d49N19k01J31m8J21k6j75K31L1j60j95J82K72j28m57L55J07m0j96K59K3J73
5616C29k40k0J17l19q0J35J77l69J00lK32l36K60m4K61k94j6J88J84j36k47L46
$$ y = [-38, -106, 173, -73, -17, 10, 39, 156, -159, -227, 175, 71, -73, 184, 121, 85, -172, -89, -27, 4, -76, 178, 119, 307, -166, 144, -176, 27, -166, -129, -73, -71, 9, -168, 47, -68, -366, 92, 422, 183, -264, -42, 199, -79, -298, 86, 299, 221, -177, -62, 257, 116, -24, -93, 185, 18, -116, -127, 197, 54, -265, -41, 252, 9, -219, 54, -31, -10, -78, -130, 119, 4, -110, 141, 333, -127, 56, -27, -25, 9, -41, -191, -129, -79, -50, -33, 395, 217, -219, 39, 439, 104, -169, 153, 305, -13, -266, 65, -37, 102, -12, 59, 8, 3, -33, 22, -23, 93, -179, -172, 119, -50, -142, 3, 509, 96, -169, 181, 356, 208, -100, -9, 208, -136, 52, -45, 62, 176, -216, 153, 159, -26, -208, -30, 75, -84, -235, -449, 70, -131, 0, -48, 73, 47, -128, 103, 134, -26, -221, -39, 233, 105, -352, 3, 110, 70, -126, 133, 156, 329, 89, 69, 186, -133, -213, -78, 99, -270, -170, -173, 59, -277, -17, -61, 200, -94, -110, 78, 262, 126, -121, 225]
5638B25j35l93O1K63K15m27oM10L4l28j04M03n8k73j78L07M1j90p2j12O67n08
5660a58j15K99Q4l08L4K26Q8n3m7j70M49l37M7J07J98l03k31K56p8m6j04K41n
5683G4m3k39J31M69l43l7j09J92j83J9M31j77j18l10K72K75n23J9J19J25mj49
5705a09L02j35k43P3L28j30j91j5J94Q3l47J11R7N31o51J63j0J66l57j01M58M9
5727B66n16J10K58P7l64r8K16K83k42o5M00l19l32J58J44K20k15N3r5K22j79q9
5749a07K23q3k58K43M1J47n05R4J34L9n6Q6J30p9l33J93J3K25o7j9K49j67j08
5772C5k75L35J89k54l5J95k70k85J92L35l1k02k47J98J43j35K61m7k7j0l65K73
5794b7J53j84K54J30O8n13r2L16K01m33k64N27j47l3o9J60J03k87J96J49j00k15
$$ y = [225, 90, -303, -242, 21, 236, -191, -197, 213, 247, -81, -185, 218, 160, -113, -291, 16, 57, -133, -205, -317, 350, -158, -273, 26, 110, -198, -164, 62, 150, 97, 50, -120, 329, -8, 39, 146, 344, 41, -190, 66, -12, -58, -162, 79, 74, 31, -208, -77, 392, 49, 12, -97, 95, -88, -69, 362, 185, 67, -243, 29, 304, -219, -200, -81, 44, 40, -109, 193, 58, -185, -112, 216, 86, -105, -120, 74, 157, -190, -79, 18, 549, -102, 61, 51, 217, -140, -241, 217, 266, -250, -140, 118, 195, -169, -267, -51, 232, -10, -75, 325, 6, -326, -168, -24, 196, -19, 34, -61, 161, -18, -107, 116, 33, -225, 18, 59, 206, -299, -205, -71, -32, -88, -2, 128, 49, -284, -91, -78, 147, 80, 61, 310, 143, 35, -240, 95, 284, 30, -5, 190, -80, -365, -173, 162, 131, -71, -318, -120, 23, -112, 149, 102, 75, 65, -300, -27, 126, -58, 196, 326, 394, -119, -211, 105, 306, -127, -391, 136, -11, -44, -113, 47, 150, -137, 59, 208, 108, -107]
5816a07J29P2j63kj85L82k17k67J24L07r8m9P2L1m5j2l75N12j10j16QJ83k9m3
5840Bj25K65j42k25J83L11k97P3l27L84q1k09K1M63j35l58q5K62J36j07k45N25
5862B89m4l97J72J56p6j63j05K94m2k72K53r0j53o1J34P6N8r6P7K01ln03K40L40
5886B85jm50J38K50r1j99N7J50j90L0j01K94r5k69jK72k9l74J96K51j39oj22J24
5910b0j42J65j62M80l71j64J3K86J66q7l25KM38l62J61L7p9O1K1O0k46L8K3R9
5934I2l57M2K87K09k97m0K30q0k78J96J15Q5K59q04L37j47n1j8L79R5k20J52n2
5957A34J44j61k52J12J43k57Q4j23J54R9k29q8L06m6n3pJ75k52K0N6L0j7k79L38
5981C1Qj52N3L38j41j98q8L16J64m20k22M13J76k74m02M22J16n5j9Q7n1j6k71
$$ y = [-107, 22, 94, -69, -71, -256, 126, -91, -358, -234, 73, -25, -74, -2, 29, -16, -28, -403, 109, -1, -117, -109, 74, 45, 2, -123, 142, 0, -225, -42, 269, -28, 45, -282, 102, 21, -188, -167, 296, 161, -197, -282, -20, 116, 9, -236, 289, 245, -152, 20, 176, 100, -63, -168, 126, 84, -188, 65, -25, -178, -239, -105, -29, 29, -67, 10, 211, 208, -295, -55, 285, 284, -166, -28, 222, 131, -68, -11, 139, -51, -21, -122, 172, 77, -192, -193, 79, 50, -324, -128, 123, -16, -22, -144, -20, -162, 3, -159, 321, -50, -214, -201, 85, 251, 164, -161, -159, 279, -83, 78, 115, 36, 97, 118, 178, -68, -30, -7, 92, -265, -223, 64, 273, -24, -64, 166, 86, -192, 4, 119, 204, 463, -341, -4, -151, -202, -220, 159, 254, 34, 186, 134, 278, 117, -135, -23, 120, -137, -53, -176, -22, 77, -152, -240, 66, 20, -33, -40, 135, -117, -97, -41, -11, -28, -307, 31, 39, -113, -60, 278, 137, -61, -149, 167, 331, -89, -311, 102, 278, 4, -398, 24, 140, 85, 66, 153, 102, 86, -185]
6004a85O1M76m13j06J37M4m39M29j52K47j95n5j12O18l30O9pj53K52n14M69k80
6026a39J11j64K40K06k05j60K68j53k72J35K60Q8m07K81n3J86l78k05L07K4J04
6047G4j69L13k36O8j4L13k62k9j49J22O7j22k01N5J53k00J3K54j90K03n4l2J2
6070a1m3r7J23M1o8j72J02J80l53o1N28r9j81q9L70R0l35K1J70Q7m96J86K47k67
6094a27J46q6J7M2l7l62N12m3k22K63O9m4k89K17J38o0j37J25r0J18m78j8J31
6117b15L19l04q8M5M07k92o4L63kl86J52L95o42J44J7J73k5j26n7L97k51k34R4
6140a80J13J84m68L88K95l59k00l2K55M5r5p0j5M00l71j18J90O9j49j71L46K60
6162C17m14N2J94j01k83o1L82P2k46J9J87K6l21K09j3N3k47KN7J08j80J38J77
$$ y = [-185, -124, 352, -61, -167, -30, 14, -425, 4, -148, 99, -96, -151, -263, 355, 25, 94, 87, -66, 186, -328, 141, -139, -28, -192, 48, 254, 49, -111, 157, 4, -268, -133, 127, 215, -192, 89, 36, 222, -156, -361, -54, -30, 74, -95, 218, -18, 50, 36, 349, 87, 58, -91, 31, 98, -24, -225, -170, -17, -217, -204, 50, -140, 63, 9, -23, -11, -54, -151, -28, 13, -55, -227, -125, 55, -298, -359, 169, 70, -111, -200, 170, 260, -75, -54, 116, 203, -293, -107, 140, -127, 19, -67, -50, -8, -45, -407, 105, 62, -160, 103, 172, 128, -161, 56, 194, 134, -3, 122, 32, 150, -328, -346, -215, 104, -200, -288, -243, 164, -128, -192, 171, 169, -217, -65, 330, -312, -168, -151, 22, -3, -129, -186, 211, -40, -274, -180, -67, 117, -351, 37, 332, -27, -227, -259, -4, 41, -54, -124, -139, 261, -110, -228, -38, 31, -118, -289, 57, 317, -97, -45, 149, 48, -235, -296, 86, 158, -88, -69, 118, 144, -177, 32, 19, 72, -175, -173, -116, -8, -188, -50, 127]
6185A27j16j53j2K83l7j18r4J88k69K2o7K89r2R7j67K32N0j65n4P4K4k56K72j30
6209g2L50l03n3K57j21m5N7M1K35m73M7J47o3q0J10L6M4j56j28J52Q7j15j22L96
6233B28l7l87m4K28r8l2O7J81K95n07J43Q2q1o6k45K32J22n1m2n0K86m19p5L16
6257D6%j02p7N3N6j16J76J64k09k97L58K9j70k02N4J96Q5j88J59J47j31j10L19
6280B40k77J50j35j42K50n6k10j2L43j99m5K7J41l14J87O8J38k11R3M4J74j33
6302A21l58L61o0M0l52L71k17Q8k0j69K31n2j46l6L92j43j92J02J84o7k67K83
6324I4r4J42Mk20K95l03o0L30P7m05L28j79J19j90l9J32m7q1j58Q4J97j18j62
6347b54K72J02l71J29J36K06j81k42J46J77k31n8K07m6K28k93K6Q8j21r3K76m
$$ y = [127, 11, -142, -154, 129, 92, -26, -120, 68, -201, -179, -246, 43, -49, 48, -119, 113, 163, -2, -56, 18, 42, -214, 58, -72, 278, -25, -78, 179, 58, 13, 70, 111, 346, -127, -80, 67, 4, -76, 34, 70, 114, -42, -170, -18, 69, -46, -168, 228, 191, -196, -240, -12, -110, -142, -75, 106, 401, -106, 37, 119, 38, -28, -273, -41, 81, 30, -12, -62, 224, -195, -270, 46, 46, -56, -133, -80, -24, -140, 36, 200, -9, -306, 52, 81, -89, -291, -237, -41, 44, -144, 15, 162, 31, -79, 240, -37, 113, -22, -164, 86, 30, -180, -192, 151, -48, -93, -66, 75, -239, -52, 16, 154, -57, 36, 80, 254, 121, -237, 124, 64, 104, -248, 123, -94, -6, -26, -195, 36, -16, -162, -198, 194, 51, -141, -39, 145, 78, -189, 94, 0, 142, 146, -74, 221, -82, -142, 188, 265, -140, 188, 9, 128, -62, -101, 31, -16, -97, -255, -171, 26, -92, -254, 18, 120, -251, -122, 14, 220, 39, -203, -57, 120, -111, -169, 38, -8, 220, -73, -47, 41, -80, -173, 103, 99]
6369I9K5l29J64J47k64J22j02L30m73K91kJ76k63q0J38K89m11J57L21l62p5Q3
6391a9q4Q0K97k91j63K06j76o5K84J13k46j61K34J52j69l6j52K55n6n9J71l2l62
6414b79J15K31j6J5j74O8j46L77l97K49P5q4k74L66J11l15l4L25l10kk9O9J28
6437F9k55J31P5K01k05m4L91m9m08L10j37L6j31J46j76M45l48l40K75K90l03p2
6459i9J92J86l33j16J89n6J38k49J50j52L6N8K9j2M0J48n3j31j55J53J67j22j30
6482a22P0M0N5j89O1J3J22k00M2J30N6m3M3j53J99k39n2Q5J04j95J72J50j39l6
6506b6j30M49k48p5l68K22J28J05ml4j8J83k77K15Q7k11j55J76j74P3M0J65P5
6529A98l27J08L8m0k09N14l05J59k31J70j3k15k21N70k46J24k48J40K77k73N3
$$ y = [99, 124, -205, -41, 106, -158, -36, -138, 192, -281, 10, 8, 184, -79, -159, -21, 268, -143, 14, 335, -27, -102, -19, -103, -23, 274, -17, -180, 26, -150, -215, 69, 182, -64, -225, 9, 161, -8, -44, -196, 59, 3, -56, 115, 83, -279, -164, 67, 51, 66, -108, -40, -186, 191, -206, 43, 118, 34, -240, 126, 237, -78, -112, 213, -97, -99, -128, -59, 69, -186, -55, 20, 221, 16, -28, 363, 314, -94, 216, 79, 115, -16, 130, -46, 399, 51, -289, -14, 276, -27, -99, 93, 279, -54, -170, 19, -37, 101, -148, 2, -150, -114, -56, -27, -39, 1, 149, 96, -35, -190, -37, 130, 8, -122, -52, -12, 43, -146, -85, -72, 50, -150, -108, 22, 78, 35, 78, -75, 124, -115, -167, -82, 22, -173, -1, 149, 10, -26, -156, 293, 45, -30, -398, -176, -48, 57, 53, 19, 1, 184, -93, 122, 209, -2, -157, 19, -155, -82, -42, 123, 198, -129, -21, 17, -23, -232, 282, -23, 136, -95, 75, 62, -153, -374, 196, -50, 74, -174, -34, 243, -30, 23]
6550B3n6K52k89j99%L06Ml68K53J28K02o11K54O8O2j23j06K44N1n7k65J28J05
6573Fl3l8l0L8m4p2L75pk69P8J25j73M1o1J21Q1J0j65qR5nj79K85o3j64J48j11
6600a9K49l45j54K24K32k94PL22l1n7j46L58k52k74L75j66J69m96L86m7j43J18
6622A6Q0j16Q1q1J73j55K7m06K86J18j76K90k72K46j42J00k14K72j36j42P7M5
6644b9J89k44J74J39j41j36N1J02l6k77K07P1Q8m35O5L47m3j64j1J28o5k22M52
6667B10q8k37J76k25J52j00O3L5K51k07M7l9J4L8K1N5Lk53pK25k9l00J65K5J29
6692A24J9l84J16K81K18m52J84J15k44J07J41k57Jq2K77q1Rj12J6j17J55L3j97
6715a30J44k35K28P7K2k36J36n3j0N3R5J04j49j74K87R9K4m00j98N08j07k42q4
$$ y = [23, -33, 219, -70, -269, -269, 37, 41, -327, -74, 54, 256, -355, -101, -33, 29, -94, -200, 44, 95, 38, -227, -99, 6, -27, -65, -95, -57, -101, -173, 202, 195, -74, 4, 129, -44, -3, -64, 57, 138, 148, -17, -25, 70, 65, -114, 171, 108, -56, 92, -19, 230, -115, -269, -45, 187, -107, -100, 222, 191, 134, -12, 346, 94, -180, 195, 29, 198, -298, 88, 41, -102, 16, 96, -20, 61, -20, 153, -2, 25, -381, -95, 23, -153, 137, -135, 111, -31, 69, -145, 127, -9, -151, -74, -29, 160, -84, 90, 229, 88, -48, 3, 105, 69, -208, -1, 70, 158, -277, -212, 135, 92, -72, -83, 45, -20, -242, 210, 122, -115, 61, -164, -12, -112, -49, -14, 237, 30, 77, 38, 52, 90, 111, 166, 169, -84, -91, 134, 105, -195, -30, -5, 124, 143, -241, -125, 156, 374, -78, 106, 221, -23, 84, 225, -32, -31, -113, 164, 83, 92, -20, -4, -121, 34, 67, -130, 14, -221, 7, 84, 106, -130, 6, -47, -57, -4, 91, 195, 46, -128, 159, 258, 282, -118, -316, 192, 85, -157, -241]
6738b41L08m0J43k34J24K19k24L7o9j10p4m5K17J73k32j60M73k19o6j1p3P6p0
6761i8K6K22K9l39J03J71J8k53P2K27k15L0n7l5K30j21J9L2J49j94k17N7K94j54
6785dL3o7k17L39j88O6K6J79m8q6J38m4l91O0L92l14J36r9K2O3J80j40j75j7K79
6810A23J09j13k09K07j17K46k66P3K04r2j79J4m1jQq4N8j5K60j39m5J9o1m5J96
6835A10J48j84j73K94j01o6L4Q6rk24J48R5j09k44O7O0P7m2O6r4P2j08J9P3K56
6860B51k56J71k24k18K78k3K28j13j50j01L79l01K7j30L23J19k59j7K04m5k18
6881g5L4M0ko6m9J77j72m5N4J41J27k48j2M0j08k02L27J37j17k24K76N3K2J42
6905B50k42p8J49q4q9J60o1k39K13J03J62m99K90O9k16Q3P5Q6l26R7Qm3J0r1J24
$$ y = [-241, 67, 27, 170, -64, 60, 279, 55, 92, 23, -87, -161, -206, 11, 184, -48, -208, 265, 46, -20, -31, -104, -28, -98, -72, 150, 179, -160, -57, 114, 132, -121, -49, 178, -37, -7, -64, -99, 131, 10, 29, 61, 210, 16, -201, -144, 150, -4, 29, -38, -255, 84, -104, -38, -12, 167, 119, 33, 171, 127, -264, -204, 188, -126, 10, -89, -67, -4, 176, 36, -139, -156, 123, 232, 119, -90, 117, 0, 246, -20, 53, 257, 165, -14, 0, -41, -42, -34, -118, -60, -75, 185, 46, 1, 20, -41, -86, 110, 258, 74, -99, 195, 94, 28, 62, 148, 139, -85, 63, 158, 49, -195, -128, -68, 9, -33, 33, -61, 11, -97, -78, -5, 251, -5, 166, -58, -276, 2, -21, 207, 94, -56, -157, 222, -79, -52, -182, 141, 260, 1, -16, 188, 143, -75, -41, -1, -3, -69, -118, 59, -113, -158, -104, 37, 164, -84, -96, -56, -164, -366, -39, 98, -19, -243, 33, 86, 108, 250, 8, -70, 79, -5, -94, 66, 5, -234, -21, 82, 244, -255, 35, 104, -112, -29, 46, 132, -194, -97, -89, -132, -122, -213, -89]
6930h9M9K66q4j62N5r8L1J24j46J07j97L2J89p3k90J92P2L6k61J49kQ2k8J73j51
6955b4K48j48j78J39j07J0K99n0k3j66L0n8J76k45J29K91l06k96L09J04j31LJ7
6978B3j4o3m2O0J70J33l58q1J22Q7k12L11m7o4N0k15J34j9j9n5M9J15k21r5L87
7003A36k98J13j49J81q9j1J23l6p0J5K46k03j18J81J67q3j01q7n9L28j26l2O1
7026H9j10L25n62M72k6l33J38Q6O5k19k64L38l8K08k40K67j89N0J41j50J33j35
7048D6k81L47K19l00j05K4J62%j21o2P1j69J47N9k84K0J97P0j85J19l18M20j29
7071e3L5P7j98J60j90M46k57M4M5lk15M10k97j30L03j09j51K53j66n0N3j23J31
7094A5j05Q9k31M01M2k59j18K66Q1k27K1Q5J93l34j21M9K01R1k07J82L5J12k62
$$ y = [-89, -40, 226, 142, -20, 35, -63, -32, 92, -54, 53, -144, -112, 77, 4, -286, -94, -22, 14, -247, -98, -100, -18, -46, 127, -24, 224, 76, -102, 37, -70, -60, 239, 189, 166, 0, 30, -28, 148, -97, 32, 323, 17, -279, 30, 134, 3, 6, 23, 9, -54, -96, -36, 134, 267, -91, -172, -50, 37, -175, 136, 89, 25, 75, -140, -6, -25, -44, -99, -50, 65, -156, -251, 136, -162, -49, -198, -17, -106, -117, 6, -30, -100, -85, 161, -42, -160, 21, 188, 105, 4, -83, -142, 186, 60, 28, 89, -21, 304, -258, 214, 188, -145, -7, 79, 144, -75, -339, -1, -39, 169, -71, 196, 7, 57, 198, 48, 181, 46, -235, 112, 331, 31, -74, -50, 112, 112, -9, -71, 0, -169, -22, 37, -247, -227, -30, 40, -145, -26, -344, 76, -53, -18, 59, -139, 21, -169, 277, 20, 64, 109, 106, -109, 301, 4, -126, 177, 68, -83, 170, 4, -46, 7, -116, 15, -90, -1, -232, 169, 211, -48, -166, 100, 181, -46, -25, 60, 253, -81, -202, -153, 48, 139, -68, 114, 149, 261, -1]
7117aj10J47L7n2n1j1q4j21J34R3j76L7L55p5k89L3J96q7K4L1K52k68k25J7L42
7142A48j62Q0j96K28K0j56K06P7Ol33L6J34j10J04l8q3K7J09j19k8q8n9J98K45
7166B46l26N8J05j24J89k88KJ29M7l05J19L05j12n6Q3K49k27j41K05l44J71J4
7188aj26kJ29k80J24K93Q2k92L1J91o4q3r2J70J97j76P8l9k67nK9J66rl95L12
7213b9N9K36n95m2L67k40L25K4j16q1P6L8n9n6j4J80J73j40l12N78l20q6k9N0
7237a3j4L60l68L1J53l88k1L66r2J56qq7O7k38J22j81%P0P1kJ6J09j77J40PJ18
7263A97k34K34J8m4k49K01j34k6j75M51j14J6j92o4L07k11m0j50L04R3J57o02
7285b57N61k86jl1rP9k52L34k37K42k57L5K76j55k90M68q4n9j35M0R2rj03P9J8
$$ y = [-1, -111, 36, 73, 21, -30, -41, -125, -246, -112, -19, -195, -158, 197, 122, -167, -134, 62, -25, -1, 30, 282, 14, -211, -194, 148, -14, 66, -130, 98, 118, -38, 168, 245, 251, -82, -46, 88, -22, 82, 44, -39, -12, 97, -22, -50, -138, -197, 1, 246, -80, -22, 83, -41, 148, -140, -138, -9, 38, -267, -148, 157, 45, -11, 72, 321, 94, -47, 158, -186, -15, -1, -127, -129, 0, -280, -156, 137, 219, -73, -42, 149, 85, 2, -90, 80, 277, 101, 179, 140, -127, -132, -103, 63, 54, -341, -29, 30, 266, -329, -371, -4, -244, 81, 105, -11, -92, -16, 22, -37, -93, -107, 73, 246, 106, -206, 372, 52, -34, -63, -13, -27, 333, -35, -4, 149, -239, -260, 106, 14, 170, 162, 75, 142, -96, 26, -155, -155, -85, -14, -16, 0, 109, -68, 72, 79, 197, -37, 197, 215, 171, -78, 123, -11, -37, -212, 239, 125, 141, -51, -115, 192, -19, -59, -209, 95, 188, 345, -257, 304, 18, 17, -14, -23, 56, -196, 138, -99, 143, -114, -79, 197, 42, -248, 220, 136, 77, -58, -18, 74, 65, -38, 41, 59]
7310E9j14Q2l1K09l50K18j01J03k26K85Rj19J73l04m0K78j51K2p9N3M5o4K14l40
7334a69J11m4J09m3l0J48J59l02P6k43K85J6K30l54R0K39j17j98J46J03k71L4
7356b5J14k2j69K75l16M83m62N7K25k78n2K94j82J54l2l12J83J04n1J72l0o1n2
7379A7j6O4J91l73kK72r4J36j18j21K49pl27L58k44L4k02M03n0o6j71J33p2Q2
7403G6n9j41K75m57J69J64L8j58R7q6K16l14J4J31O0j35k9K15j18J50l6l2Q5J03
7427B28l07J94J16r7m05L30m3k39J58Q1O0j42K2J78j80j05j32J75J46k7J2J31
7449A54k40q5J87L12m43K25n1K21k99N1k36J99o3j29K3p9J58r5M11j79K8l1l9
7472@j29K99m10J25K41j4k14q3K24Q9l63K25pJ8p8O5j54K46k26K02j99L76o0j25
$$ y = [59, -55, 27, -4, 205, -145, 73, -28, 75, -151, 134, 143, 24, 197, -107, -147, 131, -20, 2, -77, -24, 21, -43, 171, -169, -58, -102, 7, -36, -66, 82, 241, -61, 15, -228, 57, 73, 303, -51, 39, 278, 161, -37, 109, 212, -59, -25, 89, 67, -102, 173, -143, 340, -122, -65, 160, -118, -170, 124, -58, 96, 64, -248, -65, 39, -12, 160, 130, 69, 17, 1, 65, 256, -117, -119, 153, 59, 195, 77, -44, 205, 198, -129, 229, -15, 19, -183, 220, 170, 104, -67, 66, -6, 76, 17, -124, 151, -306, -137, 27, 65, -93, 4, -82, 134, -180, -166, -35, 25, -110, -139, 76, -42, 108, 72, 40, 125, 228, -79, 115, 231, 134, -271, 59, 16, -223, -65, 16, 76, -66, -44, 134, -46, -151, -283, -108, 38, 11, 23, 154, -86, -171, 16, 328, -115, 110, 59, 280, -19, 32, -204, -5, -68, -197, -174, -253, -95, -190, 221, 42, 70, 39, 0, -129, 170, -240, -115, 126, 112, -102, -185, 39, 128, -235, -10, -17, 1, -77, -12, -166, 80, -146, 56, -143, 233, 173, 48]
7496D8L18k30M1j35J57k04J56j50O9k40J38j57L72j46pL2K61j50j65K11l72L00
7518A47J5k87O1J47j52n7J86K02l29j16J17j8N0k19L09L2k44J35k11L25j35j09
7540a51K67j85m8L02j1l14r8O9J43k10K21K31r2j27N0J22j67J32l55J07K16K28
7562C30m14j9K93l79L42l03M31q0m32J32J58Q3k03n5J69j04N5j78L80j09n3J6
7584F0J43j03q3j69L17p8l61M86j56k12K38N7j55N0j82J6jO4k61L05J44j86j3
7607h0K31p5L5L3k46K75j45k19J10K75j2k51p6L96j42k49N48k56Q0l55R5J45J5
7630A32r7m0L6k98J1J60n0K50M9k95J67NLQ7M7m18L85rq0M2j25K65j46n5j27J24
7656B3J42j65j28J16J62k19j39J20J99j39j36J02K71k77j14K52J3j13k59L30j21
$$ y = [48, 366, 136, 177, 42, 199, -5, 151, 1, 70, -170, -32, -189, 183, 37, 30, 62, 323, 173, 8, 219, -153, 147, 162, -125, -64, 83, -69, -126, 60, 262, -67, -183, -66, -84, -34, -253, 56, 88, -156, -21, -232, 93, -42, -151, 116, -69, -117, 185, 174, -140, -238, -169, -26, -236, -15, 216, 124, -3, 47, 169, 2, 134, -221, -114, 102, 330, -84, -103, 190, -189, 153, -150, 281, 201, -231, -99, 59, 142, -61, -116, 53, -51, 4, -174, 206, 97, 44, 60, 203, 100, 17, -152, 165, 87, -274, 212, 56, -156, 82, 139, -16, 34, -148, -132, -133, -69, -330, -25, 119, -67, -80, 151, 76, 111, 144, -102, 173, 28, -191, -81, 194, 182, -69, -145, 251, 109, -140, 408, 152, 232, -123, -28, 117, 132, 35, -5, 31, -267, -256, -96, -146, 104, 153, -142, 25, 30, 33, 120, 167, -251, 134, 125, 45, 87, -38, 227, 81, 26, -101, 23, 165, 0, -128, -12, 150, -69, -208, -88, 111, -28, -164, -62, 209, -68, -182, 70, 83, -30, -289, 41, -80]
7677h0n0J45M7j6Ol5P8j57O2m6J18K38k01r2J13m8K21l95J26J07r3j13P5q5j27
7702b02J14j5J42o3Q4m4k09K96j89J16L2j08M4J11k1J41l41J50K11m11r4K97p
7725C4j05M37k16L6j73J42r2j06J19j71M7jl6q1K70J26k06r2R3j2J0L7oJ8k45
7750a73M15K5j68j03P9J05j14q4o1j42l2L0L3L10J68k63o5J06M3n4p3K49j18K2
7774A35l8r0J17j78L6k3j20n4K86j65M28l25k8Q1j69k8q2M66k37J9j72O8J18R9
7798A44k92N02l80kk4J74j99J3k8N1J9j09j26L45l32J48K01l0o0p3J1r0J25L4
7822B2m6J5J73k27K4KK5j6j19J60R6O4k24M6q9j6P7J5J93k99o1J43J54k41m0K19
7848E0K8o5j12J87J13m8j52n4K6m4o1J42J15k32R7J67j18j41Q9J17p5m4J15j41
$$ y = [-80, -130, 15, 62, 46, 52, 17, 95, -62, 0, -46, 72, 310, 109, 17, 130, 82, 303, -92, 34, 141, 48, -65, 10, -75, -202, -88, -103, 39, -24, 60, 16, -193, 103, -86, 30, 62, -46, -2, 109, 88, 229, -112, 38, 249, -162, -256, 41, 34, -71, 366, 150, 186, 13, 155, 63, -43, 76, -95, -48, -49, -85, -166, 104, 230, 24, -68, 25, 13, 23, 60, 54, 72, -173, 242, 267, 99, -4, 75, 180, 66, -18, -79, -221, -253, -223, -190, 120, 288, 25, -40, 66, 109, 55, -18, 231, 113, 135, 97, 7, 124, -54, -18, -41, -161, -215, 71, -94, 334, 9, -19, 62, -107, -135, -217, 249, 12, 31, -141, -73, 45, 144, -148, 354, -26, -28, -52, 122, -77, -64, -92, -41, -22, -131, -257, 88, -244, -96, 105, 75, 15, -58, -47, -137, -12, 22, -24, -9, 164, -63, -39, -37, -12, -28, -147, 13, 109, 173, -51, -5, -94, -110, -33, -18, 175, -124, -185, -42, 112, -129, -169, 50, 78, 13, -99, 88, 201, 153, 1, -53, -27, -71, -132, 10, 125, -107, -10, 157, 39, -102, -13, 104, 29, -15, 100, -41]
7872d1R3j82L9Q2J38n6k40L19Pj23r7J97k92k6Q9J04m1L8k36K22L33k53j17L03
7896B60r2j38j27J16q8K38k31r7J23N9j8J89j11j89QK59L6l95K85j14j79M8J96
7919C8l8J90j97k32M05j70k13L10o4L03l43k3J4j1K5Om2Q5j84O7K62j79k0J32
7943A21k47Q1Q4j91J03Nk10J96K21p5j36q3K15P6j50j49J04J85j42k9L74j70j64
7966A9J77m1j46o4j31K9k1J71J03k19J52lj14K21k66Q8j40P6N2J38j05K8J00Q
7990A12n5J8q1J15n5J02J27k36L9J38k09L0M0J11k20k10J72J48k31J40J04K55
8012C54l46j85M29m8k20K17l97J57P1j98J48L03l91J1j5O0L15k61L10j86k75K44
8034I7j32J73j47J25j47O8J60l9l9pJ85l43J2J51j02nJ96j75q9J57m08M19J40
$$ y = [-41, 52, -130, -91, -9, 129, 73, -167, 152, 159, 36, -61, 136, -156, -182, -93, 11, -30, 8, -228, -6, 327, 74, -43, 260, 168, 30, -97, 19, -69, 169, -62, -159, -36, 23, 5, 194, 83, -106, -98, 161, 197, -198, 87, -27, -206, -158, 38, 0, 190, -7, -239, 166, -4, -217, 93, 29, 332, -11, -34, -20, -31, -6, 0, -42, 43, -141, -74, 188, 9, -11, 121, -126, -45, 39, -152, -49, -44, -254, -58, 163, 88, -48, -131, 84, 160, 10, -139, -35, 150, 8, -21, 353, 183, 19, 196, 155, 9, -55, -186, -157, -178, -7, 96, -123, 29, 26, -88, 133, -133, -45, -185, -109, -57, 81, -24, 4, 104, 112, 57, 75, -6, 109, 54, 156, 283, 47, 86, 224, 15, 45, 85, 196, -24, -234, -62, 86, -145, -5, 99, 354, 8, -177, 252, 204, -16, 201, -196, -39, 32, -166, -18, 285, -106, -95, -110, -50, 265, 4, 314, 128, -147, 97, -35, 138, -9, 116, -31, 37, 197, 158, 119, 112, 297, -46, -34, 117, 15, 10, 206, 31, -58, 99, -309, 110, 250]
8057B50m22K86k5j30k07M12k61J17k49N49l98O8n6l5K38O2l28J39J44l54J41k2
8079h1L22k62K52k82J87j70r1k94M39k3j41P0L88k38j18l62N33j20j45M78l77
8100c5k4J67k28J62k50j9M30j48j13R8J23Q2l22L8K99k45J74k12K62n7m6k07L21
8123B50k55k0R8j13K68l49o0K81j25j09n4K97j80n8J76l00N84k91%j88K35j90
8145a03N1K41l5k41k41O78k08j71k74M41K4j87j68p6J11m2J94m4J03J09j98J8
8167a8M0n3M7J65j56j42j31K74J74k06J3LKJ03l67K21K0J70l47K97P3k31o1K26
$$ y = [250, -172, 114, 89, -41, -248, 164, -97, 20, -229, 320, -78, -10, -66, -101, 137, 199, -129, 10, 154, -200, -59, -81, 241, -21, 231, -51, 136, -34, -125, -419, 20, -3, -144, -74, 314, 76, -42, -404, 129, 9, -136, 342, -35, -59, 108, -120, 42, -208, -227, 203, 55, -58, 40, 163, 245, -77, -39, 260, 15, 189, -23, 239, 182, 136, -71, 250, -5, -25, 73, -40, 228, -121, -181, 100, -25, -134, -188, 109, -71, -129, 47, -253, 331, 40, 40, -148, 87, -103, -52, 189, 154, -87, -328, 350, 142, -29, -303, 138, 162, -25, -193, -269, -158, -200, -6, -50, 53, 162, -36, -18, 22, -31, 16, 181, 25, -117, -248, 26, 200, -6, 7, 10, 12, 115, -252, -31, -11, 159, -188, 109, 182, -49, -110, 116]
8191A16
$$ Imaginary data points
##PAGE= N=2
##DATA TABLE= (X++(I..I)), XYDATA
0@%%%%%%%%%%%%Kj0J6j6J6k1K9l2L9m7N5o3P2q8J03j18J34j51J73j97K21k50K82
35A49l18L58m01M48m98N56o16O80p53Q31r16J010j113J229j355J489j641J810
53I49j997K209k447K720l038L406l844M375n029N865o973Q509j0778J4463k1411
68a3021L8737j56994k30307M36481J07652k54808M5180J55266j10125l9290M3469
79B2240m6183L1038P3924n8683n9114J6647K3365k6485J4560P1938n2471j00147
91h9371Q0808O2571r1733j1314Q9397j7882n6088K6567j1680k0407Q9364N228
103E5460q9892J9024J6441l8963L1806K8337q564O373j5389k0631R719K5660L4207
116E3588k63n0991k7101K6471j2245m4685M3386M4321n0293k7212K4694K9589
$$ y = [0, 0, 0, 0, 0, 0, 0, 0, 0, 0, 0, 0, 0, 2, -8, 8, -8, 8, -13, 16, -16, 23, -24, 31, -32, 40, -48, 55, -63, 71, -80, 93, -104, 117, -133, 149, -169, 189, -212, 236, -262, 294, -322, 358, -395, 436, -480, 530, -583, 646, -709, 780, -861, 949, -1048, 1161, -1286, 1434, -1604, 1802, -2042, 2333, -2696, 3169, -3804, 4705, -6073, 8390, -13021, 25716, -131278, -361585, 74896, 182548, -72260, -27080, 128186, 18061, -21229, 22240, -23943, 7095, 81019, 22336, -36778, -20131, 3234, -23251, -8691, 63247, 10776, -89371, -8563, 54008, -37725, -49039, 40358, 22476, -33612, -7045, -18725, -39132, 50232, 55460, -34432, -15408, 1033, -37930, -6124, 22213, 13649, 20022, 4633, -15998, -6279, 19381, 53588, 53325, 2334, -24767, 1704, -10541, -55226, -11840, 32481, -17812, -45024, -20330, 9259]
128I259J8735l4866o462N0655k5483n2111K8807L3709r235k0608p343K0709J3940
141A9706l5388j4035O8074J5218q1663o617N1894j1660j1949Q622P728J9524k6733
154B721m2556L1106M1401j2288l5927j5753J6764M917j7942J8724M4602j4365
166B1404m5884J5558K0492j4636K4901R162m0698N136K29l4523K7843L4325j6275
179G034J0080Q824m1926r453M1104l476k7419K9113K1777m5880l7129K3831L8318
192A4798p001j6444K4342k724l5897R486J2059j315K1583j8136l1391M3733J6891
205B9984n7428J3586O4145l6158n8073L9709L6547k3060j7396l065J0046J4323
217A3160j8237j0581K6251J3581k3645k6580J6143K5003l2018j6272N3463R162
$$ y = [9259, 27994, -6872, -13334, 37321, 11838, -40273, -11466, 22243, 13008, -7600, -14943, 5766, 19706, -15682, -29717, 38357, 53575, -28088, -34705, 17189, 5529, -6420, 2202, 9930, 29454, 2721, -39835, -8729, 32672, 20384, -15543, -31296, -14532, -9615, -27557, -8833, 35769, 21404, -24480, -8922, 11570, -3066, 21835, 30997, -9701, -4565, -4336, -38859, -11016, 23309, 7034, 17114, 25938, -15988, -25441, 15663, 12187, -15232, 13881, 35658, -10222, -47351, -23520, 14798, 7797, -8647, 15695, 12971, -22926, -13440, -1381, -2696, 18887, 751, -30640, 13093, 29984, -27444, -13858, 50287, 14129, -43944, -4235, 32312, 9252, -8144, -11209, -1163, 13160, -5077, -15658, 10593, 24174, 529, -26051, -9908, 15095, -16923, -33195, 20268, 29430]
229B9430n5913K851M2137j1918j3117J9065m160k143M902l1191L139M4211j4824
242A2469k6596J8178l044j6506K0322J4001j7221q508O834m016j1380P273K3906
255A5712J243k9442o170J9233j707o812O065N013J4565q297l8531J7882M5272
268C4026k5208k3338L3046J999l2443o94J0943L936Q255j2411j3057J7428l698
281a216k0904K3316K6394k1313k6044K993K0513N378j7847M118K2249j2130k3400
294a7893P910J5996P835k247j4253K421J1972k0246p524L2858j942k7886J3530
307E31R705j8714J650O144o162R011R36j6849N297J2732n470P60N418o394r62
322b367O810J336o83l304m62J644j3536k142K5232M790j8280j147K268l862N737
$$ y = [29430, -26483, -23632, 18505, 6587, -6530, 12535, 8375, 6232, 11134, -20057, -16918, 27293, 12469, -14127, 4051, 1007, -15499, 4823, 18824, 1603, -6905, -71, -4087, -15467, -8194, 15712, 16955, -12487, -18657, 576, -1131, -7943, -1878, 3135, 17700, 9403, -29128, -11246, 34026, 8818, -14520, 18526, 20525, -11918, -12612, -1669, 2267, 10522, -1889, -14946, 2482, -1216, -22120, 1196, 27590, 6277, -19767, -16774, 3739, 9117, -8730, -4612, 17637, 5507, -17893, -9983, 6013, 13848, 11601, -2652, -231, 11741, -8505, -16029, 16829, 14887, -12999, 531, 10236, -8478, -6828, -684, -6846, 2165, 3101, -13748, -8451, 4281, -1189, -429, 4989, -1405, -2367, 4443, 5779, 5096, 1792, 1330, 2974, -10562, -12704, 12528, 17318, -962, -2109, 159, -3703, 2034]
337B034m568J24K2308j4311l9492K1555L4914k7914j7683L2362Q393k5301q834
350a6413J3448J5745k496j6802j074J5058P20j5361k601K2147R543k8729j2425
363a9240K8461M85k3392J6544J6750k3502r876J0014j062P452P475j3643J048
376b486Q422j9254l387K7210J162j7558L638M251p778J492Q894K085l898j660
390A133K75m042q81P671R53m327R49l854k834J0951m118j0806J8634P303l2706
405a5699j703L1322p544j8792J0886M911p741l149m241R139J7816j0752j9140
418a4687J4572J5532j7048j0031K1764R947k4824j4148K2788J3117j9140o962
430i120J1377J679o13n027p304J6850J0188k7782p959K5002l550j7172J4427R108
$$ y = [2034, -2534, -2410, 19898, 5587, -33905, -12350, 22564, -5350, -23033, 9329, 17722, -7579, -16413, -2965, 12780, 10284, -6518, -7592, 7466, 8186, -7175, -9776, 12371, 21914, -6815, -19240, 9221, 9706, -13686, 2858, 19608, -3894, -13770, -3756, -4818, 2634, 10109, -3534, -2486, 5936, -13318, -16705, 10505, 11667, -5891, -2253, 1998, -5780, -4288, 4606, 6691, 2793, 1133, 1408, -2634, -3515, 4156, 5109, 782, 1731, -2123, -4957, 5994, 1876, -8930, 9704, 17007, -15699, -17402, 13920, 6376, -12416, -1530, 3381, -4360, -7509, -11750, -2611, 15205, 4453, -14687, -115, 15417, -1631, -11662, 10102, 20049, -4775, -18923, 3865, 16982, -2158, -9120, 2257, 3936, 3323, -1704, -9008, 7842, 18030, -9752, -17711, 7291, 3741, -13431, 996, 10104]
444A0104j6380k375P368l330J42O985J724j404l957k710K217M389N533M76m036
459D746R60m209q650R750Q777j5604m366J3345q555j1234J4851P720q670p10j563
474c412j033P977n374o103J5215R99k0430Q64J7963L81j0869J911J2053O9j5163
489d952m282J5622N843j2524m323P401L891q176j0376J2663J6576j8670j7142
502a8449J8536P214j5545j241Q193J908M65p440l023J7981N638j9117Q79J4501
516A0500q904o309R715P99o675J24P29j362j117M430L495m559k547J838l467n46
532c856M987k189r84O476p460q960J6922M477j9824P551J6913j7440j1347J6909
546B175N807p015j979p31K555M989n441m164J2472M474j8041p796J5585N000j6397
$$ y = [10104, -6276, -8651, -1283, -4613, -4471, 2514, 4238, 2834, -1123, -3833, -1616, 2773, 8306, 8782, 4746, 5706, 1497, -7153, 2597, 11374, -4230, -8596, 4749, -3806, -15040, -189, 7531, -1139, -1849, -3412, -4445, 3532, -1842, -7945, 7270, 8269, -12161, -11297, 6666, 7047, -3822, -1911, 10142, 10211, -4952, -9234, 6388, 12231, -293, -4616, 2785, 6676, -1500, -11876, 787, 17363, -1307, -18449, 87, 7301, -8244, -9485, -1292, 616, 1081, -6359, -9382, 8599, 14237, -4880, -4001, 10500, 1596, -4713, 5002, 5801, -874, -750, -21, -1383, -2500, 1930, 5425, 866, -1681, 157, -3310, -3856, 1131, -1058, -2042, 4434, -3026, -11986, 4936, 9413, -10411, -2860, 14053, -3387, -14734, 2175, 7982, 967, -1012, -1743, 812, 5801, 360, -3804, 8668, 13142, -4899, -12695, 2890, 7890, -8507]
561h507o58J9164m819k0502Q950J5110p052l585L291j540M135k532j3142J0301
575a386J6994j6440j3468J8688N074j6825K506J2693l241p392j084K508L462L03
589B392j715q62J650O12n067L7Q912j668q900L389J524q797N490J0709r248n917
605g459J2178j044r390M162N912O12j891p734j17J0746l056j0695O891J0020p658
620A477j0025O164J0760k920j0815K033R550n039r562N304Q727q23q149m050Q350
635I82M664j1333O84J3960n045j3537N177Q630k359k352J65K839L083n662o113
650f217J0154N520j1279l251P315p54o147J849N915j055n803J015L125k389J079
665i23K784k230o1J222n379J143Q719k796n054Q249l507j0206J0048P236j2699
$$ y = [-8507, -9165, 9999, 5180, -15322, -6372, 8738, 1686, -1899, 1392, -148, 3987, 1455, -11687, -1386, 15608, -832, -14300, 4388, 9462, -7363, -4857, 7836, 4595, -2797, -3881, -1373, 2089, 2392, 677, -185, 1465, 2077, -2990, -2953, 5959, 4291, -4609, -1220, 304, -8493, -3003, 7706, -1542, -7459, 4719, 3675, -5715, -1553, 4359, 4971, 3080, -4654, -4771, 5975, 2919, -7776, -885, 9135, 1477, -8548, -2384, 8376, 5456, -5359, -3326, 6224, 1185, -8377, -3073, 5654, 4831, -3318, -7368, 982, 5646, -5687, -5003, 8957, 3912, -9625, -4448, 4182, 1823, -529, -364, 2475, 5558, -104, -6217, 3937, 9457, -1822, -5073, 2242, 1488, -4659, -2810, 3105, 2050, -3753, -2738, 387, -2002, -923, 1861, -369, -430, 792, -4587, -3444, 5275, 2479, -2575, 5674, 2167, -8039, 2009, 9245, -3454]
680c454j73J1619n010j0453L794P555K23m154m221J565N756k071q850L455J2443
695H024m424j5940O379J6913q819j1422J2752N463j1311j093N239M26L043k702
709B528q011O449O273j2704j141J5213k613j3817L331Q552m174n213L758M601
723C032l490l621J815J450J014J856k467q06M377l582l012Q667N16r720M156O412
739F597r071j904R833k007o229K591K4j867J589n15J039K778n125m344O547L598
755C534o353j044P739J152r545k511J0889L633r176j682O988M9n301k086M086
770C72P354l882j1928N232J1007q672p453J0501M163r454l103L770L075J569m022
785a471k791O364J024q153R18Q524k0o647K53L865k017k251M452J220m577J208
$$ y = [-3454, -3627, 7992, 2982, -7471, -3677, 3878, 4101, -53, -4274, -2709, 3047, 976, -7874, -4419, 8024, 3600, -12340, -5961, 10952, 2133, -9289, 3463, 8926, -2385, -3478, 1761, 2187, 5230, 2528, -5483, 966, 7239, -5465, -6606, 8607, 5994, -7823, -4492, 4060, -114, -5327, -1569, 3032, -458, -4079, -2264, -814, 200, 2056, -411, -1217, 3160, -422, -3434, 5233, 5749, -3971, 185, 6597, -2474, -4378, 5455, 3448, -2781, -190, -166, -2033, -444, -959, 80, 2858, -2267, -6611, -64, 3534, -2819, -3863, 3876, 5028, -4517, -7028, 3861, 7494, -1682, -3364, 3624, 3673, -1628, -3714, 372, 7726, 3844, -8084, -2852, 8155, -517, -7970, 2531, 6694, -2760, -5863, -2093, 982, 2551, -1471, -4262, 2102, 3126, -5027, -4109, 4415, 4395, -2252, -1999, 1866, -151, -2402, 2050, 3270, -1307, -99]
801i9K588m125QM940j787j969K020l907j453P133k013n847O097K024r032J318
817d104Q913k801n184L395K269m078k071K669L390K75l081k867K614L922l048
832B13m776P909N011j1709l675J1818P50r233K416N611k845l695q03J633N799
847D424k111q723L032Q234o299o337Q910N415p526m621N804L480l563j263K827
862A683L85j232k163j748M284L908m769k730M679j285m330N188J858o020K174
877a18L050o512j516O582Q06l902k12K25M00J403j858m53M827K69o699Q7P622
894D001N03o807K340O572m400o993M795M943l424k819m39L73K422k503m122P288
910A730M324r994k867R898J6p516K451N745k441m047l08L625K750j810l167J841
$$ y = [-99, 2489, -1636, -1628, 3312, 1525, -444, 1576, -2331, -3784, 3349, 1336, -4511, 1586, 3610, -5422, -4104, 4809, 2008, -3176, 219, 2488, -1590, -3661, -992, 2398, 2673, -408, -3275, -661, 3261, 213, -4563, 3346, 8357, -3352, -7027, 4791, 5541, -3692, -1276, 4335, 1490, -2205, -3008, -1375, 4424, 2313, -6410, -3378, 4856, -1443, -7780, 1130, 6545, -981, -5602, 202, 3682, 119, -1144, 1683, 2068, 836, -1327, -3075, 1209, 5117, 348, -2382, 2297, 1012, -3318, 1870, 3728, -2292, -118, 2932, -3580, -5096, 1486, 2292, -1610, -1822, -1597, -1197, 206, -1652, -2105, 2722, 2991, -3708, -3621, 4001, 4504, -2303, 37, 6609, 2209, -4784, 11, 4954, 1530, -1289, -1728, -1355, 1067, -1436, -5558, 1730, 6054, -3940, -6807, 3091, 3107, -4409, -1958, 3787, 1346, -2701, -3009, 616, 3366, 1556, -1611, 230]
926B30L392l332l897M784N050n539m806M904J981m819Q62L706k447j494J087k576
942b914Q06L664k182j866L127j409k550M569R94k823K370K276m747k152N127J977
958D267m582k050L570P01m004q23L566K100j407m279j123O676O64p808J753Q619
974E840m720p517N088N126l104j973P20J047J147k891k311N671L198p035k026
989c740O251O75n673J229N290j554m931L23K804o28j090J48K44J189q54l004K922
1006c99M600l864l063N011l24m842K506L475l308p38K115j805j456K907O56j681
1022b10M81o38r09J718K22k135J742L176l898m051N454L528o367j473O467o83
1038B424o442J069L948L35n20k915o56N514j25p087L266Q211n058p573M548N051
$$ y = [230, 3622, 290, -3607, 1177, 6227, 688, -4118, 786, 2767, -2052, -1190, 2516, 69, -1425, -338, -2914, -2108, 1556, -626, -2492, 635, -774, -3324, 1245, 2239, -584, 1786, 4062, -685, -2837, 2290, 4267, -315, -2365, 1205, 1906, -2098, -2921, 645, 2745, 1338, -2941, -4064, 2612, 3276, -4532, -2779, 5840, 1120, -6397, -1309, 3817, 713, -1260, -540, 507, 1654, -1237, -3548, 2123, 5321, -1714, -3740, 2511, 3186, -2487, -1258, 4032, 2478, -2453, -2130, 674, 46, -1044, -896, -652, 537, -317, -3321, -399, 4201, 337, -2726, 2285, 1961, -2881, -375, 3100, -208, -946, 1169, -636, -2092, 815, 1471, -210, 271, -367, -1276, 442, 664, -1471, 271, 3447, -451, -4502, 952, 4480, -1887, -3360, 3107, 2424, -4018, -2949, 999, 1334, 814, -2101, -2757, 2757, 2632, -4455, -1189, 7022, 1964, -5609, -1061, 3990]
1054C990l760k647K639J686j278k180N2K196K058k217l093K593K404m539j049
1069c145N787n76n196K082K589l149L80L040j635j125J539j481p8K490l49j592
1085d19K353m66l119J646K513j908j671K608m65m217J011L871r83l140J594J262
1101D70j354o88N97J465J669k180l730L689M213m899k072O145L36n723j94M003
1117A747J264k309j953J018K592j889m343K672M997k566n505K571M199k918l146
1132c569L319K505k783j778J106J424J439o80k233K198J725l733l78M339q07l121
1148a027J893M59l257J508K569k320j249J974p15j980R28J447k01n5r71j244J849
1165c92K231k566j068M084M47n642R31N619j898l563K729J178k668p8N93J89K191
$$ y = [3990, 230, -2417, 222, 1908, 630, -1550, -1498, 698, 2756, 539, -2554, 39, 2443, -2096, -3145, 2642, 2066, -3130, -1048, 1541, -1608, -1228, 1812, 177, -948, 591, -890, -968, 1522, 1173, -419, 1934, 1468, -1651, -5, 2508, 600, -1071, 1537, 1072, -3145, -2134, 1737, 754, -2386, -792, 470, -884, -1572, -975, 490, 2159, -21, -3751, -62, 4151, -748, -2820, 3325, 3661, -2062, -2256, 1747, 3011, 702, -1251, -233, 2359, 470, -3873, -1201, 3796, 1230, -4275, -1704, 2495, -423, -3569, -250, 2255, -528, -2306, -1200, 224, 1663, 983, -1250, 948, 2673, -1060, -1438, 2901, 2094, -1027, 866, 1325, -1932, -424, 2145, -175, -1424, 550, -165, -2145, -1217, 230, 29, -26, -997, -2241, -392, 1839, -727, -1795, 2289, 2736, -2906, -1975, 3644, 1746, -1817, 912, 2090, -578, -656, -63, 126, 2317]
1182B317j839l470K885K876m933j482O142L37o324R6N268l03l076M14K115p0j088
1199a35j454P08L731n54m642J062M828l057l457M168J876m002l36K382j496p7
1215d55J447j274n22J473j063j505K333P05j725M47M11j423j0K675r51k130J946
1232C79J574l137j221L841R41k615r00J315N03M6j641m22L644J28n122N13M779
1249B605j493l494J894K546k277k033J410J888K53j783j021K017R24k626j074
1264b264L966R02m033j076M335l04k777J031J893p55q97o05K09J902J69k848O76
1281d76K518k646j653K972R40l041J60J669j199o65J917l30j060J044K12j519
1297a157P10J135j71N6J5j231K98K483j504k602L022J945m170j741M553M45l137
$$ y = [2317, 478, -2992, -107, 2769, -2164, -3646, 2496, 2833, -3491, -3395, 1873, 1570, -1506, -1092, 1023, 953, -135, -1589, -881, 2850, 2296, -2346, -1284, 3544, 487, -2970, 1198, 3074, -928, -1264, 1118, -378, -455, 992, -282, -804, 669, -394, -1899, 434, 1139, -586, -139, 272, -1151, -1161, 1514, 563, -1567, 379, 1953, -1184, -2405, 1436, 2377, -238, -1138, 177, 680, 726, -915, -1337, 2307, 2435, -2687, -2174, 2605, 1112, -2382, -488, 2058, -219, -2252, -842, 1046, 1299, -484, -1505, 512, 1436, -1190, -2264, 1702, 2604, -1429, -2505, 1830, 1526, -1251, -220, 1673, 918, 21, -584, -375, 1527, 1696, -1152, -476, 2042, -604, -2257, 715, 1655, -1386, -1226, 443, -756, -1421, 496, 166, -894, 150, 362, -1157, -447, 688, 517, 573, 588, -643, -345, 2138, 634, -1968, 1054, 2999, -1171, -2912, 1641, 2086, -1051]
1314a051k94J607K1n29j283k17L395l23m203M70M614j080m074K295L841k715k727
1331b253K266J982r59r58L4O32O52j367j670J917K178l536j423L678n67l057J706
1348g45K373k279p16R76P2j57Q49l23l55J154p96j175J516J030j567k5J704j473
1366F3j394K551N83k598KK227j546j713J670Q99r09m12l00K05J255q68k032K973
1384F56J680l538j663M196J213l256k15K514K95k243o54J374J486j007k252L49
1400a065K668o62l544J494L554k356k858K017K145j849l59J166l50J33l77r49
1416a192J355J379j655r64J955l35j959J514J570j603q29J762m89j219R77P50
1432A017j014m18M59l07l20N59m70Q0J292j455j444K578J058k737j5L182j377
$$ y = [-1051, -1345, 262, 283, -246, -1529, -1746, 1649, 1326, -2877, -2407, 2207, 1127, -2947, -652, 3189, 474, -2253, 13, 1995, 1036, 78, 112, 744, 1396, 29, -1641, 276, 2454, -1082, -2505, 1173, 606, -2451, -745, 1628, -651, -1367, -391, -319, -476, 373, 50, -305, 849, 53, -1122, 394, 1424, -143, -168, 1536, 63, -1331, 1220, 1803, -795, -793, 1434, -112, -1825, -155, 744, -165, -577, -877, -672, 583, -285, -2317, 656, 2336, -1202, -2865, 1331, 2544, -712, -927, 1587, 1882, -361, -1015, 359, 1845, 838, -1414, -1065, 1603, 941, -2603, -1109, 2445, 89, -2769, -752, 1393, -456, -815, 351, 1, 134, -243, -1192, 163, 1542, -113, -1077, 878, 543, -1416, 98, 1668, 65, -764, 998, 509, -710, 267, 1017, 3, -415, 44, -263, -583, -24, -494, -414, 878, -577, -2021, 557, 1615, -1122, -1137, 2045, 668]
1449F68k471J731J625q93j084L66L93K25o44r52J669J455k891j464L306J276l632
1466a317k72L487m49k862j1K368J24j042r87J04J917o81k412J255L000j948k612
1483b338K293J302j653k82J763m56p74M47m10j23R36k79r07R86n1r73L63J129
1501I73j205q07J895n26j907J299J910k114j095J992K91j681L75P26K90L87j239
1518d36q14K566L47k755N41K779j121l042J523K498j762j451R98R34p63q26j38
1535i22J204O60j460j708K351J369k920j79L174o1l435Q70K261p18n81K16K77
1552C98L50j62j308L40J984r01j667J384N65j601o03J957m34j403P86N56j352
1569a111M72J098o37n72M04M18k64N81n45l4J435m15k127J141K048j548j386J939
$$ y = [668, -1803, -72, 1553, 660, -424, -58, 335, 560, -84, -1036, 633, 2088, -803, -2267, 1039, 2315, -1317, -1589, 1898, 1449, -1413, -1424, 944, 1068, 26, -961, -857, 1060, 379, -2033, -778, 2222, 274, -2338, -45, 1257, -396, -678, 1085, 629, -145, 302, -108, -231, 705, 426, -481, 505, 454, -519, -156, 973, -232, -1039, 856, 330, -1577, -278, 1632, -482, -1577, 415, 706, -975, -600, 126, 416, 803, -436, -1250, 1316, 1663, -1092, -551, 2228, 1107, -1935, -412, 2086, 324, -1127, -129, 805, 42, -784, -922, 282, 942, -518, -2226, 125, 1494, -1426, -1605, 1569, 1508, -1927, -1057, 1204, 486, -95, 121, 398, 748, 586, -722, -382, 1602, 701, -966, 418, 983, -618, -1221, 736, 302, -1101, -315, 241, -1111, -639, 459, -178, -750, -346, 72, -192, 389, -156, -190, 1245, 830, -1297, -156, 1892, 344, -1042, 897]
1587H97O55j949q33J433P08q43r95J70J081K73k124j03K967m90l012J023K718
1604A576j077k080J564J532j385r39Q63R18K83q95j273J638P99k420k82K467j23
1621A166k581P36J580q95j110Q83N52n68k73j98L63Q69n20q39J114N07j393jJ470
1640H62l24j673J348R51j913L86J616n77j299O03J06j24J4k36K02R94o34j766
1658a464J045K025j804j540K334R54k707l37K011L26j387l20Q56K58K29j271l8
1675h30K457n25k653O34K737j437k017J894J243j517j146J367K27k00l23l83N07
1692C5N69j315q9J633j35j826J82J885j242o28J008P16j221K52O26l35l28N08
1710B95L8l95M56n50k5P29j90r60J056P34j885m07J753O0j719P4J742q35j210
$$ y = [897, 1552, -397, -1230, 203, 911, 68, -927, -757, 324, 597, -1527, -1630, 1337, 847, -2165, -1142, 1576, 499, -1581, -17, 1515, 130, -809, 54, 972, 1255, 360, -913, 725, 1524, -896, -1178, 1289, 1166, -1415, -679, 901, 6, -1104, -221, 331, -237, -510, -708, -345, 524, 4, -835, 279, 786, -607, -608, 862, 538, -1135, 213, 1164, -749, -363, 1253, 676, -623, -20, 86, -38, -24, -260, -58, 936, 302, -1464, -419, 1606, -198, -1738, 596, 1550, -1157, -1494, 517, 843, -544, -864, -8, 250, 479, -792, -830, 1627, 1102, -1551, -917, 1820, 383, -1634, 260, 1503, -14, -1160, 207, 434, 234, -89, -472, 35, 604, -711, -800, 833, 698, -1128, -946, 939, -303, -931, 77, 793, -428, -176, 450, 115, -213, 295, 333, -62, 394, -156, -181, 548, 358, -602, 454, 1188, -697, -1104, 649, 709, -1010, -936, 806, -29, -1239]
1729a239O38P33L32o94p80R76J116j159j045J705J235k250r58K585K00j958q1
1746f44J614l50o86q01O39J109m85j711N16J736r79j396J104J102j105q09J109
1763c7M54p38O8N19j45L0M3k12P90P7j162L20R89r32q55J423K65j413J91R36q49
1784b38r60J063N17p95j60J7K11P98o56m62J209M53j599m64K034n0j723N74J828
1803A597j012j384Q34Q73m15n86k13K28Q98j206q46J420R68k051r08K234N95j959
1821i33j36J775j98j037J09O15M15N5j207M00J203o56j303J219Q58j190r06J527
1839F10j42j308N38O66n13m87P32j74r5J0J09k00M82n28j88J006J36j643M93J635
1859A139j128j140J485M64q58n35J047J55m90m21k01R86L37j504k37J608n5j695
$$ y = [-1239, -601, 132, 464, -230, -1010, -34, 1082, -77, -1122, 583, 1818, -432, -1390, 1195, 1395, -563, -644, 970, 620, -66, -867, -228, 881, 396, -1315, -799, 937, -42, -1438, -334, 768, -337, -1146, -37, 417, -321, -253, 266, 121, 151, 194, -18, 772, 849, -313, 7, 996, 64, -791, 632, 897, -516, -325, 611, -238, -1198, -135, 382, -413, -573, -556, -345, 453, -203, -665, 544, 997, -602, -1066, 968, 918, -805, -231, 1597, 585, -799, 35, 908, 493, -93, -306, -78, 820, -386, -1232, 188, 1156, -895, -1803, 431, 1026, -933, -1069, 706, 508, -529, -420, 195, 610, 665, -542, -142, 1061, 405, -898, 321, 1179, -11, -917, 610, 468, -840, -302, 364, -149, -636, 96, -78, -173, -163, -54, -254, 228, -300, -488, 518, 654, -989, -496, 1139, 11, -1129, 356, 820, -38, -573, 474, 629, 139, -282, -483, 503, 840, -664, -901, 707, 652, -1043]
1877a043L60J807o97j734Q60J362p66o30L45P15j26n09p11Q99Q46j228q58J599
1895D91L96j799L62J572m64j252O64M56m9l38j28KM44l36p24O12Q02p81o21J159
1915D68qj188L26R52j079j26R89P3q53K76O39rn49j75J38P70o2j052K71J246p45
1936C02j514J197J430j540q62R73M52p31n19O98L95j16o16k91J217L2j574K43
1954h24J837m80j757J075J147q38m46N20M73l58o78K10N82L46r21n13R52L37j496
1973h32K43J136l91j051L58J049q33l30J134k26m6m26J17J18N14m21p1M91j96
1992C37p68O30M87p78l89P99M83j234j11R67Pp02k08K85P24p34m49M05R82o69
2012F4j124J062R86j052q92J602M33j268l21R54N53r66l84J06Q18j63j534P63
$$ y = [-1043, -683, 1124, 427, -1307, -447, 915, 149, -481, -136, 579, 453, -56, -767, 132, 978, -250, -1108, 491, 887, -912, -550, 1022, 558, -694, -30, 426, 377, 39, -89, -87, 357, 21, -703, -91, 711, -70, -691, 468, 460, -728, -402, 550, -529, -655, 334, 407, -446, -170, 469, 460, -89, -264, -126, 644, 582, -470, -199, 1047, 302, -1212, -15, 1415, -125, -987, -14, 438, -293, -812, -114, 281, 165, -451, -742, 475, 507, -1067, -824, 1013, 533, -1224, -149, 998, 160, -286, 234, 707, 349, -329, -119, 463, 809, -112, -625, 327, 664, -832, -589, 547, 156, -895, -537, 512, -321, -651, 483, 257, 211, -215, -98, 20, 534, 113, 42, 533, 337, -431, 199, 686, -92, -481, 318, 801, -433, -544, 423, 430, -272, -480, -195, 529, -205, -654, -249, 733, 64, -1060, 2, 988, -64, -956, 646, 1079, -189, -510, 444, 997, 31, -353, -247, 571, 408, -1126, -363]
2030c63J137j44j509K61J325r61m52P21M29m67n74M36M66l95L5o7L67J57p63L61
2050@O01k43j072J042K27q77l36J181l78n25N5L67l02L3K09J76L0j09n25J82Q01
2071E37q59m31Q73M96r16k14J129l4o80j74O97j06n04J03J83N32n55p91O64R26
2091H76q98j172J579L54j316j91Q20N73p84k31M41L43l77n94K16Q72j27r73J84
2110d05J154r77l62Q64O75j018j57P21j91k52K26k02L15j52m37J09M73m46m33
2129d95O08L88q25l88J154j79p79K59Q74r17J7m0R39m23l45j97M18O64r59J04
2149a22P42J34j020n42J527j81j134L94N69O0q09M5N11M8k38n15M09O38p74m86
2169g44Q92P06j250m65J010L10q54K3P55J82n94j10J71L00M8o46L83L80m03p41
$$ y = [-363, 774, 630, -879, -618, 707, -254, -706, 15, 444, -23, -597, -161, 305, -90, -55, -122, 245, 402, -361, 0, 601, 358, -714, 328, 555, -322, -658, 523, 145, -380, -325, 42, -260, -227, -18, 158, 188, 79, -446, -264, 537, -322, -753, 120, 616, -300, -514, 615, 581, -99, -273, 424, 318, -186, -83, 100, 632, 77, -714, -50, 876, -22, -1194, 385, 739, -577, -768, 52, 625, -159, -390, 51, 394, 17, -577, -361, 511, 384, -589, -405, 749, -228, -590, 274, 949, -69, -226, 495, 304, 52, 278, 76, 391, 239, -198, -89, 384, -62, -495, 113, 501, -324, -712, 442, 263, -516, -257, 617, -300, -283, -323, 616, 193, -152, -349, 69, 733, -226, -122, 620, 754, -266, -808, 719, 538, -596, -202, 367, 427, -382, -337, 174, 222, -16, -531, -122, 516, -258, -744, 148, 854, -396, -861, 149, 459, -395, -372, 383, 565, -29, -139, 32, 332, 380, -266, 117, 497, 94, -647]
2189f47Q79J12p17J03M76k89m87L97L43j44j62QJ44r7J4k18M91R7m23n42J181
2210E19J05q17o4J012o35m62N44L93m67m95K06N01j38n36k13R19m0j092O2J007
2230C09q2j016L96J010k62r29L14N97k6m21M3O1O69o10m75P29L10r00k43Q95p8
2251B91p87P8O21l31r3j05N02j83p0l69K68M55k95j83M07K63p55K79Q29n43q71
2272e92N50O41n65m17L73M67n16l01J51L63R4p42K09O08j86p38M60P56q28o82
2292h95R14M83l02q28Q24R1j68n51K82M97J31n74m72Q09L34r80J00J008n21p05
2312e23K79O33l10l53J74L57ll00j74K24K89o74q3Q94p2q38J66Q29l55n91M21
2333a0K77l61R2O5K26m41ok78P67l7j40k79O03k41p32M95K63m31k76N69k3n76
$$ y = [-647, 232, 344, -373, -270, 206, -83, -570, -173, 170, 26, -136, -128, 16, -81, -67, -285, 206, 303, -120, -662, 519, 624, -193, -257, 755, 120, -342, 202, 595, 128, -367, -161, 340, 202, -334, -547, 372, 332, -760, -698, 309, 227, -789, -393, 617, 355, -574, -260, 337, 311, -110, -67, -6, 663, 53, -422, 307, 617, -283, -526, 369, 291, -496, -418, 203, -128, -221, -326, 176, -7, -77, -446, -178, 277, -18, -201, 206, 469, -286, -7, 822, 279, -592, -42, 599, 34, -383, -10, 457, -59, -360, -209, 154, 248, -494, -285, 323, 137, -601, -141, 615, -213, -895, 19, 502, 200, -628, 196, 287, 119, -432, -150, 347, 478, -96, -568, 241, 575, -405, -305, 703, 182, -523, -244, 389, 79, -274, -100, 257, 254, -46, -220, 4, 293, -381, -464, 430, 358, -480, -314, 515, 160, -431, -10, 267, -94, -2, 63, 289, -152, -158, -436, 331, 294, 154, -125, 478, 237, -495, 0, 263, -168, -444, 125, 102, -474]
2355d74P9L56L63j84n41M11N75m30q15M89Q43p34l98M72O69o49k29K66J86k64
2375ik76L36J96j2p58M36K33K70q62P7Q55n50n35L35N14j78n12J37N97k77l09
2396b92PM49n9j34mM12k26m27K13K91j96l59L12K08l84k74Q75j61n46J72J06J6
2418aK16l22P1N49n27o84Q72L81o88k56O85J26o07M2N27J16p62P0L53Q0k72j23
2440a54L20j50j7l73M78L35o16k15N57L04o23J1K64r5O3j44q4M90k00k58J42N70
2462F05l67n42l6O26k86m87N29L26n14k1K95j0m09K26q4K34j82k39K32L85n46
2483b65J07M34J77q15L5N72j67K8j03J61q6l91K68J1J56j10l69M95J19l43l28
2504d14N62K35o43j37R25k44q83L99L62J0j73k79K10M01k04n15M08N23p66m25
$$ y = [-474, -395, -39, 324, 140, -401, 10, 585, 155, -660, -171, 672, -62, -460, 12, 681, 32, -197, 69, 255, -9, -285, 51, 247, 235, -523, -87, 146, 416, -446, -369, 486, -64, -599, -264, 250, 72, -440, -303, 294, 17, -292, -285, 164, 105, -29, -33, 379, 153, -274, -61, 230, 34, -325, -13, 195, -189, -463, 412, 251, -295, -123, -17, -1, 215, -107, -36, 513, -14, -698, 174, 555, -133, -389, 296, 422, -185, -143, 384, 500, -262, -192, 161, 241, -31, -154, 166, 16, -1, -374, 104, 439, -177, -392, 165, 469, -154, -143, 121, 26, 89, -55, -139, 351, 151, -107, 35, 605, 238, -304, -340, 286, 0, -487, 42, 368, -146, -167, 128, 118, -291, -65, -149, 85, -97, -336, -104, 281, -265, -158, 276, 453, -362, -327, 245, 78, 106, 3, 164, 78, -313, -45, -34, 122, 12, -357, 138, 257, -86, -414, 148, 383, -260, -397, 528, 284, -599, -200, 162, 172, -1, -280, -70, 331, 127, -388, 20, 543, -223, -648]
2524f48N87J60m19o6M97K64m23Q4J43m19L02j04k14K46O9j05P1K02m98K28J95
2545A52O1l19O3K07Q2n19K46L60k25k46l7K42k80M68n50L54K29o34K45M21m8o71
2567c99M4P43k95k17k3L72j29p7p9l8K26k95j92N20Q8n23K9N92K6o26M6M45J78
2590D16m86K14J71K08n91M5K6K60k38l33J75L18m87N7K86P3n62M21L33l48Kj12
2612a52J50K43k15L3R0L5k21P7K83j01l45K77R7l39N3QL59l09j01K86j43j80K00
2635H5l44J15J5j42K50J02K29o18o6O15k64k47J65M93l47j96l9L57L7n03j04K65
2657a42L58m09j98L13L02m82J09L26k63k9J03P6k8k34R1L28N8m53J30k2K17l56
2679b05K00K28j21j46J39K34l60m08K96J67J5r1k40K96j36j45O1L51j72j03l3
$$ y = [-648, -61, 99, -320, -386, 111, 375, -48, 36, 179, -240, 62, -42, -256, -10, 59, -46, 25, 227, -271, -43, 152, 213, -106, -43, 164, 246, -273, -27, 333, 108, -138, -175, 67, -213, 255, -295, 59, 288, -346, -101, 320, 272, -399, -355, 388, 93, -124, -147, 225, 96, 19, -60, -98, 128, -167, -359, 161, 249, -274, -245, 347, 373, -253, -207, 238, 416, -70, 144, 315, 523, -68, -23, 3, 263, 25, -308, -133, 185, -302, -245, 41, 114, -448, -27, 306, -42, -40, -152, -2, 241, 26, 59, 149, 184, -37, 40, 323, 222, -123, 154, 251, -88, -35, -27, 332, 23, -78, 208, 65, -115, 85, -259, -144, -129, -271, -21, 81, 310, -308, -374, 241, -23, -270, -105, 388, 41, -155, -194, 163, 200, -303, -407, -142, 216, -193, -391, -78, 224, -258, -149, 177, -86, -115, -12, 64, 36, -198, -107, 221, 279, -174, -44, -66, 151, -205, -5, 223, 102, -44, 95, 329, -31, -439, -143, 24, 39, -52, -292, 4, -132, -277, -216, 135, -37, -140, -173]
2700a73L17Q2l82J75N8j76K5j01M64k33l82M04L1q0k91K46K94l1n60L02M11k99
2722A01l56J32J05j02l60M45K14r0j78M6K20k05j16n5L20K20n52J89J04j44j0
2743g2J16Q5J6k61k80O02j26j30P8j9RL9k69K02p2K45l02K81m57m8K83J78j21
2766b3k76M25J43j55k68j13L22Q2L5j09K7r1j69L7M00n0n29K53K18j90j68M47
2788B48Rj96m67L84K05k50j20K8K17oj02j01N11k80k41K63K18j82m07J78J39O1
2810A09j14k19K87L3j76L2L65k37l71J56N38m15j18K23j06p2j14mMJ06J70n8L38
2833C57n41K48M1P2q5k07L66k07M0q0J72Kl73J46J07M0j47Q3j31M4K7%J04J61
2857B39m11j03M52q8k23M8P0R3j63QJ37J59k65J37j35K04k02j36K75nl36k27M46
$$ y = [-173, 144, 226, -156, 19, 77, -99, -74, -175, 289, 56, -326, 78, 109, 29, -262, -16, 278, 247, -313, -11, 400, 101, -255, -123, -18, -120, -480, -35, 179, 89, -89, -43, 177, -28, -144, -199, 121, 341, -211, -22, 82, -62, -72, 44, 129, 145, -116, -396, 206, 80, -50, 28, 9, 18, 57, -212, -10, -82, 163, -139, 142, -315, -363, -80, 98, -23, -299, 126, 269, 114, -154, -267, 55, 137, 172, 63, 90, -1, -170, -133, 267, 217, -312, -59, 159, -31, -199, 248, 257, 61, -406, -22, 183, -67, -187, -159, 58, 52, -50, -151, 360, 80, -161, 102, 320, 138, -269, -91, 48, 109, -5, -224, 63, 96, -80, -48, 317, 80, -291, -135, 403, -12, -130, 93, -13, -85, -199, -203, -199, -93, 77, 19, 357, -184, 64, 105, 177, 92, -115, 251, 44, 84, 4, 176, 178, -195, -49, 58, 98, -49, 34, -97, -53, -26, -26, 78, 239, -172, -275, 177, 89, -134, -86, -16, 77, -86, -78, 59, 218, -47, 90, -45, 159, -43, -179, 96, 91, -245, -472, -26]
2880b6K54r2p0j33K88j69j52K07K44k54j46K14J08l15n3J48J37l73j33M69j65
2901a2j71J3J03J29k49J08J07J50j54J04j57j01J12j78L95k84J03k1K20n4k92
2922a29J9L95j1m64K2L51r6j81N5J02j5j40O3N8K61o12o2L39k06L5O5J7J46J20
2946A32m50M39j39K83l72P5J37j56m9J04j27N7k3L42j5n21K32J82L1l7l41M19
2968B03q7P1k14oJ12j25j16K25O7m16o8L60P6l36J54K28N5p7k46K71k95N6J96
2991H8N9M21o66Q4kM86m03k59J34J22k53J37L5Q9o2j80j28L35r2k09J01J70k29
3014b22K26PJ82j75J06j97M8J12Jr0J70k67m8J43K01P1k04j80J51J33l09J52K8
$$ y = [-26, 228, 136, 66, -67, 221, 52, -100, 107, 351, 97, -49, 165, 273, -42, -95, 53, 190, -183, -316, 153, -12, -183, -170, -67, 62, -187, -79, 28, 178, 24, 128, -29, -130, -18, -196, 199, -85, 18, -3, 217, 163, -129, -110, 285, 274, -190, -168, 183, 87, -94, -39, 63, 48, -92, -29, 29, 290, -322, -384, -45, -251, -216, -151, -134, 12, 132, -318, 121, -18, 265, -107, -32, 105, -51, -100, 4, -123, -66, -89, 253, 238, -283, -51, 131, 162, 125, -216, 203, 116, 187, -27, -33, 79, -46, -162, 63, 130, -286, -354, 6, 82, -254, -100, 128, 183, 106, -140, 131, -164, -108, 88, 147, 568, -98, -14, -16, 470, 67, -192, -58, 64, -189, -52, -17, 72, 10, -170, -298, 37, -55, -264, -163, 7, -222, 4, 11, 193, 18, 124, -73, -25, 87, 88, -2, 168, -99, -147, -4, 197, 268, 64, -116, 35, 168, -141, 11, 39]
$$ [...]
8191g
##END NTUPLES=NMR FID
##END=
