##TITLE=1H_SL1-5ID(290mg)
 CDCl3
 8 sc, 
 14.1.2022
##JCAMPDX= 6.0         $$ Bruker NMR JCAMP-DX V2.0
##DATA TYPE= NMR FID
##DATA CLASS= NTUPLES
##ORIGIN= UXNMR, Bruker Analytische Messtechnik GmbH
##OWNER= root
$$ XWIN-NMR		Version 3.5
$$ Fri Jan 14 14:39:23 2022 Russian Standard Time (UT+4h)  she@DPX200
##.OBSERVE FREQUENCY= 200.131346
##.OBSERVE NUCLEUS= ^1H
##.DELAY= (6, 6)
##.ACQUISITION MODE= SIMULTANEOUS
##.ACQUISITION SCHEME= undefined
##.AVERAGES= 8
##.DIGITISER RES= 18
##SPECTROMETER/DATA SYSTEM= spect
##.PULSE SEQUENCE= zg30
##.SOLVENT NAME= CDCl3
##.SHIFT REFERENCE= (INTERNAL, CDCl3, 0, 15.7039)
##AUDIT TRAIL= $$ (NUMBER, WHEN, WHO, WHERE, WHAT)
$$ ##TITLE= Audit trail, XWIN-NMR		Version 3.5
$$ ##JCAMPDX= 5.01
$$ ##ORIGIN= Bruker BioSpin GmbH
$$ ##OWNER= she
$$ F:/spectra/data/she/nmr/H-F/1/audita.txt
$$ ##AUDIT TRAIL=  $$ (NUMBER, WHEN, WHO, WHERE, WHAT)
(   1,<2022-01-14 14:38:00.01 +0400>,<she>,<DPX200>,
      <created by zg, POWCHK disabled, PULCHK disabled
       configuration hash MD5:
       00 E9 B6 7A A2 85 ED C7 34 08 36 98 17 FE 4E 26
       data hash MD5: 16K
       09 CA 1B 5F 75 E3 C2 77 F5 43 8E 11 DD 60 DD 48>)
$$ ##END=
$$ 
$$ hash MD5
$$ 14 0C 04 7E 1E 2F C4 15 42 CE CA EF 91 7B A9 9C
##$RELAX= 
##$RELAX= 
##$RELAX= 
##$RELAX= 
##$RELAX= 
##$RELAX= 
$$ Bruker specific parameters
$$ --------------------------
##$DU= <F:/spectra>
##$EXPNO= 1
##$NAME= <H-F>
##$PROCNO= 1
##$TYPE= <nmr>
##$USER= <she>
##$AMP= (0..31)
100 100 100 100 100 100 100 100 100 100 100 100 100 100 100 100 100 100 
100 100 100 100 100 100 100 100 100 100 100 100 100 100 
##$AQSEQ= 0
##$AQ_mod= 1
##$AUNM= <au_zg>
##$AUTOPOS= <>
##$BF1= 200.13
##$BF2= 200.13
##$BF3= 200.13
##$BF4= 200.13
##$BF5= 200.13
##$BF6= 200.13
##$BF7= 200.13
##$BF8= 200.13
##$BYTORDA= 1
##$CFDGTYP= 0
##$CFRGTYP= 5
##$CHEMSTR= <none>
##$CNST= (0..31)
1 1 145 1 1 1 1 1 1 1 1 1 1 1 1 1 1 1 1 1 1 1 1 1 1 1 1 1 1 1 1 1 
##$CPDPRG= <>
##$CPDPRG1= <>
##$CPDPRG2= <>
##$CPDPRG3= <>
##$CPDPRG4= <mlev>
##$CPDPRG5= <mlev>
##$CPDPRG6= <mlev>
##$CPDPRG7= <mlev>
##$CPDPRG8= <mlev>
##$CPDPRGB= <>
##$CPDPRGT= <>
##$D= (0..31)
0 1.2 0 0 0 0 0 0 0 0.06 0 0.03 0 0 0 0 0.0002 0 0 0 0 0 0 0 0 0 0 0 0 
0 0 0 
##$DATE= 1642156679
##$DBL= (0..7)
120 120 120 120 120 120 120 120 
##$DBP= (0..7)
150 150 150 150 150 150 150 150 
##$DBP07= 0
##$DBPNAM0= <>
##$DBPNAM1= <>
##$DBPNAM2= <>
##$DBPNAM3= <>
##$DBPNAM4= <>
##$DBPNAM5= <>
##$DBPNAM6= <>
##$DBPNAM7= <>
##$DBPOAL= (0..7)
0.5 0.5 0.5 0.5 0.5 0.5 0.5 0.5 
##$DBPOFFS= (0..7)
0 0 0 0 0 0 0 0 
##$DE= 6
##$DECBNUC= <off>
##$DECIM= 32
##$DECNUC= <off>
##$DECSTAT= 4
##$DIGMOD= 1
##$DIGTYP= 9
##$DL= (0..7)
0 120 120 120 120 120 120 120 
##$DP= (0..7)
150 150 150 150 150 150 150 150 
##$DP07= 0
##$DPNAME0= <>
##$DPNAME1= <>
##$DPNAME2= <>
##$DPNAME3= <>
##$DPNAME4= <>
##$DPNAME5= <>
##$DPNAME6= <>
##$DPNAME7= <>
##$DPOAL= (0..7)
0.5 0.5 0.5 0.5 0.5 0.5 0.5 0.5 
##$DPOFFS= (0..7)
0 0 0 0 0 0 0 0 
##$DQDMODE= 0
##$DR= 18
##$DS= 0
##$DSLIST= <SSSSSSSSSSSSSSS>
$$ [...]
##$SUBNAM2= <"">
##$SUBNAM3= <"">
##$SUBNAM4= <"">
##$SUBNAM5= <"">
##$SUBNAM6= <"">
##$SUBNAM7= <"">
##$SUBNAM8= <"">
##$SUBNAM9= <"">
##$SW= 18.0517287032376
##$SWIBOX= (0..15)
0 0 2 0 0 0 0 0 0 0 0 0 0 0 0 0 
##$SW_h= 3612.71676300578
##$TD= 16384
##$TD0= 1
##$TE= 0
##$TE2= 300
##$TE3= 300
##$TEG= 300
##$TL= (0..7)
0 120 120 120 120 120 120 120 
##$TP= (0..7)
150 150 150 150 150 150 150 150 
##$TP07= 0
##$TPNAME0= <>
##$TPNAME1= <>
##$TPNAME2= <>
##$TPNAME3= <>
##$TPNAME4= <>
##$TPNAME5= <>
##$TPNAME6= <>
##$TPNAME7= <>
##$TPOAL= (0..7)
0.5 0.5 0.5 0.5 0.5 0.5 0.5 0.5 
##$TPOFFS= (0..7)
0 0 0 0 0 0 0 0 
##$TUNHIN= 0
##$TUNHOUT= 0
##$TUNXOUT= 0
##$USERA1= <user>
##$USERA2= <user>
##$USERA3= <user>
##$USERA4= <user>
##$USERA5= <user>
##$V9= 5
##$VALIST= <valist>
##$VCLIST= <CCCCCCCCCCCCCCC>
##$VD= 0
##$VDLIST= <DDDDDDDDDDDDDDD>
##$VPLIST= <PPPPPPPPPPPPPPP>
##$VTLIST= <TTTTTTTTTTTTTTT>
##$WBST= 1024
##$WBSW= 4
##$XGAIN= (0..3)
0 0 0 0 
##$XL= 0
##$YL= 0
##$YMAX_a= 61161
##$YMIN_a= -111750
##$ZGOPTNS= <>
##$ZL1= 120
##$ZL2= 120
##$ZL3= 120
##$ZL4= 120
##$ABSF1= 10
##$ABSF2= 0
##$ABSG= 5
##$ABSL= 3
##$ALPHA= 0
##$AQORDER= 0
##$ASSFAC= 0
##$ASSFACI= 0
##$ASSFACX= 0
##$ASSWID= 0
##$AUNMP= <proc_1d>
##$AZFE= 0.1
##$AZFW= 0.1
##$BCFW= 1
##$BC_mod= 2
##$BYTORDP= 1
##$COROFFS= 0
##$CY= 11.3945322036743
##$DATMOD= 1
##$DC= 2
##$DFILT= <>
##$DTYPP= 0
##$F1P= 2.36226072786647
##$F2P= -0.459571619588291
##$FCOR= 0.5
##$FTSIZE= 0
##$FT_mod= 4
##$GAMMA= 1
##$GB= 0.15
##$INTBC= 1
##$INTSCL= 1
##$ISEN= 128
##$LB= 0.24
##$LEV0= 0
##$LPBIN= 0
##$MAXI= 10000
##$MC2= 0
##$MEAN= 0
##$ME_mod= 0
##$MI= 1.114404
##$NCOEF= 0
##$NC_proc= 0
##$NLEV= 6
##$NOISF1= 3.799351
##$NOISF2= 2.8
##$NSP= 1
##$NTH_PI= 0
##$NZP= 0
##$OFFSET= 15.70392
##$PC= 1
##$PHC0= -15871.64
##$PHC1= 13.40078
##$PH_mod= 1
##$PKNL= yes
##$PPARMOD= 0
##$PSCAL= 0
##$PSIGN= 0
##$REVERSE= no
##$SF= 200.130013532006
##$SI= 16384
##$SIGF1= 3
##$SIGF2= 2
##$SINO= 400
##$SIOLD= 16384
##$SREGLST= <1H.CDCl3>
##$SSB= 0
##$STSI= 0
##$STSR= 0
##$SW_p= 3612.71676300578
##$SYMM= 0
##$S_DEV= 0
##$TDeff= 0
##$TDoff= 0
##$TI= <>
##$TILT= no
##$TM1= 0
##$TM2= 0
##$TOPLEV= 0
##$USERP1= <user>
##$USERP2= <user>
##$USERP3= <user>
##$USERP4= <user>
##$USERP5= <user>
##$WDW= 1
##$XDIM= 8192
##$YMAX_p= 0
##$YMIN_p= 0
$$ End of Bruker specific parameters
$$ ---------------------------------
##NTUPLES= NMR FID
##VAR_NAME=  TIME,          FID/REAL,        FID/IMAG
##SYMBOL=    X,             R,               I
##VAR_TYPE=  INDEPENDENT,   DEPENDENT,       DEPENDENT
##VAR_FORM=  AFFN,          ASDF,            ASDF
##VAR_DIM=   8192,          8192,            8192
##UNITS=     SECONDS,       ARBITRARY UNITS, ARBITRARY UNITS
##FACTOR=    0.0002768,     1,               1
##FIRST=     0,             0,               0
##LAST=      2.2672688,     0,               0
##MIN=       0,             -111750,         0
##MAX=       2.2672688,     61161,           0
$$ Real data points
##PAGE= N=1
##DATA TABLE= (X++(R..R)), XYDATA
0@%%%%%%%%%%%%%%qJ6j6J6j6K4l2L2m0M8n6P2q3R1j04J20j43J67j87K11k40K72
$$ 0 0 0 0 0 0 0 0 0 0 0 0 0 0 0 -8 8 -8 8 -8 16 -16 16 -24 24 -32 40 -43 48 -56 64 -79 88 -99 112 -128 144
36A44l04L41l84M30m78N30n90O57p27Q02q87R80j080J189j310J444j589J752j937
$$ 144 -160 181 -203 227 -251 279 -311 346 -381 421 -466 514 -566 623 -687 757 -832 920 -1017
55a017K141k373K636k939L297l718M227m860N667o738Q241j0517J4406k2857P5565
$$ -1017 1124 -1249 1387 -1552 1745 -1973 2254 -2606 3061 -3677 4564 -5953 8453 -14404 61161
70F1161n7707q3520J22840k0157n6336L5612K6179m1313J3190P943l4816L906
$$ 61161 3454 -80066 42774 22617 -33719 1893 28072 -13241 -51 7892 -26924 -23018
82b3018M6833j8660k0814J9612O63k6742R999K4772j0866k1582K4936P378k6311
$$ -23018 23815 5155 -15659 3953 4616 -22126 -12127 12645 1779 -19803 5133 12511 -13800
95a3800J0528J8598j7570Q295J4172k9425j0825L7618l64k6800J7408Q186k5100
$$ -13800 -3272 15326 -2244 6051 20223 -9202 -20027 17591 17227 -9573 7835 16021 -9079
108i079Q708Q368j5805R087N802k3970m039J8645J470p303Q586M181p428J268
$$ -9079 -371 7997 -7808 1279 7081 -16889 -20928 -2283 -813 -8116 470 4651 -2777 -1509
122a509J938J424Q388j681j1201m444P523L638r486O832J5927j3615j1968J2247
$$ -1509 429 1853 10241 8560 -2641 -7085 438 4076 -5410 1422 17349 3734 -8234 4013
136D013j519r468R504M606r682K781K329j6629N239K0524r696r779J0633j856
$$ 4013 2494 -6974 2530 7136 -2546 235 2564 -14065 -8826 11698 2002 -7777 2856 1000
150A000q498L139M805J860M32l880n758N942J1367m156q353M996L132j0635m724
$$ 1000 -7498 -4359 446 2306 2738 -1142 -6900 -958 10409 6253 -2100 2896 6028 -4607 -9331
165i331J3096L705r676K789m7q017R448L854j1964P916J1936j5521q974J2514
$$ -9331 3765 7470 -2206 583 536 -7481 1967 5821 -6143 1773 13709 -1812 -10786 1728
179A728k443p153J1995L24j1491P095K139j1179O562J1544p370p559O595K779
$$ 1728 -715 -7868 4127 4451 -7040 55 2194 -8985 -2423 9121 1751 -5808 787 3566
193C566q031K768J0451m823q876M545L277m093N017L868j1774R81J1989j2490
$$ 3566 -4465 -1697 8754 3931 -4945 -400 2877 -1216 3801 7669 -4105 -3124 8865 -3625
207c625q367J9177J079j5749M331N793q546J843O346n745J498O653r564l166J3428
$$ -3625 -11992 7185 8264 -7485 -3154 2639 -5907 -4064 2282 -3463 -1965 4688 -4876 -8042 5386
222E386j215r006P026P340r230p698Q594P429m870j721Q48n584n42M619l891J73
$$ 5386 4171 -4835 2191 9531 301 -7397 1197 8626 3756 2035 2883 -2701 -3243 1376 -2515 -2342
238b342J0484m769j4260O654Q108r660K231R444p104l546N696m756k898J0311
$$ -2342 8142 3373 -10887 -4233 3875 -5785 -3554 5890 -1214 -4760 936 -3820 -6718 3593
252C593J094p544M141N089n889k134N008O28j876N17j456l502J932M265m212l496
$$ 3593 4687 -2857 1284 6373 484 -1650 3358 3986 2110 2627 1171 -2331 -399 3866 -346 -3842
268c842N919k118q534N944P531o914k669M771k270j097N340k713n93P314m916
$$ -3842 2077 -41 -8575 -2631 4900 -2014 -4683 88 -2182 -3279 2061 -652 -1245 6069 1153
283A153p312Q168L398p082K028M913n134k762M336N69j691J037o32j960L66K41
$$ 1153 -6159 2009 5407 -1675 353 5266 132 -2630 1706 2275 584 1621 989 -971 -605 -364
299c64k235o33M846R10p096n36N040j318N27M539l069k075M448m002m576R017
$$ -364 -2599 -3232 1614 2524 -4572 -5108 -68 -1386 -859 3680 611 -1464 2984 -1018 -5594 3423
315C423K987q399J969L776o929Q83O613l943j832M814m283m030O798J725o338
$$ 3423 6410 -1989 -20 3756 -3173 -2290 4323 380 -1452 3362 -921 -4951 1847 3572 -2766
330b766P88N461k907m670K461M088j721j369J000k152n93M231k085l121O990J541
$$ -2766 -1978 3483 576 -4094 -1633 2455 734 -635 365 -1787 -2380 1851 -234 -3355 3635 5176
346E176r951P72P601l355j951N061k337l076K885j988k228O805P26p163J832M822
$$ 5176 -4775 -4003 3598 243 -1708 3353 1016 -2060 825 -1163 -3391 3414 4140 -3023 -1191 3631
362C631l254k028L681K61k919j044O27N86L39O3q80j092J796m68k833L214M392
$$ 3631 377 -1651 2030 2291 -628 -1672 -1045 -459 -120 -57 -937 -2029 -233 -701 -3534 -320 4072
379D072m287j985M429j860l592M650J163k637K558p07n003L180M376m419n30L604
$$ 4072 -215 -2200 2229 369 -3223 1427 2590 -47 2511 1804 -3199 -19 4357 -62 -592 3012
395C012k638l707K793J085j018J370p58l533N25L211j238k021L282K321n138j662
$$ 3012 374 -3333 -540 545 -473 897 139 -3394 -2869 342 -896 -2917 365 2686 -2452 -4114
411d114N357N17j542K950l10l093K770M0n174L565M995o246l283N582j620m244
$$ -4114 1243 1760 218 3168 2858 -235 2535 2575 -2599 966 5961 -285 -3568 2014 394 -3850
427c850L548K216k835o2m90j447K508J651l510n96M085l07m055J810M986r95l507
$$ -3850 -302 1914 -921 -983 -1473 -2920 -412 1239 -2271 -2867 1218 911 -3144 -1334 3652 2657 -850
444h50J330N45j932K784J543l621J104K462m418p62M876j752l942L561l32n179
$$ -850 480 1025 -907 1877 3420 -201 903 3365 -1053 -1815 3061 1309 -2633 928 596 -4583
460d583J982K716k379P50K598k343j089L152P4j557K111J368k591j643J803Q08
$$ -4583 -2601 115 -2264 -1514 1084 -1259 -2348 804 878 -679 1432 2800 209 -1434 369 1177
476A177l06J065j85k051J55J113k264N09M035j940m751K315K021k567P34J595
$$ 1177 871 1936 1751 -300 -145 968 -1296 -787 3248 1308 -3443 -1128 893 -1674 -940 655
492F55j029L48M76l253O94M071j877k396L221Q43k737M57K386K36o52o96j124
$$ 655 -374 -26 450 -2803 -2109 1962 85 -2311 910 1753 -984 -527 1859 2095 1443 747 -377
509c77J59J150p90j537K110J174l158j553L104J054k209Q70P05k067P65Q73j763
$$ -377 -218 932 142 -1395 715 1889 -1269 -2822 282 1336 -873 -3 702 -1365 -600 273 -1490
526a490J544K278l077j566L389k06k723K270J211k548J73J095j199R01K283j318
$$ -1490 54 2332 -745 -2311 1078 872 -1851 419 1630 -918 -745 350 -849 52 2335 1017
542A017k136J933Q84k630O3K881r92k238J003J08j759J869J640k371K15K110l143
$$ 1017 -1119 814 1698 -932 -869 2012 1020 -1218 -215 -107 -1866 3 1643 -728 -513 1597 -1546
559a546j329M529n18l487K346J399l074M29K406r28J38J258k149q53K905J52k753
$$ -1546 -2875 1654 1136 -2351 -5 1394 -1680 -1251 1155 227 365 1623 -526 -1379 1526 1678 -1075
576a075J345K615j935k685J822J383j248m72O99j354q35J245j070j16L154q24
$$ -1075 270 2885 950 -1735 87 1470 222 -250 449 -905 -1740 -495 -1565 -1681 1473 649
592F49l765K256K711k841k97K966p03j469J236n85m59K452k95k293O80J404j516
$$ 649 -3116 -860 1851 -990 -1287 1679 976 -493 743 158 -301 2151 1856 -437 243 1647 131
609A31q10J315K39j006n80m4m28L31J185p32j022Q54J74j542P68K141r55o25J041
$$ 131 -679 636 875 -131 -711 -755 -1183 -852 333 -399 -1421 -567 -393 -1935 -1167 974 19 -606 435
628D35k93l47J371k51k22J266o56k315J386J252j797j08J338n74j629k92Q27N37
$$ 435 142 -205 1166 915 693 1959 1303 -1012 374 1626 -171 -279 1059 485 -1144 -1436 -609 -72
646g2L59j310o15P89M79p58J48J701N13j854J36J512o52n49J341k21n68L12o93
$$ -72 287 -1023 -1638 -849 -370 -1128 -980 721 1234 -620 -484 1028 376 -173 1168 947 379 691 -2
665bm65J795J64k364N40J660j899j013J731N2p20K94p60n83J479P06j290O7J437
$$ -2 -467 1328 1492 -872 -332 1328 -571 -1584 147 199 -521 -227 -987 -1570 -91 615 -675 -608 829
684H29n26j406O80J435l19m75L81n23m93J327m45j355J902M48k752M2K313r50
$$ 829 303 -1103 -423 1012 693 218 599 76 -417 910 465 -890 1012 1460 -1292 -1250 1063 113
702A13j179J647k54j375J252l79q57J809M55k386J16J926r27j092J555R87j780
$$ 113 -1066 581 327 -1048 204 -175 -1032 777 1232 -1154 -1038 888 -39 -1131 424 1411 -369
719c69m75Q77L5k80P50j83p94Q88Pj654Q87K214j667j405J808R9j729Q75J321
$$ -369 -844 33 68 -212 538 355 -439 449 456 -1198 -311 1903 236 -1169 639 738 -991 -116 1205
738A205j290J13O17j540L24J639j240r11J708k35j853N09J371m70k66N01k43l82
$$ 1205 -85 28 645 -895 -571 1068 -172 -1083 625 390 -1463 -954 417 -53 -319 182 -61 -443
756d43M29N25o69O40Q64j368o87J305K61j076P68K42r72p8L13p36K52J496j414
$$ -443 -14 511 -158 482 1346 -22 -709 596 857 -219 549 791 -181 -259 54 -682 -430 1066 -348
775c48j256J280N61j335M25Q63k4j16l97m73J040R29r07n92R74M11j335p9J685
$$ -348 -1604 -324 237 -1098 -673 190 166 50 -347 -820 220 1149 242 -350 624 1035 -300 -379 1306
794A306l32j057L58J32n71j8L51m16L29K2j256lJ440n54j107J296M29r62J84P57
$$ 1306 974 -83 275 407 -164 -182 169 -247 82 104 -1152 -1155 285 -269 -1376 -80 349 -613 -429 328
814C28l00L14M76o39k42P46M8o38M17N14r00m86P48k09n65N33K02r42M7M71r42
$$ 328 28 342 818 179 -63 683 731 93 510 1024 124 -362 386 177 -388 145 347 -595 -548 -77 -1019
835a019J63J416l44j464R77N08r20L26Q55l82J71L33q52J07J385m40j099O70O42
$$ -1019 -856 560 216 -1248 -271 237 -683 -357 498 116 287 620 -232 -125 1260 820 -279 391 1033
854A033j176o04R82L54o78k74m4j88M33K63o79L36Q02p57j219J279Q76j289Q7
$$ 1033 -143 -747 235 589 -89 -363 -407 -595 -162 101 -578 -242 560 -197 -1416 -137 739 -550 -463
873d63J033l25m26L79k77M7R73q68p39J067J76r53J70R11m55p26O28k08l93P06
$$ -463 570 245 -181 198 -79 -32 941 73 -666 401 577 -376 -206 705 250 -476 152 -56 -449 257
893B57j1o81J4M78l04k01P89L0o73J76M75m98k65J043n45m28P42m92r01J198O04
$$ 257 246 -435 -421 57 -247 -448 341 371 -302 -126 349 -149 -414 629 84 -344 398 -94 -995 203 807
914H07j176K59Q77o64n27P20j68k16O31l50p03Q96J92r81J31Q20m17r89K80O30
$$ 807 -369 -110 767 103 -424 296 128 -88 543 193 -510 386 578 -403 -272 548 131 -858 -578 52
934E2k93j25L21n8KJ30l05j31J073j02j111M33R92p37m55Q26K35q30L98k85j12
$$ 52 -241 -366 -45 -103 -101 29 -276 -407 666 564 -547 -114 878 141 -314 512 747 -83 315 30 -82
955h2L73p1p86K95M78o22k38O55J29m38j91K07j47L2L73j8k15N59K55q58M36R16
$$ -82 291 220 -566 -271 207 -415 -653 2 131 -307 -498 -291 -438 -406 -33 -51 -266 293 548 -310 126 1042
977A042n94k49M13r5n00K95j65l49O31J8j231M31N53l71n75O40No12K18K04LL50
$$ 1042 448 199 612 517 17 312 147 -202 429 447 -784 -353 200 -171 -746 -106 -101 -713 -495 -291 -288 62
999F2k4k12L56L16o19j3O88L10p54j86O74j8o63K24M44m50ql54n02O45M55q88
$$ 62 38 -174 182 498 -121 -134 554 864 110 -76 598 580 -83 141 585 135 127 -227 -729 -84 371 -517
1021e17j31P46l19m90N70L92l95K9J27j71L26J94j94k16P72m23n15K63M94j05
$$ -517 -648 98 -221 -711 -141 251 -144 -115 12 -159 167 361 167 -49 723 300 -215 48 542 437
1041D37m94M19k57l92J73M4l29M06L54q23l30Q17O5l79M32ql77J55J3j90M27L20
$$ 437 -57 362 105 -287 -114 -70 -399 7 361 -462 -792 25 90 -289 143 135 -242 -87 -74 -264 163 483
1063D83m31k59N52j07m32K31O49m94m17K01Rj55L59j13j41J31Q2p34J65R47n27
$$ 483 52 -207 345 238 -194 37 686 192 -225 -24 -15 -170 189 76 -65 66 148 -586 -421 526 -1
1084an70N48K31m52M4K88K8j87L1j86J29K72k64j52M21K48n91k63P18J42m79L26
$$ -1 -571 -23 208 -244 -200 88 116 -71 -40 -226 -97 175 -89 -241 180 428 -163 -426 292 434 -45 281
1106B81q6q7j06O3o3Q0L49m19l87L90J61m36p2L41n5j64J72j39R5L39L3n72K79
$$ 281 195 108 2 65 2 82 431 12 -375 15 176 -260 -332 9 -46 -210 -38 -177 -82 257 290 -282 -3
1129cL95m79l2L57J38k60o5j23K11M1n5j42L39M7n30l83O65nk86j99L04j1m18
$$ -3 392 -87 -119 238 376 116 51 -72 139 180 125 -17 322 369 -161 -544 121 116 -170 -369 -65 -76 -494
1152d94L37p6J11J70l25j69O65J27l29N1M10m10j55M71P7m5Rl18k7MP6o17L87
$$ -494 -157 -233 -122 48 -277 -446 219 346 17 68 478 68 -87 384 461 416 425 107 80 84 160 -457 -70
1175g0L06l41m19L67mk00J58K40r6p3K09k54q7N45K53p32L60L54l27k98M52kl25
$$ -70 236 -105 -524 -157 -161 -361 -203 37 -59 -132 77 -177 -264 281 534 -198 162 516 189 -109 343 341 16
1198A6Q5r3k20K34K25n76p0O47m14m82M47L02l69j34J25J1J32J46r1l2M75j41
$$ 16 101 8 -212 22 247 -329 -399 248 -166 -648 -201 101 -268 -402 -277 -266 -134 12 -79 -111 364 223
1220B23n44M00N22n06j63L79j13l25K15k7J8J42j28n35L39L25o01j08N98l7j99
$$ 223 -321 79 601 95 -68 311 198 -127 88 61 79 221 93 -442 -103 222 -379 -487 111 74 -125
1241a25j86L13k31J37P1N8Q8q5Pj97L89L05l88o8J68k23j98K30R8j19m3O9l49
$$ -125 -311 2 -229 -92 -21 37 125 40 47 -150 239 544 156 88 256 33 -165 65 163 44 1 70 -279
1264b79K50K64k68k01L72j00l96K31J92n3N4N4m07K48K24j39l99O00J33p57O2
$$ -279 -29 235 -33 -234 138 38 -358 -127 65 12 66 120 -287 -39 185 46 -353 247 380 -377 -315
1285c15P55k25k87J34R2q1j75k0J15L43m8m18k6L13m9l39Q7M89k74j74P4o7J59
$$ -315 440 215 -72 62 154 73 -102 -122 -7 336 288 -130 -156 157 108 -231 -144 345 71 -103 -29 -96 63
1308F3k5l19O2L79k06j40J61K06l21Q7M7J4R1K08n7O7l7ql88K95j1j50j66K72
$$ 63 38 -281 -219 160 -46 -186 -25 181 -140 -53 -6 8 99 307 250 317 280 272 -116 179 168 18 -148 124
1332A24o7k23K18j51j15J28J20k77j18K60N5k01K07J39q6k52L50R0n7J60j75j51
$$ 124 57 -166 52 -99 -214 -86 34 -243 -361 -101 -46 -247 -40 99 13 -239 111 201 144 304 129 -22
1354b2L67j07m19K60M18m25k97L58j7m19M2J42q4O0j59J00O0K98k51j77M33Q5
$$ -22 345 238 -181 79 497 72 -225 133 116 -303 -261 -119 -203 -143 -302 -202 -142 156 -95 -272 161 246
1376B46m18N9P09k79j64j4j12J80o5j50P2J37Q3k81k03L47j63k39P1J47j83J3
$$ 246 -172 -113 596 317 153 139 27 207 142 -8 64 201 284 3 -200 147 -16 -255 -184 -37 -220 -207
1398b07J00j84K69J90j91j88M03j08k73J72L59l12MJ81j9o5R8l11j62L69q3k60
$$ -207 -107 -291 -22 168 -23 -211 192 84 -189 -17 342 30 34 215 196 131 229 -82 -244 125 42 -218
1420b18j36L67l3m27K30N6r0o6K37N2J18j23k11R4L93j74j20J40O4j20j74K36
$$ -218 -354 13 -20 -447 -217 -161 -251 -317 -80 -28 90 -33 -244 -150 243 69 -51 89 153 33 -141 95
1442I5Q7r6j82N7L7P6k03k5K44J56n42m5M15L8k26R8J1q2Pj20K40l1P8l5j76K41
$$ 95 182 86 -96 -39 -2 74 -129 -154 90 246 -296 -341 74 112 -114 -16 -5 -87 -80 -200 40 9 87 52 -124 117
1468A17j1l05RM36j64j18J4MP4J05l2j58J41o4j6j93L80L3j69m3k09L04k1k00
$$ 117 106 -199 -190 246 82 -36 -22 -18 56 161 129 -29 112 48 32 -161 219 252 83 40 -169 135 114 -86
1492h6M1J0K0rk90M81o2j99K5J36N9k24N4J89r7pj19Q1J85M0k69N9K09n5l34J94
$$ -86 -45 -35 -15 -24 -314 167 105 -94 -69 67 126 -98 -44 145 48 41 -78 3 188 228 -41 18 227 172 -162 32
1518C2J9p3k1R7k70L9J49k39P0L11j93j74J96J32k5j25K50M0j45n4J07O0J77j20
$$ 32 51 -22 -43 54 -216 -177 -28 -267 -197 114 -79 -253 -57 75 50 -75 175 215 70 16 123 183 360 240
1542B40j70L2J89k76j55L21q1k38j32J84j56k4K56j20n4K07j04k66K49L20j46
$$ 240 70 102 291 15 -140 181 100 -138 -270 -86 -242 -266 -10 -130 -184 23 -81 -347 -98 222 76
1563G6p5L10j16j68M8K19m6r6K31n88K40J68k3l06K7K55l66j12J22O2oM0k32R5
$$ 76 1 311 195 27 75 294 248 152 383 -205 35 203 180 -126 -99 156 -210 -322 -200 -138 -144 -104 -336 -241
1587b41K11L5k12K70J68k86j02K52L2j53J12j1P4n5PJ8M4mj86j40K30q4j53L2
$$ -241 -30 5 -207 63 231 -55 -157 95 127 -26 86 75 149 94 101 119 163 159 -27 -167 63 -21 -174 -142
1611a42L16k98J36m7n8J02J98k55j61K22K17l35O3J09l4j14K79j39r9J92k86M8
$$ -142 174 -124 12 -35 -93 9 207 -48 -209 13 230 -105 -42 67 33 -81 198 59 -40 152 -134 -86
1633h6K40j89j98P9L44Mm65J86R5N1j59P2k02K94J8r6p2K26P2n03L65J07k19j57
$$ -86 154 -35 -233 -154 190 194 -271 -85 10 61 -98 -26 -228 66 84 -12 -84 142 214 -289 76 183 -36 -193
1657a93K50j99K12k3m6o4L38j28l11J75K66m38J08J89J34k75j19K51q3J24j99
$$ -193 57 -142 70 47 1 -63 275 147 -164 11 277 -161 -53 136 270 -5 -124 127 44 168 -31
1678c1j55M4K03k38Q9J57k4k54K17O1P9j63K48l36K15P6nk83K81K61n17N5J71
$$ -31 -186 -142 61 -177 -88 69 45 -209 8 69 148 -15 233 -103 112 188 183 -100 181 442 -75 -20 151
1701A51l3j46K9L4k8j56M9N2l1L66k22l06K55P1l84N9J61J52j37LR9j28L97p5
$$ 151 118 -28 1 35 7 -149 -100 -48 -79 287 65 -241 14 85 -299 -240 -79 73 -64 -61 38 -90 307 232
1725B32l33K04K82l62q9J41J46l02Q4K3k6j34P1llL4r3j75L91j06j78L1L46j55
$$ 232 -101 103 385 23 -66 75 221 -81 3 26 0 -134 -63 -66 -69 -35 -128 -303 88 -18 -196 -165 181 26
1749B6j84L35j03l5J31m8j39K21j48j8j1J35j06p8L1n5j9k6J22j22j49K05j04
$$ 26 -158 177 74 39 170 122 -17 204 56 38 27 162 56 -22 9 -46 -65 -91 31 -91 -240 -35 -139
1772a39k6K41L0k92K45M1J7j45M3J46j58J00o6j50J91J5j05l2K72j13k41J0o6
$$ -139 -165 76 106 -186 59 100 117 -28 15 161 3 103 37 -113 78 93 -12 -44 228 115 -126 -116 -182
1795a82J04M7j18%J01k9J0J8K25l53j33L79M2j36J34n5J39j93q6J81J06n8j19
$$ -182 -78 -31 -149 -149 -48 -77 -67 -49 176 -177 -310 69 111 -25 109 54 193 0 -86 95 201 143 24
1818B4p8J34O2k26JJ36q2J35r7N2k74J75R6k55K77J49l99kK27P8k77N3L09l77
$$ 24 -54 80 142 -84 -83 53 -29 106 9 61 -213 -38 58 -197 80 229 -170 -172 55 133 -144 -91 218 -159
1842a59J81J45k52J41j56J98q2Q9O0j21j54M9J9m3L3k3N4J71j65N2R8j49J01j10
$$ -159 22 167 -85 56 -100 98 16 105 165 44 -110 -61 -42 -85 -52 -75 -21 150 -15 37 135 -14 87 -23
1866b3K5J48m02K8J42L3lR7j48J1J16j45R3J25j2j89J42J61j36j59J36K01j23
$$ -23 2 150 -252 -224 -82 -49 -52 45 -103 -92 24 -121 -28 97 85 -104 38 199 63 -96 40 241 118
1889A18o8j99J80p0Q3q9j19K75m6l17J61K84k84M7m1R9j16K00j13r4L33m8j35
$$ 118 50 -149 31 -39 44 -45 -164 111 65 -252 -91 193 -91 -44 -85 14 -102 98 -15 -109 224 176 41
1912D1P2J60j53K5J45l4j81j46j00R6R9J5j11l0J06j7k13N8J09j38J02j40K34
$$ 41 113 273 120 145 290 256 75 -71 -171 -75 24 39 -72 -102 4 -13 -226 -168 -59 -197 -95 -235 -1
1935aN6o8m1R2p2J67j45K17L7j50J27r0l3qmj7n5J2j26j07J41n6j43J57K4J57
$$ -1 55 -13 -54 38 -34 133 -12 205 242 92 219 129 96 88 84 67 12 24 -102 -209 -68 -124 -267 -110 -86 71
1961G1k83P2rK93o7r9R9J75k40J98j19k8K11l15O3K44k11q8m7K43k51J2M8K3j12
$$ 71 -212 -140 -149 144 77 -22 77 252 12 210 91 63 274 -41 22 266 55 -33 -80 163 -88 -76 -28 -5 -117
1986a17n7J06k5J45mo6J42j11j13J40k51L57q8j1M2q6k3J77j90J11p0j6o7Q6Q
$$ -117 -174 -68 -93 52 48 -18 124 13 -100 40 -211 146 58 47 89 3 -20 157 -33 78 8 -8 -75 11 19
2011A9OJR8j99J67k0j14j54L13j67j66J96mM9j66K49k02J44j54l6R4%P0j49K40
$$ 19 25 26 124 -75 92 72 -42 -196 117 -50 -216 -20 -24 25 -141 108 -94 50 -104 -140 -46 -46 24 -125 115
2036A15K1Ol05j6M35l77l3J37n3J48j25%Q0J82k11pj30K39j82J9%o6q7R0L5K36
$$ 115 136 142 -163 -179 256 -121 -154 -17 -70 78 -47 -47 33 215 4 -3 -133 106 -76 -57 -57 -123 -210 -120 -85 151
2062A51j22j06J0N6P0j32j5K53j90R2J85k60q8L02k09r6J72L7k27k8K21M3j75
$$ 151 29 -77 -67 -11 59 -73 -88 165 -25 67 252 -8 -96 206 -3 -99 73 110 -117 -145 76 119 -56
2085e6j4Knn3n2J99o3J09j32J29N3j34j2n3L93l52J98j69K88l25J72Mno3o0l0
$$ -56 -70 -68 -73 -126 -178 21 -42 67 -65 64 117 -17 -29 -82 311 -41 157 -12 276 -49 123 127 122 59 -1 -31
2111c1P3Kj49m5l5K14n2k28J26J7P6M3R5q8J67n3j10L6R5L1J3L1K4j08p8r5J03
$$ -31 42 44 -105 -150 -185 29 -23 -251 -125 -108 -32 11 106 18 185 132 22 58 153 184 197 228 252 144 66 -29 74
2138G4j9j70K43j61J18k97m8J61J17j24j0J57j71R9M7j18J89m1j99J10J5J64N8
$$ 74 55 -115 128 -33 85 -212 -260 -99 18 -106 -116 41 -130 -31 16 -102 87 46 -153 -43 -28 136 194
2161A94j06j12N6R6k04J04J14j02o6r6L4J74k42L1j09K03k35K59L7P8n9j65J33
$$ 194 88 -24 32 128 -76 28 142 40 -26 -122 -88 86 -156 -125 -234 -31 -266 -7 30 108 49 -116 17
2184A7O6R6k07M1J41p3Lo6o4K60k39k31L89k61J16j0L3J8N0p4j18P1R1k48J85
$$ 17 83 179 -28 13 154 81 84 18 -46 214 -25 -256 133 -128 -12 -22 11 29 79 5 -113 -42 49 -199 -14
2209a4m9j22K07o3q3j4J75q7P3Jo3rK16p1j42o8J50j48J05J5kl7O2qN7j10J21
$$ -14 -63 -185 22 -41 -124 -138 37 -50 23 24 -39 -48 168 97 -45 -113 37 -111 -6 9 7 -30 32 24 81 -29 92
2236I2q2q5J52k3q9l5j15K31j06MRj20K30O0p3r9j2Q4r7L9J37j19O2MJ40j74M1
$$ 92 10 -75 77 54 -35 -70 -185 46 -60 -56 -47 -167 63 123 50 -49 -61 23 -74 -35 102 -17 45 49 189 15 56
2263E6M3J33k92J96j80Q7l9r1J34m2k9j4n3r5Q7J61j15L1J74o0o2k03L48J05k72
$$ 56 99 232 -60 136 -44 43 4 -87 47 5 -24 -38 -91 -186 -99 62 -53 -22 152 92 30 -173 175 280 8
2288HJ74k04K68r5j71j71K15r3m5MJ91nj85ok7K90l62K85k29J45J54k04N1J43
$$ 8 182 -22 246 151 -20 -191 24 -69 -114 -110 81 76 -109 -115 -142 148 -214 71 -158 -13 141 -63 -12 131
2312A31j27k13K47N4j02J33j26J59k6j2j60j30K99j11Jj59Q8m8lp0J76j44J49
$$ 131 4 -209 38 92 -10 123 -3 156 130 118 -42 -172 127 16 17 -142 -54 -102 -105 -175 1 -143 6
2335Fj8L1q1j0J09o4K70j44M1n6J68q8j71Q1k2L7k7o2m9Q5j2L7j52K36k32m5J2
$$ 6 -12 19 -62 -72 37 -27 243 99 140 84 252 164 -7 74 52 89 62 0 -49 36 24 61 -91 145 -87 -132 -120
2362a20J19l1m6rK19Np5j1m5k8K0P8m3J39k4k80J0J70p5J32k7l6J54j75k34J54
$$ -120 -1 -32 -78 -87 132 137 62 51 6 -22 -2 76 33 172 148 -132 -122 48 -27 105 78 42 196 21 -213 -59
2388e9J48p9P8N3J5l9k32O6J43r4n8J09j91J95l5k7L0J02j49m5OP7l8Mr3K15p2
$$ -59 89 10 88 141 156 117 -115 -49 94 0 -58 51 -140 55 20 -7 23 125 -24 -69 -63 14 -24 -20 -113 102 30
2415C0R9Mj41J01q2k6j9L9k20K18j6P3l6j11Q4j63K50l8j7k7J12N1k04O1l1p3
$$ 30 129 133 -8 93 11 -15 -34 5 -215 3 -13 60 24 -87 -3 -166 84 46 29 2 114 165 -39 22 -9 -82
2441h2J46k0J04j96K1J63j05q5J42M6j76nj83K47m1jM6j27R4P7m5k1o1O9K07k48
$$ -82 64 44 148 -48 -27 136 31 -54 88 134 -42 -47 -230 17 -24 -25 21 -106 -12 65 20 -1 -62 7 214 -34
2467c4K6J01N8o3j22K03q3j9J7p1j24J75J03m4kj42j2P3J0r7J67j78n6q7P7R5
$$ -34 -8 93 151 88 -34 169 86 67 84 13 -111 64 167 123 121 -21 -33 40 50 -47 120 -58 -114 -201 -124 -29
2493b9K2p2n3K15Rn4Or3R6J02j0r8j7L6K38j67j26p7J00j11O8O0n1k4l8k0j5J60
$$ -29 -7 -79 -132 83 92 38 44 -49 47 149 139 41 24 60 298 131 5 -72 28 -83 -15 45 -6 -30 -68 -88 -103 57
2521E7j04r1M0J26j34l6L4K57p0k7k36K22l3M2J00j77k5p3K01r3j17J00m4J03
$$ 57 -47 -138 -98 28 -106 -142 -108 149 79 52 -184 38 5 47 147 -30 -55 -128 73 -20 -137 -37 -81 22
2545B2j31J65j71J50L1o8q9K18j22n7J8m2J51J11j32j71J39K9l5j7R7k37O2L0
$$ 22 -109 56 -115 35 66 -2 -91 127 5 -52 -34 -76 75 186 54 -117 22 51 16 -1 96 -141 -79 -49
2569d9J6J27o4j6N1O2j97N6J41j86J1p6o6J85N6J67l21J91k08J62l28K71P5j95
$$ -49 -33 94 30 14 65 127 -70 -14 127 -59 -48 -124 -190 -5 51 218 -103 88 -120 42 -286 -15 60 -135
2593a35K08k25K16r0o6R5J49Or1n7P2R9p0j45K45j29k09J86J06p6k35J03jo9J57
$$ -135 73 -152 64 -26 -92 3 152 158 67 10 82 181 111 -34 211 82 -127 59 165 89 -146 -43 -44 -113 44
2618D4r9jJ1J62l05M8R5r6K10j03m9J01p5K30l5j06P6k43L03o5J1J16j21p6KJ12
$$ 44 -55 -56 -45 117 -188 -140 -45 -141 69 -34 -83 18 -57 173 138 32 108 -135 168 103 114 230 109 33 35 147
2644A47k20j36J87Rk1kk4K0M8j58L14k09N7j3m2R4j37J61k3J6O1k05JJ6R6j21
$$ 147 -73 -209 -22 -13 -34 -36 -60 -40 8 -150 164 -45 12 -1 -43 51 -86 75 52 68 129 -76 -75 -59 37 -84
2670h4j2Q2p7J10J7l3Q8j93J3J94m3K40n40K08O7j23K35k42J33R8k03J16J08k39
$$ -84 -96 -14 -91 19 36 3 91 -102 -89 105 62 302 -238 -30 37 -86 149 -93 40 138 -65 51 159 -80
2694h0O9K2J27l5j02R9j84K75k07n9l1n1j03J80J52p0M7J05j55jj2J9J28p6r1
$$ -80 -11 11 138 103 1 100 -84 191 -16 -75 -106 -157 -260 -80 72 2 49 154 -1 -2 -14 5 133 57 -34
2719c4K1J11K8j23K04o5r0l3p4J61j68o6L40j80o8P0p1j23J30K8K19k18kj79J18
$$ -34 -13 98 126 3 207 142 52 19 -55 106 -62 -128 212 32 -36 34 -37 -160 -30 -2 217 -1 -3 -182 -64
2744f4O9n9j4J43K0k24J50J2J9N5k02Q1m8J66j7j52O9kJ68j66J0m5M9l8P4j22
$$ -64 5 -54 -68 75 95 -129 21 33 52 107 -95 -14 -62 104 87 -65 4 2 170 4 14 -31 18 -20 54 -68
2770f8L9J55j63q4J30M3N7j56M6r9m3J42j80K34j12l3J15K6Rj7J07r1Q8j04J43
$$ -68 -29 126 -37 -121 9 52 109 -47 -1 -100 -143 -1 -181 53 -59 -92 23 49 58 41 148 57 145 41 184
2795A84j31j8q9M9J12j05L7j39K6J11P2r9o1O9k06J19J67l4N5k28O4O4R4j26J63
$$ 184 53 35 -54 -5 107 2 39 -100 -74 37 109 10 -51 18 -188 -69 98 64 119 -109 -45 19 113 -13 150
2820A50k12M1N2J15L2j74O0l1j14j2O8J7or7L1K34k65mJ3J16J2k1k24J64J29j09
$$ 150 -62 -21 31 146 178 4 64 33 -81 -93 -25 -8 -14 -111 -80 154 -111 -115 -102 14 26 5 -219 -55 74 -35
2846c5O6O9J38k09K5Q3n2p8P6j06N3l0K1K6N1k05J03r0M3J46j64N9k14P2K07L5
$$ -35 31 100 238 29 54 137 85 7 83 -23 30 0 21 47 98 -107 -4 -94 -51 95 -69 -10 -224 -152 55 90
2872I0N7j05J5j85L58k06j14Q1J00J8J3k38J53NJ8j39M0N3R9r9j29M8O4L6j12
$$ 90 147 42 57 -128 230 24 -90 -9 91 109 122 -116 37 42 60 -79 -39 14 113 14 -115 -67 -3 33 -79
2897g9K7o6J95k23K18K2r7l4P0K0j54J19P7J03k98R0K06k58N4j00J09J92l54K42
$$ -79 -52 -118 77 -146 72 94 -3 -37 33 53 -101 18 95 198 -100 -10 196 -62 -8 -108 1 193 -161 81
2921H1k36J66j6m6J6J37l6J6r5j26J86K5K3r8l3j24J79l0K3K4O3P1j79R5o7M5
$$ 81 -155 11 -5 -51 -35 102 66 82 -13 -139 47 72 95 -3 -36 -160 19 -11 12 36 99 170 -9 86 19 64
2947F4J1j22O7p9l8K45k08n8J45J38k24j9P4J43q3rj81K37j33J09m5q2J47j86
$$ 64 75 -47 20 -59 -97 148 -60 -118 27 165 -59 -78 -4 139 56 47 -134 103 -30 79 34 -48 99 -87
2971h7J35j25J83j84J11k8p8L9J32k57J06k7p8K45j08J6J28j25j11Q7m5M4J1J77
$$ -87 48 -77 106 -78 33 5 -73 -34 98 -159 -53 -80 -158 87 -21 -5 123 -2 -113 -26 -71 -27 -16 161
2995A61j03j02n9J26Ro2N4q2kK0K5K31k58n5J04J70j15M2q5j20mL1O3J2o4N5L8
$$ 161 58 -44 -103 23 32 -30 24 -58 -60 -40 -15 216 -42 -97 7 177 62 104 19 -101 -105 -74 -11 1 -63 -8 30
3022C0k37L32j31M0r2J6O5k4q5P1n4J08k30J36P4j1q5P5O7l6q6m3L3J42J24k32
$$ 30 -207 125 -6 34 -58 -42 23 -1 -86 -15 -69 39 -191 -55 19 8 -77 -2 65 29 -57 -100 -67 75 199 -33
3048c3l6P5j31Q1p7J95P4k56R1K0j4k9J26j72K82l11J46J26j09J4l0j9O0n5j23
$$ -33 -69 6 -125 -44 -121 74 148 -108 -17 3 -11 -40 86 -86 196 -115 31 157 48 62 32 13 73 18 -105
3073a05N9kk5R2m0j10K53j74rJ56R4l18PM5Q3JK1n6O4k2O6J19k96J10R4Q5n7r8
$$ -105 -46 -48 -73 19 -21 -131 122 -52 -61 95 189 -129 -122 -77 6 7 28 -28 36 14 80 199 -97 13 107 192 135 37
3101C7qK2p0R2j01J4j35J43n4J07o3q1N9m9P4N2JJ5J64k09J55j73N5r7J18J04
$$ 37 29 51 -19 73 -28 -14 -149 -6 -60 47 -16 -97 -38 -87 -13 39 40 55 219 10 165 -8 47 -50 68 172
3127A72j96j46J75J01j17N4J10j79P2m9J25j01P3M1j21J28j5j09o4K27k45K6J29
$$ 172 -24 -170 5 106 -11 43 153 -26 46 -3 122 21 94 135 14 142 127 18 -46 181 -64 -38 91
3150I1J6k88K91Om4N8j2r9r8J09J69l22O3J05j3LJ02j58l1J78j34j52J27l3J0
$$ 91 107 -181 110 116 72 130 118 19 -79 30 199 -123 -60 45 32 35 137 -21 -52 126 -8 -160 -33 -66 -56
3175e6J34r7K08j6r8k4j21n1J64j66Q0K7j0m4N3M8J30j77J15l0j92K71o7q1N7
$$ -56 78 -19 189 173 75 51 -70 -121 43 -123 -43 -16 -26 -70 -17 31 161 -16 99 69 -123 148 81 0 57
3200E7k9K2k23K66p4J70k33p7K36m0k23J18P9j08O9O4L9k89N3j02K21q4J89o9
$$ 57 28 50 -173 93 19 189 -44 -121 115 75 -148 -30 49 -59 10 74 113 -176 -123 -225 -4 -88 101 32
3224C2j80J73o0J00j33O4l6r9J04j42O6P5P2J44m54M23J9l68K94j18j78P1J53
$$ 32 -148 25 -35 65 -68 -4 -40 -139 -35 -177 -111 -36 36 180 -274 149 168 -200 94 -24 -202 -131 22
3247B2j73Q7J03q3J49J5q2mKqn4K9P2p7kj47K31j55j25K99k69J29J39j53M7k2
$$ 22 -151 -64 39 -44 105 120 38 34 36 28 -26 3 75 -2 -4 -151 80 -75 -200 99 -170 -41 98 -55 -8 -30
3273c0Q2j18O6n1l9J60j5j2L8j00J45k62J55q8N7o6M7M8K3%j18kK27j20j2Q5k14
$$ -30 52 -66 0 -51 -90 70 55 43 81 -19 126 -136 19 -69 -12 -78 -31 17 40 40 -78 -80 147 27 15 100 -114
3300a14K97k26J52j64l7K7J65R1k37O0Lj98P8J56j43J23j10k4J09O6N1O1p3j55
$$ -114 183 -43 109 -55 -92 -65 100 191 -46 14 17 -181 -103 53 -90 33 -77 -101 8 74 125 186 113 -42
3324d2J17l3oq1N9J34j3k67K8J60q6p8J66j25K5J59j96J00o8M6j48M8Q3J35q6
$$ -42 75 42 36 -45 14 148 135 -132 -104 56 -30 -108 58 -67 -42 117 -79 21 -47 -1 -149 -101 -18 117 31
3349C1q5R8K6j03Q5j35J55J6j77J13K3j7q4J19j04L1m2l5L4J49j05K6r8p2P3O3
$$ 31 -54 44 70 -33 52 -83 72 88 -89 24 47 30 -54 65 -39 -8 -50 -85 -51 98 -7 19 -79 -151 -78 -15
3375a5R4p4L0J87k24J55r1M7K3j72K3n5K18k20J23k2q3n2J74J8j17J8o4Q3L9j12
$$ -15 79 5 35 222 -2 153 62 109 132 -40 -17 -72 146 -74 49 27 -56 -108 66 84 -33 -15 -79 4 43 -69
3401f9P6Pp5m4L4N9r2R6m9K10j66J72r8k2N7j2k04J19n1p7O5p0K23j14J06j69
$$ -69 7 14 -61 -105 -71 -12 -104 -8 -57 153 -13 159 61 39 96 84 -120 -1 -52 -129 -64 -134 89 -25 81 -88
3427h8K7N4J09l4l2o2L7j1N8J42l14N6p1J60l0n4J10j02l0J75k20R2o9R9o4p8
$$ -88 -61 -7 102 68 36 -26 11 0 58 200 -114 -58 -129 31 1 -53 57 -45 -75 100 -120 -28 -97 2 -62 -140
3453a40J01N6p5o9J71n3q1O7J45q4j47J24J87j74k9oJ02r5r3Q6N8p3M2N0j12o1
$$ -140 -39 17 -58 -127 44 -9 -90 -23 122 38 -109 15 202 28 -1 -7 95 0 -93 -7 51 -22 20 70 -42 -103
3479a03k1J28r5j3K00k08P7R2K6p5j23J76j1o1k6O1L5q1J77N8j53o3N3m6j08J21
$$ -103 -124 4 -91 -104 96 -112 -35 57 83 8 -115 61 50 -11 -37 24 59 -22 155 213 60 -3 50 4 -104 17
3505A7OJ7Mj56RQ0Mm8P8m0R1K2j14j34M5K2QPO5j45J68P0j37Q2l3O7j30O6Q2j82
$$ 17 23 40 44 -112 -103 -23 -19 -67 11 -29 62 84 -30 -164 -119 -97 -89 -82 -17 -162 6 76 -61 21 -12 55 -75 -9 73 -109
3535a09M0Q6J61j04p4R0k52J52kp3J20p8J29j48J6o0K15r1P6q2j03J50o3Q4L2
$$ -109 -69 17 178 74 0 90 -162 -10 -12 -85 35 -43 86 -62 -46 -106 109 18 94 12 -91 59 -4 80 112
3560A12L6j52R1j40J29n9N2l0L1j65J85k5N7k64K62p6m9m9j5J38o1o0qJ7J13L2
$$ 112 148 -4 87 -53 76 17 69 39 70 -95 90 65 122 -142 120 44 -5 -54 -69 69 8 -52 -60 -43 70 102
3586A02r2j52J68qj9j0j21R9P9r0Q7l7N5p9nrm6j56K98q0N6Jj92J66j8MN0K2j14
$$ 102 10 -142 26 18 -1 -11 -132 -33 46 -44 43 6 61 -18 -23 -32 -78 -234 64 -16 40 41 -151 15 -3 1 51 73 -41
3615d1k4L2r4J01J54k16O2m5L6R9k79N4J02L2K03k10L2m9O5k7o1KJ41n7l2J3r2
$$ -41 -65 -33 -127 -26 128 -88 -26 -71 -35 64 -215 -161 -59 -27 176 -34 -2 -51 14 -13 -74 -72 69 12 -20 -7 -99
3642i9K8p5J59k0n7N5o3N0rN0R4J26k02n8J8Q1r5J39k22K42j03j05k7K72n1l16
$$ -99 -71 -146 13 -7 -64 -9 -72 -22 -31 19 113 239 37 -21 -3 78 -17 122 -100 142 39 -66 -93 179 128 -188
3668a88J10J5J79k46J83q5P9N7l8l4M6j26J53j05K2mK9Q3j10K7m8K5q9j0K9j4
$$ -188 -78 -63 116 -130 53 -32 47 104 66 32 78 -48 105 0 22 18 47 130 20 47 -1 24 -65 -75 -46 -60
3694f0JO0P3j13J71j93M9K1n7QR3J25j65P5k55J71K23k17k55N0J58L2o6J24k3
$$ -60 -59 1 74 -39 132 -61 -12 9 -48 -40 53 178 13 88 -167 4 227 10 -245 -195 -37 -5 -71 53 30
3719C0j31J15l8r5K5J03O8J04j19l1pN8r2N5P4k44J33Q6Q2j63l9j02J55q2R0k02
$$ 30 -101 14 -24 -119 -94 9 77 181 62 31 24 82 -10 45 119 -125 8 94 176 13 -26 -128 27 -55 35 -167
3745a67K13P1q8r0O4O4j13P2P6o4j13P9j26J18m2j06R5J38k42K01j71K27k42K68
$$ -167 46 117 29 -61 3 67 -46 26 102 38 -75 4 -122 -4 -46 -152 -57 81 -161 40 -131 96 -146 122
3769A22l5j70J58qj91J63m7J53q4j02j2P6J06j39J2L4p9m3K20j33j56L25j41J19
$$ 122 87 -83 75 67 -124 39 -8 145 61 -41 -53 23 129 -10 2 36 -43 -86 134 1 -155 170 29 148
3793A48k5k65L23j05j57nJ41j92kK20j48l0J57J6l11J83M9j63N7N6m6K24o0o0
$$ 148 123 -142 181 76 -81 -86 55 -137 -139 81 -67 -97 60 76 -235 -52 -3 -166 -109 -53 -99 125 65 5
3817EJ12j7k7j12p3J65j81J9N2J28j04J28j68O7J81j03l7k6J11r3M1r4N1J7l0
$$ 5 117 100 73 -39 -112 53 -128 -109 -57 71 -33 95 -73 -6 175 72 35 9 120 27 68 -26 25 42 12
3842A2N6k06J9O7n3L61k43p4j40K01j75J03J1R1j05J13j19K6O0O3o7j57K59q5
$$ 12 68 -138 -119 -52 -105 256 13 -61 -201 0 -175 -72 -61 30 -75 38 -81 -55 5 68 1 -156 103 18
3866A8M8j02o7J88j14J81j27N0j07q0n5O3R9o7N4J83J0q0j33j44J81J2M5n6j08
$$ 18 66 -36 -103 85 -29 152 25 75 -32 -112 -167 -104 -5 -72 -18 165 175 95 -38 -182 -1 11 56 0 -108
3891a08J00N9J3q0K1J37k12k5j6J16R1k04K2M5J88k46O7Q9n0k1N6p3J8J11K0j81
$$ -108 -8 51 64 -16 5 142 -70 -95 -111 5 96 -108 -86 -41 147 -99 -32 57 7 -14 42 -31 -13 98 118 -63
3917f3Q3O6j92J30m0N6j41j9k9K87k93J60j31K1J27K6J1l4M4j70K1J10r4l7Q3
$$ -63 20 86 -106 24 -16 40 -101 -120 -149 138 -155 5 -126 -105 22 48 59 25 69 -101 -80 30 -64 -101 -18
3942a8L0j2J85k21R7Jj2j45k5K66k27k26J80jR8m5PR9L8q8r2N9L9r7R2M3N8k5
$$ -18 12 0 185 -36 61 62 50 -95 -120 146 -81 -307 -127 -128 -30 -75 -68 31 69 -19 -111 -52 -13 -110 -18 25 83 58
3970E8k09J7J47j00J79jj46J41k0j37K2O0Q3j28%J43m3r8j24K16%q9j12K18j53
$$ 58 -151 -134 13 -87 92 91 -55 86 66 -71 -49 11 94 -34 -34 109 66 -32 -156 60 60 -29 -141 77 -76
3995g6Q3j04J33P4j44m0J53k23P6l2K8J66q0J29j76J98j01K0j18M3q1lQR6pmN4
$$ -76 7 -97 36 110 -34 -74 79 -144 -68 -100 -72 94 14 143 -33 165 64 84 -34 9 -72 -75 -67 29 22 18 72
4022G2k13K84n2o0J51j75K1j2j41P6J7J37j11R7J3r3J05m8o3N1J1j3l06J63K6
$$ 72 -141 143 91 31 182 7 28 16 -125 -49 -32 105 -6 91 104 11 116 68 5 56 67 54 -252 -89 -63
4047f3j2oO3M2j07qK42j93J09j38N1l1K13j75j2P5j07N5j6J8R7j9j76O7o3K23
$$ -63 -75 -81 -18 24 -83 -91 151 -42 67 -71 -20 -51 162 -13 -25 50 -57 -2 -18 0 97 78 -98 -31 -94 129
4073A29j28m8qJ82k59J47K56l34K59j15j43J08Q0j14k2Rj1qj34J82j43J4J04k9
$$ 129 1 -47 -55 127 -132 15 271 -63 196 81 -62 46 126 12 -10 -1 -12 -20 -154 28 -115 -101 3 -26
4097b6J51j60K4P4l9k17L27l28K45j02mL2qm3K13j95O1J8L6j32R2P0k15j01K03
$$ -26 125 -35 -11 63 24 -193 134 -194 51 -51 -55 -23 -31 -74 139 -56 5 23 59 -73 19 89 -126 -227 -24
4122b4k5Q6k0K0q9J9o0J16o3n4K4K10j00k36J59K2O2m2o2N1p1J32l0p8l8Q1pk9
$$ -24 -49 37 17 37 -52 -33 -93 23 -40 -94 -70 140 40 -196 -37 -15 47 5 -57 -6 -77 55 25 -53 -91 -10 -17 -46
4150d6O3j11M3R5j07p7L10j70P9n3j40R7J75j68N4n1M9j33J65j80q1K24j37J4
$$ -46 17 -94 -51 44 -63 -140 170 0 79 26 -114 -17 158 -10 44 -7 42 -91 74 -106 -187 37 -100 -86
4174h6J5M1P0j23M6J54k11M4kQ3j4j03QJ65m9%J89k41KLn9L1J21j71j07K42j49
$$ -86 -71 -30 40 -83 -37 117 -94 -50 -52 31 17 -86 -78 87 38 38 227 -14 -12 -9 -68 -37 84 -87 -194 48 -101
4201a01K17K0k17J54Lj45J63r5j59mP7m9J26j27qN3M6R7P8k00p9J83m3R2p2o7
$$ -101 116 136 -81 73 76 -69 94 -1 -160 -164 -87 -136 -10 -137 -145 -92 -46 51 129 -71 -150 33 -10 82 10 -57
4227e7J05M9l3n5M9mj65J08q9J81j36L08l91Q2K11l03Q0Q0Q3j80J6L1O5N0j42
$$ -57 48 97 64 9 58 54 -111 -3 -92 89 -47 261 -130 -48 163 -140 -60 20 103 -77 -61 -30 35 85 -57
4252e7j53K74o2J9r0Q2m6n5J77j51M7J04m6O3k72P1n3J08K07l13n9J43J67r5j33
$$ -57 -210 64 2 21 -69 13 -33 -88 89 -62 -15 89 43 106 -166 -95 -148 -40 167 -146 -205 -62 105 10 -123
4277a23K2Q2j45%J55j36J58QP9j52J49j77O1M8m4K3j03J25j67K08j4j56r2J36
$$ -123 -101 -19 -164 -164 -9 -145 13 21 100 -52 97 -80 -19 29 -15 8 -95 30 -137 71 57 -99 -191 -55
4301e5O6j40J93k39L32j13j51k9m8J26j19K29lK6j55J35l3j5p7K63k18no9L5l8
$$ -55 11 -129 64 -175 157 44 -107 -136 -184 -58 -177 52 49 75 -80 55 22 7 -70 193 -25 -30 -99 -64 -102
4326a02p4L3R7J39n1k3j64K48k14J55j08K15j60K29k27n1J20k36K01j12J28j49
$$ -102 -176 -143 -46 93 42 19 -145 103 -111 44 -64 151 -9 220 -7 -58 62 -174 27 -85 43 -106
4348a06J25N5p0j62J60k0M8O6q9j85J85j5L3k3KK0m2L4J25j10j12R9k5j1J28j43
$$ -106 19 74 4 -158 2 -18 30 96 7 -178 7 -8 25 2 4 24 -18 16 141 31 -81 18 -7 -18 110 -33
4374c3p3K62j41J23k3r9K5P9q0qj44N2J20N0j44K2N9m7N2k3p6kJ12k05J36J2J79
$$ -33 -106 156 15 138 115 16 41 120 40 32 -112 -60 60 110 -34 -12 47 0 52 29 -47 -49 63 -142 -6 6 185
4401A85j39N5j04j39P4J6J95k59K19k2k3r0M3o9RQ9m0m9O7p6j3J37j69R7Mo9j03
$$ 185 46 101 -3 -142 -68 -52 143 -116 103 81 58 -32 11 -58 -49 40 0 -49 18 -58 -71 66 -103 -6 -2 -71 -174
4428a74K95j33P3p7K2p7%N2J0L2o2p9J60l3j5%O1J59k17n6k7Q6p8O1q8k6j3Q7
$$ -174 121 -12 61 -16 6 -71 -71 -19 -9 23 -39 -118 42 9 -6 -6 55 214 -3 -59 -86 0 -78 -17 -105 -131 -144 -57
4456e7P0n2o2K4J58K6j01j38J52Q3M9j96K1R4l6o2q8J75j87R5K9K9m3q0M8o3R0
$$ -57 13 -39 -101 -77 81 107 6 -132 20 103 152 -44 -23 71 35 -27 -115 60 -127 -32 -3 26 -17 -97 -49 -112 -22
4483b2l6O9Jo3Q1j5O5n1l6QM4q9K5J50k75Q3R3N1j47J03o6L6M6r7P1J9j23J7P7
$$ -22 -58 11 12 -51 30 15 80 29 -7 1 45 -44 -19 131 -144 -61 32 83 -64 39 -27 9 55 -42 29 48 -75 -58 19
4512A9o3k2nJ07m2n8L4J3j7K4r3R0q6J22M5p2o2K27k65K52j88n3J61N2j03Q2n2
$$ 19 -44 -66 -71 36 -6 -64 -30 -17 -34 -10 -103 -13 -99 23 68 -4 -66 161 -104 148 -40 -93 68 120 17 99 47
4539D7K7j4k44K07l8J02Lmk18L11j35N5j44J13m5k6J14j10q0K46j20j26Q2KQ1
$$ 47 74 60 -184 23 -15 87 90 86 -132 179 44 99 -45 68 23 -3 111 1 -79 167 47 -79 3 5 86
4564H6P8j65j39K05m3mo9J0J19j62O8k1M9J8nO3j08LJ2nj41M9n6P9M8PO8j07j14
$$ 86 164 -1 -140 65 22 18 -51 -41 78 -84 -16 -37 12 30 25 88 -20 -17 -5 -10 -151 -102 -158 -79 -31 -24 44 -63 -177
4593a77K02k0J48k40Q7J16j45R5M5r8j95J99j25K33j03o9J11r7J81m2j98l8K33
$$ -177 25 5 153 -87 0 116 -29 66 111 13 -182 17 -108 125 22 -47 64 -33 148 106 -92 -130 103
4616A03j43o2r6K52j13J21q6j9P1k1Q8k37K28m5m9O3Kr6R5j35o9J20L9M5JO7j72
$$ 103 -40 -102 -198 54 -59 62 -24 -43 28 7 95 -142 86 41 -8 55 57 -39 56 -79 -148 -28 11 56 57 124 -48
4643d8n8J42j53K30j60J34m4L6m4K0n7j0R9j19J11j34J27k16O5J67j13K5p2k3
$$ -48 -106 36 -117 113 -47 87 43 79 35 55 -2 -12 87 -32 79 -55 72 -144 -79 88 -25 0 -72 -95
4667i5J72J01m5j25%n9J41j64J29j03Ll3J6P1O6o6L7J51k43L3M9P4j91J81n4p7
$$ -95 77 178 133 8 8 -51 90 -74 55 -48 -45 -78 -62 9 75 9 46 197 -46 -13 36 110 -81 100 46 -31
4693c1L7J63j24n3k7o8k37K90j19J99o8K5J17j31n0n7J54j67K07m6j2j41J36k17
$$ -31 6 169 45 -8 -35 -103 -340 -50 -169 30 -38 -13 104 -27 -77 -134 20 -147 60 14 2 -139 -3 -220
4717b20K78j30KK14o0j43J53j04p5J2L2L6P4L9l6K0j4j73J26l1J25j37J6nj03
$$ -220 58 -72 -70 144 84 -59 94 -10 -85 -73 -41 -5 69 108 72 92 78 -95 31 0 125 -12 4 -1 -104
4742a04K05k75M5J38n1J12J00j15Jn2j52J28L0k04J50l1l5R1r9Q4n8N5O0R6k35
$$ -104 101 -174 -129 9 -42 70 170 55 56 4 -148 -20 10 -194 -44 -75 -110 -19 -118 -34 -92 -37 23 119 -116
4767a16L2J84j72J02L0O2j04P0j20O1N3k14J39k7K2Q5N4j2j15rp7J48j10M3k0
$$ -116 -84 100 -72 30 60 122 18 88 -32 29 82 -132 7 -20 2 87 141 129 14 5 -72 76 -34 9 -11
4792a1o0R5j10J83l0n3j30O1K28j87m3L1J4rj69J38K2o6PK01j93J02L7j98J44
$$ -11 -71 24 -86 97 67 14 -116 -55 173 -14 -57 -26 -12 -21 -190 -52 -30 -96 -89 112 -81 21 58 -140 4
4817DJ0j2n0N2Q1j7j26j01K9k3M8J84q7J83j97P7O1j40k7R0Qj92J21P0k29J07
$$ 4 14 2 -48 4 85 68 -58 -159 -130 -153 -105 79 -8 175 -22 55 116 -24 -51 39 47 -145 -24 46 -183 -76
4843g6NN2R4j3m6N7%q2j71J66Ok8J82j97l8k4J11oj17J63qq1R8L3j45R1N3J8p2
$$ -76 -71 -19 75 62 16 73 73 -9 -180 -14 -8 -36 146 -51 -89 -113 -2 -8 -125 38 30 -51 47 80 -65 26 79 97 25
4872B5l3J14k07J31M4j34R5p3Q7j09Rq5m6K37J7J6j79rN3J56j6L6k44R9R7j67
$$ 25 -8 106 -101 30 74 -60 35 -38 49 -60 -51 -136 -182 55 72 88 -91 -100 -47 109 93 129 -115 -16 81 -86
4898h6M1J46kP6j49J49j78L0J64l16k7K25j99O6J39p6Q0j87l4K33k06J27k3k8
$$ -86 -45 101 99 175 26 175 -3 27 191 -125 -152 73 -126 -60 79 3 83 -104 -138 95 -111 16 -7 -35
4922c5O0m6Q2j44J65k10N1M3J54j9r6L4j61Q8K14q7k01K04r7Q0k8O8j03o4O7j03
$$ -35 25 -21 61 -83 82 -128 -77 -34 120 101 5 39 -122 -34 180 93 -108 96 -1 79 51 119 16 -48 19 -84
4948h4J38r3K20j28P7j03N5j60J03ml9K3N4j00l9K84j72J0j6K7j07m3N2m2N2K8
$$ -84 54 -39 181 53 130 27 82 -78 25 21 -18 5 59 -41 -80 204 32 42 26 53 -54 -97 -45 -87 -35 -7
4974gP0Np3q6J81j13j13J41j24J82j17n9M6O3N9lP8l2j52j69J14J11R7j40J2j4
$$ -7 63 68 -5 -91 90 -23 -136 5 -119 63 -54 -113 -67 -4 55 52 130 98 -54 -223 -109 2 99 -41 -29 -43
5000d3N0R3k58J88J41j95k5J30k0km3M0k41J28J87j78J18j62K29l32J80k4N5j21
$$ -43 7 100 -158 30 171 -24 -49 81 61 59 16 56 -185 -57 130 -48 70 -92 137 -195 -15 -39 16 -105
5024a05J41p9J10j66J03j9k00K17N5M8k0m5M3k5j27O6k3L2j03j30K86o2K7j17
$$ -105 36 -43 67 -99 4 -15 -215 2 57 105 85 40 83 58 -69 -3 -26 6 -97 -227 59 -3 24 -93
5048i3J37j24K2J67p1j11J26j40Q7o6K50k63j0Q3j4OO8J4k45M9K09J15j48K1j43
$$ -93 44 -80 -58 109 38 -73 53 -87 0 -66 184 -79 -89 -6 -20 -14 54 68 -177 -128 81 196 48 69 -74
5073g4J01J0Mp3R1Jj25k7J46N3k56J1Q1m5J30l1o0J8J49Mj42nk9M5R0r7R5j68
$$ -74 27 37 41 -32 59 60 -65 -92 54 107 -149 -138 -57 -102 28 -3 -63 -45 104 108 -34 -39 -68 -23 67 -30 65 -103
5101a03m1O1N2j56L24k21O3jq6J60r7j20K77j51J61k07M4R3r1j02J66j7r4J37
$$ -103 -144 -83 -31 -187 137 -84 -21 -22 -108 52 -45 -165 112 -39 122 -85 -41 52 -39 -141 25 8 -86 51
5125E1l0k5R8q8q1QJ31q1r5N6J25m4j41K96q0o9q1K7J22mq1m9J51k36K47k04J6
$$ 51 21 -4 94 6 -75 -67 64 -17 -112 -56 69 25 -116 180 100 31 -50 -23 99 95 14 -35 116 -120 127 -77 -61
5152f1P3M7q6j66O5J35M0l7j14M9j1Q8Q6l49K24J70m3j52J01m1k6r9J61j25Q9
$$ -61 12 59 -27 -193 -128 7 47 10 -104 -55 -66 22 108 -241 -17 153 110 -42 59 18 -8 -107 54 -71 18
5177A8j28J75n4J7J57j87J06q4m7p4J38p3J7j25J48l1r8K0R3L5q7Q9L9q4J09N0
$$ 18 -110 65 11 28 185 -2 104 20 -27 -101 37 -36 -19 -144 4 -27 -125 -105 -12 23 -64 25 64 -20 89 139
5203A39j97J19n1j37J63k0P8j39K04j38l2J14j84J21j0Mn3J79j31L5k27J23j59
$$ 139 -58 61 10 -127 36 16 94 -45 159 21 -11 103 -81 40 30 34 -19 160 29 64 -163 -40 -199
5226a99K48Oj8OLK1m7j26q6L01M5n6j15M8L1p8P5m5o6M6J17q0k8j01K8n5J81j90
$$ -199 49 55 37 43 46 67 20 -106 -192 109 154 98 -17 31 62 -16 59 14 -52 -6 111 31 3 -98 -70 -125 56 -134
5254a34Lq4J37K75k33J42n0j60Q6o3M3P5q5J54j36j21J26J13k9j4q1j3J42M1p2
$$ -134 -131 -215 -78 197 -36 106 56 -104 -18 -81 -38 37 -48 106 -30 -151 -25 88 59 45 -36 -49 93 134 62
5279F2j24k6j1J84L7m9J5o8J1k16K71m5j8N6o6N3o5j97K75K3j67J59k20J03KP4
$$ 62 -62 -88 -99 85 122 73 88 20 31 -185 86 41 23 79 13 66 1 -196 79 102 -65 94 -126 -23 -21 53
5305E3o4j40J90j55l4J32K9P5L9l54J74J89n0j15rNP3K2k03L8J71o4Pk7L9J07
$$ 53 -11 -151 39 -116 -150 -18 11 86 125 -229 -55 134 84 -31 -40 -35 38 60 -143 -105 66 2 9 -18 21 128
5331A28j74Q8j2J17M4k65K01N4j01j37PM9n1J14j06O2J93j91nO1k15J94n9J8P7
$$ 128 -46 42 30 147 191 -74 127 181 80 -57 -50 -1 -52 62 -44 18 211 20 15 76 -139 55 -4 14 91
5356I1j1j22m1K1J93j85J9p2J02j34J80rj75J79k12l5J62J9lj4J53j79J2K7j06
$$ 91 80 -42 -83 -62 131 -54 -35 -107 -5 -139 41 32 -143 36 -176 -211 -49 -30 -33 -47 106 -73 -61 -34 -140
5381a40Q9LJ2J32Oq9O1O4k04N4R9j64oR3O3p1R1j49M9r7MK34j2j11J03o4pl8o7
$$ -140 -51 -48 -36 96 102 13 74 138 -66 -12 87 -77 -83 10 73 2 93 -56 -7 -104 -100 134 122 11 114 50 43 5 -62
5410f2O0L4p4M2p2r4L07j89m3J14J15k1k25pJ78j23O5j32J62J05j40M1N9j77P
$$ -62 -2 32 -42 0 -72 -166 141 -48 -91 23 138 117 -108 -115 63 -60 5 -127 35 140 0 41 100 -77 -70
5435g0L4j35L75j21j78J08R4j90J25j66N0J30j7J28r1n2K2O0r3j1P4k30J75N6
$$ -70 -36 -171 204 83 -95 13 107 -83 42 -124 -74 56 39 167 76 24 46 106 13 2 76 -154 21 77
5459G7n8j06k2Q4Q0R5k13R1r2J56j45J9K7r0pJ02M4j58J12J37j3j99J55r9O5m5
$$ 77 19 -87 -109 -25 55 150 -63 28 -64 92 -53 -34 -7 -97 -104 -2 42 -116 -4 133 120 -79 76 -23 42 -3
5485cj11P3q5O1j45K17j7J24OLj26MK43l48R6J32o1j24K23k69J80j02j49J02J22
$$ -3 -114 -41 -126 -65 -210 7 -10 114 120 123 -3 1 244 -104 -8 124 63 -61 162 -107 73 -29 -178 -76 46
5510D6m5l2p4n6K99k57Q7J37j50l4n8J95j3p0R0j28j9K4q0K72j48J08K9l43K82
$$ 46 1 -31 -105 -161 138 -119 -32 105 -45 -79 -137 58 45 -25 65 -63 -82 -58 -138 134 -14 94 123 -220 62
5535F2J35j26p8j59K03J7o6J39j02J65k35J34j21%Q6n5L9n3L7j35K21n8q5L07
$$ 62 197 71 -7 -166 37 54 -12 127 25 190 -45 89 -32 -32 54 -1 38 -15 22 -113 108 50 -35 272
5559B72l09J70l0k19J64j3Mj41j7J54m4L7J01j43j8Lr1L3K79l09J95N7k00JJ56
$$ 272 -37 133 103 -116 48 35 39 -102 -119 35 -9 28 129 -14 -32 -29 -120 -87 192 -117 78 135 -65 -64 92
5584I2r2J61j04M2j68J36m3m3J15j77J39r5q7N2K15j16j32J89O5K5k44J3K9J6
$$ 92 0 161 57 99 -69 67 24 -19 96 -81 58 -37 -124 -72 143 27 -105 84 149 174 -70 -57 -28 -12
5608a2k5r4J74J0J05k85K93j17j31L3R5QJ10k10J64j38j05J54Kp0J45k10J78j1
$$ -12 -37 -131 43 53 158 -127 166 49 -82 -49 46 54 164 -46 118 -20 -125 29 31 -39 106 -104 74 63
5632F3j38K69j05n0Q8Rj00j46K3J60j1j44m2J93Pj32j05J94m5j29m0K55j87J97
$$ 63 -75 194 89 39 127 136 36 -110 -87 73 62 -82 -124 69 76 -56 -161 33 -12 -141 -181 74 -113 84
5656H4m0m4L7N6q7j25J89j50J19M0r2p3l9J16J00j17J32q3j2m2M5J1N0r2NJ47
$$ 84 44 0 37 93 6 -119 70 -80 39 79 -13 -86 -125 -9 91 -26 106 23 11 -31 14 25 75 -17 -12 135
5682A35r7k49J15J74n5M7J13j08j62LQ1j63M3J11k7L6j01L1N6N7j21J1N8M6K01
$$ 135 38 -211 -96 78 23 70 183 75 -87 -84 -3 -166 -123 -12 -39 -3 -104 -73 -17 40 -81 -70 -12 34 235
5707B35k36J29r3l1J28k18K34K8j92O2n1Ln6R9K9j33q7M6K42j36q5Q0J4M6K8p1
$$ 235 -1 128 35 4 132 -86 148 176 -16 46 -5 -2 -58 41 70 -63 -150 -104 138 2 -83 -3 11 57 85 14
5733A4o5J53o7o5K3p0J21n6J81k10J25k68L46k12J31q0J04j14j25K31j29n4K04
$$ 14 -51 102 35 -30 -7 -77 44 -12 169 -41 84 -184 162 -50 81 1 105 -9 -134 97 -32 -86 118
5756A18J37k29j28M7L7K00l23M5R0O4j67J10J39k01J31o6o4J46l2nr5J17j69q
$$ 118 255 26 -102 -55 -18 182 -141 -96 -6 58 -109 1 140 -61 70 4 -60 86 54 49 -46 71 -98 -106
5780a06K24j77Q3j49K4J83n8q7J78j0l0p0j3M0n0J23j85J62j12P6Oj22L9N1o1
$$ -106 118 -59 24 -125 -101 82 24 -63 115 105 75 5 -8 32 -18 105 -80 82 -30 46 52 -70 -31 20 -41
5805d1k10K93J2p2M1l4o0r5J64l4J7l2Q2j24k4J15m5jO6N7p8P9j45P2K6q7J22
$$ -41 -251 42 54 -18 23 -11 -71 -166 -2 -36 -19 -51 31 -93 -117 -2 -47 -48 18 75 -3 76 -69 3 29 -58 64
5832F4k43L16r0L9k5k6J9j2p1L5J89p5j5j04l6J16r7p7J70k98J06K08j17O1k64
$$ 64 -179 137 47 86 61 35 54 42 -29 6 195 120 105 1 -35 81 -16 -93 77 -221 -115 93 -24 37 -227
5857b27L08O5k78O6K44r9r0m5J5o8J94k42K35J38l66K26j18J73k6j46n4K74k42
$$ -227 81 146 -132 -66 178 79 -11 -56 -41 -109 85 -157 78 216 -150 76 -42 131 105 -41 -95 179 -63
5880f3R1P2q2Lk5k2O6l3j21J06J72k12J56k23K49j70Q0J3p9L0j51M8J28j10O9
$$ -63 28 100 18 21 -4 -26 40 7 -114 -8 164 -48 108 -115 134 -36 44 57 -22 8 -143 -95 33 -77 -8
5905hJ14j83J31j52J76j62m2K28j97K24n8k51J72Q7j64j2J24M4l8jP9n9r7n4Q2
$$ -8 106 -77 54 -98 78 -84 -126 102 -95 129 71 -180 -8 79 -85 -97 27 71 33 32 111 52 -45 -99 -17
5930a7l4J46M8k05L0J10o3M0mj26J82n0j84K21j20J00rl43L02K0j52l6J63j30
$$ -17 -51 95 143 -62 -32 78 15 55 51 -75 107 57 -127 94 -26 74 65 -278 24 44 -108 -144 19 -111
5954a11Q8R1kRj91N0J28j66J16j80J92Q6pj10L6J0OK6j11NqJ10j6n4mJ80l79J92
$$ -111 -23 68 66 75 -116 -66 62 -104 12 -168 24 110 103 -7 29 39 45 71 -40 -35 -43 67 51 -3 -7 173 -206 -14
5982a4M8K0j14J24l0Q2j08j09N8q7K87k21J07o4J17Q6j21r3J40k35K26L3r1r9
$$ -14 34 54 -60 64 34 116 8 -101 -43 -130 157 -64 43 -21 96 182 61 -32 108 -127 99 132 41 -58
6006e8R1L5k2N0j24j52J26P9O5j05m1l2J23kN8q1qP9l9j05L9pR3q8J05j09O3j24
$$ -58 33 68 46 96 -28 -180 -54 25 90 -15 -56 -88 35 33 91 10 2 81 42 -63 -24 -31 62 -26 79 -30 33 -91
6034i1J14j87L04m8p0o2m0N2L6J5o6J95k16nJ29r6kK34k26L2n2r0R0M5J03j01
$$ -91 23 -164 140 92 22 -40 -80 -28 8 23 -43 152 -64 -69 60 -36 -38 196 -30 2 -50 -140 -50 -5 98 -3
6060co5J06K1j59M0J36Kj65J12l5M4P1j51j23R2J47k61J39q8R2J91j42J31J8j84
$$ -3 -68 38 59 -100 -60 76 78 -87 25 -10 34 105 -46 -169 -77 70 -191 -52 -140 -48 143 1 132 150 -34
6085c4J7l0J34j14J45j35MJ58j68J93k09N7j17N1J18p0l7J9n2N7M2q2L4O%p9M2
$$ -34 -17 -47 87 -27 118 -17 -13 145 -23 170 -39 18 -99 -48 70 0 -37 -18 -70 -13 29 -53 -19 -13 -13 -92 -50
6112e0K07k65J26r6J46j37J12j28O9R4J7j6m3Pq5J04q0MJL8j71K20J52k83J1R
$$ -50 157 -108 18 -78 68 -69 43 -85 -16 78 95 79 36 43 -42 62 -18 -14 -13 25 -146 74 226 -57 -46 -37
6138c7L1l0K08j00j53K18j26J3j6p3O0K24r1k6n8p0o7J86j63j9P0J76j03M3p2
$$ -37 -6 -36 172 72 -81 137 11 24 8 -65 -5 219 128 102 44 -26 -93 93 -70 -89 -19 157 54 97 25
6163B5oj6nJ49k71J65L7k45N5J20R2j61N0m4L1J03j36J4r1J37k3j59K49j01J47
$$ 25 19 3 -2 147 -124 41 78 -167 -112 8 100 -61 -11 -55 -24 79 -57 -43 -134 3 -20 -179 70 -31 116
6188A16k8o8j5j35J44J00k36O2j03K17r7O9K9j87K04j13j4j9O5n0l2O4P9Pm7p0
$$ 116 88 20 5 -130 14 114 -122 -60 -163 54 -43 26 55 -132 72 -41 -55 -74 -9 -59 -91 -27 52 59 12 -58
6214e8J13m6M1r3l1Q5j94K58k19J47M9P1r4j41O3P9j69J21k7np0M4N4k1o3J62
$$ -58 55 9 50 -43 -74 11 -183 75 -144 3 52 123 29 -112 -49 30 -139 -18 -45 -50 -120 -76 -22 -43 -106 56
6240E6k8k7l3O1o7J03j24q4J80J61k16MQ9m4j06L4P2N7j37J61j48K4J17q2N2n1
$$ 56 28 1 -32 29 -38 65 -59 -143 37 198 -18 -14 75 31 -75 -41 31 88 -49 112 -36 -12 105 23 75 24
6266B4J88p5k94KJ65n4j5j2O3j01K67j56J17k45PJ55J39k07J22M1k02p2L8K75
$$ 24 212 137 -157 -155 10 -44 -59 -71 -8 -109 158 2 119 -126 -119 36 175 -32 90 131 -71 -143 -105 170
6290A70k23N2m8N9N7p4m8J01k2Ol3PK7q8K2O4L5j74J32m9j18J76J23l2k09J88
$$ 170 -53 -1 -49 10 67 -7 -55 46 24 30 -3 4 31 -57 -35 29 64 -110 22 -27 -145 31 154 122 -87 101
6316A01r0K2K4l2o8J06K3LN6l3j14N5q2J18k08Q4J79k22J28Q8p7j35K87k97J68
$$ 101 11 33 57 25 -43 63 86 89 145 112 -2 53 -29 89 -119 -35 144 -78 50 138 61 -74 213 -84 84
6341H4r6j9L9j25R0P2j52J09n9J26p1L4j20P4J25j65O3P1n2N2j49N6J11n5j34
$$ 84 -12 -31 8 -117 -27 45 -107 2 -57 69 -2 32 -88 -14 111 -54 9 80 28 80 -69 -13 98 43 -91
6366i1Q5j8p8J79p1m2J07r4J0J6Q2j11J53n4k00O4r1J47K1q1K3R3r1J41j69J72
$$ -91 -6 -24 -102 77 6 -36 71 -23 -13 3 85 -26 127 73 -127 -63 -154 -7 14 -67 -44 49 -42 99 -70 102
6392A02k5j56o0J22n4L5p8J48l7M3p8J0pL7m6P8L1k00J04O1m3M1q6%%J30j77P6
$$ 102 77 -79 -139 -17 -71 -36 -114 34 -3 40 -38 -28 -35 2 -44 34 65 -135 -31 30 -13 28 -58 -58 -58 72 -105 -29
6420b9J39o0n3m4K6n7J90q3K1J74l30J48p0P5n4M6n4J1Pk22J22Q3%J93L0j86k5
$$ -29 110 50 -3 -47 -21 -78 112 29 50 224 -106 42 -28 47 -7 39 -15 -4 3 -219 -97 -14 -14 179 209 23 -2
6447bQj54J54r1O5J99r1j90O7J21k5j78R1o1m9J58j58O7J45o2r5Q3j3j9k6K7m1
$$ -2 6 -148 6 -85 -20 179 88 -102 -35 86 61 -117 -26 -87 -136 22 -136 -69 76 14 -81 2 -11 -30 -56 -29 -70
6474g0l0k1J63O3j08k42K09q9K81k55N8m5M5K6m1k0J48j07R1O5j08j17J22j05
$$ -70 -100 -121 42 105 -3 -245 -36 -125 156 -99 -41 -86 -41 -15 -56 -76 72 -35 56 121 13 -104 18 -87
6498h7N5k0J00p7l5L2J04J9k08J02j4m5P6L2J1P9q9k19L41p9j92J57m1k7M6k06
$$ -87 -32 -52 48 -29 -64 -32 72 91 -117 -15 -29 -74 2 34 45 124 35 -184 157 78 -114 43 2 -25 21 -185
6524a85P4K17pj6pjM2j76l9K54p2M4k62K42j53j02J57k5P6l1M2q5J67o4k09O6
$$ -185 -111 106 99 83 76 75 117 -59 -98 156 84 128 -134 108 -45 -147 10 -15 61 30 72 -13 154 90 -119 -53
6550e3q1J94j60J82k24K09l4j61J35J61k98K51j54J08Q1k27K32k66J25j33K55
$$ -53 -134 60 -100 82 -142 67 33 -128 7 168 -130 121 -33 75 156 -71 161 -105 20 -113 142
6571A42l20J28MP3p0P0j57J81J0k11J65m1j3k2J16q3K6j4N9n0j9Pm5K2J10k52
$$ 142 -178 -50 -46 27 -43 27 -130 51 61 -150 15 -26 -39 -61 55 -28 -2 -16 43 -7 -26 -19 -64 -42 68 -184
6597a84Q3Q2J54o3M4j76J07j94N5M3k1J57Mn2j25J09k2l9n0k7%R7n7J23l1J24
$$ -184 -101 -19 135 72 116 -60 47 -147 -92 -49 -70 87 91 39 -86 23 1 -38 -88 -115 -115 -18 -75 48 17 141
6623A41k7j83J44m6Jj1p6J00J8r0J03l1j37l0R1K0J94j89o5N8Q9r5M0K0j92P3
$$ 141 114 -69 75 29 30 19 -57 43 61 -29 74 43 -94 -124 -33 -13 181 -8 -73 -15 74 -21 19 39 -153 -80
6649h0Q6O9J38k00j03Q3O5k8k2l0j07R5Om6J54j52J36l5j16J07k2j04J44P9k11
$$ -80 6 75 213 13 -90 -7 58 30 8 -22 -129 -34 -28 -74 80 -72 64 29 -87 20 -2 -106 38 117 -94
6674i4R1r2m2K16j28K2J21j31J47R8r6j76P1M0o0L23m15J86k35J3J50j8J47jj21
$$ -94 -3 -95 -137 79 -49 -27 94 -37 110 208 112 -64 7 47 -13 310 -105 81 -154 -141 9 -9 138 137 16
6699A6J25j35j09J13N2l4q3N6%K7N5j15O7oOn6J97j32j20K64r6Jj48J49M0k25
$$ 16 141 6 -103 10 62 28 -55 1 1 28 83 -32 35 29 35 -21 176 44 -76 188 92 93 -55 94 134 -91
6725i1N1p4m0J33pn9J68j4l0k8O4j24n6J21o9P9o2L7K1k5l3Q8j01Q6j1M3k3K3
$$ -91 -40 -114 -154 -21 -28 -87 81 67 37 9 73 -51 -107 14 -55 24 -38 -1 20 -5 -38 50 -51 35 24 67 44 67
6753F7m9l8n7J60k33K41j43k9J78j79R7l6R9J52k44J32j14j26J78o5l5L25j51
$$ 67 18 -20 -77 83 -150 91 -52 -81 97 -82 15 -21 78 230 -14 118 4 -122 56 -9 -44 281 130
6776A30k68K61n0M1m7j85R5p2J52J3l8J0L0l1Nl7Q8m7J07l07K85n0k41K79j42
$$ 130 -138 123 73 114 67 -118 -23 -95 57 70 32 42 72 41 46 9 97 50 157 -150 135 85 -156 123 -19
6801a9r1N0O0P3m3R8j04Lj05R1J3QKM4j12N8l1N3nJ3j17o8j6L8Q9K9l0M7j14J53
$$ -19 -110 -60 0 73 30 128 24 27 -78 13 26 34 36 80 -32 26 -5 48 43 56 -61 -129 -145 -107 -18 11 -19 28 -86 67
6831F7Q5k19O8J0n1O8M9j86R6m5M2N2o3K5k6q5K40n2o8N7j02J4r1L2k9J16j51
$$ 67 152 -67 1 11 -40 28 77 -109 -13 -58 -16 36 -27 -2 -28 -113 127 75 7 64 -38 -24 -115 -83 -112 4 -147
6858a47J38R4n4k1j13J38J24k17L4R5j09J34K7k47P2J19j43J04M6j09kR1l9R6
$$ -147 -9 85 31 10 -103 35 159 -58 -24 71 -38 96 123 -124 -52 67 -76 28 74 -35 -37 54 15 111
6882A11k00J53o6K5j09R9K1q2M1l9M7l8l9j38J66m5J8N0m0j9L6jQ9m2j40K16q4
$$ 111 -89 64 -2 23 -86 13 34 -48 -7 -46 1 -37 -76 -214 -48 -93 -75 -25 -65 -84 -48 -49 40 -2 -142 74 -10
6909a0O2n8K38k00l8M7o6PQ3k35J69n4j50K29P3l4j58J87j0ok7L1K3k1Mk8j79
$$ -10 52 -6 232 32 -6 41 -25 -18 65 -170 -1 -55 -205 24 97 63 -95 92 82 76 49 80 103 82 86 58 -121
6936a21J16pJ00k20O8m7Q3O9K4l6j83P6P8km8l3L8Q0m4J7P7J06k44p5K5L6J98
$$ -121 -5 -12 88 -132 -64 -111 -28 41 65 29 -154 -78 0 -2 -50 -83 -45 35 -9 8 85 191 -53 -128 -103 -67 131
6963A31p3N1j51K6jQ6J20j46k18J81m1N9m2K6J12j53k8m4j05K29j45J14n7L1R2
$$ 131 58 109 -42 -16 -17 69 189 43 -175 6 -35 24 -18 8 120 -33 -61 -105 -210 19 -126 -12 -69 -38 54
6988E4r7R9pr2J43p5m3j74J5J22L6o9J40r1J23j40K3j05K04j31J13k3p3J11K2
$$ 54 -43 56 49 -43 100 25 -18 -192 -177 -55 -19 -88 52 -39 84 -56 -33 -138 66 -65 48 25 -48 63 85
7013H5j27r8K74j87J29l0m8J0j7j2J88j74P8k9R2p6n7j02J48M2m5k4mq2J17k6
$$ 85 -42 -140 134 -53 76 46 -2 8 -9 -21 167 -7 71 42 134 58 1 -101 47 89 44 20 16 -66 51 25
7039B5j02K5R6j1M8p8rO5Q4p0j26O8Oj76K96j18Np7L7M8J16q8j79q1J68J20j97
$$ 25 -77 -52 44 33 81 3 -6 59 143 73 -53 15 21 -155 141 23 28 -49 -12 36 152 64 -115 -196 -28 92 -105
7066a05K61m0j41m4K9l9L8O2QN3K1k19J37m7M7N2Qj8j33J46j0J1L4k00Q1j8J00
$$ -105 156 116 -25 -69 -40 -79 -41 21 29 82 103 -116 21 -26 21 73 81 63 -70 76 66 77 111 -89 -8 -26 74
7093G4j12J26J07j99o3%PJ44l0j53l7K75j40n9L1R3qj51P6J23o0M7k3o8J77k19
$$ 74 -38 88 195 -4 -67 -67 -60 84 54 -99 -136 139 -1 -60 -29 64 56 -95 -19 104 44 91 68 0 177 -42
7119d2ML8m4o2R6Qj64R1K07j65J26o9pJ1R6j71n5K3n5J11J91k51k8J34N6L7j63
$$ -42 -38 0 -44 -106 -10 -2 -166 -75 132 -33 93 24 17 28 124 -47 -102 -79 -134 -23 168 -83 -111 23 79 116 -47
7146d7J00MN3k66L74k40j85K29j04JK17j23j33L0kJ07j75K46j3k1j29J15J53k49
$$ -47 53 57 110 -156 218 -22 -207 22 -82 -81 136 13 -120 -90 -92 15 -160 86 73 52 -77 38 191 -58
7170e8p7L09j73P9j37M7M8N8j50P9O2j83K97r8r0n0n0J40r2J3mj1o6J64r3j22
$$ -58 -135 174 1 80 -57 -10 38 96 -54 25 87 -96 201 103 13 -37 -87 53 -39 -26 -30 -41 -107 57 -36 -158
7196a58L10k72K37j47O3J9Q2j60J17l8n0M3k17K49j1J5j71m6mK40k39K29m7P6
$$ -158 152 -120 117 -30 33 52 134 -26 91 53 3 46 -171 78 67 82 -89 -135 -139 101 -138 91 44 120
7220A20k23J79n3K05j23j30m8j06K09q4R9o8J00l4r9J28j02L4m6M7l8J37P2q9
$$ 120 -103 76 23 228 105 -25 -73 -179 30 -54 45 -23 77 43 -56 72 -30 4 -42 5 -33 104 176 87
7244H7m7q0RM4o5k0O0N5m2q7J52p5J11O2j48p2J80kj83K3J9L7O3j97J53l4l3J01
$$ 87 40 -40 -31 13 -52 -72 -12 43 1 -86 66 -9 102 164 16 -56 124 122 -61 -38 -19 18 81 -116 37 3 -30 71
7272G1j54L7N4m0O5K1Jj55M7j47J78J06n4n%on4j23q3J73K43k14J20Q3j83j21
$$ 71 -83 -46 8 -32 33 54 55 -100 -53 -200 -22 84 30 25 25 19 -35 -158 -241 -68 175 -39 81 164 -19 -140
7298a40P4R9j39K5n9J20m0n3n1J12k5J45k3j45O4P8J40k46j7J16k30J10J09L0
$$ -140 -66 33 -106 -81 -140 -20 -60 -113 -164 -52 -77 68 45 -100 -36 42 182 -64 -81 35 -195 -85 24 54
7322E4J31j62j24K3l7J37%j67J67l1j02K44p0j03J13j62J73n9%n6M9j31J01L0
$$ 54 185 23 -101 -78 -115 22 22 -145 22 -9 -111 133 63 -40 73 -89 84 25 25 -31 18 -113 -12 18
7346A8j43K29o2j09L7P6N4j38L7J27l4j28N7K0l6J40j96k2o0O3Q9m9j6J18q1M5
$$ 18 -125 104 42 -67 -30 46 100 -38 -1 126 92 -36 21 41 5 145 -51 -73 -133 -70 19 -30 -46 72 -9 36
7372C6M1kr8M0M8l4N0j03m3K41j70N9qn4K9k1oNJ42p7p1M3m0J98j96l0j16J63
$$ 36 77 75 -23 17 65 31 81 -22 -65 176 6 65 57 3 32 11 5 10 152 75 4 47 7 205 9 -21 -137 26
7400B6N8j47P0j9J26j32J12k34K31r1l0M7k06L52j90j49K17Ko2M3P2q1m1k8K8
$$ 26 84 -63 7 -12 114 -18 94 -140 91 0 -30 17 -189 163 -27 -176 41 43 -19 24 96 15 -26 -54 -26
7425b6p5J37o5P7m4k7j2J33p1N4p6k2J17o9o5m0M2M8N0k5p4P4K0j26J1K8J7K09
$$ -26 -101 36 -29 48 4 -23 -35 98 27 81 5 -17 100 31 -34 -74 -32 16 66 41 -33 41 61 -65 -54 -26 -9 200
7453B00j38J5j67j4J7M3N6Q5q6j09Q6K7rj14j6R7l5O3K0Q0j91P6%j5j13J96j92
$$ 200 62 77 -90 -104 -87 -44 12 97 11 -98 -12 15 6 -108 -124 -27 -62 1 21 101 -90 -14 -14 -29 -142 54 -138
7480a38Qn8J76Q5j23j7m7J15L6o4PR7j41J77q0j26J36q8n8P7M9j10J63pl7m5o1
$$ -138 -130 -188 -12 73 -50 -67 -114 1 37 -27 -20 77 -64 113 33 -93 43 -45 -103 -26 23 -87 76 69 32 -13 -74
7507g4K05n4j54P9pn6N8K5Q9n9r7k6r0J86P3r9M9k67J98m2M3K4q0J02Oq8J19r2
$$ -74 131 77 -77 2 -5 -61 -3 22 111 52 -45 -71 -161 25 98 -1 48 -219 -21 -63 -20 4 -76 26 32 -56 63 -29
7535b9J0q8J63j22K45k83J15Q6j2j68J2L4J4Q8J29k67M4N6j19qr0L94k46L6J12
$$ -29 -19 -107 56 -66 179 -104 11 97 85 -83 -71 -37 -23 65 194 -73 -29 27 -92 -100 -190 204 -42 -6 106
7560A06j56N4J0N2j58J16J14j37j39J57j5P6m1n6l2Qq6J15n2p8J72n7K5j30R8
$$ 106 -50 4 14 66 -92 24 138 1 -138 19 4 80 39 -17 -49 -41 -127 -12 -64 -142 30 -27 -2 -132 -34
7585c4j0q5k4K33P1k55O6p6P7n2J19j2R3j19P2k23J55k7N5r4O6Q7m7Q6q%m1l7
$$ -34 -44 -129 -153 80 151 -104 -38 -114 -37 -89 30 18 111 -8 64 -159 -4 -31 24 -70 -4 83 36 122 114 114 73 36
7613C6m9J65k16KL0R5k06J5J3Q9j3j77K52J52j08L0k24J38k03K42J1P9k53K2K0
$$ 36 -13 152 -64 -62 -32 63 -143 -128 -115 -26 -39 -216 36 188 80 110 -114 24 -179 63 74 153 -100 -78 -58
7638e8m4J32j04J22l7o1P0L9j0o7Oo9J43O1j03j99P8J28J0j0Qk4N6q0m5n9J38
$$ -58 -102 30 -74 48 11 -50 20 59 49 -18 -12 -81 62 123 20 -179 -101 27 37 27 35 11 67 -13 -58 -117 21
7665B1j33k1K80j73J50k31J53P0j04l9MJ34m4o2o8O9oJ27j60m0P3J19n6j17Pj7
$$ 21 -112 -133 147 -26 124 -107 46 116 12 -27 -23 111 67 5 -63 6 0 127 -33 -73 0 119 63 -54 -47 -64
7691f4O9r5J36r9J0L3P0J09j69r7K47k40Q5Ml4M5p1O8R9j40p1J17R8r0l2lr6j1
$$ -64 5 -90 46 -53 -43 -10 60 169 0 -97 150 -90 -5 -1 -35 10 -61 7 106 -34 -105 12 110 20 -12 -15 -111 -122
7719a22M1Q6nJ01l6n3O3k2l8qp7O1n9Q9J20j33Ml7M1mJ94j51QK4j4j59J18n7R1
$$ -122 -81 5 0 101 65 12 75 53 15 7 -70 -9 -68 21 141 8 12 -25 16 12 206 55 63 87 73 -86 32 -25 66
7748F6Q0j08L2j09J20j28J68o5L3Qj69pJ11j5N3k11j1R1J17j5j29J07q7R1L2j6
$$ 66 146 38 70 -39 81 -47 121 56 89 97 -72 -79 32 17 70 -141 -152 -61 56 41 -88 19 -68 23 55 39
7774C9O4r1J05k7M3j45O6k21J03K34k90J35J07pk56R2J19m6O7r8R7qq4Q1j22j07
$$ 39 103 12 117 90 133 -12 54 -167 -64 170 -120 15 122 115 -141 -49 70 24 91 -7 90 82 -2 79 -43 -150
7800a50J48Q0j69J13o6NOJ30j13j40J92k43J86LO1N4j21J22j60J43M6o0Lk9o1
$$ -150 -2 78 -91 22 -44 -39 -33 97 -16 -156 36 -207 -21 -18 43 97 -24 98 -62 81 127 67 70 41 -20
7825b0K7K5j16Q9L7k6j7J9k9n6P6j7K53k02P5j2j96P5q6N1k2J35o7l6R1r0J35
$$ -20 7 32 -84 5 42 16 -1 18 -11 -67 9 -8 245 43 118 106 -90 -15 -101 -50 -72 63 -4 -40 51 -39 96
7852I6j21Rj09J44n5m9J23rj12J25L8q2J64j97k4J61j84J68j47P4J0RPj04Pm3
$$ 96 -25 -16 -125 19 -36 -85 38 29 -83 42 80 -2 162 -35 -59 102 -82 86 -61 13 23 32 39 -65 -58 -101
7878a01N1J14Jl8m8L5p2M7j76N8q4K01R3r1R4k5o5j5m2P9M3J9K7j48J26j05p7
$$ -101 -50 64 65 27 -21 14 -58 -11 -187 -129 -213 -12 81 -10 84 59 -6 -21 -63 16 59 78 105 -43 83 -22 -99
7905i9M4k3q9P7J66J05j20j81J43j30J50j79K74k57R6j3o7J81j36R4m8p9L2Nj9
$$ -99 -55 -78 -167 -90 76 181 61 -120 23 -107 43 -136 138 -119 -23 -36 -103 78 -58 36 -12 -91 -59 -54 -73
7930g3J90l0j25P9j00P4Q6o0l56M15N1n4l6j82K2J80k14J56qR4j05P6r4n1K2n8
$$ -73 117 87 -38 41 -59 15 101 41 -315 100 151 97 61 -121 -99 81 -133 23 15 109 4 80 -14 -65 -43 -101
7956a01O4M1np9K8K8n0mK1N9k9J18n3q1J59j66P3qj3Oj98J61R9j2%j59J85ok43
$$ -101 -37 4 -1 -80 -52 -24 -74 -78 -57 2 -27 91 38 -43 116 -50 23 15 2 8 -190 -29 70 58 58 -101 84 78 -165
7985a65M7L6q0L59k25J58k38R6o9Q8r4O3J72k37j2Q0Oj39J5J92k17J75o2J50j09
$$ -165 -118 -82 -162 197 -28 130 -108 -12 -81 7 -87 -24 148 -89 -101 -21 -15 -154 -139 53 -164 11 -51 99 -10
8010a0L4Q1R3k06M6p2O0o2J58k7M1r8o2J27m2n8m5M5n8J57j55M4J4N6L2n6o6j36
$$ -10 24 105 198 -8 38 -34 26 -36 122 95 136 38 -24 103 61 3 -42 3 -55 102 -53 -9 5 61 93 37 -29 -165
8038a65K65q2j39J54J6r5L6Ql3O9j6q5J73m4j09l8J41j4%j20J39J7k2l6j26J46
$$ -165 100 18 -121 33 49 -46 -10 -2 -35 34 18 -67 106 62 -47 -85 56 42 42 -78 61 78 56 20 -106 40
8064D0k0j02M1J39k0j95O7QJ08j11K02q2oK7n6Oj9j65K50j89p1K25j99J20K0K5
$$ 40 20 -82 -41 98 78 -117 -50 -42 66 -45 157 75 69 96 40 46 27 -138 112 -77 -148 77 -122 -2 18 43
8090D3lj06N9J73j83l7N0j21J1J45N0j11p7J08m3K19l09J46l4J16k8k3j5k3l6
$$ 43 40 -66 -7 166 -17 -54 -4 -125 -114 31 81 -30 -107 1 -42 177 -132 14 -20 96 68 45 30 7 -29
8115b9jQ6r7J58r2J9q3J24k10J57O2j17l9J17J1q7n7n6M5J42P2j53L0m5Q6K2j0
$$ -29 -30 56 -41 117 25 44 -39 85 -125 32 94 -23 -62 55 66 -21 -78 -134 -89 53 125 -28 2 -43 43 65 55
8142E5l6r9p7J53j9O8Nk1R0j43R1j35L7J03j87K21j75oK51j25r1m3P4N2j42J64
$$ 55 19 -80 -157 -4 -23 45 50 29 119 -24 67 -68 -31 72 -115 106 -69 -75 176 51 -40 -83 -9 43 -99 65
8168F5pj25K8p7J96j55J17j48R5K1n4p6K21K5k05J59J7j56J60j41k9P7J13
$$ 65 58 -67 -39 -116 80 -75 42 -106 -11 10 -44 -120 101 126 -79 80 97 -59 101 -40 -69 8 121
8191A21
$$ Imaginary data points
##PAGE= N=2
##DATA TABLE= (X++(I..I)), XYDATA
0@%%%%%%%%%%%%%%%%%%%qJ6j6J6j6J6k2L0l2L2l9M7n0N8o5P3q4R2j03J16j29J42
$$ 0 0 0 0 0 0 0 0 0 0 0 0 0 0 0 0 0 0 0 0 -8 8 -8 8 -8 8 -14 16 -16 16 -23 24 -26 32 -33 40 -44 48 -55 61 -68 74
41G4j58J76j93K12k34K59k84L12l44L77m15M60n09N60o19O89p70Q67r83J122j293
$$ 74 -84 92 -101 111 -123 136 -148 164 -180 197 -218 242 -267 293 -326 363 -407 460 -523 599 -694
62f94J514j813K231k855L881n847J0834m4984p4017J35618L1393q3712K6496M8164
$$ -694 820 -993 1238 -1617 2264 -3583 7251 -37733 -111750 23868 55261 -28451 -1955 46209
76D6209m8735k050K7337l1660P23L8814j6806l1113J5420J4040k3418K58K6939
$$ 46209 -2526 -4576 22761 -8899 -8176 30638 13832 -17281 -1861 12179 -11239 -10981 15958
89A5958j6557k5259K1250J3081k1453K212K1734j2020r792J9557j5923j4846M0316
$$ 15958 -599 -25858 -4608 8473 -12980 -10768 10966 -1054 -10846 8711 -7212 -22058 18258
102A8258K777l6440J1938J4992j8019M987J7961j0037l944R655j7796q496K5792
$$ 18258 21035 -15405 -3467 11525 -6494 -1507 16454 6417 2473 12128 -5668 -14164 11628
115A1628R75j6641M148q36q618N41M283N193K332k761r917m870J2601O772p084
$$ 11628 12603 -4038 110 -726 -9344 -8803 -4520 673 3005 244 -9673 -14543 -1942 4830 -2254
130b254N417J0855j0419j4812J1443R078j1148N900Q800j5447k182N631j1744
$$ -2254 3163 14018 3599 -11213 230 9308 -1840 4060 12860 -2587 -4769 862 -10882
143a0882N660K0112o905j4904P456M112j0805K507Q983l264k894l919n879P746
$$ -10882 -5222 14890 7985 -6919 537 4649 -6156 -3649 5334 2070 -824 -4743 -10622 -2876
157b876R322l680p489K671O595q322m944J4514M097j1482J00K714n124M452O994
$$ -2876 6446 2766 -4723 -2052 4543 -3779 -8723 5791 9888 -1594 -1494 1220 -3904 548 7542
172G542q824J018J3153j3416j3901J5276K452r547R754L370j1844L525N970q737
$$ 7542 -1282 -264 12889 -527 -14428 848 3300 -6247 3507 6877 -4967 -1442 4528 -4209
186d209K061J2681p416j2091P031L083q060J432Q836k368q560M846Q088m683J260
$$ -4209 -2148 10533 3117 -8974 -1943 1140 -6920 -5488 3348 980 -7580 -2734 5354 671 1931
201A931N312r935q73J2084p592j0073J5671N501j7970J376J2099q431k714Q250
$$ 1931 7243 -2692 -3565 8519 927 -9146 6525 12026 -5944 -4568 7531 -900 -3614 4636
215D636n942k300O288o434m335J1164J107j0716L802Q920q264p648R993P098o603
$$ 4636 -1306 -3606 2682 -3752 -8087 3077 4184 -6532 -2730 6190 -2074 -9722 271 7369 766
230G66m569K944q48m04O926m13k980P523k617j4194N984J0586q810l499Q375n125
$$ 766 -3803 -859 -1707 -2111 4815 4402 1422 8945 6328 -7866 -1882 8704 -106 -3605 4770 -355
246c55p691O687k48m781Q525K226r883K306O391n106l076N485K229k865K51J054
$$ -355 -8046 -1359 -1607 -6388 2137 4363 -5520 -3214 3177 -1929 -5005 480 2709 -156 95 1149
262A149j862K163M484l749l997M896L00p291L733Q450p455o373O132o05l075M347
$$ 1149 -713 1450 5934 2185 -1812 3084 3384 -3907 -174 8276 821 -5552 580 -25 -3100 1247
278A247j380l749M847k277p283O945O414p466p23P106l918l309O069J656k813
$$ 1247 -133 -3882 965 -1312 -8595 -1650 4764 -2702 -3425 3681 -237 -3546 2523 4179 1366
293A366M28q0j690o9J250j150p69L569k0o362q48O035J80k575K867k140m476L883
$$ 1366 1794 1714 24 -45 1205 55 -714 2855 2835 -3527 -4375 1660 1840 -735 2132 -8 -4484 -601
311f01m12m551P334M239r165m72O510m822q89P795k492m788M386j189m877O043
$$ -601 -1013 -5564 1770 6009 -3156 -3628 2882 -1940 -2829 4966 2474 -2314 2072 883 -3994 2049
327B049L135p115l25N750k152n220K828M495k476k840J035m51p44L848j81l986
$$ 2049 5184 -1931 -2256 3494 1342 -3878 -1050 3445 969 -1871 -836 -1287 -2031 1817 1636 -2350
343b350M699K259r056p02R179j984n212M431o29m567L331P49k606N177J456p549
$$ -2350 2349 4608 -4448 -5150 4029 2045 -3167 1264 635 -3932 -601 148 -2458 2719 4175 -3374
359c374Q30O193k569l298L372J189l289n49K016R85o2m03j000j197R97L57k470
$$ -3374 -2544 3649 1080 -2218 1154 2343 -946 -1495 521 1506 1444 1041 41 -1156 -159 198 -2272
376b272J661L901m076l540M604N7l715L594K296l811P36P57m003K675N481l460
$$ -2272 -611 3290 -786 -4326 278 335 -3380 214 2510 -1301 -565 192 -3811 -1136 4345 885
392H85k496M456j176l650L253K418k136k97l41l019N70L385j095k777K096J639
$$ 885 -1611 2845 1669 -1981 1272 3690 1554 1257 916 -2103 -1533 1852 757 -2020 76 1715
408A715m522k466N505J325l707J384R21l273K184K428l777K561N777n077m393
$$ 1715 -2807 -5273 232 1557 -2150 -766 155 -3118 -934 1494 -2283 278 6055 978 -3415
423c415O200N78n214K874L210l521j557J312j370J432J695l736j442L451j82m187
$$ -3415 2785 3363 -1851 1023 4233 712 -845 467 -903 529 2224 -1512 -2954 497 315 -3872
439c872R39M858j096m460J489K130r35J307J920l100p1L301k405j914N432k90
$$ -3872 -2933 1925 829 -3631 -2142 -12 -947 360 2280 -820 -891 2410 5 -1909 3523 3233
455C233m263K786J743m880J021L554k909j815K410k213k340L255N43k376J341
$$ 3233 -1030 1756 3499 -1381 -360 3194 285 -1530 880 -1333 -3673 -418 125 -2251 -910
470i10J854k683j045K343J368o74j0L08j395K59K132j109j41L380j421m838J871
$$ -910 944 -1739 -2784 -441 927 253 243 551 -844 -585 1547 438 297 3677 2256 -2582 -711
487g11L080k619n71K360j203o78Q69k246K20L655j712l563K314J605l156N7L227
$$ -711 2369 -250 -821 1539 336 -342 527 -1719 -1499 2156 444 -3119 -805 800 -2356 -2299 928
504I28j80j430R2M9P65J430n29j502J063J276k674j439L276J268k804K07Q62j563
$$ 928 748 -682 -590 -541 224 1654 1125 -377 686 1962 -712 -2151 1125 2393 -411 -204 658 -905
522i05J79J250r71o7K264k477k169L652J089l113J351J696k682q22J861o76k07
$$ -905 -726 524 -447 -514 1750 -727 -2896 756 1845 -1268 83 1779 -903 -1725 136 -540 -747
539g47J845r96k403K094J773j958K0K940q09k932P66J168j467J003J965k421r87
$$ -747 1098 102 -2301 -207 1566 -392 -372 2568 1759 -1173 -407 761 -706 297 2262 -159 -1146
556a146K330j826j438L992L61m239R81K314l008k46L205q85j178J144j296j340
$$ -1146 1184 -642 -2080 1912 2273 -1966 -985 1329 -1679 -1925 1280 395 -783 361 -935 -2275
572b275K778J069k926L84K864j597k488K410K338j202r60R43n45j048J181m33
$$ -2275 503 1572 -1354 -970 1894 297 -2191 219 2557 1355 395 1338 793 -255 926 493
588D93r89J977o83l960J572L220k740j353L298k32k546R73Q46q14J497M48k348
$$ 493 -496 1481 798 -3162 -1590 1630 -1110 -2463 835 603 -1943 -970 -124 -938 559 1007 -1341
605a341J021J788r82o88J516M16j197m00K02m7L11N69m66j501N76M54j336J62
$$ -1341 -320 1468 486 -202 1314 1730 533 133 335 288 599 1168 702 -799 -223 231 -1105 -943
623i43J923j149j616Q65k10m44J193L42p23J216J4j580J107J930j257p76J528
$$ -943 980 -169 -1785 -920 -1130 -1574 -381 -39 -762 454 468 -1112 -5 1925 668 -108 1420
640A420k40j531J77J191M54m36j259n06N40L29q59k85J185N1j634o05K066j45
$$ 1420 1180 -351 -174 1017 1471 1035 -224 -730 -190 139 -720 -1005 180 231 -1403 -2008 58 -87
658h7r61J175L87j205M91K99m29J168P98k117J99J995j201j290J820M95j436r3
$$ -87 -1048 127 514 -691 -200 99 -330 838 1636 -481 -282 1713 512 -778 1042 1537 101 8
676Hk08p26J217N68j671l83J443l01j428P58J425n01r28N65k68l49J188J72j185
$$ 8 -200 -926 291 859 -812 -1195 248 -53 -1481 -723 702 201 -727 -162 -430 -779 409 581 -604
695f04J182J040k600o5K805q16j968J523K60j729R31P00j187Q16Q13k211r3K202
$$ -604 578 1618 -982 -1047 1758 942 -1026 497 757 -972 -41 659 -528 288 1101 -1110 -1203 999
713I99o84j406J338P61j373q70J124M90m13L00m8r79N08N00j233M49J973j061
$$ 999 315 -1091 247 1008 -365 -1235 -111 379 -34 266 218 -761 -253 247 -986 -537 1436 375
731C75j855J629R52j899O24J632j428m11J033j013J93J457q18j274J294J74j780
$$ 375 -1480 149 1101 -798 -174 1458 30 -381 652 -361 -168 1289 471 -803 491 665 -1115
748a115L93J634n24j058N23j50n19L93M23m20K54O37r17p08J314P76j097K65O05
$$ -1115 -722 912 388 -670 -147 -297 -816 -423 0 -420 -166 471 -446 -1154 160 936 -161 104 709
767G09o48k66Q96o38J58J042r49j569J585P44j543k61J164k60p23k62j01P23P71
$$ 709 61 -205 691 53 211 1253 304 -1265 320 1064 -479 -740 424 164 -559 -821 -922 -199 572
786E72j014p44R08N82r86K7J465O6j161J89Q90n07j43P34j85k31J10p76r8J347
$$ 572 -442 -1186 -278 304 -682 -655 810 876 -285 -96 794 287 144 878 693 462 572 -204 -302 1045
806A045m66j519O01O87j090m49J070j04k61N06n79l91R56K99p14O74N26n59o04
$$ 1045 579 -940 -339 348 -742 -1191 -121 -225 -486 20 -559 -950 6 305 -409 265 791 232 -372
825c72Q11K74o19M37M26p31l12P82o11m37J069m31j435O52R50r97m21J347p26
$$ -372 439 713 94 531 957 226 -86 696 85 -352 717 286 -1149 -497 453 -544 -965 382 -344
844c44m11O00n66k31J319J55j328O77R45p37n84J164N49p88n81K55K74j8m6n02
$$ -344 -755 -155 -721 -952 367 522 -806 -129 816 79 -505 659 1208 420 -161 94 368 350 304 -198
864a98rP28p24j011J113R17j252m60J019j71n16M82J41k67O39k89q39O90P37j073
$$ -198 -207 521 -203 -1214 -101 816 -436 -896 123 -48 -564 -82 59 -208 431 142 -697 -7 730 -343
884c43J47R09l92q52P07J19k24J66J88m80j79K12j93j84Q35p3q85L0Q05m53j84
$$ -343 -196 713 321 -531 176 295 71 237 425 -55 -234 -22 -215 -399 436 363 -522 -492 313 -140 -324
905c24O72r0n74M98k44n58Q15O31j061l64Q97k65p38Q40J75k83j63m4m34P30N68
$$ -324 348 258 -316 182 -62 -620 195 826 -235 -599 298 33 -705 135 310 27 -136 -180 -614 116 684
926F84o74q8R86j76j381N26P66l22n73L85j71l36R5j02J3N56K7j050P8J543o50
$$ 684 10 -78 908 732 -649 -123 643 321 -252 133 -38 -374 -279 -381 -368 188 215 -835 -757 786 136
947A36q30R26L68r05J54L65j06N22N2p40P8M36k88m47O90K36q02k49L53j43j46
$$ 136 -694 232 600 -305 -151 214 108 630 682 -58 20 456 168 -279 411 647 -155 -404 -51 -194 -340
968c40L75k81l13O7M57p28J13J065m32l91M84K92o28M56O19o73K18L32q34J29
$$ -340 35 -246 -559 -492 -35 -763 -650 415 -17 -408 76 368 -260 196 815 142 360 692 -142 -13
988a3P93l71m09M04k7p41QL52j61K7j70l16L23J83j86l04Q73J8o11j00Q34K53
$$ -13 780 409 0 404 377 -364 -356 -4 -165 -138 -308 -624 -301 -118 -304 -608 265 283 -328 -428 406 659
1010F59r30K86N41j42k85K1j21N03N09r93k98N76j64p13M03M59n25k89L2N8J02
$$ 659 -271 15 556 414 129 150 29 532 1041 48 -250 326 162 -551 -148 311 -214 -503 -471 -413 -311
1031c11N10m92L4L15m7l99K42Q26k93n21M00m6j77J70J40k66J92J23o93O8N47
$$ -311 199 -293 -259 56 9 -390 -148 678 385 -136 264 218 41 211 351 85 277 400 -293 -225 322
1052C22Q1p86J22L79l47k5K39m32K78L34k83m41O88J73p99N24N96n26m33L35M22
$$ 322 403 -383 -261 118 -229 -254 -15 -447 -169 165 -118 -559 129 302 -497 27 623 97 -336 -1 421
1073D21j66j90J87n9j77J14l01q4Q14k64r85O44L75n94j69Q09j18m21lN8J0K21
$$ 421 255 65 252 193 16 130 -171 -255 559 295 -690 -46 329 -265 -434 375 257 -164 -167 -109 -99 122
1095A22j8l49N31j1n85j68O74R5n31qM09j14j01L57k08l9K95l55k84K62O36m42
$$ 122 104 -245 286 275 -310 -478 196 291 -240 -248 161 47 -54 303 95 56 351 -4 -288 -26 610 168
1117A68l38M90k01l90K46k06O4M06k59n80L91K94l43j92O94j76l77k3J94J66M7
$$ 168 -170 320 119 -271 -25 -231 -167 239 -20 -600 -209 85 -258 -450 244 68 -309 -332 -138 28 75
1138G5P2k80L91N7j30j74N04Q4m21l77M30k52j00oK1o3j0k50j29N77m6l36k5M92
$$ 75 147 -133 258 315 185 11 515 599 178 -199 231 -21 -121 -127 -106 -169 -179 -429 -558 19 -27 -363 -388 104
1162A04k43k64M41K28l49oK81k13K75L3k04R3M69n10l87L52J87l45QJ75k39j78
$$ 104 -139 -403 38 266 -83 -89 192 -21 254 287 83 176 645 135 -252 100 287 -58 -50 125 -114 -292
1184b92K53k44k02M90j12n45J90O06k48k51N61o1l00J32K48k03O7M34o03qN30
$$ -292 -39 -283 -485 5 -107 -652 -462 144 -104 -355 206 145 -155 -23 225 22 89 523 -80 -88 442
1205D42l01m81K55L97l01l42K87q2j40K04k15l3M14k44m26K94P13l70m85O94m8
$$ 442 141 -340 -85 312 11 -331 -44 -126 -266 -62 -277 -310 104 -140 -566 -272 441 71 -414 280 232
1226B32k01P7L04m73K52j4k84r6O27n65j55N68K1o96M5M23P8k84J31q6p1J02J39
$$ 232 31 108 412 -61 191 177 -107 -203 424 -141 -296 272 293 -403 -358 65 143 -141 -10 -96 -167 -65 74
1249G4j55J23K05m96j16L90L9k91K84K49l54M5K34j00j63K67l15j36L89k19j44
$$ 74 -81 42 247 -249 -365 25 64 -227 57 306 -48 -3 231 131 -32 235 -80 -216 173 -46 -190
1270a90J30K23n1q2m8r8R7K34n7k63K15qk89L3L00K5k87M3P0j13J84k45O0L93
$$ -190 -60 163 112 30 -18 -116 -19 215 158 -105 110 102 -187 -154 146 171 -116 -73 -3 -116 68 -177 -117 276
1294B76K9n71j9P20k07m93K41M64k00n60L37m9J4K66k74L8J08j54k32L53K9k11
$$ 276 305 -266 -285 435 228 -265 -24 440 240 -320 17 -32 -18 248 -26 12 120 -34 -266 87 116 -95
1316i5k86L23j54RJ48l9r9L70j92l3l1M49j19k85J88J51m11J45L36k69j31J98
$$ -95 -381 -58 -212 -203 -55 -94 -193 177 -15 -48 -79 370 251 -34 154 305 -106 39 375 106 -25 173
1338A73k92q2K58o3j98J3L60m17j44K91R7j98o5J71r3L50Nj65M6L77l16j16M31
$$ 173 -119 -201 57 -6 -204 -191 169 -248 -392 -101 -4 -202 -267 -96 -189 161 166 1 47 424 108 -8 423
1361D23mm68J79K25o8m71J31j01M4K42l53j33J34J99l66J49L36j20k18Q4K68J3
$$ 423 419 -49 130 355 287 -184 -53 -154 -110 132 -221 -354 -220 -21 -387 -238 98 -22 -240 -156 112 125
1383A25k3l1M0K22m5k76j69O30j33l36M5J20j47k08K38k01K0O5k7k18J76K33n28
$$ 125 102 71 111 333 288 12 -157 473 340 4 49 169 22 -186 52 -149 -129 -64 -91 -309 -133 100 -428
1406d28K09M90l77k83L93m6r4J79jj67K81L18m62O7Q5p4m13K22J22n7l1M6K4k03
$$ -428 -219 271 -106 -389 4 -42 -136 43 42 -125 156 474 12 79 164 90 -323 -101 21 -36 -67 -21 3 -200
1430b00Q5k93J55L21o8k79J81K73k67j39K19J07m4n7o9K69k2O1m13J99J55k37
$$ -200 -115 -408 -253 68 0 -279 -98 175 -92 -231 -12 95 51 -6 -75 194 172 233 -180 19 174 -63
1452f3j33K40J43k12L4qk1j47J36J43j23K7j43k08K85J82k71r1M99q9k59j12L42
$$ -63 -196 44 187 -25 9 1 -20 -167 -31 112 -11 16 -127 -335 -50 132 -139 -230 269 180 -79 -191 151
1475A51l06K86o4j88P3J01P9k64K54L0l00J05J36j05J63n4J19k14K47k90Lr4L13
$$ 151 -155 131 67 -121 -48 53 132 -132 122 152 -148 -43 93 -12 151 97 216 2 249 -41 -38 -132 181
1498A81l52j0K47j00q5O2O5p9q9P6j98N05M5l01j2K43j17j39J63J9J00j37Q3K1
$$ 181 -171 -181 66 -34 -119 -57 8 -71 -160 -84 -282 223 268 -33 -45 198 81 -58 105 124 224 87 170 191
1522A91j31K4j51l2K84k67j19KJ84p9j31Q6J26l08j1K25%J57R8k89K28J53j64
$$ 191 60 84 -67 -99 185 -82 -201 -199 -15 -94 -225 -139 -13 -321 -332 -107 -107 50 148 -141 87 240 76
1545G6M4K70k62M4k24K70q3p5J4k6K0j00j05j32m5M61j70l01J16qL3J05O7l4N6
$$ 76 120 390 128 172 -52 218 135 60 74 48 68 -32 -137 -269 -314 147 -23 -324 -208 -216 -183 -78 -11 -45 11
1570A1J16j65jL55j02k55K36R3l05pL2J89k60L8n0j28J69K0j72P5J65m97J82J51
$$ 11 127 -38 -39 316 214 -41 195 288 -17 -24 8 197 -63 -25 -75 -203 -34 -14 -186 -111 54 -443 -261 -110
1594a10L0p3J69K21k97N2m7M5J39J48j83k50M25ml74J88M0j66o9pJ50j38Q5m9
$$ -110 -80 -153 16 237 -60 -8 -55 -10 129 277 94 -156 269 265 -109 79 119 -47 -116 -123 27 -111 -26 -75
1618g5q3n2J89k00q3M01q0j79K26k4j91L37j47l10L98jj61j02J86J02k38O5J23
$$ -75 -158 -210 -21 -221 -304 97 17 -162 64 40 -151 186 39 -271 127 126 -35 -137 49 151 -87 -22 101
1641A01k9o8m2J31q0L52n11L4L34j49r4k07M31l11k03K85L0O5j49q8J24Q1r7k74
$$ 101 72 4 -38 93 13 365 -146 -112 222 73 -21 -228 203 -108 -311 -26 4 69 -80 -168 -44 37 -60 -334
1665c34K92J29q6k10L12L7k33J41J93k54J6J34j98L1L52k37k18K51j10l4n0K46
$$ -334 -42 87 1 -209 103 140 -93 48 241 -13 3 137 -61 -30 322 85 -133 118 8 -26 -76 170
1687A70j15n7P2j70j13K77j53j4J98J0k32j2J95n7k6K71J9j79J15N9j90r2J39
$$ 170 55 -2 70 -100 -213 64 -89 -103 95 105 -127 -139 56 -1 -27 244 263 84 199 258 68 -24 115
1710A15J7j49J23j4l41n2M00j71k18L8J06p0K88r3k47L30Q7l51J51L71l8k66q9
$$ 115 132 -17 106 92 -249 -301 99 -72 -290 -252 -146 -216 72 -21 -268 62 149 -202 -51 320 282 16 -73
1733g3K90j23o7L5k1N1p7P4o4J22J3m35J59J58k31p4j8O1J10j70J75o9J74Q8j00
$$ -73 217 94 27 62 41 92 15 89 25 147 160 -275 -116 42 -189 -263 -281 -220 -110 -280 -105 -174 0 88 -12
1758a2O2J11j77q0J13L37l40l1J98j41NJ00r7R3j63O7j30j22P4k1J03l3P4k01
$$ -12 50 161 -16 -96 17 354 14 -17 181 40 45 145 48 141 -22 45 -85 -207 -133 -154 -51 -84 -10 -211
1782b11J36j9j04K52K48n27K59P3k9j64K10O2j52o4J76p0p7N5q6J00k6k37qJ14
$$ -211 -75 -94 -198 54 302 -225 34 107 78 -86 124 186 34 -30 146 76 -1 54 -32 68 42 -195 -203 -89
1806h9J92j88o7L8J70j71P4LJ54k01J36j10K03q2q7j21L55j21j07L7j35J68l1
$$ -89 103 -85 -152 -114 56 -115 -41 -38 116 -85 51 -59 144 62 -25 -146 209 88 -19 18 -117 51 20
1829B0J69k84J48n5J16l09L25k3j86Q1O0j06N6K9m2j49J94R8j11K22k90j9K9j7
$$ 20 189 -95 53 -2 114 -195 130 107 -79 2 62 -44 12 41 -1 -150 44 142 31 253 -37 -56 -27 -44
1853d4J90j46L0P7k11J18k10J43J37J82j91j17K17j45j02oK3J10j23n4K20j86
$$ -44 146 0 30 107 -104 14 -196 -53 84 266 75 -42 175 30 -72 -78 -55 55 -68 -122 98 -88
1875h8j61K25op4K18l21O9J20M8or3J25L3m5j58K88J0o0Q9j42m9Pj74J86K57m12
$$ -88 -249 -24 -30 -104 114 -207 -138 -18 30 24 -69 56 89 44 -114 174 184 124 213 71 22 29 -145 41 298 -114
1901a14l7J52M5o4P4j98MJ21Nj10q1K29K9n3j3N3j7J23N1j6k9qq5k4j3J30p4J
$$ -114 -151 1 46 -18 56 -142 -138 -17 -12 -122 -203 26 55 2 -11 42 25 148 199 183 154 146 61 37 24 154 80 81
1929H1j8j1j40K26j26j71Q6mQ0j21J67j81L12m9o3o9rL6K7r4K84j13k29J92p8
$$ 81 63 52 -88 138 12 -159 -73 -77 3 -118 49 -132 180 131 68 -1 -10 26 53 -41 243 130 -99 93 15
1954A5J92r9j38l1J11j83j19K81lq1j26J06RP3J0j13%L89j72j48l1M18k31j57
$$ 15 207 108 -30 -61 50 -133 -252 29 26 -55 -181 -75 -66 7 17 -96 -96 293 121 -27 -58 360 129 -28
1978b8Q6J54kk71N2M0p0R9j61Q4J90j38l5p0N4M3j51n8J96Q5j62N9J88j69N4j05
$$ -28 58 212 210 -61 -9 31 -39 60 -101 -17 173 35 0 -70 -16 27 -124 -182 14 99 -63 -4 184 15 69 -36
2004c6oK38o3pq6K19k16P6p5j17J70j50J0P9R0j25P8l06L37j79j55J11J97j76
$$ -36 -42 196 133 126 40 259 43 119 44 -73 97 -53 -43 36 126 1 79 -227 110 -69 -224 -113 84 -92
2028i2J08N2l8N4j0k17R8J27j57m8R0K0r6P7k1L2k4R8q4N0J03q3k9r3L82l65J72
$$ -92 16 68 30 84 74 -143 -45 82 -75 -123 -33 -13 -109 -32 -53 -21 -45 53 -31 19 122 39 10 -83 299 -66 106
2055A06J84j04l35J89M2p6R7j59j04J36O4m6j67J61o5n3M7J5J1J11J40J7j11J05
$$ 106 290 186 -149 40 82 6 103 -56 -160 -24 40 -6 -173 -12 -77 -130 -83 -68 -57 54 194 211 100 205
2079B05j40r5K12J41l59R7J61k11j19J42l0p2J64j84P0j4j07l8j37K83j58J05
$$ 205 65 -30 182 323 -36 61 222 11 -108 34 4 -68 96 -88 -18 -32 -139 -177 -314 -31 -189 -84
2101h4J56M2j48J27l0Q1O2j25p5l4J99k37J6L0K12k11j76J1K34k03P1j7Q7J11
$$ -84 72 114 -34 93 63 144 206 81 6 -28 171 -66 -50 -20 192 -19 -195 -184 50 -153 -82 -99 -12 99
2125I9k10o2N5Q2Mn4J04K66k20n2J25pj56J74q9j34K09L7j84J30p1Q6j73j4L9
$$ 99 -111 -173 -118 -36 -32 -86 18 284 64 12 137 130 -26 148 59 -75 134 171 -13 117 46 132 -41 -55 -16
2150a6m3j1r0K1l1j54L03j27J50qJ12m9J14J7j24K3P0J0j74o3J65q2L3J2j30J70
$$ -16 -59 -70 -160 -139 -170 -324 -21 -148 2 -6 106 57 171 188 64 87 157 167 -7 -70 95 13 46 58 -72 98
2176I8j36LO4r1k3p0K11r4O9j42j38M44j29n3oj9m2K29j22rj5m3J25o8l5M7j44
$$ 98 -38 -35 29 -62 -85 -155 56 -38 31 -111 -249 195 66 13 7 -12 -54 175 53 44 29 -14 111 43 8 55 -89
2203h9O4K8J41l42O1N9J04K9qN2k90O8M9M2k5J61r8j04p3K10p6K2O5j53M7K7J43
$$ -89 -25 3 144 -198 -137 -78 26 55 47 99 -191 -123 -74 -32 -57 104 6 -98 -171 39 -37 -15 50 -103 -56 -29 114
2230A14n5O4p9j03J07j04NQ0J53j39l0J7Q5m1k58J70r0J31j91P3J2P1j31M5J24
$$ 114 59 123 44 -59 48 -56 -51 29 182 43 13 30 115 74 -184 -14 -104 27 -164 -91 -79 -8 -139 -94 30
2255C0m4j71J33KJ1o0O2Q0o1N3M7q0J69j61L3Q1km1p9l6K5j69K33m7p1n8J13r2
$$ 30 -14 -185 -52 -50 -39 -99 -37 43 -18 35 82 2 171 10 43 124 122 81 2 -34 -9 -178 55 8 -63 -121 -8 -100
2283a00j33pK68O3k72L14r0J14j84O9M4Q4j43j15M4k7K8Q2Rn0k4N2l5o9q0PJ8
$$ -100 -233 -240 28 91 -181 133 43 157 -27 42 86 170 27 -88 -44 -71 -43 39 48 -2 -26 26 -9 -78 -158 -151 -133
2310a33O3J24l43L21PQj32l2O0J55j07K2M8q2R1j30n3K88j34L9l1m0M4n6Q7k9
$$ -133 -70 54 -289 32 39 47 -85 -117 -57 98 -9 13 61 -21 70 -60 -113 175 41 80 49 9 53 -3 84 55
2336E5k34J22q2Q0M5J06q1j03O8o2P1q8J83k13K1K31J6N9k16J22k27J30M8k7j85
$$ 55 -179 -57 -139 -59 -14 92 11 -92 -24 -86 -15 -103 80 -133 -112 119 135 194 -22 100 -127 3 51 24 -161
2361a61J57j44P2j09K83k58NJ67j19J56p2l1j00L53j89o4J88j66j5N7J15m8o4
$$ -161 -4 -148 -76 -185 98 -160 -155 12 -107 49 -23 -54 -154 199 10 -54 134 -32 -47 10 125 77 13
2384A3R6r6N5J02r3j17n3P6n0j40K64pk96L07k5pj35qqK97m7j41j41K55r0jj65
$$ 13 109 13 68 170 77 -40 -93 -17 -67 -207 57 50 -246 61 36 29 -106 -114 -122 175 128 -13 -154 101 11 10 -155
2411a55P9P5k0m5J13j31l7K70j65k8J38p5k0J11j67J44j81L83l08O2p0L4P8L8
$$ -155 -76 -1 -21 -66 47 -84 -121 149 -16 -44 94 19 -1 110 -57 87 -94 289 -19 43 -27 7 85 123
2435A23k43R3M4j86O6J34N9j12M6J9j42kN1R6j97J95kj08J57p4J46r6j39J82l8
$$ 123 -120 -27 17 -169 -103 31 90 -22 24 43 -99 -101 -50 46 -151 44 42 -66 91 17 163 67 -72 110 72
2460G2j59j6J09m2J43j60r4K52q5j47J23k41L04j81Q4Q5p7p5J69j30N3q4O6l3
$$ 72 -87 -103 6 -36 107 -53 -147 105 20 -127 -4 -245 59 -122 -38 47 -30 -105 64 -66 -13 -97 -31 -64
2484f4K03j45pK46j31j02m5M6j0j31j22J28M3J85n7p1L7M2N5j69p8J09J67J27
$$ -64 139 -6 -13 233 102 0 -45 1 -9 -140 -262 -134 -91 94 37 -34 3 45 100 -69 -147 -38 129 256
2508B56j70j13J35j55R0N8mj09q2R7j35J37q4Q0P7l04R0m9K11j42J63j23J22J15
$$ 256 86 -27 108 -47 43 101 97 -12 -94 3 -132 5 -79 1 78 -226 -136 -185 26 -116 47 -76 46 161
2532A61j89J04k2R7j08l1J4J1k27J56L3P5j9m3J1P6j08J0J11j32J05j95lK5n5
$$ 161 -28 76 54 151 43 12 26 37 -190 -34 -1 74 55 12 23 99 -9 1 112 -20 85 -110 -113 -88 -143
2557a43J68J2j85J21n2k1M5J63j33J2j1J5pP1k19J73pj69K10q2J19r8j00J01j14
$$ -143 25 37 -148 -27 -79 -100 -55 108 -25 -13 -24 -9 -16 55 -164 9 2 -167 43 -39 80 -18 -118 -17 -131
2582a31K18J1k57J58Jq0k3M1N6O9k20J15K49j06k36N7P2p6K18k31J89j6j0Mj37
$$ -131 87 98 -159 -1 0 -80 -103 -62 -6 63 -157 -42 207 101 -135 -78 -6 -82 136 -95 94 78 68 72 -65
2607f5N2P6j00pN7J67r8q8M8q4Q2j91J83%j69o0K61Km3n5m0P9K5l3R2R3j31l7
$$ -65 -13 63 -37 -44 13 180 82 -6 42 -42 40 -151 32 32 -137 -197 64 66 23 -32 -72 7 32 -1 91 184 53 16
2635A6q3K54j53j16pJ15M6k8Rm2J50j25q9J7L5k4l8l9lJ27j57K06k41J96k07K03
$$ 16 -67 187 34 -82 -89 26 72 44 53 11 161 36 -53 -36 -1 -25 -63 -102 -105 22 -135 71 -170 26 -181 22
2661B2n0j53J83n1P3Q4N6j59J21j56K08J4j05j5p7J58j29P8p0K6q5r6P8r2J4J31
$$ 22 -28 -181 2 -49 24 108 164 5 126 -30 178 192 87 72 -5 153 24 102 32 58 -27 -123 -45 -137 -123 8
2687Hj85J67r5M4m8L3m8K08k39J95l0j71J25L0R9j44J27j76J67p8O5j62J97q4
$$ 8 -177 -10 -105 -61 -109 -76 -124 84 -155 40 10 -161 -36 -6 93 -51 76 -100 67 -11 54 -108 89 5
2711Eqo8r2J53r3J22N5m2q4M6N0k2l4J70r4j8M6j65m6J07M8Mj17L9l9Q0j29J51
$$ 5 -3 -71 -163 -10 -103 19 74 32 -52 -6 44 22 -12 158 64 46 92 -73 -119 -12 36 40 -77 -38 -77 3 -126 25
2739B5l2J01l14J72R8n0QJ2n9J10n3o3O9lq9J03K7p9M8j7o2l6K1J4K5L2r7QJ14
$$ 25 -7 94 -220 -48 50 0 8 20 -39 71 18 -45 24 21 -68 35 62 -17 31 14 -48 -84 -63 -49 -24 8 -89 -81 33
2768C3j01K1J07r9RQ2N3q8l6J1P3j28J43m2N0j05p2o8pJ68m3N5m9p9J3N8j34K98
$$ 33 -68 -47 60 -39 -30 52 105 17 -19 -8 65 -63 80 38 88 -17 -89 -157 -164 4 -39 16 -33 -112 -99 -41 -175 123
2796A23j06r2J37nL6j57O7l6l9J19j92J69K7n8M2k5p3P2J10j04O4k06P7J21j10
$$ 123 17 -75 62 57 93 -64 3 -33 -72 47 -145 24 51 -7 35 10 -63 9 119 15 79 -127 -50 71 -39
2821c9m5N7J19N4j93k5O4J52o1j85J20j7N3m2N0lj85k5N8J11k50J24J43Pq4J1
$$ -39 -84 -27 92 146 -47 -72 -8 144 83 -102 18 1 54 12 62 59 -126 -151 -93 18 -232 -108 35 42 -42 -31
2847c1j37J62J31j70J47Pp6q5PJ66M4p9J7j2k38K98j21j53R3K0m3l4J23J5j43
$$ -31 -168 -6 125 -45 102 109 33 -52 -45 121 165 86 103 91 -147 151 30 -123 -30 -10 -53 -87 36 51 -92
2872i2l9J34o0j09J90j0m5J51l0p7n0J24j0o2M6j67J76p3J12Rj49J26l4j4o3k6
$$ -92 -131 3 -57 -166 24 14 -31 120 90 13 -37 87 77 15 61 -106 70 -3 109 118 -31 95 61 47 -16 -42
2898d2j56J71M6M2Rj95n9J02J50J2j7Oj27J04r7J09n1j9J1P8j23K1L5j18J27k0
$$ -42 -198 -27 19 61 70 -125 -184 -82 68 80 63 69 -58 46 -51 58 7 -12 -1 77 -46 -25 10 -108 19 -1
2924alK14n0j51j45J05J17j09J23k20l8K59k05J69j73QJ13J71k06j0k3P6k7K7
$$ -1 -4 210 160 9 -136 -31 86 -23 100 -120 -158 101 -104 65 -108 -100 13 184 -22 -32 -55 21 -6 21
2948B1j34o3J00L7J2j11J63J50k07m3J63n1O1l52K01j3J71k73J89q3R6L7q3J55
$$ 21 -113 -176 -76 -39 -27 -138 25 175 -32 -75 88 37 98 -254 -53 -66 105 -168 21 -62 34 71 -12 143
2972A43n9k30j1Q0j05J72n6R6o7O7J6j90J17J13k91K24J07j60J44k5j05M4q4O1
$$ 143 84 -146 -157 -77 -182 -10 -66 30 -37 30 46 -144 -27 86 -205 19 126 -34 110 85 -20 24 -60 1
2996An7J46j16j01N1L9O9j84J11J27l6j18J9Q5Q1k38Q7J63p1q4N0p2J95j10M7
$$ 1 -56 90 -26 -127 -76 -37 32 -152 -41 86 50 -68 -49 36 117 -121 -34 129 58 -26 24 -48 147 37 84
3021H4j95K40j64N2o8j34J85J9oj56J24j4K7K2LJ98l63K73J0n9Q3N4j28j70J95
$$ 84 -111 129 -35 17 -51 -185 0 19 13 -143 -19 -33 -6 16 19 217 -146 127 137 78 161 215 87 -83 112
3046A12Q1j77L5r6L5p6K56k40K06l36K20j67Q9Q4Q9j29K03k51j82J22K01j88q9
$$ 112 193 16 51 -45 -10 -86 170 -70 136 -200 20 -147 -58 26 115 -14 189 -62 -244 -122 79 -109 -198
3069a98K43j49K10j43R6n7j4R1j28n8K52KK0k88J45j08j4J36j79J71j42K05j50
$$ -198 45 -104 106 -37 59 2 -12 79 -49 -107 145 147 167 -121 24 -84 -98 38 -141 30 -112 93 -57
3092e7J24k4l5k9M5j62M2J84j68J93j14Q6r2O4JlQm6Q9j87P3j6k3RJ78k63K3L41
$$ -57 67 43 8 -21 24 -138 -96 88 -80 113 -1 85 -7 57 58 55 63 17 106 -81 -8 -24 -47 -38 140 -123 -100 241
3120B41k51j3M0pln7M1P7j29L7L3oj61L44k21m3K4Qk2J40j81O2j21J54K5q9J77
$$ 241 -10 -23 17 10 7 -50 -9 68 -61 -24 9 3 -158 186 -35 -78 -54 -46 -68 72 -109 -47 -168 -14 11 -78 99
3147I9k28K70k53k9J66j8P6Oj3O3j85K1Q8m8n3P9K7Rj27jM8J60j65k9J03p5J8
$$ 99 -129 141 -112 -141 25 7 83 89 76 139 -46 -25 63 15 -38 41 68 77 -50 -51 -3 157 -8 -37 66 -9 9
3174Ip7P8J87l88L37p6r7K7p1k14L54j61K35j68oL6jL1K20k33J32l1j31o6J52
$$ 9 -68 10 197 -191 146 70 -27 0 -71 -285 69 -92 143 -25 -31 5 4 35 255 22 154 123 -8 -74 78
3199G8R0q5j50J52J57k31J34j36p8K54k18M9o8Q0p9q7lJ66J35k16mo6O0o1J59
$$ 78 168 83 -67 85 242 11 145 9 -69 185 -33 16 -52 28 -51 -138 -141 25 160 -56 -60 -126 -66 -127 32
3224C2o0Oo6R5Km2J43k47p5K06O0nL5p2M7P8q9j01m6M0r6J76%k9K08k01R4j35
$$ 32 -28 -22 -88 7 9 -33 110 -137 -212 -6 54 49 84 12 59 137 48 -53 -99 -59 -155 21 21 -8 200 -1 93 -42
3252d2k1J26j11oQJ51k64J71o0N5n4R6J3p5m8o4J28L0rL5j33J15o3n9k8J24p8
$$ -42 -63 63 -48 -54 -46 105 -159 12 -48 7 -47 49 62 -13 -61 -125 3 33 24 59 -74 41 -22 -81 -109 15 -63
3279f3p2J78j11OK02k17J15R1q5mm9J84k86K34M0k34qP6j63K65o2J04j42J6l6
$$ -63 -135 43 -68 -62 140 -77 38 129 44 40 -9 175 -111 123 163 -71 -79 -3 -166 99 37 141 -1 15 -21
3304b1nj55J22J73N2j49p4m8Q0R4r6R9k0k7j18J32k2m2n7Q0m2N4r6J05p5M3j2
$$ -21 -26 -181 -59 114 166 17 -57 -105 -25 69 -27 72 52 25 -93 39 17 -25 -82 -2 -44 10 -86 19 -56 -13 -25
3331b5R7j36J03o2j8m8m8K54j71R5P1j61K7J1J59k4k76J49J03j21R3J6o1r9P9
$$ -25 72 -64 39 -23 -41 -89 -137 117 -54 41 112 -49 -22 -11 148 124 -152 -3 100 -21 72 88 27 -72 7
3356Gj9j7P1J2n4R3q2k5J4N8jn2J43k46p8K40K1n7o2P3qr5R8p7o3j1n1N2O4J98
$$ 7 -12 -29 42 54 0 93 11 -14 0 58 57 5 148 -98 -176 64 85 28 -34 39 31 -64 34 -43 -106 -117 -168 -116 -52 146
3386A46j03n4L8K1j64K04j53l8PP3R6r2N4o8q5J68pk9mj60k4J21J01k4l9R3mq3
$$ 146 43 -11 27 48 -116 88 -65 -103 -96 -23 73 -19 35 -33 -118 50 43 14 10 -150 -174 -53 48 24 -15 78 74 -9
3414iJ27j00m2P1J7O5j00q6M3R9j15L3j00J63K1j05l9j38P7pP5n3MR6n0o4J68
$$ -9 118 18 -24 47 64 129 29 -57 -14 85 -30 3 -97 66 87 -18 -57 -195 -118 -125 -50 -103 -99 -3 -53 -117 51
3441E1L1j57K64k18J50n0p3J3O8k10K27k6o0o8K34k21j01J84j72l1J70J12j23
$$ 51 82 -75 189 -29 121 71 -2 11 79 -131 96 70 10 -58 176 -45 -146 38 -134 -165 5 117 -6
3464fO9k2%k8J8o2J24j7L4j08l8l0n0K12k01J48j35k0J25l5O0j4Kp1J38L7R1j29
$$ -6 63 41 41 13 31 -31 93 76 110 2 -36 -66 -116 96 -105 43 -92 -112 13 -22 38 24 26 -45 93 130 221 92
3492I2p5m8m4J81k94N6R8P2q9M7K9m3R2m4Q7j31k6O8p4Q0j13M8R2mj38j41K73
$$ 92 17 -31 -75 106 -188 -132 -34 38 -51 -4 25 -18 74 30 117 -14 -40 28 -46 34 -79 -31 61 57 -81 -222 51
3519E1m2k19L17j65K4J36r5p6R0o2OJ8J06j06J2rj29J54j05J30J05j51Q0n0K3
$$ 51 9 -210 107 -58 -34 102 7 -69 21 -41 -35 -17 89 -17 -5 -14 -143 11 -94 36 141 -10 70 20 43
3544D3pj53K28k48K02n5k06L04l46J95J23j03j07P3J44l09K7O9O9Q6m3Mj88K40
$$ 43 36 -117 111 -137 65 10 -196 108 -238 -43 80 -23 -130 -57 87 -222 -195 -126 -57 29 -14 -10 -198 42
3568D2j55J87l4j48K02K3j12J7q5n8J45K3q8J21j51J55N8j85OO4j2j34K94k98
$$ 42 -113 74 40 -108 94 117 5 22 -63 -121 24 47 -41 80 -71 84 142 -43 -37 27 15 -119 175 -123
3592a23J58Jj26n4L1K76J8k51M2PO5r0PJ30r6L7N7L6j31j22K27J61k74m4R0J24
$$ -123 35 36 -90 -144 -113 163 181 -70 -28 -21 44 -46 -39 91 -5 32 89 125 -6 -128 99 260 -14 -58 32 156
3618A56j58m4N7O4q2o0K5q5R7n3K91j90j02J21M1m5kj53J31j5l9K3k2Q1N2m6J7
$$ 156 -2 -46 11 75 -7 -67 -42 -127 -30 -83 208 18 -84 37 78 33 31 -122 9 -6 -45 -22 -44 37 89 43 60
3645F0j10m0o6R3K3r3J37J9j55J50r6J19j45R1J68j38J41j35J4L9q0j2R0n4Q0
$$ 60 -50 -90 -156 -63 -40 -133 4 23 -132 18 -78 41 -104 -13 155 17 158 23 37 76 -4 -16 74 20 100
3670A00nK6j97K08j03j2M8j29l0J10r6j03K20Q2j4k10J88k09M3J53R3k15O6J66
$$ 100 95 121 -76 132 29 17 65 -64 -94 16 -80 -183 37 119 105 -105 83 -126 -83 70 163 -52 14 180
3694A80l78J35J58r9l0Q7J1M7M9l05J60O1q7l1P5k9m9j26J32J18l5N2j48N9l0
$$ 180 -198 -63 95 -4 -34 53 64 111 160 -145 15 76 -11 -42 33 4 -45 -171 -39 79 44 96 -52 7 -23
3719b3oJ7KJ6m6K04k59J41K02l16%l4P3J03N2J07l22P2J38L6j06R0j15Q8k04R9
$$ -23 -29 -12 -10 6 -40 164 -95 46 248 -68 -68 -102 -29 74 126 233 -89 -17 121 157 51 141 26 114 -90 9
3745IM3q8K44l46K64k32mJ33j13O4RK7Qn0M3k2ol5N6M9Pm0R2M4j64lL5J03j19
$$ 9 52 -36 208 -138 126 -106 -110 23 -90 -26 -17 10 18 -32 11 -11 -17 -52 4 53 60 20 112 156 -8 -11 24 127 8
3774HL2J2j01J40j41l9Op2j4L14j81qJ15k43OJ97Jq4M2P2j14L3J42j41Q0j25K4
$$ 8 40 52 -49 91 -50 -89 -83 -155 -169 145 -36 -44 71 -172 -166 31 32 -52 -10 62 -52 -19 123 -18 62 -63 -39
3801c9r2L7J00j40J71q7L5L8J35n8j81r2J09R6j6p2K6l9M9J71j33J21m7r8k9J39
$$ -39 -131 -94 6 -134 37 -50 -15 23 158 100 -81 -173 -64 32 16 -56 -30 -69 -20 151 18 139 92 -6 -35 104
3827A04j53J46p8o9R8j40O8K4j04O6J04Qj86k6M3P5M1m9Q7k36K44j33k2J39K4
$$ 104 -49 97 19 -50 48 -92 -24 0 -104 -38 66 74 -112 -138 -95 -20 21 -28 59 -177 67 -66 -88 51 75
3852G5m5PK6lJ41l45J13J91k60Q1K1K6P3o4mL5j53J18ml8P8j22n5Q1j98J24q9
$$ 75 30 37 63 60 201 -144 -31 160 -100 -19 2 28 101 37 33 68 -85 33 29 -9 69 -53 -108 -27 -225 -101 -190
3879a90P2k3J77P2l8Kk23J04l4j00K58o4j00J93J2r7m3J7J47k71R5J63j79j45
$$ -190 -118 -141 36 108 70 72 -151 -47 -81 -181 77 13 -87 106 118 21 -22 -5 142 -129 -34 129 -50 -195
3903a95J22J39p9P3J8j15n4K5J64j65j5K1J68j54J0J76j02j18J23j34J35j21L0
$$ -195 -73 66 -13 60 78 -37 -91 -66 98 -67 -82 -61 107 -47 -37 139 37 -81 42 -92 43 -78 -48
3926d8l1Q8o3j3k4j6K01j2j40J44j05j5J28j46l7n6K87k50J54N2j06J05k03K08
$$ -48 -79 9 -54 -67 -91 -107 94 82 -58 86 -19 -34 94 -52 -89 -145 142 -108 46 98 -8 97 -106 102
3950A02j50Q5r0r5M5J93J25j68k04Q0Q8K7o1l0j74K57n5K1r1Q9ro3M1Q0j37M3
$$ 102 -48 37 -53 -148 -103 90 215 47 -157 -77 11 38 -23 -53 -227 30 -25 -4 -95 -6 -15 -78 -37 43 -94 -51
3976e1J43O7j44r4N2J54j66m8J18j10j4K63j80K31j32j02n9Q1K26l18mm4M5n1
$$ -51 92 159 15 -79 -27 127 -39 -87 31 -79 -93 170 -10 221 89 -13 -72 9 235 -83 -87 -131 -86 -137
4000a37J81Nj81N5J38j27R5j04j1J19Rj04m9M0J03M1k05J28P6n1K3j56J60j3N9
$$ -137 44 49 -132 -77 61 -66 29 -75 -86 33 42 -62 -111 -71 32 73 -132 -4 72 21 44 -112 48 35 94
4025I4j60K49l23K04K1p5N0p4j17K85n0m2j03m7O2j88J27J76j3j15j05J02j12
$$ 94 -66 183 -140 64 85 10 60 -14 -131 154 104 62 -41 -88 -26 -214 -87 89 76 -39 -144 -42 -154
4048a54J8J07L0k45K34J8J24k28L0L3l0J77k06Q2K59k54R3r2P5j17l7J11j23J16
$$ -154 -136 -29 1 -244 -10 8 132 -96 -66 -33 -63 114 -92 -10 249 -5 88 -4 71 -46 -83 28 -95 21
4072B1j0j39J63P7k01J15p2K12l17M0O9J27j49J46j28L8J64k71J4J82q0Pp6l1
$$ 21 11 -128 35 112 -89 26 -46 166 -151 -111 -42 85 -64 82 -46 -8 156 -115 -101 81 1 8 -68 -99
4096i9L7j3J32j23K26j48l4J19j94J90j43J30J17k97O5K63n2j53q9Q7O5l8l3k9
$$ -99 -62 -75 57 -66 160 12 -22 97 -97 93 -50 80 197 -100 -35 228 176 23 -66 21 86 48 15 -14
4120a4l1M0l7N0JJ52q6n3m8j26J96K23r6j45j82J81n4J0J12r8q6Q1J56k87K87
$$ -14 -45 -5 -42 8 9 161 75 22 -26 -152 44 267 171 26 -156 25 -29 -19 93 -5 -91 -10 146 -141 146
4145A46k17J7P4K8j32L2K4m7K3Q3o2n4o8K13l4l1N7j20O6Q7j64P9NQj03J01l5
$$ 146 -71 -54 20 48 -84 -52 -28 -75 -52 31 -31 -85 -153 60 26 -5 52 -68 -2 85 -79 0 5 13 -90 11 -24
4172b4M1M6P3j4j75l0K17p9m4O0j9J9L8J3j14R6j02L1J66k64J95m3lK8o4l3J3
$$ -24 17 63 136 122 -53 -83 134 55 11 71 52 71 109 122 8 104 2 33 199 -65 130 87 84 112 48 15 28
4199B8k7J53k06R5l5j5Q9j29L7j72J59L4j38J70P0j8o4J0j19p2J37P7k5j6M1j6
$$ 28 1 154 -52 43 8 -7 82 -47 -10 -182 -23 11 -127 43 113 95 31 41 -78 -150 -13 64 39 23 64 48
4225D8k9L2N0j09J3l6oJ99k51Q3J16n4M7k30j5R3O8P4KMj08R9j60j34J57jJ4J45
$$ 48 19 51 101 -8 5 -31 -37 162 -89 -6 110 56 103 -127 -142 -49 19 93 95 99 -9 90 -70 -204 -47 -48 -34 111
4253A11k47J61k3Jr5J36j62N1P2m6O5N1J6M7j48Q7j20k2J7R6k2j19J03o8K06k53
$$ 111 -136 25 2 3 -92 44 -118 -67 5 -41 24 75 91 138 -10 77 -43 -65 -48 48 26 -93 10 -58 148 -105
4279a05j3J38j02K44j66o1o3P5L0o5jO0M7m0n8PQ3o7r1J50r3k5N6K42k22J63J7
$$ -105 -118 20 -82 162 -4 -65 -128 -53 -23 -88 -89 -29 18 -22 -80 -73 10 -57 -148 2 -91 -116 -60 182 -40 123 140
4306A40k09J11jn8K1J17r8p3M0J02q1q%k7J92p7j60N9rR6o0L6j6p0K3J9O6m3l00
$$ 140 -69 42 41 -17 4 121 23 -50 -10 92 11 3 3 -24 168 91 -69 -10 -19 77 17 53 37 -33 -10 9 75 32 -268
4335b68K54k2m2j28K70j31J26q1j1o6Q8N6j25J74N3j73J08k1o3N4l4N4r2J8P0
$$ -268 -14 -36 -78 -206 64 -67 59 -22 -33 -99 -11 45 -80 94 147 -26 82 61 -2 52 18 72 -20 -2 68
4360F8j38j24J47N8M0k4J6j53N4k2L9k7J15l2Q9r7j66J72j9jj3O6n0l7L1l4J12
$$ 68 -70 -194 -47 11 51 27 43 -110 -56 -78 -39 -66 49 17 106 9 -157 15 -4 -5 -18 48 -2 -39 -8 -42 70
4387G0j63J50N5j62M0l8P1j5J39j60j4j9N6j77K06o7N5Qq1J23j14KL7j51J15M8
$$ 70 -93 57 112 -50 -10 -48 23 8 147 -13 -27 -46 10 -167 39 -28 27 35 -46 77 -37 -35 2 -149 -34 14
4413A4Ok87J81J32k2J01j27J07p6K8r7k5l4m9J99k23J34Q6O5j53LJ67q3m0J39
$$ 14 20 -267 -86 46 24 125 -2 105 29 57 -40 -65 -99 -148 51 -172 -38 48 113 -40 -37 130 47 7 146
4438A46j87P4K1%J1j44Q2K1r9J47O5j45J60j13M3j65n3J83J32k1r1J8k3j67J1
$$ 146 -41 33 54 54 65 -79 3 24 -75 72 137 -8 152 39 82 -83 -136 47 179 158 67 85 62 -105 -94
4463i4Q9j1l7j4J77l6Q7o3j60K7kN9Q0j62K74k87q7J04J2m5J32p3Q4q5J36j42
$$ -94 -5 -16 -53 -67 110 74 161 98 -62 -35 -37 22 102 -60 214 -73 -160 -56 -44 -89 43 -30 54 -31 105 -37
4489c7j1l6m5J65j65K8R7J23j71J75r1p2P9j19N2K9n9J00j16J42P1k29P4j09J50
$$ -37 -48 -84 -129 36 -129 -101 -4 119 -52 123 32 -40 39 -80 -28 1 -58 42 -74 68 139 -90 -16 -125 25
4514B5q0J70j33l2J01p8J12n9l2m9Q0j38J80K1rJ19j94p0Q2n4P4j50Q9j05J85
$$ 25 -55 115 -18 -50 51 -27 85 26 -6 -55 25 -113 67 88 79 198 4 -66 16 -38 36 -114 -25 -130 55
4539E5r0O1J52k65R6nj4J10q6p0J74n6N9k20J44q6n8J34j24n3J23K7po4R5j10
$$ 55 -35 26 178 -87 9 4 -10 100 14 -56 118 62 121 -99 45 -41 -99 35 -89 -142 -19 8 1 -63 32 -78
4565g8K15j71j08K18j43rn0N4pK44j49m4p7J20K1p9MP1j40O4M9N7k01J0L1K56
$$ -78 137 -34 -142 76 -67 -76 -126 -72 -79 165 16 -28 -105 15 36 -43 -39 32 -108 -44 5 62 -139 -129 -98 158
4591A58j36L9r4Q0P2j7j75R7j7L4j26o1O3K05j19J2N3j07M3k36J15L5L3l0m5J41
$$ 158 22 61 -33 47 119 102 -73 24 7 41 -85 -146 -83 122 3 15 68 -39 4 -232 -117 -82 -49 -79 -124 17
4617A7n9R4j36k6J15J29j48j7r7OJ08J36r8K2L3J00l5j45j4j33L06k19J11K8m1
$$ 17 -42 52 -84 -110 5 134 -14 -31 -128 -122 -14 122 24 46 79 179 144 -1 -15 -148 158 -61 50 78 37
4642C7m8J61j45J06k0pl7ll5O0p2J8Kk8Q8l1J91k68j9k9k0J16N8j43J34j6j28
$$ 37 -11 150 5 111 91 84 47 44 9 69 -3 15 17 -11 77 46 237 -31 -50 -79 -99 17 75 -68 66 50 -78
4669g8k9J65l18L46j69J22r9Q0k4O5J17j50J8p8l3p8K86n3j97M8R1o0J88j29j1
$$ -78 -107 58 -260 86 -83 39 -60 20 -4 61 178 28 46 -32 -65 -143 143 90 -107 -59 32 -28 160 31 20
4694B0L4J41k69j2N1n8j2n8K18j16l1M1J48o4o1J7M9o0O9n7ll3L6K4j37O6P2J
$$ 20 54 195 -74 -86 -35 -93 -105 -163 55 -61 -92 -51 97 33 -28 -11 38 -22 47 -10 -13 -46 -10 14 -123 -57 15 16
4722A6m0n1J21l8P5%mj0l1k8N8J69k78%J10n8j18J15l9P0M4r6J36j13j56J40J8
$$ 16 -24 -75 46 8 83 83 79 69 38 10 68 237 -41 -41 69 11 -107 8 -31 39 83 -13 123 10 -146 -6 12
4749A2J2j09J30j14N1Jl2J14o2m4r1j8R5Q3j33P4pk7k2K08j63k8K5Q0r9k9r0J52
$$ 12 24 -85 45 -69 -18 -17 -49 65 3 -41 -132 -150 -55 28 -105 -31 -38 -65 -87 121 -42 -70 -45 35 -64 -93 -183 -31
4777c1j11K19k3r2k2p4R9m5J6KK19k17O6K5j65J95m4j80J89n7J57j13J4M1j50
$$ -31 -142 77 54 -38 -60 -134 -35 -80 -64 -62 157 -60 6 31 -134 61 17 -163 26 -31 126 13 27 68 -82
4802h2K1l5K61l47K38o4m9p7J10o5Q4p8l0K10m8Ml9J00j71M7l6l1K01J2k41J18
$$ -82 -61 -96 165 -182 56 -8 -57 -134 -24 -89 -5 -83 -113 97 49 53 14 114 -57 -10 -46 -77 124 136 -105 13
4828A3J3P1j71p5K23p4l9R6q0O1k0j22J18p7Q2j5L0n8q4J77q3J45p2q3j85K69
$$ 13 26 97 -74 -149 74 0 -39 57 -23 38 18 -104 14 -63 19 4 34 -24 -108 69 -14 131 59 -24 -209 60
4854F0q5P0m9O0j1Q7lk08J26K8k6N7j79J21n4m4m2N3Q9j56k6J88O5k65R4J4L9
$$ 60 -25 45 -4 56 45 132 129 -79 47 75 49 106 -73 48 -6 -50 -92 -39 50 -106 -132 56 121 -144 -50 -36 3
4881CKm0o2QJ38np2Q2j75P6K34j03j23J7O2J07k05j26J22p6J89k02K06j84ol2
$$ 3 5 -35 -97 -89 49 44 -28 54 -121 -45 189 86 -37 -20 42 149 -56 -182 -60 -136 53 -149 57 -127 -133 -165
$$ [...]
8191a39
##END NTUPLES=NMR FID
##END=
