##TITLE=1H_SL04-DOX(rechrom-A)
 CDCl3
 8 sc, 
 10.8.2023
##JCAMPDX= 6.0         $$ Bruker NMR JCAMP-DX V2.0
##DATA TYPE= NMR FID
##DATA CLASS= NTUPLES
##ORIGIN= UXNMR, Bruker Analytische Messtechnik GmbH
##OWNER= root
$$ XWIN-NMR		Version 3.5
$$ Thu Aug 10 15:07:34 2023 Russian Standard Time (UT+4h)  she@DPX200
##.OBSERVE FREQUENCY= 200.13135
##.OBSERVE NUCLEUS= ^1H
##.DELAY= (6, 6)
##.ACQUISITION MODE= SIMULTANEOUS
##.ACQUISITION SCHEME= undefined
##.AVERAGES= 8
##.DIGITISER RES= 18
##SPECTROMETER/DATA SYSTEM= spect
##.PULSE SEQUENCE= zg30
##.SOLVENT NAME= CDCl3
##.SHIFT REFERENCE= (INTERNAL, CDCl3, 0, 15.7039)
##AUDIT TRAIL= $$ (NUMBER, WHEN, WHO, WHERE, WHAT)
$$ ##TITLE= Audit trail, XWIN-NMR		Version 3.5
$$ ##JCAMPDX= 5.01
$$ ##ORIGIN= Bruker BioSpin GmbH
$$ ##OWNER= she
$$ F:/spectra/data/she/nmr/H-F/1/audita.txt
$$ ##AUDIT TRAIL=  $$ (NUMBER, WHEN, WHO, WHERE, WHAT)
(   1,<2023-08-10 15:06:33.78 +0400>,<she>,<DPX200>,
      <created by zg, POWCHK disabled, PULCHK disabled
       configuration hash MD5:
       00 E9 B6 7A A2 85 ED C7 34 08 36 98 17 FE 4E 26
       data hash MD5: 16K
       88 33 D1 7F 6E 4C FD 0E 02 16 33 C8 09 22 40 CF>)
$$ ##END=
$$ 
$$ hash MD5
$$ 07 09 ED 3C B5 29 9B AC F8 76 86 EA 30 DF 4F F5
##$RELAX= 
##$RELAX= 
##$RELAX= 
##$RELAX= 
##$RELAX= 
##$RELAX= 
$$ Bruker specific parameters
$$ --------------------------
##$DU= <F:/spectra>
##$EXPNO= 1
##$NAME= <H-F>
##$PROCNO= 1
##$TYPE= <nmr>
##$USER= <she>
##$AMP= (0..31)
100 100 100 100 100 100 100 100 100 100 100 100 100 100 100 100 100 100 
100 100 100 100 100 100 100 100 100 100 100 100 100 100 
##$AQSEQ= 0
##$AQ_mod= 1
##$AUNM= <au_zg>
##$AUTOPOS= <>
##$BF1= 200.13
##$BF2= 200.13
##$BF3= 200.13
##$BF4= 200.13
##$BF5= 200.13
##$BF6= 200.13
##$BF7= 200.13
##$BF8= 200.13
##$BYTORDA= 1
##$CFDGTYP= 0
##$CFRGTYP= 5
##$CHEMSTR= <none>
##$CNST= (0..31)
1 1 145 1 1 1 1 1 1 1 1 1 1 1 1 1 1 1 1 1 1 1 1 1 1 1 1 1 1 1 1 1 
##$CPDPRG= <>
##$CPDPRG1= <>
##$CPDPRG2= <>
##$CPDPRG3= <>
##$CPDPRG4= <mlev>
##$CPDPRG5= <mlev>
##$CPDPRG6= <mlev>
##$CPDPRG7= <mlev>
##$CPDPRG8= <mlev>
##$CPDPRGB= <>
##$CPDPRGT= <>
##$D= (0..31)
0 1.2 0 0 0 0 0 0 0 0.06 0 0.03 0 0 0 0 0.0002 0 0 0 0 0 0 0 0 0 0 0 0 
0 0 0 
##$DATE= 1691665593
##$DBL= (0..7)
120 120 120 120 120 120 120 120 
##$DBP= (0..7)
150 150 150 150 150 150 150 150 
##$DBP07= 0
##$DBPNAM0= <>
##$DBPNAM1= <>
##$DBPNAM2= <>
##$DBPNAM3= <>
##$DBPNAM4= <>
##$DBPNAM5= <>
##$DBPNAM6= <>
##$DBPNAM7= <>
##$DBPOAL= (0..7)
0.5 0.5 0.5 0.5 0.5 0.5 0.5 0.5 
##$DBPOFFS= (0..7)
0 0 0 0 0 0 0 0 
##$DE= 6
##$DECBNUC= <off>
##$DECIM= 32
##$DECNUC= <off>
##$DECSTAT= 4
##$DIGMOD= 1
##$DIGTYP= 9
##$DL= (0..7)
0 120 120 120 120 120 120 120 
##$DP= (0..7)
150 150 150 150 150 150 150 150 
##$DP07= 0
##$DPNAME0= <>
##$DPNAME1= <>
##$DPNAME2= <>
##$DPNAME3= <>
##$DPNAME4= <>
##$DPNAME5= <>
##$DPNAME6= <>
##$DPNAME7= <>
##$DPOAL= (0..7)
0.5 0.5 0.5 0.5 0.5 0.5 0.5 0.5 
##$DPOFFS= (0..7)
0 0 0 0 0 0 0 0 
##$DQDMODE= 0
##$DR= 18
##$DS= 0
$$ [...]
##$SUBNAM2= <"">
##$SUBNAM3= <"">
##$SUBNAM4= <"">
##$SUBNAM5= <"">
##$SUBNAM6= <"">
##$SUBNAM7= <"">
##$SUBNAM8= <"">
##$SUBNAM9= <"">
##$SW= 18.05172834244
##$SWIBOX= (0..15)
0 0 2 0 0 0 0 0 0 0 0 0 0 0 0 0 
##$SW_h= 3612.71676300578
##$TD= 16384
##$TD0= 1
##$TE= 0
##$TE2= 300
##$TE3= 300
##$TEG= 300
##$TL= (0..7)
0 120 120 120 120 120 120 120 
##$TP= (0..7)
150 150 150 150 150 150 150 150 
##$TP07= 0
##$TPNAME0= <>
##$TPNAME1= <>
##$TPNAME2= <>
##$TPNAME3= <>
##$TPNAME4= <>
##$TPNAME5= <>
##$TPNAME6= <>
##$TPNAME7= <>
##$TPOAL= (0..7)
0.5 0.5 0.5 0.5 0.5 0.5 0.5 0.5 
##$TPOFFS= (0..7)
0 0 0 0 0 0 0 0 
##$TUNHIN= 0
##$TUNHOUT= 0
##$TUNXOUT= 0
##$USERA1= <user>
##$USERA2= <user>
##$USERA3= <user>
##$USERA4= <user>
##$USERA5= <user>
##$V9= 5
##$VALIST= <valist>
##$VCLIST= <CCCCCCCCCCCCCCC>
##$VD= 0
##$VDLIST= <DDDDDDDDDDDDDDD>
##$VPLIST= <PPPPPPPPPPPPPPP>
##$VTLIST= <TTTTTTTTTTTTTTT>
##$WBST= 1024
##$WBSW= 4
##$XGAIN= (0..3)
0 0 0 0 
##$XL= 0
##$YL= 0
##$YMAX_a= 123584
##$YMIN_a= -136239
##$ZGOPTNS= <>
##$ZL1= 120
##$ZL2= 120
##$ZL3= 120
##$ZL4= 120
##$ABSF1= 10
##$ABSF2= 0
##$ABSG= 5
##$ABSL= 3
##$ALPHA= 0
##$AQORDER= 0
##$ASSFAC= 0
##$ASSFACI= 0
##$ASSFACX= 0
##$ASSWID= 0
##$AUNMP= <proc_1d>
##$AZFE= 0.1
##$AZFW= 0.1
##$BCFW= 1
##$BC_mod= 2
##$BYTORDP= 1
##$COROFFS= 0
##$CY= 11.3945322036743
##$DATMOD= 1
##$DC= 2
##$DFILT= <>
##$DTYPP= 0
##$F1P= 15.7292609196834
##$F2P= 12.9074282941183
##$FCOR= 0.5
##$FTSIZE= 0
##$FT_mod= 4
##$GAMMA= 1
##$GB= 0.15
##$INTBC= 1
##$INTSCL= 1
##$ISEN= 128
##$LB= 0.24
##$LEV0= 0
##$LPBIN= 0
##$MAXI= 10000
##$MC2= 0
##$MEAN= 0
##$ME_mod= 0
##$MI= 1.114404
##$NCOEF= 0
##$NC_proc= 0
##$NLEV= 6
##$NOISF1= 3.799351
##$NOISF2= 2.8
##$NSP= 1
##$NTH_PI= 0
##$NZP= 0
##$OFFSET= 15.70392
##$PC= 1
##$PHC0= -21049.88
##$PHC1= 18.25272
##$PH_mod= 1
##$PKNL= yes
##$PPARMOD= 0
##$PSCAL= 0
##$PSIGN= 0
##$REVERSE= no
##$SF= 200.130013532006
##$SI= 16384
##$SIGF1= 3
##$SIGF2= 2
##$SINO= 400
##$SIOLD= 16384
##$SREGLST= <1H.CDCl3>
##$SSB= 0
##$STSI= 0
##$STSR= 0
##$SW_p= 3612.71676300578
##$SYMM= 0
##$S_DEV= 0
##$TDeff= 0
##$TDoff= 0
##$TI= <>
##$TILT= no
##$TM1= 0
##$TM2= 0
##$TOPLEV= 0
##$USERP1= <user>
##$USERP2= <user>
##$USERP3= <user>
##$USERP4= <user>
##$USERP5= <user>
##$WDW= 1
##$XDIM= 8192
##$YMAX_p= 0
##$YMIN_p= 0
$$ End of Bruker specific parameters
$$ ---------------------------------
##NTUPLES= NMR FID
##VAR_NAME=  TIME,          FID/REAL,        FID/IMAG
##SYMBOL=    X,             R,               I
##VAR_TYPE=  INDEPENDENT,   DEPENDENT,       DEPENDENT
##VAR_FORM=  AFFN,          ASDF,            ASDF
##VAR_DIM=   8192,          8192,            8192
##UNITS=     SECONDS,       ARBITRARY UNITS, ARBITRARY UNITS
##FACTOR=    0.0002768,     1,               1
##FIRST=     0,             0,               0
##LAST=      2.2672688,     0,               0
##MIN=       0,             -136239,         0
##MAX=       2.2672688,     123584,          0
$$ Real data points
##PAGE= N=1
##DATA TABLE= (X++(R..R)), XYDATA
0 0 0 0 0 0 0 0 0 0 0 0 0 0 8 -8 8 -8 9 -16 16 -24 24 -32 39 -40 48 -57 70 -80 90 -104 120 -136 154 -175
34 -175 198 -222 250 -279 312 -348 387 -430 476 -528 583 -644 711 -784 863 -951 1047 -1154
52 -1154 1272 -1405 1551 -1718 1908 -2128 2381 -2682 3046 -3491 4053 -4794 5812 -7303 9697
67 9697 -14185 25452 -114145 -136239 115774 12311 -52121 28542 40179 -29546 25201 23490
79 23490 -18518 28717 53787 -20169 -28095 14666 25054 37 -1137 1940 9294 5083 -4303
92 -4303 4447 7594 -4394 -2483 -16778 -20316 -6318 -10483 -14980 -1066 -2555 -15396 -8374 -127
106 -127 -5273 15728 16878 -16760 -3876 24262 1678 -2141 35920 22589 -19028 -3697 5792
119 5792 -8603 14006 22117 -9720 -13375 1561 -7993 -10379 5560 -995 -8341 -916 -10383 -12418
133 -12418 3816 608 -10669 -7013 -2766 -2186 5177 5346 426 7769 7516 -2676 641 6779 8201
148 8201 10629 7829 1450 -733 -1132 -2416 2883 6280 -60 -3164 -7684 -12137 -2933 5781 496
163 496 -5781 -7732 -10392 -7809 1203 2689 -76 1061 -4232 -6757 -199 4163 5676 7476 3296
178 3296 -1324 5711 10054 1754 2251 8291 1687 -3769 4289 7120 -152 -33 1668 -6860 -9077 -3445
194 -3445 -4399 -4601 950 -2905 -12414 -8251 -427 -2270 -306 5047 -152 -4249 1929 2803 -684 6528
210 6528 9682 -299 -1326 6682 5840 4554 9187 5916 -757 722 -151 -5486 -1437 2233 -5614 -7312
226 -7312 -2149 -4421 -8416 -3454 -327 -4790 -3634 -729 -3066 -1884 3341 2777 -1189 302 2669
241 2669 1678 4209 8593 7451 4245 3028 379 -999 4645 6924 -34 -1672 1443 -3500 -7217
256 -7217 -622 279 -6725 -5454 -3225 -7757 -4154 2625 -2481 -5413 465 -1792 -4698 3436 5486
271 5486 119 4057 6189 312 1663 6257 3566 4554 7445 2221 -1470 2376 1850 -70 973 -2929
287 -2929 -6733 -3487 -1439 -2257 -592 -2211 -5876 -5209 -4310 -3860 -1 2056 -156 -2162 -2040 444
303 444 3276 2742 1485 4757 4873 1245 3535 6229 2916 1614 2795 682 806 2570 -1287 -1358 2667
320 2667 -2245 -6951 -2075 -2933 -7549 -855 1662 -5482 -3478 683 -5548 -3663 4455 493 -2934
335 -2934 2403 1712 -643 6100 5531 -775 2811 5033 171 1928 6982 3961 22 -306 -1039 -1077 -945
352 -945 -1272 -844 -1805 -3603 -2528 -3107 -5008 -2470 -668 -3768 -2324 124 -1888 -708 2752 50
368 50 413 3361 -4 -745 6532 6780 1487 2930 3415 -723 1462 3821 1378 1340 1209 -4050 -3910 1380
386 1380 -1484 -4820 -1833 -2766 -6264 -1594 1109 -3144 -2724 -47 -2934 -2827 1110 900 63 1982
402 1982 2501 2567 2745 2279 2498 4678 4275 2441 1661 1540 1078 663 -731 -952 -705 -2326 -2976 -1384 -1622
421 -1622 -1772 -915 -3592 -5332 -2533 -1720 -2398 -832 -1070 -2657 -320 1450 7 2529 4604 1704
437 1704 1876 5133 3752 1823 4548 3697 101 1198 1522 -926 -783 904 -993 -2006 -985 -3169
453 -3169 -4605 -2500 -1821 -2651 -2505 -2890 -4627 -2958 67 -305 -1475 254 1381 308 2074 5113
469 5113 4424 3172 3088 1897 1879 4558 4255 652 803 1044 -1410 -1006 880 -2393 -4521 -1562 -2101 -4439
487 -4439 -2258 -1061 -4148 -4211 -1819 -2350 -2413 -137 749 187 1804 2271 1288 2219 3553 3317 4085 4991
505 4991 3767 1326 1747 2424 1131 445 703 -1057 -3360 -1698 -720 -2628 -3421 -2974 -4363 -4387 -2611
522 -2611 -1987 -2120 -342 -1446 -2620 375 1548 -492 1540 4349 3016 2578 4114 3145 1733 3144
538 3144 2753 1912 1953 1051 -15 23 -289 -1081 -1190 -2496 -4144 -2996 -1604 -2477 -2473 -2785 -3638 -2943 -1928
557 -1928 -1354 367 1818 459 165 2253 2975 2522 2466 1887 2045 2703 2196 2717 3009 1048 -188 727
575 727 -35 -614 722 -141 -2660 -1935 -1813 -3954 -3573 -1680 -2848 -3308 -1272 -1692 -1526 346 -97 40
593 40 2415 1765 241 2040 2753 1930 3633 3344 -515 573 3377 1206 188 2549 1519 -1029 -739
610 -739 -998 -2180 -1288 -1623 -3089 -2645 -2029 -2977 -3320 -2176 -1256 -1414 -1783 -401 1549 846 345 2337
628 2337 2547 714 2096 2713 1190 2965 3787 1239 1036 2079 414 79 1664 -847 -2010 -131
644 -131 -1915 -3946 -663 -1117 -4763 -3474 -1519 -2843 -1993 -45 -1154 -1166 1267 81 -320 2860 3011
661 3011 981 1684 2294 1709 2512 3011 1889 1309 1813 492 -194 244 466 190 -1910 -2786 -1941 -2457 -3147
680 -3147 -1729 -1380 -2658 -2199 -1929 -2147 -968 664 105 485 1401 889 1573 2793 1997 1417 2921 2474
698 2474 876 1767 2630 842 963 1243 -424 -29 -275 -1642 -2167 -1115 -1813 -2926 -2382 -1873 -2446 -2086
716 -2086 -1299 -1325 -918 -537 146 1038 1211 856 663 594 1643 2055 2509 2596 1687 1325 1546 1039 622 1686
736 1686 1067 -785 -864 -171 -1313 -1642 -1529 -2578 -2813 -1583 -1958 -2075 -1130 -380 -1031 -1052 -123 -448 444
755 444 1254 1241 1450 1767 1391 1069 1570 2347 2441 1516 1248 1489 976 86 198 192 -1367 -1726 -1336 -2124 -1668
776 -1668 -479 -1548 -2578 -1787 -1899 -1824 -154 -408 -984 407 631 -932 683 2022 529 878 2037
793 2037 1901 2319 2970 1839 802 1950 845 -400 798 873 -946 -994 -773 -1982 -2290 -1684 -2093 -1928
811 -1928 -949 -1543 -1866 -1592 -1502 -500 86 -396 51 1049 782 954 1912 2163 2246 2044 994 1333 2501 2028
831 2028 669 1404 320 -690 -658 -780 -1960 -890 -671 -2565 -2254 -875 -1596 -2272 -799 -1310 -1462 -663
849 -663 -537 -676 1137 1241 -378 731 2149 1376 1833 2683 2237 1815 1637 750 1186 1839 713 -340
867 -340 402 -347 -1649 -1041 -1479 -1586 -1668 -1815 -2764 -2088 -1397 -1451 -1315 -1002 -1163 -165 378 8 1168 1588
887 1588 1094 978 2114 1853 2039 2283 1199 1273 1743 763 80 1058 435 -1021 -987 -950 -1773 -1532 -1464 -2078
907 -2078 -2054 -1200 -2220 -2051 -996 -687 -677 -36 -206 118 1377 1154 973 2240 2423 1150 1309 2306 1656
926 1656 1469 1672 881 474 216 -232 -614 -265 -661 -1244 -1687 -1525 -1738 -1643 -1473 -1524 -1600 -1573 -1339 -765 -354
947 -354 -227 596 241 387 1668 2288 1733 1824 2238 1700 1255 1394 1323 778 848 81 -82 -393 -664 -1166 -809
968 -809 -721 -1885 -1942 -1594 -1674 -1646 -1210 -1415 -1556 -1081 -826 20 883 955 824 986 1660 1387 1914 2090 1760 1530
990 1530 1635 1215 623 843 439 -219 -436 -119 -960 -1162 -997 -839 -1416 -1782 -2076 -1650 -1356 -1030 -1165 -473
1010 -473 -57 -211 9 100 435 1200 1287 1229 1614 1834 1933 1746 1397 910 1419 740 25 533 513 -90 -926 -1241
1032 -1241 -1819 -1307 -1105 -1627 -1615 -738 -1753 -2587 -765 -409 -1091 -569 574 315 765 1443 819 1175 2114
1051 2114 1894 991 1440 1675 1451 1298 987 41 117 -257 -940 -766 -247 -830 -1501 -1429 -1440 -1484 -1551 -1407 -1447 -980
1073 -980 -932 -672 98 99 217 509 748 881 2110 1748 1284 1817 1508 1107 1365 1121 618 956 702 -612
1093 -612 -565 53 -720 -1370 -1056 -1146 -1828 -1782 -1609 -1500 -1163 -1019 -1628 -799 71 -277 252 900 1041 1250 1397
1114 1397 859 1091 1726 1298 1123 1433 859 505 800 419 -63 326 -323 -1282 -933 -877 -1598 -1410 -941 -1765
1134 -1765 -1288 -1463 -1784 -965 34 -672 -444 296 540 287 1021 1014 738 1462 1531 819 1371 1488 1149 1291 649
1155 649 323 332 447 -354 -612 -352 -1386 -1536 -908 -1156 -1672 -1071 -1494 -1397 -178 -573 -937 -86 -86 -524 450
1176 450 1031 808 1219 1576 898 729 1560 1562 934 1133 1121 832 252 -168 -185 -169 -275 -997 -1123 -1242 -1215 -1301
1198 -1301 -1277 -1344 -924 -1399 -1028 -782 -327 -166 465 665 471 944 912 677 1053 1751 1372 1372 1398 1210 627 1021
1220 1021 430 -242 110 146 -928 -1093 -751 -1387 -1355 -1242 -1488 -1351 -917 -558 -1141 -527 -389 -563 -208 129
1240 129 369 1036 799 708 1149 1827 1446 1093 1735 1423 376 841 919 458 216 -357 -809 -1193 -915 -829 -1077
1261 -1077 -960 -1141 -1447 -1528 -1240 -894 -389 -655 -280 -176 243 220 758 991 947 1272 1239 867 1494 1622 1706
1282 1706 897 719 517 186 78 -234 -73 -193 -1225 -1229 -1133 -1384 -1211 -1210 -1255 -1285 -484 -458 -970 -527 222 129
1304 129 45 736 765 763 1331 1164 998 1454 1282 649 1063 1115 628 244 41 -402 -384 -406 -1143 -1282 -1011 -1192
1326 -1192 -1367 -1009 -1011 -1238 -635 -947 -1172 -447 381 120 178 588 990 728 707 1365 1743 1554 684 1261 1017
1347 1017 551 748 663 150 100 -122 -698 -602 -519 -809 -1109 -1065 -1282 -1221 -754 -876 -982 -196 -127 -718 -385 431
1369 431 342 855 825 623 983 1298 1255 839 1605 1150 441 698 621 257 9 -159 -635 -620 -571 -972 -1050 -1094 -1251
1392 -1251 -1244 -952 -1016 -609 -589 -782 -349 93 143 63 435 446 884 1122 873 1185 1465 1081 949 939 1155 378
1414 378 336 224 -575 -66 -99 -988 -820 -1189 -1231 -1271 -906 -1093 -1290 -470 -1070 -806 31 171 -62 55 743
1435 743 530 668 1067 967 1549 1192 774 748 961 831 646 246 291 -334 -406 -567 -660 -694 -910 -1146 -1251 -1369
1457 -1369 -1145 -772 -951 -1033 -491 -473 -533 144 360 545 608 774 681 1259 1134 1191 912 1025 650 588 1052 487
1479 487 -65 224 -258 -606 -201 -466 -847 -937 -786 -1411 -1103 -849 -1026 -811 -205 -108 -360 13 334 182 477
1500 477 845 814 976 848 1070 1372 1104 631 859 906 251 82 201 -266 -284 -105 -620 -959 -823 -774 -1074
1521 -1074 -916 -1231 -746 -733 -665 -554 -269 7 -44 23 236 574 691 928 690 992 1081 983 925 725 722 239 409
1544 409 -74 31 -338 -364 -625 -663 -561 -1128 -887 -815 -1015 -879 -833 -1094 -572 -74 -90 -254 471 521 392 750
1566 750 1114 979 929 1204 817 445 969 853 409 388 454 128 90 -587 -460 -366 -533 -630 -1037 -869 -829 -946
1588 -946 -1159 -554 -265 -595 -379 -71 257 357 415 609 567 1000 876 412 1013 1311 703 680 789 354 13
1609 13 25 -50 -479 -109 -320 -934 -906 -684 -1068 -1286 -1084 -1113 -761 -604 -211 -540 -160 148 148 267 539 863
1631 863 614 830 689 687 1046 934 394 583 567 -127 -67 144 -274 -629 -421 -737 -857 -629 -803 -758 -891 -727
1653 -727 -972 -986 -388 -389 -112 -175 113 449 637 689 702 1123 809 1301 715 573 560 637 827 341 173 -176 -363
1676 -363 -572 -673 -416 -574 -926 -970 -598 -744 -799 -498 -732 -461 -65 -267 -133 330 393 456 681 785 921
1697 921 883 893 717 432 980 852 487 457 93 59 143 -627 -606 -318 -653 -553 -785 -697 -926 -758 -598 -268
1719 -268 -349 -195 -437 -415 161 207 438 643 896 830 716 720 705 930 887 417 528 392 8 -2 -140 -177 -527
1742 -527 -742 -749 -452 -671 -858 -857 -781 -855 -974 -565 -394 -536 -128 -130 151 489 605 526 436 427 661 996 708 790
1766 790 711 652 405 161 -90 -376 -51 -87 -466 -687 -719 -650 -885 -959 -732 -923 -822 -631 -243 -88 -167 -118 37
1789 37 184 422 737 483 786 823 659 245 726 739 551 590 257 27 -249 -17 -210 -560 -699 -654 -642 -808
1811 -808 -797 -711 -520 -668 -574 -384 -353 -421 -234 196 159 311 339 450 548 558 617 685 1001 773 368 476 490 -40
1835 -40 92 -276 -61 -31 -191 -597 -365 -669 -682 -868 -658 -446 -405 -543 -293 -142 -45 139 223 466 581 602
1857 602 549 524 692 855 711 721 739 802 619 111 1 -169 -115 -227 -709 -417 -878 -590 -565 -940 -635 -464
1879 -464 -604 -448 -360 -122 -65 -149 190 320 520 423 558 958 721 795 502 919 619 661 467 323 170 158
1901 158 -81 -263 -92 -392 -728 -487 -710 -417 -589 -621 -470 -512 -301 -326 -289 97 358 149 188 254 642 889
1923 889 777 548 742 652 542 399 448 443 347 82 -55 -15 29 -184 -448 -531 -608 -652 -796 -798 -367 -512 -504 -328 -175
1948 -175 -190 184 227 118 333 618 575 363 817 756 891 523 511 395 539 293 191 -133 99 -510 -525 -777
1970 -777 -358 -592 -563 -668 -744 -520 -601 -498 -299 -110 -109 13 6 367 345 389 659 698 412 654 569 648 449 617
1994 617 336 59 18 -87 -159 -99 -357 -401 -466 -659 -459 -745 -687 -531 -532 -750 -344 -426 -190 135 169 373 416 493
2018 493 462 796 861 652 413 862 685 679 400 148 130 278 -294 -267 -286 -351 -345 -521 -437 -839 -639 -616 -198 -429
2042 -429 -350 -291 -501 34 52 193 241 473 544 612 649 611 478 775 534 32 604 143 269 -1 -184 -180 -165 -268
2066 -268 -713 -465 -788 -529 -620 -530 -364 -259 -276 -366 -62 -37 372 285 -66 346 497 474 527 687 778 568 547
2089 547 543 469 351 168 -59 100 0 -143 -535 -317 -704 -424 -676 -688 -631 -491 -500 -442 -25 -26 -229 57 398
2112 398 72 232 281 657 408 449 582 528 495 550 256 94 31 139 111 -26 29 -344 -455 -511 -410 -542 -602
2135 -602 -461 -713 -595 -644 -250 -136 72 -80 98 307 279 383 308 497 790 736 687 534 398 380 288 346 259
2158 259 47 -171 -368 -44 -322 -473 -441 -431 -729 -801 -487 -706 -588 -446 -416 -145 84 65 179 300 357 591
2180 591 284 707 435 755 554 365 324 404 496 -73 284 -221 -171 -192 -282 -430 -200 -336 -653 -663 -508 -503 -370
2203 -370 -368 -297 100 -43 -90 316 15 69 507 516 315 886 635 669 409 548 444 31 360 132 116 137 -297
2226 -297 -304 -286 -416 -417 -358 -282 -569 -561 -308 -396 -175 27 -144 -134 297 384 136 520 586 417 509 307 607 303 381
2251 381 387 162 429 405 -17 -231 -95 -391 -283 -374 -497 -325 -409 -549 -617 -564 -373 -183 -236 -118 329 -21 138
2274 138 -62 409 502 608 428 606 857 360 170 368 575 240 38 5 -159 -142 -103 -449 -476 -212 -642 -483
2296 -483 -504 -602 -671 -279 -552 -240 -161 -51 -140 -175 247 356 405 244 498 465 555 527 588 264 187 285 348 28 246
2321 246 76 -156 -353 -273 -178 -284 -580 -546 -310 -533 -520 -256 -175 -415 -156 77 164 -37 157 151 541 600 481
2344 481 413 575 559 475 218 305 284 234 175 -368 -368 -447 -340 -248 -513 -651 -602 -653 -497 -334 -433 -273 -97 118 -73
2369 -73 292 193 117 270 293 233 382 270 292 361 560 171 175 145 76 -136 -81 -191 -120 -410 -247 -511 -339 -776
2393 -776 -516 -312 -534 -261 -348 -99 -258 108 -145 225 321 100 440 361 276 134 522 352 473 403 275 259
2415 259 -12 254 39 -136 5 -338 -172 -412 -618 -427 -263 -335 -523 -566 -310 -95 -229 -44 -83 11 -38 79
2437 79 532 571 301 466 513 448 597 566 386 422 234 -28 31 57 -150 -487 -381 -581 -219 -376 -154 -383 -514
2460 -514 -493 -222 -154 -62 -144 -97 303 83 357 259 289 540 526 419 421 478 276 212 245 260 217 -158 -65 -219 5
2485 5 -408 -201 -637 -403 -622 -413 -319 -195 -191 -241 -261 -329 -34 286 -155 188 292 294 625 192 541 391 503
2508 503 493 -8 358 -81 348 401 -13 -82 -159 -239 -139 -143 -190 -298 -371 -386 -282 -399 -336 -226 -200 -36 -41 36 -147
2533 -147 346 387 251 241 332 439 210 308 294 389 276 -17 31 -17 -222 -461 -525 -368 -219 -290 -459 -449 -575 -431
2557 -431 -282 -306 -256 -355 310 20 28 27 141 152 433 644 363 534 429 549 504 449 166 124 235 -113 59 8
2581 8 -221 -34 -385 -349 -292 -277 -332 -43 -157 -171 -379 -437 -200 -173 172 173 10 257 459 302 338 324 291 308 111
2606 111 186 117 146 136 -167 265 -232 -107 -340 -355 -387 -99 -254 -451 -196 -321 -210 -266 -337 -114 247 -41 -16
2629 -16 86 345 403 311 198 345 334 299 382 312 415 156 98 124 253 -75 -235 -468 -243 -208 -370 -438 -418 -429
2653 -429 -156 -322 -615 -277 24 187 101 5 178 242 177 283 389 417 226 300 373 310 244 200 -9 46 -448 85
2677 85 -98 -261 -183 -263 -209 -235 -401 -373 -555 -360 -303 -198 68 -223 171 114 264 86 93 266 249 129 271 465
2701 465 341 252 154 68 119 60 224 -316 301 77 -164 -273 -323 -129 -124 -321 -326 -237 -139 43 -199 117 188 36
2725 36 -167 11 370 -238 458 447 360 653 382 311 194 9 180 211 110 -306 -10 -69 -151 -188 -181 -491 -481 -163
2749 -163 -375 -326 -342 -373 -419 13 22 206 -58 315 8 446 199 446 338 337 132 430 401 34 292 16 44
2772 44 -152 -159 -128 -49 -266 -396 -418 -434 -610 -258 -120 -223 -461 -25 -299 -7 152 -8 208 62 65 445 271
2795 271 336 210 282 321 472 20 144 76 75 111 -203 -21 -31 -125 -150 -566 -611 -363 -467 -84 -325 81 -49 -39
2819 -39 -52 30 101 114 107 108 268 239 164 352 201 496 136 111 149 247 67 28 35 140 -359 -431 -386 -237 -151 -344 -377
2846 -377 -208 -442 -445 -35 -359 -102 -56 96 140 42 205 237 254 100 264 72 320 318 75 359 -74 63 127
2869 127 -80 -257 -110 -194 -391 -341 -136 -327 -685 -128 -279 -491 -235 96 -318 -290 73 -47 121 174 241 422
2891 422 177 253 260 161 138 239 90 94 48 -158 -169 -22 -295 -359 -261 -187 -129 -265 -382 -365 -279 -209 -454 -8 166
2916 166 -210 -33 125 442 45 316 283 320 96 401 199 179 269 221 190 16 63 78 79 -218 -98 -150 -543 -416
2940 -416 -501 -251 -700 -8 -282 -133 -23 -24 105 -20 40 162 185 308 241 224 185 366 229 207 190 177 293 150
2964 150 104 -261 -140 -259 -447 -378 -514 -174 -332 -168 -195 -219 -7 -330 -353 -175 71 -58 -14 69 171 186 248
2987 248 101 322 380 417 105 46 189 212 163 95 113 -50 -44 16 -215 46 -115 -143 -203 -407 -68 -288 -231 -132 -250
3012 -250 -110 -14 244 76 218 93 -102 18 338 240 334 295 87 -63 141 -65 97 245 -53 -50 54 -145
3034 -145 -125 -9 -278 -45 -206 -267 -224 -109 40 -275 -378 33 -130 -40 315 177 280 136 234 190 255 350 374
3057 374 -95 106 157 103 -173 14 -160 65 25 -405 -137 -263 -368 -212 -147 -62 73 -203 -11 -209 81 160
3079 160 171 46 68 218 105 133 285 496 98 397 64 162 128 -176 70 15 -52 -48 79 -261 -7 107 -341
3102 -341 -427 -409 -114 -69 -134 -270 -27 -118 -106 -60 101 29 161 261 363 290 179 195 135 206 193 104 -75 186 377
3127 377 -50 52 -275 68 -16 -283 -423 -117 -421 -215 142 -85 -242 -99 -17 4 -79 173 115 100 116 341
3149 341 179 100 325 218 103 45 73 114 104 -81 -115 -164 -10 -65 -67 3 -36 -90 -237 -93 -297 -147 -44 -23 148
3174 148 -117 107 -24 203 -93 171 249 123 159 68 342 18 155 294 4 24 -19 57 -234 -86 -254 -305
3196 -305 -231 -72 -223 -271 -352 -171 -290 -85 -91 -234 -98 223 270 87 16 298 46 191 272 215 481 293 276
3219 276 112 98 -18 238 71 239 78 -63 -169 -353 -119 -41 -268 5 -189 -151 -85 -10 49 -273 -226 136
3241 136 206 255 171 133 -41 203 233 338 226 170 381 -27 45 154 139 73 135 -227 109 -155 -372 -151 -81 -124
3265 -124 -74 -175 -121 -274 -107 -199 -142 -75 147 -18 129 306 -43 318 85 -5 358 272 -36 -56 89 94 138 -29
3289 -29 -232 -452 -173 -137 -226 -50 -15 -68 -59 -323 -149 -127 51 208 183 -6 -34 252 283 33 218 77 184 189
3313 189 93 13 88 13 -78 85 -50 -10 -224 -317 -37 -215 -374 -307 -252 -174 -195 -285 -10 116 -336 38 -81 -1
3337 -1 30 30 -39 -15 147 290 231 261 180 154 -161 197 -64 247 -69 -119 47 -315 243 -345 -134 -169 -151 -194 -142
3362 -142 -385 48 -115 -28 53 94 -110 133 -2 23 437 68 168 64 420 204 103 90 461 353 270 138
3384 138 49 -3 102 -114 -225 -241 15 -171 -53 -249 123 -240 17 78 -181 205 -56 2 -114 160 -177 40
3406 40 237 138 183 248 361 19 185 -261 262 259 210 8 -24 148 -320 -140 -155 -182 -302 -339 -154 -241 -36 -37 152
3431 152 -60 -109 1 172 -50 -150 178 -153 167 223 159 115 98 580 147 134 222 9 -18 -138 -106 -204 -286 -141
3455 -141 -173 -151 -319 -230 5 -277 -64 267 -34 -126 207 94 -187 199 59 -69 166 -26 219 122 -183 165
3477 165 -57 235 271 -219 -53 -70 -250 203 50 -185 -315 -182 -100 -244 -203 17 94 13 -232 -59 -243 -7
3499 -7 203 -14 264 294 60 210 182 136 416 412 -67 51 -54 72 -9 149 -173 -67 -341 -154 -275 -368 -5
3522 -5 -390 -34 -90 8 40 -346 -37 -48 205 54 203 383 335 99 -36 93 329 -1 190 -67 133 171 -148
3545 -148 -42 262 17 -144 -8 88 -371 -95 42 134 -77 9 194 -179 -232 -34 -223 107 1 193 115 81
3567 81 172 138 12 183 164 144 317 3 135 201 -32 -152 137 -41 -75 -205 -105 -10 -176 -457 -5 -122 83
3590 83 34 -52 -2 -4 191 -53 -295 177 93 96 -8 3 110 129 214 192 -37 -33 -85 62 5 -236 -104 -246 -525 -236
3616 -236 -83 -9 -169 -121 -73 -331 -240 -203 -62 251 312 128 35 185 209 250 339 134 186 163 251 87 107 77 161
3641 161 109 -276 -64 138 -292 39 72 -53 -120 -121 -167 -128 -148 -87 30 -84 -56 -29 200 -179 107 111 429 -19
3665 -19 212 -27 201 237 125 -54 84 166 23 -163 -117 -175 4 76 -13 -178 -481 -265 -229 -419 -50 -56 -121 -134
3689 -134 -163 54 -28 -47 197 194 132 328 23 135 88 45 35 125 -198 138 192 -130 -49 -226 -237 -61 -266 -200 -195
3714 -195 -71 54 -310 8 -407 -3 20 -44 82 119 364 67 65 23 349 -63 -67 -37 161 168 172 110 156 325 14
3739 14 -96 49 -191 -71 -16 -65 -204 19 69 -385 -364 -321 -7 18 -76 -35 202 -87 57 152 -24 495 -71
3762 -71 142 -80 21 -10 129 140 84 -67 78 -134 47 -134 -95 -75 10 -238 92 -24 -127 -143 -105 153 -187
3785 -187 -182 -193 16 2 28 -83 252 231 195 -39 -94 443 158 29 176 157 104 -101 58 -45 45 123 -70 -296
3809 -296 -214 -433 -197 -43 -94 -336 67 49 -70 176 132 -221 -158 149 -9 33 247 213 12 246 215 340 193
3832 193 329 -90 67 145 -244 -13 -133 139 -355 -218 122 -376 -297 -116 -245 -84 -245 15 58 77 176 -101
3854 -101 -91 172 98 75 -48 -89 214 -286 255 160 -99 113 157 84 62 -101 -227 -88 -39 -191 -140 -338 -385 -201
3878 -201 -253 -138 -194 -223 488 -45 59 132 175 121 44 198 112 191 91 -2 102 90 348 51 -16 -30 -252 -126
3902 -126 -213 -104 -229 -50 -67 -64 -86 -102 -121 104 21 24 -213 -102 54 45 94 6 200 249 149 236 260 33 157 -1
3928 -1 88 69 9 -105 172 -192 -350 -162 4 -33 -338 -44 91 -25 -50 -165 -214 -14 102 36 74 57 242 41
3952 41 119 43 262 171 36 36 180 35 194 18 -211 83 -173 -34 -164 -280 8 87 -257 31 -10 -94 -39
3975 -39 17 -132 -115 -152 -144 -54 192 70 -108 180 87 456 152 -50 157 92 209 62 159 242 35 145 19 136
3999 136 -149 -243 13 -39 -147 -311 67 -138 1 -194 -140 -115 26 173 47 98 -37 109 99 -1 99 273
4021 273 220 240 320 236 228 163 -82 -43 103 30 -137 -69 -5 -120 -415 -312 -328 -164 -200 -362 143 -43 100 -55
4045 -55 -9 213 386 5 194 420 277 102 77 146 154 30 219 182 -32 -31 152 -64 -21 -212 137 -57 -116 -127
4069 -127 -93 -30 -186 -5 121 -116 130 -139 44 -100 161 136 -21 42 -43 235 245 200 27 174 140 -7 401
4092 401 36 71 -30 -68 -207 12 -339 -96 -238 77 -134 -98 183 21 -13 -20 -68 -183 11 50 248 222 -62
4115 -62 208 32 63 47 231 72 121 -68 -134 11 130 29 -215 -42 -107 -62 -223 -112 -283 85 -105 -433
4137 -433 -90 106 -36 -31 -174 36 19 24 36 213 -22 4 33 156 25 379 -103 231 -185 -137 209 3 190
4160 190 -212 0 -193 41 -388 204 -117 -329 321 -98 -98 57 129 -122 135 23 21 311 -155 -164 29 279
4182 279 -2 62 9 -58 -86 121 179 -140 -75 -66 -465 67 -186 140 -127 -93 113 -78 -81 -11 -19 0 -117 -116 -32 134
4208 134 0 -57 157 49 86 171 86 54 111 -99 303 98 14 73 83 -59 -139 -9 -43 -13 -255 -83 -118 -213 -116
4233 -116 -99 -147 -244 -46 244 287 20 102 92 365 -83 57 -167 -54 142 427 170 190 140 29 71 132 -143
4256 -143 -119 -33 21 -232 -107 -222 -273 -203 -153 -235 -78 -52 56 -212 28 -64 167 -144 133 201 180 45 -113 84
4280 84 -104 25 61 139 15 -101 -84 -59 154 -234 45 -240 -186 39 -182 -362 -203 -117 -412 6 -101 -187 -136
4303 -136 22 33 162 -153 9 -86 -30 200 272 190 -8 75 217 -54 120 -3 72 -256 77 1 50 -126 -189
4326 -189 66 2 -44 -80 -152 108 -184 -267 -107 144 -83 -92 208 161 -30 78 -144 18 144 175 -27 257 208
4349 208 -89 383 -12 29 -69 -34 -327 -184 -123 -66 -122 -53 -112 128 -176 108 310 -26 -22 23 44 74 103 -8 0
4374 0 152 217 75 -19 268 218 -33 -98 2 124 42 10 55 -185 -34 -298 -371 -196 -135 -321 -336 -5 -144 86
4398 86 -227 18 92 2 238 74 -274 184 160 -96 111 180 214 -106 177 -89 48 -88 -33 72 -7 -207 113
4421 113 -149 -112 -193 -72 7 -103 -119 56 -105 146 217 107 42 -130 261 116 81 -16 117 270 -19 -76 159
4444 159 5 124 72 58 -85 35 -11 -302 35 -15 -93 28 -85 -18 107 -233 -81 -117 -91 3 -3 27 116 97 75
4469 75 -111 205 186 222 160 -77 24 282 -25 -74 -23 -211 263 36 -141 -83 -42 -162 170 -243 140 10 -57
4492 -57 46 -38 -90 16 78 -10 56 -137 304 -235 77 428 56 -131 270 44 33 54 -64 -142 -50 -312 -293 52
4516 52 -128 -108 -172 -445 143 -85 -100 -79 -320 -96 74 -43 -70 -59 -87 79 255 -42 163 55 99 186 124 108
4540 108 -75 241 185 200 -11 118 206 17 -258 -251 223 -155 -71 -81 -190 -213 20 -190 -38 -130 144 -142 91
4563 91 120 -109 221 28 374 99 153 -123 -110 -132 -72 79 33 -26 -168 290 58 48 127 -243 -348 52 -205
4586 -205 -81 139 -155 -95 220 2 182 8 212 30 94 -49 34 -69 -37 265 115 311 316 304 -131 175
4608 175 49 -186 78 -36 25 188 73 -139 -73 -336 -21 -43 -53 -179 -298 -3 -251 -78 -131 -26 254 169
4630 169 -17 127 -155 -103 99 84 166 -72 453 -102 77 65 -130 -275 4 -139 -116 26 -59 45 -241 -14
4652 -14 -200 -68 -104 269 -62 12 -99 68 194 -157 130 260 260 99 151 139 205 152 -102 51 -15 69 -44 -85
4676 -85 18 130 -34 -430 -128 8 7 -72 -125 101 6 -194 99 145 -29 192 -115 94 -79 188 41 141
4698 141 94 97 170 249 -5 6 -142 -42 126 -126 167 -70 -236 -94 -232 -66 -259 -296 -6 -161 -240 171 -112
4721 -112 48 177 140 113 149 138 351 -14 88 30 141 320 41 60 -43 182 158 -111 116 -56 11 -42 37
4744 37 -59 -156 -96 -14 -86 -263 -19 -187 -19 217 -85 -82 108 -61 107 66 91 144 135 164 84 186 227 -100 155
4769 155 232 -56 237 33 -307 -201 89 -52 -279 68 -390 -95 14 -231 10 -4 -11 209 243 124 60 283
4791 283 90 286 306 116 305 82 80 -38 250 124 126 191 -138 34 -108 20 -321 -1 38 -197 -103 -42 -131
4814 -131 -110 -175 -33 -85 76 -128 138 -18 176 219 139 23 208 84 -38 159 132 -61 20 155 -69 82
4836 82 188 -115 -105 -198 -22 -140 -273 -32 -33 -209 -207 -176 -192 -36 -53 -177 -139 -98 -7 -136 122 90 -13 182 172
4861 172 35 449 -76 119 -35 75 -30 -127 14 -97 6 -145 -259 -164 80 -89 72 -24 -255 109 126
4882 126 139 228 -194 41 78 229 38 39 236 228 -24 185 -208 178 -164 204 -17 158 25 -371 -108 -18 35
4905 35 -289 9 43 65 -224 -91 -123 -278 55 145 -63 91 6 190 228 3 -55 -103 205 68 278 -168 188
4928 188 115 132 51 -72 -70 1 29 -217 -230 -75 -144 -600 18 90 10 -76 -84 103 -29 131 -104 310 69 53 254
4953 254 61 238 187 44 146 -20 94 161 67 55 -27 -142 114 -95 -219 -208 -41 -198 -226 -191 -228 -260 -73
4976 -73 -34 76 -69 142 123 91 239 117 -15 102 164 12 150 -215 -11 -19 147 92 61 202 -33 52 62 108
5000 108 -68 22 22 -304 -245 -119 41 -93 -77 -81 90 -291 -69 -88 216 86 -246 158 194 -131 182 228 154 267
5024 267 -43 -77 -174 -69 -140 -63 -333 -69 -177 20 -109 -36 -7 -153 -198 -47 -440 4 -175 190 112 -266 -73
5047 -73 -61 127 80 -55 35 -131 120 -115 157 110 23 -14 -41 61 216 107 -55 -333 -213 -89 -199 -158 -108
5070 -108 -39 50 -255 -27 -50 -37 -15 -219 18 25 -31 -42 112 -36 -197 -137 21 66 93 200 -14 -29 35 110 85
5095 85 -122 79 52 -150 -126 -148 40 73 -95 -147 58 -422 -68 232 -102 -200 7 -143 243 168 55 316 76
5118 76 129 88 36 -26 140 105 -109 6 -62 -229 106 -4 -203 -68 158 -178 -135 -78 -23 -63 1 76 -1 -14 86
5143 86 -85 -286 209 39 55 200 262 42 -36 32 207 -38 -102 56 65 107 -62 -3 -13 40 -139 -132 -99 -242 31
5168 31 -245 -97 -333 -132 194 162 128 126 295 45 191 235 90 299 -21 135 194 82 -426 -52 -138 19 -43
5191 -43 -191 -24 83 -331 -9 -208 -48 -65 347 -78 -62 -20 -29 76 -205 -3 177 122 -49 -75 235 76 -124
5214 -124 117 -49 25 113 -52 -40 201 26 21 -164 -295 -29 -64 228 -74 92 -87 -133 -327 -55 -40 -125 -69
5237 -69 94 128 118 260 176 227 83 196 -5 123 -41 42 107 -13 -27 -146 77 -148 46 -5 -82 -82 204 -102
5261 -102 -9 71 -26 53 -67 -181 -52 -136 60 93 -152 -38 -129 -184 144 -70 92 103 156 -243 -20 388 -272
5284 -272 -70 -145 188 -115 -24 -203 171 -210 -44 -21 -145 -6 -213 12 -179 -132 -124 -72 32 -74 56 -79
5306 -79 20 109 177 110 77 -161 -49 136 163 110 88 -108 -7 -157 -337 -252 -122 -65 -128 -185 -87 -205 -281 -261 4
5331 4 -12 33 9 -186 41 13 -37 77 75 181 189 148 209 58 135 135 -355 183 70 -109 -154 -93 181 44 -29 -262
5357 -262 -32 -309 -82 -121 -75 89 -53 30 -207 -118 109 -91 -230 88 375 -49 5 44 10 172 -40 81
5379 81 98 174 132 169 73 82 -322 -272 53 124 -252 -89 133 1 -188 -209 219 175 19 79 168 -137 88 98 -198
5404 -198 60 251 -86 254 234 176 174 198 81 -67 -105 -125 -119 53 38 -28 -259 28 -52 -115 -309 -143 -187 -35 -269
5429 -269 52 -196 -98 -31 326 108 -59 243 161 229 140 86 44 211 91 50 69 -79 -114 47 -78 167 -343
5452 -343 27 -229 -214 -217 -144 11 -88 119 -155 12 8 -19 206 -69 138 -50 170 227 187 73 86 203 188 92
5476 92 -92 66 -98 265 -218 71 49 -282 -106 -52 -94 -82 -124 -154 -288 61 -59 68 133 187 -2 128 2
5499 2 60 189 -249 -49 64 -31 485 216 326 198 93 59 -64 151 -168 88 -50 -9 126 -86 -66 -183
5521 -183 156 -23 -190 -486 -283 -85 -120 -86 -187 185 -59 119 52 164 168 224 -89 -126 -94 59 20 190 47
5544 47 -154 129 46 -17 -22 -53 -45 -1 -43 92 -101 -191 -289 -115 218 -15 -46 -140 145 74 -223 163 -227 214 80
5569 80 109 47 5 -100 328 -9 156 35 -54 87 -51 152 -520 -276 -166 -66 -396 -89 19 -193 -158 -13
5591 -13 -177 60 53 124 -114 96 149 209 -96 100 56 43 86 -128 229 -169 116 -140 237 199 -72 -4 41 -290
5615 -290 -29 194 -135 -349 -171 -321 236 -71 -137 -80 -154 -127 35 -135 145 31 66 370 -143 304 -83 -194
5637 -194 91 206 198 14 -28 -6 75 402 -126 9 -365 -323 -234 37 -17 -159 18 55 107 -41 -66 -81 90 122
5661 122 153 271 100 237 104 147 174 169 172 -303 -195 -8 -155 106 -134 -68 51 66 -80 -79 -273 -9 -148 -352
5685 -352 -58 -87 53 -267 -41 141 -25 291 84 54 125 171 43 13 34 -132 282 -151 26 59 -168 118
5707 118 -72 84 17 -223 54 -47 -21 -75 -276 9 -95 -94 -124 159 -150 -158 229 28 134 -54 151 61 142
5730 142 70 247 94 203 59 92 -336 -47 262 -135 -123 -42 -213 16 -139 -161 -45 99 -8 64 65 -4 145
5753 145 -36 16 25 19 29 212 -35 206 58 121 123 7 -89 -129 -15 106 -117 276 192 0 -142 -163 -146 -26 -157
5778 -157 -305 -116 -222 -108 -222 -80 -28 59 18 -175 -199 -49 82 136 -54 -40 -5 -42 276 266 48 117 -19
5801 -19 -7 -173 -49 102 -103 25 -70 56 -105 131 -90 -95 207 -28 17 165 61 15 -18 -38 -117 62 -105
5824 -105 92 -128 224 154 -32 -33 12 42 -90 -64 259 -132 -84 -121 139 19 -124 43 6 -96 78 79 -165 -32
5848 -32 -140 70 115 -54 216 212 324 77 -115 26 27 118 192 184 9 142 -188 178 143 135 16 178 80 -111 -223
5873 -223 -127 -82 100 -52 -42 -11 -109 15 -220 -95 -76 3 -258 -15 -142 231 142 200 -52 1 195 257 15 340
5897 340 24 -141 34 107 -43 -50 51 145 -149 -12 -265 -116 77 31 228 10 62 -56 -198 89 335 -129
5919 -129 159 31 233 104 200 63 138 136 52 223 81 186 -186 -77 -69 -205 -33 -49 -87 133 -59 -95 -210
5942 -210 90 -63 -4 269 0 -43 -67 -63 134 160 269 44 153 105 -267 160 -82 -70 73 -188 -22 -64 253
5965 253 82 -144 76 -57 -115 40 -169 -74 -255 -55 -62 274 178 177 -117 -248 93 140 -19 99 -110 78 -22
5988 -22 -105 -22 -222 460 -73 211 -32 169 -221 -197 147 104 -136 -270 -97 160 -59 194 -39 -33 60 23 1
6011 1 159 -150 70 -32 -138 244 272 -10 131 85 234 152 96 -16 -117 -109 278 105 5 135 -343 45 -158
6034 -158 -6 -47 42 -113 223 -237 -5 -140 138 -119 107 79 -185 85 11 358 67 114 3 246 -163 -24
6056 -24 319 -107 -100 -148 71 -79 192 188 12 12 102 -182 -81 56 -77 -15 -398 -212 -17 122 128 -50 -39 76
6080 76 9 139 1 464 432 -4 83 14 -256 264 292 -63 78 -158 -223 -36 -162 97 -254 -55 -319 8
6102 8 -57 -146 -51 37 205 40 -237 199 -9 -27 26 15 96 -16 126 28 30 99 203 31 170 -14 156 420 -9
6127 -9 -15 -220 90 -202 -279 238 30 -34 -262 -358 -3 -233 -325 -59 -63 100 -77 -101 -82 82 210 -4 -62 79
6151 79 355 87 112 111 161 -31 202 -27 -103 -142 -92 24 -209 -109 -107 98 -77 -270 -46 -157 13 97 131 -187
6175 -187 -64 -60 -25 107 202 -120 -175 335 384 228 51 119 277 -136 204 343 -35 -185 38 -39 276 -209 -25
6198 -25 -148 -42 4 57 58 -134 -245 -217 89 -195 55 157 41 148 185 -92 111 27 224 330 69 81 -45
6221 -45 161 89 187 -150 -131 130 117 -139 -90 -43 -68 20 -89 -164 -225 109 43 145 318 31 90 13 58 -57 -49 -120
6247 -120 54 150 -60 -4 -1 78 -53 58 173 127 -103 -58 -101 -94 47 55 -86 -41 -386 -42 -18 -131 9 -205 188
6272 188 -117 75 273 -41 -33 177 150 -197 27 -37 72 219 195 -57 -72 68 172 46 -61 160 -61 -167
6294 -167 82 -128 -124 -126 0 -73 -101 -329 1 -142 75 -132 -35 -16 15 51 131 -20 -68 122 163 173 37 132 -80
6319 -80 -172 49 -80 -185 29 -251 -210 -218 -48 143 -87 283 16 -131 295 155 -123 125 72 -132 105 90
6341 90 299 305 82 -48 -3 161 106 66 -42 88 -197 -78 -171 -92 -35 -203 -3 -152 -172 -266 -71 -59 -206 68
6365 68 -76 -21 76 24 -44 221 92 30 70 184 281 91 107 -83 -105 -152 -168 279 100 90 -38 -158 -155 163 -65
6390 -65 -180 -71 -50 126 -83 -79 -79 -91 236 113 -2 132 53 -22 165 200 119 363 147 138 61 224 320 277 121
6415 121 -30 162 64 -107 -40 69 40 -182 -47 1 114 -199 -26 -89 -193 -271 61 -10 13 -145 23 89 -32
6438 -32 0 -30 312 251 -4 59 -106 48 262 34 161 142 152 187 -24 121 -169 -203 -146 41 73 6 -53 -38 78
6463 78 13 197 213 147 -24 -9 52 85 257 -163 128 155 183 216 -18 -180 127 -25 90 220 -66 24 144 -220
6487 -220 -86 95 97 29 -216 -416 -110 -192 57 168 -255 -6 -299 194 117 -247 253 0 -5 40 -214 192 143
6510 143 206 152 -145 -209 24 -25 -266 145 76 -158 222 196 -185 19 -10 -57 -36 68 -11 -291 289 143 106 81
6534 81 13 267 138 37 183 131 369 223 -134 -7 100 208 90 214 -16 106 -112 -116 -390 -155 -144 -40
6556 -40 -510 146 8 -391 45 10 17 102 -230 -51 130 92 36 90 113 107 51 460 -32 -287 226 158 191 -224 -132
6581 -132 -111 -35 -153 -79 -487 89 25 -100 -152 -209 -101 -169 23 41 38 64 -127 86 29 -114 -2 -50 -5 162 -29
6606 -29 197 -183 185 75 -221 50 -28 -143 -79 -343 -180 -16 -259 -121 -95 -177 -28 -104 -107 -55 -320 33 169
6629 169 218 0 -17 -63 -11 376 -141 -195 -143 258 -130 -83 4 -79 222 104 -181 103 190 -297 -159 -82 -77 -26 -14
6654 -14 -206 -159 -156 99 -65 84 67 71 -172 106 55 -46 -73 -83 46 182 -131 -18 48 56 15 -152 175 -15 -13
6679 -13 -35 -12 -8 -192 -110 -137 -8 -361 123 -59 -71 151 -165 90 22 -21 -54 3 0 163 133 -126 161 58 21
6704 21 -154 -26 -73 -40 -218 -200 254 164 -14 8 -153 -20 15 -60 29 -254 -67 -184 -67 -46 -122 -89 -75 -137 66
6729 66 -49 82 -9 53 101 86 143 -3 -4 166 40 -60 -115 -154 -84 -23 -90 -2 52 -47 -101 -155 -37 78 45 7 -74
6756 -74 -209 172 7 83 -113 147 20 172 -117 -173 -129 -155 -246 -165 -8 65 206 100 -281 40 73 -49 115
6779 115 38 -185 -33 -123 187 -180 115 28 174 65 -63 -173 135 -159 91 -67 -6 164 19 156 187 -152
6801 -152 -97 -32 -28 46 -84 -77 38 -11 -135 -222 22 -112 -87 -113 82 230 -213 -46 -42 -13 25 -81 -91 -227 -53
6826 -53 -141 -73 74 39 80 -220 -259 114 12 70 4 35 170 -230 328 -17 317 -186 231 173 -176 -121 -108 -225
6850 -225 -69 -222 24 13 -123 -259 -285 248 213 -15 31 -32 114 160 157 4 193 -72 108 -177 -149 -216 -5
6873 -5 161 -194 97 67 -66 210 6 -132 -108 -291 -255 216 31 160 260 -102 -152 72 235 195 242 145 -36
6896 -36 198 188 -196 72 -277 -73 -84 -163 -98 58 71 -86 184 -38 -104 -57 128 -161 -322 177 -211 171 -223
6919 -223 206 30 75 21 74 370 27 242 218 -48 -11 82 -47 42 -54 103 369 3 -327 122 29 171 41
6942 41 130 -42 35 -212 -18 236 -136 281 -12 62 -3 105 -104 163 -74 -59 -64 -32 35 -33 81 -140 163 -298
6966 -298 137 -80 -29 -124 -334 123 142 -211 -61 -291 88 100 12 -86 79 -326 129 -79 89 96 -199 134 -190
6989 -190 158 -32 -146 15 21 52 235 115 10 4 38 -225 206 -5 -31 -88 -135 -145 -19 37 -110 -105 239 131
7013 131 76 59 152 -123 -201 85 53 55 243 177 125 -21 -101 111 4 174 88 198 -60 134 97 111 -198 56
7037 56 -56 19 -357 -63 45 -347 -25 -109 -215 -22 171 72 -98 97 100 -4 -5 73 179 266 -171 -170 236 143
7061 143 142 96 -133 -282 -47 -270 -116 -175 125 -102 -184 8 -95 -73 5 -29 -40 165 201 -209 -3 141 -143
7084 -143 -32 -170 215 -143 120 302 334 184 61 305 49 -229 -153 85 -8 80 -44 -145 -104 -299 -192 -205
7106 -205 -96 0 -111 -59 -151 -134 -167 -137 -150 34 30 -149 27 28 -108 72 -212 -48 45 -54 13 89 -181 59 -104
7131 -104 -31 -112 -109 -89 -3 285 40 68 196 -28 5 41 11 -61 50 -155 18 84 90 -116 190 178 167 19 137
7156 137 293 167 179 -42 -51 49 -171 -211 -128 -5 -307 -46 -236 -237 -132 -61 -7 15 138 -101 45 -25 10 94
7180 94 220 38 207 -321 88 206 185 148 134 252 99 76 -198 -12 -99 112 72 -64 7 -1 -150 61 88 -26
7204 -26 -180 40 85 146 63 129 -162 44 180 212 22 -87 -74 8 -157 -117 170 -67 139 36 -7 -92 -8 -33
7228 -33 21 -100 -159 -210 2 -87 182 -139 347 68 -31 20 182 -133 -156 177 217 -37 188 -153 -23 34 146
7251 146 44 219 123 25 141 -21 -67 -10 242 35 46 -150 77 -125 75 -106 4 -127 235 -160 -204 125
7273 125 -8 -80 36 276 4 28 38 -14 391 254 151 26 211 394 -189 -61 171 130 -70 -124 -158 -207 -135
7296 -135 171 -140 185 -26 -73 -44 36 126 -69 99 233 -32 20 61 180 179 164 -262 235 123 -127 -16 50
7319 50 43 -66 -24 -108 -190 28 -210 27 -329 -65 99 -116 -121 105 -343 118 -403 -83 -183 -97 224 -191 82
7342 82 167 193 101 88 87 -70 264 61 91 -119 142 -115 -97 -102 -235 14 -20 193 -166 -103 214 -226 -97 -542
7366 -542 -252 -111 -151 -153 69 284 -40 99 -158 9 308 -39 -41 212 296 176 49 -136 68 28 5 5 215
7389 215 -264 -440 -173 -117 -88 -146 41 -59 128 -39 -8 97 202 -40 70 199 -136 -122 263 149 -115 2
7411 2 -42 -73 57 -116 -162 127 148 -16 -68 -95 60 -13 -6 -376 81 47 -48 -126 134 35 -116 17 -15 -52 -9 51
7437 51 -49 -84 92 40 -128 176 -16 -147 65 173 -27 -145 -58 49 121 15 -73 38 -85 -227 5 -160
7459 -160 44 -148 -143 -73 -345 74 41 386 75 -151 195 48 116 -76 30 -131 -107 144 351 167 -165 142
7481 142 -31 -167 -89 35 9 -30 -2 74 -10 -61 -69 -71 -208 -46 37 -124 -60 -13 -47 8 346 -80 -116 -195 291 -207
7507 -207 219 -20 42 -11 -78 48 32 -56 -8 -134 169 51 -49 -182 43 100 88 -40 -239 -197 -44 32 -78
7530 -78 30 -164 -199 19 -204 115 -203 -166 -184 325 168 171 30 -40 -16 -60 143 -185 26 39 76 -53 51 6
7554 6 -256 -146 -54 66 -104 -79 -161 -56 -28 11 68 -246 189 110 213 43 67 108 37 52 188 -181 36 -26 -71
7579 -71 240 -94 -218 -75 -45 -149 -203 -86 -86 0 35 -270 -11 351 -173 -50 85 133 39 155 228 91 151 58
7603 58 107 22 22 120 336 -8 -39 -76 -148 122 65 41 116 12 -41 -205 46 96 -157 51 -54 255 -54 -170 61
7628 61 3 -272 -89 -154 121 -164 18 -200 -117 51 -104 8 49 4 96 -38 -75 113 -71 -140 34 -319 -37
7651 -37 13 -126 -99 -124 142 -12 -186 -53 61 71 -148 99 25 -59 -139 -99 35 219 78 57 251 129 -181
7674 -181 -137 -22 -36 2 -40 62 148 66 40 4 85 21 28 -132 119 -116 -88 135 -200 -22 221 -28 43 127 134 -155
7700 -155 57 -16 48 148 90 67 -26 -4 105 18 -73 -100 -262 69 -22 106 208 -231 -112 64 -129 -66 -120 -45
7724 -45 -118 -73 82 67 41 106 134 127 -139 158 -98 17 -11 211 131 16 -97 145 -25 141 -126 -98 -208 214
7748 214 -13 101 -206 -227 -365 354 -99 -74 65 -126 -171 60 63 -9 -37 -142 263 62 219 -146 -60 -131 52
7771 52 -185 109 7 33 43 -135 -56 -94 -139 263 -47 -81 -16 -171 371 123 213 67 -30 -66 -205 96 49 -100
7795 -100 117 54 171 71 345 160 187 127 -352 31 21 -104 -8 -127 122 -144 -29 -105 2 34 138 74 37
7818 37 24 5 -243 47 -11 21 20 130 53 -217 -9 104 -107 -27 121 -93 -210 -127 17 -67 252 27 -241 -71
7842 -71 28 -63 -52 8 42 -108 54 -199 -80 -183 5 -15 -27 149 21 -3 -66 176 -176 -202 -26 195 -122 311
7866 311 -28 42 -199 60 -46 5 213 -108 165 -260 45 117 237 -70 61 219 55 -80 2 103 123 12
7888 12 252 188 11 111 25 251 -198 -137 147 -38 -22 -18 13 124 88 3 29 -70 31 -42 22 19 102 53 -66 280
7914 280 -255 -84 39 -61 81 -31 106 86 -21 -12 11 0 29 -159 -26 24 61 -37 -120 155 -45 -69 61 214
7938 214 -144 -173 -171 -89 -82 -135 -212 -195 122 -176 144 -82 21 -35 -108 58 65 37 -33 -50 -186 -96 35 117 -97 -132
7964 -132 -76 205 97 -282 -121 161 -109 77 -177 -37 -11 153 -17 -136 -192 242 -102 77 -1 -101 99
7985 99 -80 109 119 26 59 152 104 66 62 380 191 315 238 2 34 -163 308 -16 -106 12 -266 147 197 -86
8009 -86 -70 -139 -157 64 -153 -107 66 48 99 202 -259 192 249 330 117 183 4 -125 39 -114 78 -93 166
8032 166 172 -263 161 -153 38 -152 -144 -47 -143 -181 -404 -58 96 -126 30 132 -46 -79 -75 -233 26 87 102 -114
8056 -114 239 134 52 132 -96 -57 -67 -39 -135 -9 241 277 -193 -180 -223 136 -152 103 210 102 -141 281 244
8079 244 14 76 76 134 109 -63 -90 27 169 215 63 100 85 60 153 -77 109 161 75 12 -110 51 -233 25 253
8104 253 -142 -182 -129 -195 -85 71 -228 -206 -251 -56 -112 -293 177 87 38 34 82 -187 -87 273 -42 51 22 -227
8128 -227 -79 -268 -20 -9 3 128 -111 -120 60 11 -171 72 0 -29 7 128 -131 257 34 213 269 151 219
8151 219 -120 -21 -43 -17 -148 -63 66 -230 -36 57 33 132 163 382 -34 -20 83 -42 -40 44 -75 115 79 142 283
8176 283 161 23 45 339 -96 32 -116 15 -9 -84 -54 113 138 -104 87
8191H7
$$ Imaginary data points
##PAGE= N=2
##DATA TABLE= (X++(I..I)), XYDATA
0 0 0 0 0 0 0 0 0 0 0 0 0 0 0 0 0 -8 8 -8 8 -8 12 -16 16 -21 24 -28 32 -39 44 -51 57 -67 76 -86 97 -109 124
37 124 -137 154 -172 193 -214 238 -263 294 -324 356 -395 434 -479 527 -581 639 -705 778 -860
56 -860 953 -1058 1178 -1319 1488 -1689 1938 -2252 2663 -3230 4060 -5404 8006 -24645 123584
71 123584 69773 -113939 -2942 24850 -55637 -16541 19942 -29192 5921 36247 -24096 -42627
83 -42627 23133 27670 -1513 -6325 3967 14662 10068 3944 15404 14889 9112 2567 -647 -2252
97 -2252 5376 7367 -6104 -1811 1360 -18375 -11712 -447 -8013 225 2386 -24173 -19794 15402
111 15402 374 -17598 17830 10423 -29770 -10250 17228 7728 15060 27475 -2245 -13212 12660
124 12660 6942 -3291 10482 3985 -8425 -2542 -4186 -8104 5545 6317 -9404 -5295 3065 -1101
138 -1101 1443 -1243 -9530 -6112 -5503 -12550 -9193 2438 4414 3934 4650 -779 486 5920 5218 9289
154 9289 9593 1720 -3042 -3693 -3208 3961 11441 3612 -6102 -3126 -2409 325 6885 4754 -2107 -5210
170 -5210 -7790 -9851 -3846 881 -2046 -2832 -5130 -8537 -982 4777 -2198 -3176 4693 2416 -2949 5723
186 5723 10317 2037 1275 4983 365 -1219 5836 7334 3108 5380 1848 -7662 -4255 3939 772
201 772 -3603 -1316 -5310 -11364 -4947 -1613 -6182 -2042 1313 -6959 -8179 2541 4143 243 4180
216 4180 4120 -1822 1761 5278 2542 5466 10031 3587 -193 5389 4281 -1937 1397 3567 -2236 -3936
232 -3936 -1697 -3401 -5258 -1395 -2834 -8248 -6908 -3118 -3476 -2586 1015 18 -3505 -2793 -1003 558
248 558 6176 8643 3147 629 5460 4297 454 6322 7958 -16 -416 3491 -492 -454 4577 -1790
264 -1790 -7924 -2898 -2906 -7905 -2906 -187 -7071 -6022 -1579 -5745 -5059 2173 1237 69 4276 1494
280 1494 -1516 3987 6217 3626 4402 3101 543 4522 7274 4367 3084 1615 -2681 -2393 -582 -954
296 -954 -55 -347 -4646 -7018 -6193 -3813 -2158 -3126 -4890 -2576 -781 -3408 -1690 2621 540 -1038
312 -1038 2825 3082 3079 5633 3896 2598 6789 3652 -1776 3300 4985 -656 2522 5419 -3274 -4523
328 -4523 841 -4597 -6306 1145 -2424 -9086 -3540 -2085 -5399 -723 1115 -5453 -2376 3401 -649
343 -649 265 6309 3942 -299 1326 2904 3725 4832 4490 4284 3402 1249 1150 1371 -1239 -154 611 -3320
361 -3320 -4100 -1817 -3476 -4544 -1936 -3788 -5342 -1864 -3176 -4238 2193 3289 -2752 -1725 2013
376 2013 -135 1822 6422 3705 2424 3918 1015 1116 6620 4602 -971 1470 1928 -2197 482 2901
392 2901 -2779 -4603 -1879 -4134 -5344 -1783 -1908 -4232 -3024 -1943 -2309 -1778 -1398 -717 1845 2120 1037
409 1037 1369 2648 3087 3478 2726 2755 3414 2352 1742 3211 2832 1099 1097 -1176 -2909 -1107 109 -2138
427 -2138 -2464 -2672 -4903 -3624 -1848 -3409 -2828 -754 -2857 -2925 1063 962 -1059 1903 3035 304 1784
444 1784 3983 2466 2423 4732 3089 1503 2317 1592 109 1773 1902 -110 -1469 -1649 -3476 -3242 -1402
461 -1402 -2059 -4423 -3221 -2095 -3179 -2372 504 -370 -2335 -1449 -683 -94 3232 3802 908 1275 3796
478 3796 2878 2979 5100 2664 153 2789 2904 -612 213 1232 -2471 -3788 -1616 -1800 -3381 -1926
494 -1926 -1568 -2926 -2648 -2310 -3457 -2669 -930 -1039 -589 710 572 -817 643 3201 3543 3261 3957 3499
512 3499 1868 3272 4282 1547 -20 409 -795 -1458 -223 -422 -2055 -1551 -2366 -4569 -2318 -745
528 -745 -3384 -2771 -13 -1645 -2875 -796 -673 -1537 285 1785 1663 2221 2755 2311 3164 3469 2645 2642 1881
547 1881 507 1542 2129 491 -618 -1207 -2012 -2219 -1386 -1796 -1611 -655 -2867 -3670 -1539 -768 -1720 -1918
565 -1918 -1358 -653 324 625 970 1514 346 68 2216 2938 2338 3459 3196 883 1466 2264 213 -2
583 -2 1197 -329 -1614 -668 -1452 -2568 -1196 -1832 -3268 -1651 -1844 -3334 -1545 -57 -1277 -647 81
600 81 -2246 -1188 2815 1836 477 3467 3533 683 1473 2547 1662 2404 2417 673 617 1416 -190 -1146 -699
619 -699 -335 -1149 -2587 -2010 -937 -1992 -3160 -1821 -1692 -3401 -2280 -525 -1249 -238 1670 -102 -96
636 -96 2683 1882 1668 3855 2270 787 3215 2646 113 2258 2995 -1217 -825 1569 -378 -1285 213
653 213 -1963 -3543 -1838 -2580 -4010 -1553 -979 -3675 -2768 -892 -831 124 1325 1031 769 1718 1817 1688
671 1688 2892 3614 2858 1389 899 2207 1689 851 1489 1325 -260 -1386 -1279 -1805 -1460 -1027 -2526 -3586
689 -3586 -2799 -2845 -2944 -1366 -1690 -2352 -399 452 -594 606 2363 1228 1629 2490 1972 2141 2848 1768
707 1768 1399 2311 1796 317 658 778 -519 -911 -692 -1089 -2082 -2052 -1887 -1836 -2527 -2806 -3140 -2254 -1166 -577
727 -577 -114 -141 -185 -115 1280 1687 1641 2487 2743 1688 1393 2634 2331 1545 1832 1197 398 928 513 -878
747 -878 -389 -593 -2010 -2910 -2341 -2083 -2425 -2021 -2010 -2276 -1656 -1451 -1401 -258 835 1247 635 595 1710 2262
767 2262 1807 2179 2548 1501 1089 2211 1775 1430 1808 841 -1224 -686 -773 -1089 -785 -1325 -2932 -1893 -2041
786 -2041 -3443 -2540 -641 -2390 -2009 13 -38 -20 985 614 -129 1723 2036 1169 2022 3039 1714 1406
804 1406 2291 1037 521 1492 871 271 310 -298 -1699 -1851 -1600 -1430 -1633 -2550 -2276 -1632 -1779 -1890 -1149 -590
824 -590 -615 -348 -485 265 1925 1481 864 1598 2284 1524 1881 2301 1356 1714 2446 398 172 1197 -2
843 -2 -1512 -589 -1098 -2353 -1439 -1279 -2518 -1608 -1285 -2876 -2006 -255 -591 -522 445 481 -243 615 648 1060
863 1060 2313 1951 1030 1928 2151 1044 1898 2067 1090 916 579 -526 -372 20 -1040 -1645 -1912 -2124 -1701
882 -1701 -1634 -1732 -1641 -672 -1578 -1617 -208 -162 90 463 232 311 1819 1542 951 2073 2416 1217 1494 2122 1070
903 1070 1460 1261 73 -448 207 -1083 -1640 -897 -1063 -1747 -1454 -1838 -2189 -1218 -1260 -1635 -625 -143 -1006
922 -1006 -652 598 414 687 1128 1197 1305 1587 1806 1817 2101 1740 1120 1049 857 716 513 39 -683 -822 -1062
943 -1062 -1280 -1181 -1310 -1657 -1470 -1735 -1895 -1127 -319 -857 -851 73 -203 -277 835 1109 1317 1631 1448 1017 1458
964 1458 1604 1372 1373 1534 701 269 780 504 -152 -117 -998 -1470 -1352 -1255 -1166 -1017 -1247 -1784 -1925 -1218 -1144 -1030
986 -1030 -175 -224 101 649 869 844 1280 1660 1204 1180 2195 1879 1291 1451 1104 685 428 -261 12 103 -480
1007 -480 -849 -1152 -920 -1483 -1535 -1743 -1384 -1143 -1074 -1016 -965 -544 -791 -159 -137 402 1252 1262 1121 1531 2337 1752
1029 1752 894 1348 901 1222 1441 231 170 307 -576 -1526 -686 -232 -1560 -1623 -971 -1548 -1559 -917 -1510 -1751
1049 -1751 -708 -888 -1031 -205 554 647 1006 1250 787 1398 1951 1337 1851 2288 1455 581 852 765 315 421
1069 421 -313 -456 -639 -980 -1297 -1137 -1257 -1710 -1942 -1266 -1531 -1100 -957 -1008 -774 131 -174 338 857 1002
1089 1002 1395 1961 1065 1422 2039 1623 795 776 1173 529 344 105 -25 -151 -830 -1601 -1039 -896 -1472 -1779
1109 -1779 -1231 -1516 -1610 -1385 -1247 -745 -170 104 34 489 565 880 1551 1478 1246 1965 1542 700 1143 1690 1045
1130 1045 785 822 66 -483 -158 -802 -884 -308 -1266 -1916 -1330 -1594 -1699 -946 -1394 -1236 -593 -618 -695 279 982
1151 982 480 574 1044 964 1595 1933 1118 1344 1503 1006 650 1085 801 -137 191 -217 -836 -629 -473 -1449 -1412
1172 -1412 -1461 -1867 -1495 -565 -1485 -1201 -462 -715 -817 34 515 356 627 1096 903 1075 1355 996 1460 1504
1192 1504 777 782 1288 610 299 284 151 54 -838 -1093 -926 -975 -1418 -1405 -1538 -1989 -1392 -1023 -1408 -882 -99 158
1214 158 -152 731 573 632 1643 1306 1026 1427 1543 1019 945 1496 587 33 390 391 -135 -31 -382 -815 -1157
1235 -1157 -954 -1423 -1343 -1441 -1230 -1207 -1168 -1247 -823 -243 -373 -371 428 560 407 972 1447 1499 866 1217 1158 1058 1345
1258 1345 1303 681 582 209 -170 -355 -500 -469 -696 -1273 -981 -1504 -1529 -1234 -1155 -1171 -881 -504 -492 -434 -218 800
1280 800 588 619 849 957 1378 1170 1372 1405 1276 742 766 962 562 54 454 -345 -603 -405 -793 -1565 -1291
1301 -1291 -829 -1134 -1307 -776 -885 -1082 -514 -576 -538 104 39 9 702 1163 1036 743 1294 778 1035 1436 1152
1322 1152 596 917 646 311 246 241 -289 -395 -684 -1137 -1008 -709 -1084 -1541 -1194 -1049 -1057 -839 -186 -108 -187 -257
1344 -257 394 661 460 702 886 896 1059 1175 760 1089 1339 692 430 546 353 -395 89 -397 -750 -593
1364 -593 -821 -1595 -1205 -732 -1088 -1052 -787 -1065 -764 -133 -312 -400 449 536 82 728 1221 1217 892 1026 1015 1198
1386 1198 1291 1240 879 755 392 -19 -277 -281 -375 -555 -1062 -1180 -676 -1179 -1309 -877 -908 -668 -638 -606 -850 -13
1408 -13 101 166 656 792 797 866 926 1076 1477 1368 884 646 1055 573 494 -7 -478 -604 -393 -868 -820 -542 -607
1431 -607 -1322 -1310 -878 -900 -874 -358 -423 -373 -159 -242 43 790 888 565 844 1020 1388 1228 1025 904 885 890 184
1454 184 294 247 7 -22 -620 -714 -500 -799 -1339 -1108 -738 -804 -870 -1131 -847 -639 -160 -422 -23 225 465 458
1476 458 911 987 1017 1131 992 693 1299 1214 626 265 697 197 106 -163 -633 -280 -661 -1064 -1119 -1133 -1099 -1306
1498 -1306 -1152 -474 -604 -376 -404 -92 6 192 276 285 589 628 808 993 803 873 1246 913 605 628 867 279
1520 279 247 -490 -212 -336 -437 -1046 -871 -1049 -1203 -1167 -998 -713 -552 -908 -598 -195 61 203 220 420 712
1541 712 711 847 1048 828 1036 1115 687 914 739 152 110 307 -100 -205 -380 -704 -483 -352 -705 -1050 -846
1562 -846 -1092 -1168 -730 -280 -383 -233 -117 -270 43 547 861 551 964 813 1025 913 1040 1014 898 914 583
1583 583 448 264 26 62 -322 -27 -293 -758 -1039 -813 -804 -866 -1118 -705 -798 -323 -311 -490 -180 175 395 363
1605 363 795 705 695 741 928 703 1086 891 168 361 830 228 -162 -292 -137 -391 -341 -624 -1217 -959 -693
1626 -693 -1166 -816 -679 -893 -731 -770 -598 -136 328 309 160 597 639 869 651 935 1288 691 587 712 1028
1647 1028 449 220 168 47 -231 -372 -661 -596 -725 -757 -781 -1242 -1020 -770 -716 -574 -539 -318 53 -303 -188 258
1669 258 640 767 751 637 848 846 716 662 594 727 704 204 274 364 -131 -287 -375 -471 -459 -777 -1027 -593 -978 -1071
1693 -1071 -554 -377 -351 -506 -239 -124 96 298 452 397 675 718 382 822 910 856 867 542 592 167 60 -36
1715 -36 -96 -96 -44 -418 -659 -1244 -586 -549 -658 -893 -725 -716 -366 -511 -207 -36 175 -88 127 372 790 608 813
1738 813 874 710 873 636 574 590 476 475 234 127 -342 -423 -384 -688 -689 -795 -691 -750 -843 -746 -844 -574 -579 -404 98
1763 98 159 388 153 530 767 769 527 785 784 559 596 670 704 477 436 -81 -7 -135 -328 -541 -666 -832 -834 -973
1787 -973 -627 -831 -771 -834 -443 -397 -648 -294 -401 93 305 569 644 721 643 656 1027 530 774 727 760 205 527
1810 527 12 437 102 -240 -145 -465 -774 -865 -553 -796 -737 -633 -798 -418 -450 -448 -293 21 125 49 248 391
1832 391 512 672 770 786 909 983 885 403 336 64 155 125 -67 -292 -283 -620 -778 -610 -397 -989 -857 -767 -662
1855 -662 -891 -765 -432 59 134 214 329 412 732 494 417 800 562 820 846 456 555 734 438 90 163 69 -178
1878 -178 -304 -350 -242 -819 -736 -873 -757 -749 -544 -560 -839 -376 -164 -361 -326 329 253 517 671 642 767 650 709
1901 709 759 768 513 569 530 224 194 467 -157 -453 -254 -342 -664 -635 -745 -582 -586 -781 -605 -458 -280 48 -284
1924 -284 -96 192 229 395 543 554 596 691 606 953 517 633 443 335 191 220 130 -183 -83 -364 -595 -609 -498
1947 -498 -834 -496 -616 -859 -849 -355 -272 -328 -471 -58 -42 172 253 455 256 576 735 619 737 670 598 609 445
1970 445 258 81 122 6 -426 -349 -624 -589 -488 -364 -752 -566 -538 -558 -370 -595 -119 -70 -65 -35 -29 114 514 490
1994 490 320 519 480 520 409 428 691 479 309 286 -57 458 -173 -311 -258 -554 -528 -517 -636 -767 -593 -695
2016 -695 -631 -381 -379 -103 -300 -89 94 437 393 444 595 237 637 483 634 893 523 474 303 503 229 157
2038 157 -196 -149 -390 -199 -557 -492 -480 -341 -573 -590 -610 -345 -356 -305 -209 -164 116 228 204 442 613 350 389 546
2062 546 623 575 592 428 364 241 144 -5 -26 -161 -244 -266 -340 -431 -282 -758 -551 -878 -539 -344 -421 -444 -265 -82
2086 -82 -252 130 366 220 448 440 553 451 507 627 551 537 531 218 294 18 -94 -377 -89 -422 -220 -97 -567
2109 -567 -827 -505 -344 -367 -329 -570 -248 -116 -29 -30 -33 495 372 303 264 797 526 632 388 391 444 476 210 304 48
2134 48 169 -453 -132 -176 -314 -347 -499 -494 -540 -678 -370 -456 -247 -423 -355 -147 -58 -177 178 157 472 261 277 697
2158 697 635 422 620 573 327 468 297 287 160 -22 -188 -276 -387 -473 -764 -453 -740 -392 -631 -337 -234 -545
2180 -545 -464 -134 131 44 213 118 444 304 566 569 867 298 615 491 402 431 221 290 -160 -195 -121 -315 -332 -392
2204 -392 -274 -790 -624 -520 -328 -388 -361 -332 -477 67 -374 -466 144 470 336 351 479 519 746 752 575 670 525
2227 525 656 170 161 291 -167 -95 -138 -84 -477 -251 -495 -707 -294 -312 -218 -417 -619 -413 -188 -19 -388 127
2249 127 75 96 440 268 426 548 542 352 433 452 349 135 368 189 423 -228 -93 -315 -318 -449 -568 -551 -698
2272 -698 -260 -175 -637 -224 -197 -449 -55 -61 -133 -60 283 308 393 432 621 457 553 367 237 106 344 395 410 11
2296 11 -114 117 -316 -273 -652 -272 -457 -169 -557 -461 -222 -208 -205 -467 -89 216 105 140 46 106 544 522 466 606
2320 606 398 482 697 376 516 72 140 58 360 -278 -251 -546 6 -314 -755 -555 -348 -317 -754 -449 -323 -318
2342 -318 -52 -209 -30 42 57 -68 397 462 385 374 559 421 352 599 341 428 -1 -92 -36 -173 -283 -219 -330
2365 -330 -423 -474 -270 -277 -492 -430 -401 -420 -397 -151 96 -495 224 -10 144 296 499 254 475 554 496 289 473
2388 473 79 24 225 115 52 -6 -21 11 -462 -114 -387 -616 -421 -266 -732 -305 -279 -399 -164 -166 -32 -104 -107 342
2412 342 364 473 226 486 380 463 341 205 474 314 90 39 108 198 107 -314 -364 -244 -85 -492 -351 -531
2434 -531 -356 -513 -557 -391 -286 -149 -165 112 317 369 292 195 231 576 423 464 507 229 430 492 320 176 50
2457 50 73 28 -214 -366 -321 -399 -521 -388 -441 -392 -376 -374 -139 -162 -165 -75 21 108 51 62 123 121 357 442 233 367 214
2484 214 563 291 146 499 51 98 -63 180 -315 -373 -328 -474 -500 -298 -690 -359 -485 -166 -399 -412 -113 -9
2506 -9 -84 -94 147 247 419 178 208 264 453 294 462 58 470 245 147 203 188 -21 -376 -352 -272 -156 -291 -407
2530 -407 -444 -356 -126 -415 -548 -560 -82 151 -304 131 20 336 348 162 334 369 415 378 299 405 478 315 145
2553 145 493 74 -301 -295 -278 -207 -621 -503 -328 -546 -397 -491 -209 -238 -219 55 -284 105 319 172 240 36 401
2576 401 269 209 295 603 295 346 44 91 381 -43 -60 -142 -26 -1 -125 -330 -381 -241 -560 -293 -385 -530 -163
2599 -163 -261 -211 -112 58 158 203 79 191 238 323 440 364 391 294 99 488 190 331 34 143 -140 -293 92
2622 92 -480 -480 -231 -134 -229 -83 -413 -363 -181 -227 -100 -140 6 -36 -99 80 88 267 574 658 240 598 272 463
2646 463 503 224 50 165 -39 -119 -293 5 -209 -385 -187 -556 -448 -161 -125 -283 -275 -148 -49 -75 -144 163 28
2669 28 216 217 192 202 409 350 402 195 384 289 580 157 -101 -64 -168 -131 -118 -252 -364 -161 -314 -297 -416 -188
2693 -188 -373 -238 -195 -32 -193 -200 -105 305 318 159 378 303 225 215 399 323 346 272 190 333 -37 116 252 -130
2717 -130 -161 -213 -44 -353 -230 -116 -269 -448 -242 -222 -338 -419 -176 -10 -198 130 198 -28 336 384 482 231
2739 231 198 469 194 368 -10 237 22 267 -366 -159 -231 -194 -357 -220 -278 -279 -259 -534 -240 -215 -154 -199 -155 -238
2763 -238 212 60 178 32 479 -26 229 54 107 391 212 108 280 265 297 34 132 52 -4 -314 -22 -226
2785 -226 -478 -32 -294 -222 -497 -181 -216 -198 -212 -187 -99 -13 -76 77 96 -67 476 222 297 322 247 201 191 220 -15
2810 -15 -60 62 14 -89 -330 -202 -363 -574 -339 -289 8 -272 -478 -219 -418 -50 136 -266 56 65 371 242
2832 242 420 386 111 359 55 166 3 357 135 288 233 323 50 -146 140 -52 -198 -292 -191 -291 -431
2853 -431 -333 -230 -235 -109 -250 215 -151 -305 66 93 167 339 68 17 557 126 117 153 194 207 332 213 -52 35
2877 35 62 -73 -308 -313 -474 -157 -202 -301 -281 -165 -261 -185 -139 -91 -291 3 -105 152 302 390 111 508 135 282
2901 282 322 332 304 147 348 237 116 11 210 -210 -112 -98 60 -237 -558 -243 -64 -137 -494 -30 -295 -58
2923 -58 -164 -223 144 -86 341 259 280 74 331 -62 154 291 445 -44 -212 61 -42 131 219 -108 -73 -176
2945 -176 -218 -323 -172 -115 -292 -174 -201 -303 -63 -191 -31 -127 136 -27 112 198 68 261 224 282 232 231 51
2968 51 191 139 56 150 31 -98 19 -119 -347 -108 20 -135 -256 -516 -195 -425 -5 -122 -12 -62 233 206
2990 206 39 28 198 87 416 204 324 326 275 267 180 135 -9 -22 101 135 18 -5 -97 0 -162 -208 -213 -342 -151
3015 -151 -344 -167 -283 -230 38 -142 -77 40 62 40 283 346 256 155 162 143 285 245 241 85 118 -7 9 107 211
3040 211 -180 -160 -180 -94 -46 -103 -490 -394 -447 32 -180 -333 -256 111 223 226 45 71 123 196 186 95 126 79 157 281
3066 281 144 49 -74 -149 95 -60 -85 -217 -223 -351 -121 -391 -436 -278 -339 -337 -133 57 -119 -60 -121 197 153 -22
3090 -22 231 183 313 384 274 58 117 3 184 181 -66 54 -33 112 -152 -42 -402 -155 -230 -151 71 -128 -248
3113 -248 71 -238 33 -27 -51 142 -136 107 256 181 259 107 271 149 137 226 -41 271 111 56 169 1
3135 1 -70 134 108 -159 -254 -368 -190 -149 -412 -195 -32 24 -23 -66 -267 -47 17 -9 128 386 153 250 157 262
3159 262 336 261 224 133 198 392 5 -23 -346 31 -144 -201 -297 -235 -104 -247 -300 -217 -208 -110 32 -347 -99 96 150
3184 150 -203 123 227 47 484 -14 286 152 98 231 19 82 209 -84 -193 42 -123 -86 -186 -136 -178 -54
3206 -54 -222 -214 -446 -233 6 -34 -131 -90 -219 9 -50 165 74 202 162 198 316 163 309 327 207 517 41 94
3230 94 127 -235 -103 -134 -172 -237 -233 -379 -334 -28 -219 -192 -1 -63 -165 -297 -28 72 -63 -30 191 -4 92 378
3254 378 202 129 367 130 11 118 171 127 -17 21 -240 -97 -196 -133 -350 -312 -147 -159 -134 -461 -401 -184 -92 47
3278 47 16 162 -121 61 229 290 67 238 384 550 164 143 180 4 354 -84 -143 57 -223 93 -180 -85
3300 -85 -217 -197 -223 -199 -257 -37 128 -346 -19 -122 -146 -74 -76 103 90 114 380 13 -49 228 88 296 404 -213
3324 -213 -83 12 55 139 -18 50 -117 -262 -316 -176 -136 -359 -151 -50 19 -261 98 162 150 115 -316 -204 63
3347 63 150 75 269 158 308 -28 13 236 58 109 187 175 79 294 -118 -190 -52 26 58 -169 -102 -326 -310 -365 -197
3372 -197 -405 116 -25 51 313 -202 196 -52 322 189 -43 33 183 415 -80 122 68 386 88 167 -55
3393 -55 -130 -132 -256 -277 -99 -84 76 48 -288 -269 -170 -132 -53 -149 -155 -121 47 34 -23 84 579 -28 332 -122 146 -78
3419 -78 92 181 118 267 82 98 -173 -118 55 -105 -62 -408 -330 78 -192 172 287 -52 -169 -195 -118 -54 -73 193
3443 193 141 127 -66 -70 91 73 425 273 462 104 116 150 95 25 -154 -145 -430 -36 200 -166 -156 -260 -102 25
3467 25 -68 46 -383 -330 2 153 -29 169 395 157 418 303 134 305 162 16 114 299 106 29 -233 -238
3489 -238 167 -99 13 44 160 -238 -529 -322 -470 -274 -302 -193 -177 -81 -96 -16 20 -34 191 302 -21 -57 293
3512 293 277 345 245 303 28 86 236 201 116 6 -124 -148 -112 -221 -118 -235 -286 -117 -70 -229 -58 -149 -105 -39
3536 -39 -109 -92 10 146 87 425 -77 -67 163 143 95 202 19 333 -47 -51 -113 108 78 36 -2 -107 -12 -89 -190
3561 -190 -204 -319 -329 -143 -27 91 176 84 -11 304 -35 2 64 47 70 78 34 488 88 -71 111 203 -60 212
3585 212 5 -83 -55 89 -279 -284 12 -307 -297 23 -60 -194 -312 -72 -58 -164 44 107 145 -56 99 205 157
3608 157 59 183 219 124 39 121 138 109 105 36 -236 -320 -174 -105 -379 -155 -143 -143 -86 -88 -109 -65 -41 -73 277 -96 2 -61
3636 -61 -111 17 291 87 188 11 123 127 316 461 221 106 -10 -130 116 14 77 65 47 -274 12 -329
3658 -329 -308 -354 48 53 -397 -41 -165 128 106 135 154 175 194 15 176 43 244 356 280 281 127 -139 128 80
3682 80 61 31 -160 -262 37 -322 -21 -335 -139 -33 -166 -22 -144 -16 -80 13 -204 152 269 140 261 162
3704 162 50 136 346 147 142 135 140 24 17 52 -260 -6 50 -165 151 -173 49 3 -331 11 98 -18 127 -23
3728 -23 2 -120 -120 15 -82 -6 129 86 206 54 118 160 26 288 -201 103 220 -214 255 268 -45 -201 -265 -76
3752 -76 -153 -130 -57 171 -279 110 -140 164 77 -42 -134 -92 143 -169 20 82 138 92 -6 177 346 301 -2 -30
3776 -30 292 61 -38 49 -133 -61 28 108 -77 -64 -52 -193 -37 51 20 112 45 -23 12 -139 -22 154 172 100 61 -3
3802 -3 357 42 207 207 139 132 94 -37 216 165 -50 12 -133 -21 -212 248 -73 -162 31 -270 -30 6 -260 84
3826 84 50 -167 14 -136 173 264 245 157 10 113 147 -105 142 64 185 91 111 210 -27 181 -70 -47 18 -145
3850 -145 -49 -20 -177 -4 -152 -243 -48 201 -21 -67 60 83 141 247 0 295 145 271 20 55 136 203 159
3873 159 -9 3 147 -118 191 -156 -96 -35 -343 -105 -236 -194 -49 -77 -76 -27 -105 -59 -28 -32 113 257 187 153 231
3898 231 -50 179 252 147 -41 68 -218 60 234 -152 -27 -22 -81 -135 -309 -176 -202 -120 -54 -120 -149 -252 -79
3921 -79 -20 55 221 -122 112 14 272 144 -60 97 157 196 43 338 64 61 147 101 27 -83 100 -336 -170 -172
3945 -172 -7 24 -88 19 101 -285 15 -182 -61 -157 -405 -57 -24 218 170 -123 -57 5 -4 -32 22 48 326 92
3969 92 -33 70 -5 101 60 202 -56 -27 90 22 -96 16 -162 -23 -312 54 -124 -11 228 102 38 245
3991 245 324 373 331 247 206 6 247 170 -7 260 161 -111 178 269 -222 -263 145 14 96 -160 -246 -8 -302 -450
4015 -450 -203 -132 -73 -193 -44 102 96 -42 62 -155 294 53 22 219 261 301 -91 -167 249 47 38 -322 -22
4038 -22 -74 -90 -291 39 70 -98 56 -191 -100 239 51 49 -245 214 149 -307 3 -49 -41 303 113 -72 237 199
4062 199 72 230 71 2 136 -217 -58 190 -161 -157 30 -34 -60 -185 -349 -91 -305 -195 -370 -98 4 -248
4084 -248 -4 -40 179 60 -12 130 100 122 290 217 213 26 64 88 64 210 32 231 54 -281 -263 12 -124 -68
4108 -68 -39 -239 -162 -222 33 -90 -96 252 247 160 186 67 111 199 243 -121 116 436 -28 -95 -23 -48 7 -9 -90 -103 -61
4135 -61 -143 -11 -46 -96 7 105 -275 142 -182 -180 32 -131 -147 -88 112 -61 -191 88 -76 -54 170 498 192
4158 192 -204 211 32 139 108 -67 -138 -262 -45 -51 -93 -74 -118 -356 -151 -278 -88 140 303 12 35 -86 -32
4181 -32 -280 -41 189 270 28 115 324 245 40 70 -51 389 82 175 62 88 -209 37 -232 -280 -129 -315 -220
4204 -220 68 -65 -56 91 -236 -92 -90 -176 66 -44 -75 85 185 6 179 99 84 76 390 355 125 216 99 19
4228 19 83 260 205 199 -263 -205 -287 -33 118 -233 -220 -265 -171 -30 -351 0 -35 -253 -166 -32 125 -93 18 -52
4252 -52 145 111 130 -146 296 -14 -12 57 131 26 42 153 85 -143 -251 89 -233 -12 -260 -102 -135 -257 -14
4275 -14 109 -98 138 235 157 -130 21 272 164 -157 121 -42 287 275 -85 199 160 194 115 -125 -95 -268 -157
4298 -157 -260 -30 -55 50 -99 -88 161 -55 -164 -151 -13 40 242 -3 80 -160 51 85 362 192 73 11
4320 11 124 230 -29 23 83 -58 25 -177 -69 -48 -6 -264 -255 -76 77 -114 -183 -213 169 58 -108 90 177 -10
4344 -10 -340 -215 144 -11 52 12 50 3 45 32 79 71 214 -41 94 -106 40 154 -33 -37 -42 -324 -57 -192 -147
4369 -147 19 50 -73 68 31 15 266 156 63 278 135 108 16 -1 209 325 -38 -206 315 273 156 165 70 -18
4393 -18 -118 -109 -47 -4 -285 114 -190 -252 -267 55 -332 -214 -20 99 -41 -13 -74 -243 260 -12 198 24 -22
4416 -22 47 193 45 214 158 85 130 81 -266 148 -94 -50 -128 -78 -108 -149 -89 -102 -13 -274 -43 100 60 -118 246
4441 246 384 8 -134 217 68 263 59 -43 209 -117 -19 14 -202 199 65 -268 -33 -93 93 -96 -235
4462 -235 -99 -330 -248 -16 -157 -159 97 -139 -110 -88 55 -114 -114 90 160 317 29 50 92 87 -14 161 24 -40
4486 -40 -83 250 -30 49 338 -76 -268 -131 -10 -282 -230 -165 23 -141 398 -153 -169 -132 138 152 296 57 154
4509 154 -61 -26 277 187 163 -133 195 48 -28 -34 25 67 33 -93 -239 97 -149 -393 -66 -180 -87 -139 -128 -52
4533 -52 -36 -17 115 -149 85 189 134 117 203 12 172 -22 13 296 83 94 142 81 68 80 -20 -66 -116 -151 -213
4558 -213 -192 -41 -64 -164 -75 -85 15 -168 -114 -65 73 208 -141 56 126 -47 161 68 -89 212 150 90 0 208
4582 208 212 -69 -52 29 -61 -261 -111 -263 -215 -162 -8 -227 -41 -161 43 55 -251 -182 -23 -55 148 277 54
4605 54 -4 157 20 134 41 157 55 180 110 -129 3 -60 219 -285 -233 -181 -82 -296 69 -108 143 -34 5
4628 5 23 9 -29 -271 172 -14 233 -56 30 -234 77 159 150 428 319 76 12 35 153 135 214 206 57 -123 -19
4653 -19 172 -84 -79 -255 -218 -109 131 108 -11 -212 -172 65 19 35 -78 213 344 145 147 87 -156 15 3 319
4677 319 -5 57 279 57 -78 5 0 75 -213 -226 -312 -256 72 -96 85 -214 28 -282 -192 -83 65 -317 -75
4700 -75 -54 15 -22 178 287 181 69 132 164 55 127 -84 -136 26 16 -137 -116 -206 -433 200 -136 -202 -96 14
4724 14 -205 -67 -235 -292 -82 99 114 -224 17 226 10 280 100 234 163 126 87 83 118 -46 378 -75 -163
4747 -163 60 -120 52 -108 -234 -52 -340 -106 -179 -248 -350 -125 239 -229 -126 39 -109 55 -93 497 297
4768 297 166 -70 -91 226 76 118 197 -11 63 104 192 -17 -10 177 40 -223 -103 -237 -34 -18 97 -108 168
4791 168 -26 -53 -128 161 -167 25 114 97 387 236 31 190 -4 269 77 111 66 339 240 -76 -62 -149 -146 -222
4815 -222 -165 -225 -119 -79 -73 -129 -188 -185 -117 37 208 -125 -80 -103 -105 123 100 245 225 65 304 91 209 74 281
4840 281 101 -93 338 224 -4 120 -2 -391 82 -41 -17 -46 -3 100 15 -103 -132 14 19 1 94 59 83 137
4864 137 98 -84 5 46 307 -60 151 192 222 229 -96 63 -48 -61 -164 -146 -69 -48 237 48 -148 -39 272 -84
4888 -84 -221 169 7 158 -160 207 23 154 119 164 248 75 154 -60 71 -56 164 137 -272 -49 -153 -6
4910 -6 -115 145 157 122 -261 -6 -278 115 -32 -80 -33 -39 -195 94 102 -81 188 109 154 241 218 1 174 295 -123
4935 -123 113 407 189 -45 88 -42 -142 -190 43 -105 -38 -39 -147 -169 -171 -114 -48 -233 66 -349 108 29 -103
4958 -103 203 5 222 70 -80 130 71 -48 233 -18 45 -27 -290 -12 -52 14 69 -78 63 -251 -61 -66 -77
4981 -77 -94 -32 -280 1 -138 -20 148 -8 -67 109 52 26 36 157 -251 98 59 199 -116 66 148 -75 -130
5004 -130 -92 -111 -129 -28 -90 -40 -205 -186 -119 -77 -23 -161 -133 -263 -53 -58 -275 289 -59 203 145 -80 293 84
5028 84 24 103 348 115 168 304 -48 375 -81 -38 -47 -259 40 -161 145 0 -250 -137 72 -254 -17 -37 36
5051 36 -196 -200 15 -40 -128 85 172 51 -6 431 250 60 188 240 -170 -114 -25 -42 -182 -157 -21 -98 165 48
5075 48 -62 -322 -207 -168 -79 -57 5 -36 -200 -18 54 111 -178 111 138 -99 112 250 -20 -84 172 332 -17
5098 -17 98 -36 -2 34 207 6 -6 17 -9 -42 4 -259 -107 -163 59 -105 -313 105 88 139 -146 148 168 93
5122 93 194 99 125 -18 265 102 135 222 105 96 139 175 231 114 -111 44 94 -110 -261 104 -104 -291 -50 -334
5146 -334 266 8 -81 82 186 92 287 13 68 86 271 -63 87 169 184 -81 246 38 -52 2 -216 -157 -74
5169 -74 -305 -219 -85 -3 -103 -185 -473 -172 -177 -295 -147 -179 -36 -50 -1 54 21 154 57 37 34 195 92 41 3 184
5195 184 47 -265 -143 224 -53 -258 34 -56 -270 -314 -28 -25 45 -157 -80 -123 -43 -367 -98 -179 15 -75 119
5218 119 -120 230 235 -354 235 61 -59 200 -37 180 -129 -113 18 -178 81 -237 -83 -56 -150 -154 -170 -208 -196
5241 -196 -136 232 -189 -14 2 -135 37 29 -318 -70 108 -66 93 185 234 81 144 313 216 -53 113 154 -11
5264 -11 -147 38 -272 48 -236 112 85 147 -261 -274 55 -203 28 -404 38 80 47 -157 96 234 228 129 224
5287 224 131 -59 -77 -63 25 119 154 33 -162 -218 -197 75 -310 -232 236 -118 -13 -119 -208 -8 -2 -3 203 95 12
5312 12 -190 -18 19 235 149 80 -93 -65 120 -67 54 -70 118 -150 -46 39 63 -63 117 -267 -103 -107 -128
5335 -128 9 -312 -137 -261 -81 82 -75 107 117 -50 66 31 71 236 150 -6 260 254 79 290 71 154
5357 154 20 268 78 8 -35 80 -119 -125 -287 29 -143 -24 -9 -226 -50 -270 -31 -179 164 178 -113 188
5379 188 191 98 -156 -61 164 -6 45 107 108 75 -13 201 215 -78 15 -362 -50 -137 -116 -44 -99 240 9 -77 -121 80
5405 80 96 -257 -130 31 53 62 165 21 -41 273 -17 61 5 35 -117 114 182 -78 171 162 15 -65 -46 -139 -118
5430 -118 -339 -74 -269 3 2 -396 -7 -48 -98 5 -66 -39 245 -273 215 180 96 558 -121 179 30 31 145
5453 145 -32 203 -30 -75 -40 -71 -91 152 50 -71 -253 6 135 101 -21 -89 -5 -6 -4 206 62 -1 33 88 -101
5478 -101 -109 67 -20 -61 -133 -182 247 109 86 60 -35 311 115 86 -201 225 -139 -197 -243 -38 -4 -152 -59 -156 -41
5503 -41 33 -111 58 1 75 228 113 123 213 116 158 -177 419 -61 342 158 30 -136 45 153 -190 -140 -184
5526 -184 -293 0 -283 -285 23 -298 81 -90 -11 -153 78 -168 88 -48 383 158 174 -90 152 164 134 52
5548 52 -108 -61 -65 271 -1 280 104 241 -102 -154 71 -220 -36 222 -197 -171 -111 -118 31 83 -195 60 67 -48
5572 -48 36 27 53 443 218 24 74 219 217 313 30 201 -291 111 78 -255 -161 -414 -32 -13 3 -199 -54 -150 166
5597 166 -439 38 -11 256 167 59 87 -80 183 240 31 102 135 25 216 147 181 231 25 100 -49 -3 -37 -35 -76
5622 -76 -71 -97 -183 -245 -309 41 120 -6 -6 -94 -37 -23 89 142 70 -20 80 164 -201 410 -155 182 100 238 84 115
5648 115 -190 -242 -27 202 -36 -394 101 -40 -204 -167 -6 -156 -292 -386 -6 -48 331 109 14 -36 -55 4 176
5671 176 84 207 60 -92 190 149 155 -262 107 48 -121 82 -55 -50 350 -166 33 97 -133 0 -207 -230 -98
5694 -98 -7 -10 49 13 37 -31 92 368 158 -123 33 -273 330 181 197 -112 -202 253 -162 -149 -86 -134 209 -191
5718 -191 -134 254 -125 -60 113 73 -148 -48 -31 311 -6 -21 -121 -183 91 38 -224 -16 -59 150 208 215 -27 174
5742 174 -20 -240 19 -71 148 -105 -170 4 -154 -51 170 15 55 -24 376 53 -237 14 -258 -269 -68 257
5764 257 1 103 194 281 132 229 239 -126 -98 244 23 -41 78 228 75 105 -196 -42 118 -15 -79 -116 -318
5787 -318 -18 -169 -31 -239 137 26 -167 -111 96 -54 26 6 -75 -22 -82 180 138 218 140 22 124 148 83 148
5811 148 81 30 80 141 -262 -130 39 -147 -124 -187 51 -212 82 70 -192 -13 -10 51 -26 -192 -45 244 -101 205
5835 205 49 104 -272 58 -65 -110 59 39 -106 151 -176 -24 -300 -344 -162 -183 55 -142 -81 263 -271 189
5857 189 -121 128 36 39 18 -169 10 61 14 403 -48 134 98 74 306 8 126 180 -230 -118 312 -56 148
5880 148 -34 42 -105 -141 77 -69 34 -56 -138 -24 -64 51 100 232 -109 -63 263 31 31 5 153 132 -14 -49
5904 -49 -53 248 71 135 109 -83 -263 76 111 -122 36 -44 -95 -106 179 -8 62 14 -163 17 -32 92 93 -57 70
5929 70 -20 142 148 -43 88 -98 -261 67 49 -306 -239 -60 170 -91 -6 -66 -23 -327 -36 120 87 -63 -287
5952 -287 -234 113 1 -178 158 -70 70 96 192 -63 9 -127 -59 42 153 179 156 279 105 -119 208 286 19
5975 19 92 -168 21 160 52 -427 337 -207 -208 14 -126 39 -83 -121 501 -96 261 226 -76 8 404 323 81
5998 81 -97 60 381 -68 75 -180 81 166 75 30 -199 -314 3 -189 -347 -120 -86 -20 -228 35 -155 72
6020 72 43 -87 -23 77 391 257 60 -109 70 126 62 265 151 277 175 115 -82 181 -154 -95 -316 -85
6042 -85 290 102 -114 52 -282 -1 85 -117 -64 127 95 107 -10 -22 -115 106 -5 83 -55 93 -56 328 -115
6065 -115 285 292 233 53 -144 -1 -32 -33 36 -102 165 98 -93 47 -353 -82 -146 28 -284 65 272 -4 37
6088 37 281 -16 2 172 205 138 246 135 14 124 95 -65 -16 48 42 47 -235 -22 85 -31 -167 -240 -11 -23
6112 -23 -18 -43 -58 -33 -178 30 -117 -71 198 17 29 -145 16 237 19 53 53 215 140 263 2 -233 -64 -76
6136 -76 86 -261 14 -100 180 191 -64 28 -280 -18 26 -74 -20 24 -10 -83 119 294 -35 288 14 -133 26
6159 26 169 -138 320 162 235 -139 88 -143 -18 -47 -60 -122 -196 20 -286 -125 21 -131 -98 61 80 -197 -130
6182 -130 234 -201 330 176 39 131 45 134 -22 -84 125 -217 60 83 -101 -209 -29 -272 -132 13 -33 53
6204 53 -35 -238 36 39 -16 -223 -172 15 4 -66 -36 -251 -164 258 30 -8 -69 -26 -136 16 -35 43 -148 -11 -77
6229 -77 200 171 -242 18 -373 -6 -98 67 -38 -3 -189 103 -160 -176 401 -110 3 -122 -166 -12 10 -207
6251 -207 87 338 59 -143 258 220 109 218 -2 20 -140 -121 -136 -56 -85 -103 -237 -42 -314 -139 106 77 -45
6274 -45 -68 -209 80 0 -72 100 -79 -173 -161 187 96 -25 -32 242 138 93 -4 -1 28 58 38 373 -175 -106 -185 1
6300 1 44 -53 -338 -116 -100 -59 -142 12 -175 -18 -226 -62 40 85 116 74 -99 -24 41 145 93 69 -70 9 55
6325 55 -118 188 107 -85 -83 19 -143 -132 -220 72 141 1 -228 42 -197 35 -178 -175 -71 187 -3 97 243
6348 243 69 -49 31 189 98 0 -108 249 202 354 0 -211 34 -86 57 117 -126 -190 120 -2 -44 -106 -188
6371 -188 -92 -268 -141 -154 -53 -76 170 -59 84 -199 -162 213 -273 107 197 52 -52 -79 -32 16 133 41 -121
6394 -121 75 -24 235 -413 216 -87 -20 -335 -133 -15 -135 -70 67 -163 223 -103 86 177 -149 89 -16
6415 -16 269 1 -7 -244 229 291 131 -8 -5 -163 93 -135 123 31 -154 -57 -172 -5 -77 -37 18 -48 4 -163
6439 -163 41 -205 84 -12 15 -87 -93 132 164 57 -56 -101 -227 202 55 -151 -208 101 187 -196 178 -60 -39
6462 -39 -200 -111 295 -166 -108 -156 -108 7 -171 -92 109 136 115 144 63 219 31 108 99 330 108 7 42 -175 -17
6487 -17 49 136 -49 39 44 14 -178 -64 22 99 -106 -139 -101 -193 -15 94 -49 -99 79 -35 93 234 254 -28 -11
6512 -11 220 -105 17 -125 37 -86 215 -94 126 56 -32 -58 -82 -41 -94 78 -88 -6 52 18 -117 83 -275
6535 -275 42 -32 -10 42 222 116 -155 234 47 -42 -6 13 79 54 133 18 161 -60 103 -47 -278 159 -28
6558 -28 17 -95 -125 -41 -221 -133 -15 44 23 -71 52 -294 -221 -114 83 -150 265 282 209 8 51 12 77 178 48
6583 48 125 147 204 -204 2 -118 -94 18 53 -102 64 -373 -18 7 234 131 -141 -93 286 12 251 -2 96
6606 96 226 96 343 159 -255 -42 133 -53 101 -49 94 194 -360 11 246 56 32 -160 69 -132 44
6627 44 -69 -74 223 -227 -169 -2 -94 88 19 -268 -64 -106 -94 -5 11 31 23 -49 194 6 451 75 19 -204 -145
6652 -145 28 176 90 -334 -217 -279 -218 -113 53 -10 14 -73 -48 -59 -51 -31 130 31 -35 -168 237 187 252 115 84
6677 84 290 -11 -95 41 240 123 52 182 -73 -350 -117 -213 -68 28 41 267 -56 72 -163 -54 207 -19
6699 -19 48 -121 228 188 101 117 88 233 77 -105 338 130 128 153 -102 60 -70 -17 21 102 -58 6 222 131 -145
6724 -145 -114 56 -123 -33 -101 -29 -222 1 -69 -67 116 -117 -138 -180 -19 -4 318 267 11 62 -225 194 52 -105
6748 -105 -185 36 129 -44 44 72 186 -60 -7 -314 -184 92 -161 -102 -41 -368 27 46 -128 156 71 31 319
6771 319 3 0 220 0 54 104 129 -232 208 2 87 -143 55 185 -90 129 -180 111 48 -130 -188 -100 -101 298
6795 298 -55 176 -64 265 159 50 231 168 257 30 -3 34 68 -78 -327 310 177 80 50 -82 -177 -34 -204
6818 -204 -96 -151 -221 24 -11 -23 -356 33 173 -32 135 147 267 26 87 283 -65 221 129 -34 -46 -61 22
6841 22 24 -81 -73 27 -117 266 8 -119 -92 -90 3 -118 -153 -54 87 49 68 -326 28 183 -152 -178 -76 -100 110
6866 110 62 -27 252 47 -71 22 -236 93 -90 -275 130 219 17 22 17 94 -134 167 -7 -200 49 -203 -337
6889 -337 3 -170 8 -131 37 -160 76 62 98 -227 82 -39 -47 7 -220 23 143 -47 218 -128 79 -39
6911 -39 -89 204 199 109 102 60 -187 110 25 0 152 -3 -47 -72 -93 235 44 -19 -4 -154 -32 27 159 -100 94
6936 94 133 146 -52 39 -175 0 -29 -151 -483 -28 -99 -174 -159 -91 -27 -35 -189 -30 -23 -155 -380 20 54 -117 130
6961 130 88 138 -25 -102 170 94 26 459 185 165 131 153 -324 -168 6 87 64 -43 -171 -193 145 -74 91 -248
6985 -248 76 -115 73 -7 -155 110 -6 -184 -40 -188 -164 135 147 -102 263 60 -71 134 159 38 -96
7006 -96 291 -120 -26 -55 96 -58 -162 -17 -21 -134 -167 -299 -258 -225 -79 155 -131 37 50 -118 148 -10 63
7029 63 69 79 68 111 108 -120 195 109 -80 -77 105 -34 -272 -173 24 109 -27 -26 72 88 -63 -105 -150 172 -17 -2 2
7056 2 119 367 -242 118 -69 -22 61 -89 266 -91 99 -117 -5 33 119 -184 57 103 -182 -303 74 -8 -197
7079 -197 -122 18 58 -170 -59 39 -175 39 -74 -191 -208 32 129 10 106 -17 166 222 142 239 -41 -82 190
7102 190 26 -228 26 18 127 42 -100 -89 12 59 -16 -27 -146 -144 -78 225 199 108 -200 114 217 -94 28 207
7126 207 42 172 29 96 132 -146 172 -135 41 -153 102 130 -249 240 -108 68 -232 -205 -238 -270 55 50 47
7149 47 -97 82 -23 -10 144 112 14 54 -48 51 299 -75 256 -28 301 18 -168 94 115 -196 118 -211
7171 -211 22 -77 -7 -128 -134 9 -65 -16 107 -53 197 -171 -314 137 44 141 74 -168 154 30 -76 228 -100
7194 -100 73 -16 70 -21 -99 61 182 43 170 -56 -258 -135 -103 -172 -49 71 -4 -345 -13 -97 57 170 83
7217 83 299 45 -174 87 -44 -63 -47 64 210 239 142 -29 411 -130 185 -65 10 -305 254 27 -50 -54 -106
7240 -106 22 -168 -169 -65 -23 -314 236 47 -160 -116 -62 62 71 62 120 110 212 -136 120 119 63 62 55 -63 39 -362
7266 -362 98 166 -16 -178 -248 -211 -54 188 -45 -91 -134 89 122 -29 27 80 98 -8 251 46 109 208 148 -16
7290 -16 184 -42 -46 136 -291 -97 -93 12 -373 -238 -324 -197 -64 -8 -85 23 -58 -75 -87 -105 -256 -44 8 -133
7314 -133 244 16 -54 112 185 89 283 263 -185 -91 -84 97 -186 52 -101 -112 136 122 -84 0 176 -150 -229 246
7338 246 19 -107 -138 -45 -33 33 84 -269 -210 -85 165 -85 184 171 -220 142 -108 52 29 166 169 72 -35 10
7362 10 219 -181 -36 -35 -152 -41 -59 306 38 7 -38 -77 102 -95 -101 -184 -84 64 -49 20 -226 -191 -24 -196
7386 -196 -34 -2 36 252 82 -8 369 244 -56 113 -177 20 140 -262 -63 67 1 107 -58 -192 -100 224
7408 224 77 -56 10 -124 -103 43 17 -102 192 -37 85 49 54 171 88 -70 172 -156 100 -9 -144 71
7430 71 65 -96 -257 -163 -53 17 -94 210 -164 16 199 57 -21 -59 50 48 -198 172 -84 30 19 -38 -21 38
7454 38 26 334 -101 -55 -22 -34 -32 -93 -97 -50 -31 87 15 -73 -126 156 -143 266 99 97 -30 -87 109 47 152 -191
7480 -191 72 102 320 -183 128 -29 -88 125 89 -126 88 -60 45 -91 108 -82 -148 -107 -134 24 -121 -51
7502 -51 -135 160 -20 -64 -22 -203 -91 50 -54 130 284 247 206 28 182 14 -37 19 88 -83 -83 72 -259 45
7526 45 21 6 -277 -188 -95 -100 20 -16 101 -318 92 115 39 -208 4 -27 181 105 -149 144 -13 226 42 -111
7550 -111 112 18 -114 83 -64 3 123 -197 -60 61 -78 -152 -140 -184 -82 -240 -58 -19 11 -264 -291 -120 -154
7573 -154 90 -174 120 72 -178 99 67 -82 192 54 16 -55 260 -176 -6 -47 21 68 129 -39 -375 -111 112
7596 112 50 -66 -114 29 165 285 96 -11 107 58 303 -126 -80 -213 129 -101 211 -115 -74 197 -118 -277
7618 -277 -169 79 -90 -59 -224 82 -181 -86 117 -21 -37 -143 215 -134 -320 -219 176 -59 -67 113 -122 -53
7640 -53 0 -93 134 51 -83 103 38 16 30 38 -222 -255 -30 -271 -4 -123 237 -186 -58 93 -390 -223 -113
7663 -113 -6 184 73 21 79 -27 -132 38 135 196 -182 -201 -151 60 -32 138 275 31 103 -13 -29 -58 212
7686 212 -36 297 -39 -272 -99 -235 66 -137 -201 79 -135 184 -59 -231 123 -12 175 177 -87 280 149
7707 149 70 -22 64 13 208 -54 19 229 -53 -158 -79 -107 -97 17 -85 -10 -216 -41 156 -227 -17 -204 -50
7730 -50 194 -90 -92 57 -42 -10 -69 33 350 339 107 111 96 152 75 -135 299 -120 -5 42 -26 122 -108 -34 -173
7755 -173 14 -70 2 103 16 89 -61 -41 -109 157 -82 -62 130 -329 250 -139 124 51 221 -94 81 177 31
7778 31 78 13 133 -211 -70 56 -108 -15 44 104 -303 143 -111 66 79 -38 14 -163 -12 -10 223 136 -13 223
7802 223 244 -43 182 73 -62 126 39 76 -13 -66 88 -45 77 21 169 20 -86 -165 -69 -97 15 -169 -104
7825 -104 25 108 206 10 142 -201 -160 -58 52 281 84 93 137 92 -23 -226 -77 87 -152 -95 -72 231 -44
7848 -44 47 34 -70 0 -269 -45 -73 -44 -246 -83 161 -64 -151 -21 -133 110 34 8 75 18 -67 55 146 -100
7872 -100 0 106 -199 -51 -114 -97 -10 160 40 177 62 31 -32 -174 116 -94 -118 -45 -205 86 -117 78
7894 78 12 15 272 -48 11 11 -27 33 18 31 -189 -171 183 166 -36 -60 3 -47 164 -69 -17 -163 -24 -106 -82 -230
7920 -230 -27 -194 -126 247 2 128 19 59 4 117 51 -41 -57 22 73 -16 -15 31 -72 203 -99 -45 -202 6
7944 6 -140 -134 -18 -82 2 -336 -5 27 -6 -149 -122 -111 90 118 -21 59 245 86 31 147 -68 -89 36 166 89
7969 89 113 78 233 54 -217 -124 -30 -34 3 324 -112 -164 -125 206 -76 -74 31 -104 -119 -252 -5 121 1 -10 132
7994 132 314 -118 -57 28 62 77 49 45 120 111 -143 201 -42 267 200 15 97 -137 -83 -22 -308 -224 136 32 19
8019 19 158 18 27 -60 -77 94 -124 -71 -340 48 -57 -247 6 170 43 -2 -252 142 114 -100 75 34 -187
8042 -187 -68 -71 -94 -32 -60 -54 -160 159 27 -29 -115 99 45 68 -172 300 116 204 93 161 137 148 63 -65 88
8067 88 77 85 142 5 -58 96 6 286 96 77 18 86 98 136 124 -2 24 -218 49 -25 -302 28 1 119 38 136
8093 136 -118 -2 -254 -375 -46 82 164 133 381 109 -14 288 -223 -85 308 91 -22 -112 -211 85 -47
8114 -47 19 -1 -12 -221 250 -86 104 69 -84 -160 -41 -159 74 -19 91 120 -144 -129 -9 125 331 -130 -142
8137 -142 -120 -408 -200 -245 -133 -30 -134 -62 -9 20 84 -65 128 98 -132 14 -135 -256 26 220 164 270 -42
8160 -42 -52 2 -210 37 -177 151 -53 -157 -17 158 -69 -70 -80 -86 176 122 50 8 64 -124 -79 -110 109 -127 289
8185 289 -5 -75 -58 -31 61 119
8191A19
##END NTUPLES=NMR FID
##END=
