##TITLE=1H_SL-89-Dau-Beta(f9)
 CDCl3, 8 sc, 
 7.06.2021
##JCAMPDX= 6.0         $$ Bruker NMR JCAMP-DX V2.0
##DATA TYPE= NMR FID
##DATA CLASS= NTUPLES
##ORIGIN= UXNMR, Bruker Analytische Messtechnik GmbH
##OWNER= root
$$ XWIN-NMR		Version 3.5
$$ Mon Jun  7 10:34:06 2021 Russian Standard Time (UT+4h)  she@DPX200
##.OBSERVE FREQUENCY= 200.131506
##.OBSERVE NUCLEUS= ^1H
##.DELAY= (6, 6)
##.ACQUISITION MODE= SIMULTANEOUS
##.ACQUISITION SCHEME= undefined
##.AVERAGES= 8
##.DIGITISER RES= 18
##SPECTROMETER/DATA SYSTEM= spect
##.PULSE SEQUENCE= zg30
##.SOLVENT NAME= DMSO
##.SHIFT REFERENCE= (INTERNAL, DMSO, 0, 15.7039)
##AUDIT TRAIL= $$ (NUMBER, WHEN, WHO, WHERE, WHAT)
$$ ##TITLE= Audit trail, XWIN-NMR		Version 3.5
$$ ##JCAMPDX= 5.01
$$ ##ORIGIN= Bruker BioSpin GmbH
$$ ##OWNER= she
$$ F:/spectra/data/she/nmr/H-F/1/audita.txt
$$ ##AUDIT TRAIL=  $$ (NUMBER, WHEN, WHO, WHERE, WHAT)
(   1,<2021-06-07 10:33:00.76 +0400>,<she>,<DPX200>,
      <created by zg, POWCHK disabled, PULCHK disabled
       configuration hash MD5:
       00 E9 B6 7A A2 85 ED C7 34 08 36 98 17 FE 4E 26
       data hash MD5: 16K
       8F F0 9E E2 A7 1E 61 1E ED 52 D0 7A D9 04 0F F9>)
$$ ##END=
$$ 
$$ hash MD5
$$ 62 D1 DC E2 50 CC A4 9C 80 83 7D 9D F0 78 D6 16
##$RELAX= 
##$RELAX= 
##$RELAX= 
##$RELAX= 
##$RELAX= 
##$RELAX= 
$$ Bruker specific parameters
$$ --------------------------
##$DU= <F:/spectra>
##$EXPNO= 1
##$NAME= <H-F>
##$PROCNO= 1
##$TYPE= <nmr>
##$USER= <she>
##$AMP= (0..31)
100 100 100 100 100 100 100 100 100 100 100 100 100 100 100 100 100 100 
100 100 100 100 100 100 100 100 100 100 100 100 100 100 
##$AQSEQ= 0
##$AQ_mod= 1
##$AUNM= <au_zg>
##$AUTOPOS= <>
##$BF1= 200.13
##$BF2= 200.13
##$BF3= 200.13
##$BF4= 200.13
##$BF5= 200.13
##$BF6= 200.13
##$BF7= 200.13
##$BF8= 200.13
##$BYTORDA= 1
##$CFDGTYP= 0
##$CFRGTYP= 5
##$CHEMSTR= <none>
##$CNST= (0..31)
1 1 145 1 1 1 1 1 1 1 1 1 1 1 1 1 1 1 1 1 1 1 1 1 1 1 1 1 1 1 1 1 
##$CPDPRG= <>
##$CPDPRG1= <>
##$CPDPRG2= <>
##$CPDPRG3= <>
##$CPDPRG4= <mlev>
##$CPDPRG5= <mlev>
##$CPDPRG6= <mlev>
##$CPDPRG7= <mlev>
##$CPDPRG8= <mlev>
##$CPDPRGB= <>
##$CPDPRGT= <>
##$D= (0..31)
0 1.2 0 0 0 0 0 0 0 0.06 0 0.03 0 0 0 0 0.0002 0 0 0 0 0 0 0 0 0 0 0 0 
0 0 0 
##$DATE= 1623047580
##$DBL= (0..7)
120 120 120 120 120 120 120 120 
##$DBP= (0..7)
150 150 150 150 150 150 150 150 
##$DBP07= 0
##$DBPNAM0= <>
##$DBPNAM1= <>
##$DBPNAM2= <>
##$DBPNAM3= <>
##$DBPNAM4= <>
##$DBPNAM5= <>
##$DBPNAM6= <>
##$DBPNAM7= <>
##$DBPOAL= (0..7)
0.5 0.5 0.5 0.5 0.5 0.5 0.5 0.5 
##$DBPOFFS= (0..7)
0 0 0 0 0 0 0 0 
##$DE= 6
##$DECBNUC= <off>
##$DECIM= 32
##$DECNUC= <off>
##$DECSTAT= 4
##$DIGMOD= 1
##$DIGTYP= 9
##$DL= (0..7)
0 120 120 120 120 120 120 120 
##$DP= (0..7)
150 150 150 150 150 150 150 150 
##$DP07= 0
##$DPNAME0= <>
##$DPNAME1= <>
##$DPNAME2= <>
##$DPNAME3= <>
##$DPNAME4= <>
##$DPNAME5= <>
##$DPNAME6= <>
##$DPNAME7= <>
##$DPOAL= (0..7)
0.5 0.5 0.5 0.5 0.5 0.5 0.5 0.5 
##$DPOFFS= (0..7)
0 0 0 0 0 0 0 0 
##$DQDMODE= 0
##$DR= 18
##$DS= 0
##$DSLIST= <SSSSSSSSSSSSSSS>
$$ [...]
##$SUBNAM2= <"">
##$SUBNAM3= <"">
##$SUBNAM4= <"">
##$SUBNAM5= <"">
##$SUBNAM6= <"">
##$SUBNAM7= <"">
##$SUBNAM8= <"">
##$SUBNAM9= <"">
##$SW= 20.0188882624521
##$SWIBOX= (0..15)
0 0 2 0 0 0 0 0 0 0 0 0 0 0 0 0 
##$SW_h= 4006.41025641026
##$TD= 16384
##$TD0= 1
##$TE= 0
##$TE2= 300
##$TE3= 300
##$TEG= 300
##$TL= (0..7)
0 120 120 120 120 120 120 120 
##$TP= (0..7)
150 150 150 150 150 150 150 150 
##$TP07= 0
##$TPNAME0= <>
##$TPNAME1= <>
##$TPNAME2= <>
##$TPNAME3= <>
##$TPNAME4= <>
##$TPNAME5= <>
##$TPNAME6= <>
##$TPNAME7= <>
##$TPOAL= (0..7)
0.5 0.5 0.5 0.5 0.5 0.5 0.5 0.5 
##$TPOFFS= (0..7)
0 0 0 0 0 0 0 0 
##$TUNHIN= 0
##$TUNHOUT= 0
##$TUNXOUT= 0
##$USERA1= <user>
##$USERA2= <user>
##$USERA3= <user>
##$USERA4= <user>
##$USERA5= <user>
##$V9= 5
##$VALIST= <valist>
##$VCLIST= <CCCCCCCCCCCCCCC>
##$VD= 0
##$VDLIST= <DDDDDDDDDDDDDDD>
##$VPLIST= <PPPPPPPPPPPPPPP>
##$VTLIST= <TTTTTTTTTTTTTTT>
##$WBST= 1024
##$WBSW= 4
##$XGAIN= (0..3)
0 0 0 0 
##$XL= 0
##$YL= 0
##$YMAX_a= 153777
##$YMIN_a= -110604
##$ZGOPTNS= <>
##$ZL1= 120
##$ZL2= 120
##$ZL3= 120
##$ZL4= 120
##$ABSF1= 10
##$ABSF2= 0
##$ABSG= 5
##$ABSL= 3
##$ALPHA= 0
##$AQORDER= 0
##$ASSFAC= 0
##$ASSFACI= 0
##$ASSFACX= 0
##$ASSWID= 0
##$AUNMP= <proc_1d>
##$AZFE= 0.1
##$AZFW= 0.1
##$BCFW= 1
##$BC_mod= 2
##$BYTORDP= 1
##$COROFFS= 0
##$CY= 11.3945322036743
##$DATMOD= 1
##$DC= 2
##$DFILT= <>
##$DTYPP= 0
##$F1P= 15.9154993809931
##$F2P= -4.1035820241983
##$FCOR= 0.5
##$FTSIZE= 0
##$FT_mod= 4
##$GAMMA= 1
##$GB= 0.15
##$INTBC= 1
##$INTSCL= 1
##$ISEN= 128
##$LB= 0.24
##$LEV0= 0
##$LPBIN= 0
##$MAXI= 10000
##$MC2= 0
##$MEAN= 0
##$ME_mod= 0
##$MI= 1.114404
##$NCOEF= 0
##$NC_proc= 0
##$NLEV= 6
##$NOISF1= 3.799351
##$NOISF2= 2.8
##$NSP= 1
##$NTH_PI= 0
##$NZP= 0
##$OFFSET= 15.70392
##$PC= 1
##$PHC0= -11126.99
##$PHC1= 16.60101
##$PH_mod= 1
##$PKNL= yes
##$PPARMOD= 0
##$PSCAL= 0
##$PSIGN= 0
##$REVERSE= no
##$SF= 200.130013532006
##$SI= 16384
##$SIGF1= 3
##$SIGF2= 2
##$SINO= 400
##$SIOLD= 16384
##$SREGLST= <1H.CDCl3>
##$SSB= 0
##$STSI= 0
##$STSR= 0
##$SW_p= 3612.71676300578
##$SYMM= 0
##$S_DEV= 0
##$TDeff= 0
##$TDoff= 0
##$TI= <>
##$TILT= no
##$TM1= 0
##$TM2= 0
##$TOPLEV= 0
##$USERP1= <user>
##$USERP2= <user>
##$USERP3= <user>
##$USERP4= <user>
##$USERP5= <user>
##$WDW= 1
##$XDIM= 8192
##$YMAX_p= 0
##$YMIN_p= 0
$$ End of Bruker specific parameters
$$ ---------------------------------
##NTUPLES= NMR FID
##VAR_NAME=  TIME,          FID/REAL,        FID/IMAG
##SYMBOL=    X,             R,               I
##VAR_TYPE=  INDEPENDENT,   DEPENDENT,       DEPENDENT
##VAR_FORM=  AFFN,          ASDF,            ASDF
##VAR_DIM=   8192,          8192,            8192
##UNITS=     SECONDS,       ARBITRARY UNITS, ARBITRARY UNITS
##FACTOR=    0.0002496,     1,               1
##FIRST=     0,             0,               0
##LAST=      2.0444736,     0,               0
##MIN=       0,             -110604,         0
##MAX=       2.0444736,     153777,          0
$$ Real data points
##PAGE= N=1
##DATA TABLE= (X++(R..R)), XYDATA
0@%%%%%%%%%%%%%Qj6J6j6J6k4L2l2M0m8N6o4P2q8J04j20J36j52J74j98K24k55
35a35K86l24L63m04M52n04N60o20O89p64Q43r31J027j129J244j371J510j667J840
54I65k032K249k495K779l108L495l960M530n246O176p438R257j2122J7302k9499
69a9147J07650O5274k49085N2298J21037p6133m8164R0658j8105m4929K4096M597
81A0047j3456L6333j8636m4433K1121K6520j9318R251R053k1927O77K0342p936
94G638l633m749j5914K0209K7749l1691n290M1413l6029n1718P0040M5065p6779
107a3689j8312N4718k2204j9595N0258j2154m7691K7940J0749k9892L4196J8515
119C2839o5256l116O2425r822l1053K2164j573k8899J2715K5240o157j4767m274
$$ y = [0, 0, 0, 0, 0, 0, 0, 0, 0, 0, 0, 0, 0, 0, 8, -8, 8, -8, 8, -16, 16, -16, 24, -24, 32, -32, 40, -48, 56, -64, 72, -80, 94, -104, 120, -135, 151, -173, 190, -214, 238, -266, 294, -326, 363, -401, 442, -489, 538, -591, 653, -718, 792, -875, 965, -1067, 1182, -1313, 1466, -1642, 1853, -2107, 2423, -2823, 3353, -4085, 5172, -6950, 10352, -19147, 88503, 153777, -95308, -43010, 78027, 1894, -46270, 44388, 26283, -18646, 5450, 10047, -3409, 32924, 14288, -30145, -9024, 17496, -1822, 7429, 16482, -5445, -4768, 15574, 7638, 4005, -744, -16658, 3551, 31300, -391, -5681, 35732, -297, -52015, 18025, 63090, -13689, -32001, 22717, 513, -19082, 31176, 19022, -28669, -729, 10020, -19872, 14324, 32839, -32417, -35533, 26892, 17070, -13983, 8181, 6608, -22291, -9576, 15664, 9507, -5260, -9534]
132i534J1217R547r576K291J2007k5639j9531L7516J9509l1163k799J7727j2253
145f81m806J2075j1787p163J6945o446j0894K5476O596l6816p570K6728J395j2517
159i465Q948L698j4799j238J9776R858j7737k0644N719J9260K721j224N900j0373
173D00j4780J1444J4130o251k765l471r109J5618J5141k3952q778K6843r192k6192
187b0914K5546J7967l3945o855K8599n058j3762J0309p29j0337M495K327M8R563
201G254r328j9773J3889K1838r610j1540M381l265m694P160P385J700o977j2415
215a3995P816J9320r441j7377J0194L385j3984J2928J9813j9411j7080J7562N440
228E170j3508N428M787j0076N040R252q207J995R592j7613j0528K5278O957k2059
$$ y = [-9534, 1683, 11230, 1654, 3945, 15952, -9687, -29218, 8298, 27807, -3356, -6155, 11572, -681, -5487, 6588, -5199, -12362, 4583, -1863, -12757, 12719, 19315, -17501, -25071, 1657, 3052, -9465, -517, 3181, -11618, -12856, 6920, 16778, -959, -21603, -15884, 3376, 6097, 4873, 10773, 400, -14380, -2936, 11194, 4943, 2178, -1293, -10402, 5216, 20357, -3595, -12373, 14470, 5278, -20914, 4632, 22599, -11346, -18201, 10398, 5340, -8422, 1887, 1158, -9179, -4684, -2357, -2309, 7254, -2074, -21847, -7958, 13880, 4270, -7270, -2889, -6154, -10848, -3688, 3697, 5397, -1580, -13995, -6179, 13141, 3700, -13677, -3483, -98, -14082, -1154, 18659, -752, -17832, -270, 5170, -8338, -2910, 1877, -8199, -3159, 6093, -2114, -119, 9473, -8140, -18668, 6610, 13567, -8492]
242h492N085J6400j3348q512J7335K273j5992j707R244N842J052m156m890J474
256A608m72j217P212K471j0124m583O552O173K661m857j1423J121J0280j008k860
271A534O207p098j2733J4306J3729j7851q107J8368j694j7424Q657J3420j0741
284E73p729O500K032K844J521j1458l489J3243j111j0627R962N709j6256k157
298a0443J6984n48j3925J201N994m005r84R204N214j2211j3281J0111J4721q687
312f55r861R023K674q929N580Q881q779p655M685J581L517N705q298o370J1747
327B846J880j2695N315J1176j2482p626J6050O325j1801k618M560j200q23L076
341A983J637j182m152j128O487L181n515k418J285j637K745M743k493l400r55
$$ y = [-8492, -3407, 12993, -355, -8867, 8468, 10741, -5251, -6958, 2286, 8128, 9180, 5024, 134, 1608, 1136, -81, 7131, 9602, -522, -5105, 1447, 7620, 10281, 5424, -5999, -4878, 5402, 4394, 1534, 7741, 643, -12090, 2216, 15945, -1906, -10013, 8355, 6661, -10763, -2106, 11314, 573, -7156, -656, 1376, 4220, 5741, -5717, -9206, 4037, 2926, -7701, 2261, 7970, -8286, -10443, 6541, 5993, -7932, -6731, -737, -4742, -5726, 3478, 8692, -3519, -16800, -6689, 8032, -655, -10516, -1493, 1181, -7748, -2168, 6713, -2066, -9721, -5036, -3455, 62, 5767, -2531, -8901, 2846, 4726, -7969, -2654, 8522, -3960, -11586, 4464, 10789, -1012, -3630, 930, -270, -1093, 1983, 3620, 2438, -1714, -2842, 3645, 6826, 1311, -1107, 178, -1459, 1286, 6029, 3536, 136, -819]
356h19l056N413J0190q534j2943Q943Q095r075Q83Q628q463p392J0902M341o989
371A24J90m46m846N077N870m968j850M043m811j638P877m89q204L05N775O71j508
388A172l98P68j185n450P48J0459n19j1812J211R054l188k057N303m731p639O246
404b018N638k366J495j596p284L809Q639n034m444O059k304n855Q931O908j0688
419a10o702Q076M281m096j461K021M97k436j292M653K913n562n314M716M344k652
435A876r36O35j578j005J008K394L428m008q493M948R788n299o055P259Q1r256
451e213M869J0137n996q896L674M844o03N14r87k225p25K02J388K690j867n539
467c733m05O239J950m586l110J535J188k913P75N472j231q568J122Q746k122o542
$$ y = [-819, -3875, 1538, 11728, 3194, -9749, -806, 7289, -1786, -903, 7725, -738, -8130, 2772, 7113, 124, 314, -132, -4978, 99, 5969, 1001, -849, 3194, -1617, -3255, 4622, 4133, -4071, -3766, 2009, 2680, 1172, 774, 1542, 357, -5093, -4345, 6114, 5595, -6217, -5006, 4048, 860, -1197, 4106, -625, -8264, -2018, 3620, 1254, 2749, 1153, -6131, -2322, 6317, 1283, -3161, 2898, 594, -5261, 3670, 10578, -110, -6812, 1264, 5545, 1449, -12, 2009, 2506, 70, -1222, 3431, 6344, 782, -4532, 184, 4528, 1876, 940, 1575, -3, -1008, 0, 2394, 5822, 1814, -6679, -1731, 8057, 2758, -3297, 3962, 4043, -5213, -344, 9793, 3797, -5099, -1425, 3419, 2816, 3330, 2343, 118, -607, -405, 983, 3673, 1806, -3733, -4138, 2101, 4051, -535, -3645, -2110, -922, -3835, -3060, 2412, 1181, -7387, -6265, 2481, 359, -6183]
483f183M078J339o639K971Q459l412o669J824J980k27L622k082n069M139K591
498G22n405L247O515p565p115P456N820m382k144P27p94J57J689K292l99n231
514d410j955P337K950o262j22M121l584q19O867m81n327J011J029l86N265J25
530E359p660K289O346n802j922R509k500j1679N629R847o125m246M054j650l434
545a985L637J348j424J60l829k593Q236K468r385j486M966k58r79K416j421k467
561b596N07J47K784K037o054k166P540j248n938O462L481j0498r18R988j277n704
577c453K859k64l145M252K401m979J112J270m946K073Q315m617p766N035M909
592C056m505K42L804l175k773K727L136Oj432k197J238K742j677J37L105k811
$$ y = [-6183, -2105, -766, -7405, -4434, 4025, 613, -6056, -4232, -2252, -2479, 1143, -939, -6008, -1869, 722, -4683, -1436, 5079, -2486, -9601, -2145, 3675, -707, -2851, -2124, -2918, -2761, -1072, 1220, 821, -4410, -6365, 972, 3922, -2340, -2462, 1659, -1925, -2744, 4123, 3642, -1685, -674, 355, -31, 5234, 5359, -2301, -12, 6334, 532, -1390, 8119, 5619, -6060, -431, 9416, 3291, -955, 3099, 1449, -1985, 1652, 3000, 1576, 1736, -2093, -4686, 3550, 6018, -3367, -4853, 113, -145, -1124, 1292, -129, -2596, -2089, -1942, 842, 2879, -3175, -5341, 2199, 951, -4987, 1475, 4956, -5542, -6460, 3528, 2251, -3453, -594, -858, -4003, 249, 2650, -2329, -1217, 53, -4893, -2820, 5495, 878, -6888, -1853, 3056, -1449, -1207, 2597, -578, -3351, -624, 2512, 2518, 1086, -1111, 127, 2869, 1192, 1329, 4434, 1623]
608A623m270M067L794j617k079j570o42L753J027l800P07J950n024N02P607k768
624C260p648K832M926l517j529L190k7l894L99K632J456j240k540j48J400J130
640F82N23l09q00r52p63J064L808j98o568o31P046K34n296K050K618n495j075
657d062P658n69p050R10L531j034J84Q14j975K9Q02j991J933L986m059l837M438
674b92K034k729Q85Q10j947m59R34K645K492m581n475O802M880p366j050O436
690D019l905m544P306J926n964L37J910k570L063K054n014J56M127m130j228Q454
706E997j810r548L143P284l462k642L292j303k316J947K041O80j035m297N46O359
722D876j351m812K362J555m706J933M842k948l056J844j621J049L883l484l852
$$ y = [1623, -2647, 1420, 5214, 3597, 1518, -52, -694, 3059, 4086, 286, 993, 2943, -2081, -1579, 6028, 3260, -4388, -1556, 3370, -147, -1676, 1514, 1487, -2407, -2008, 624, 2080, 840, -1700, -1848, -448, 682, 1205, 896, 96, -856, -1619, -555, 3253, 3055, -3513, -4144, 2902, 3136, -2160, -110, 2508, -2987, -4062, 3596, 3027, -4023, -3113, 418, -616, -432, 382, -1593, -1564, -762, -2753, -820, 3166, -893, -4730, -292, 1742, -987, -102, 708, -1239, -1698, -764, 1881, 4373, -208, -5683, 1119, 5999, -1367, -2417, 4019, 114, -4430, 2876, 4802, -1162, -825, 1085, -1485, 1578, 3632, -1382, -1226, 2901, -1229, -2457, 5997, 4187, -5361, -2218, 5066, 1604, -1038, 2254, 951, -1365, 582, 2623, 3303, 2268, -2029, -1483, 4876, 3525, -1287, 1075, 2630, -2076, -143, 4699, 1751, -1305, 539, -1082, -33, 3850, 366, -3486]
737c486M682m59m802N251L414q266j889P221L3l701J958k08l239J482K777j94
753E74o81k079j822L672K870l433k638K248J013j290J34K275p6l329j223L164
769f21K993k876k320J860Q28j610J785K159l368k660L006K560j706n12K97r31
785a116o1J279R98R8j413k619J530M652q60l910O4L194q51k066K257K637l969
802a56l258L797L993l294k431K217Mj616J991Q69j882q30m40O83K560j08m341
819b242Q31L643k275j627L510J22m680K15M271N29k975j884J889J214j502k28
835a189K637j258l570J828L170j031j994P0K79K0J174J88n46m69j162m38L325
852A034R56m225p04L852k23l042K740K072l834j863L888J909k625j293P38P66
$$ y = [-3486, 1196, 737, -4065, 1186, 4600, -3666, -5555, 1666, 1699, -2002, -44, -252, -3491, -2009, 768, 574, -107, -2186, -4008, -336, 2534, -899, -3537, -1289, -276, -1566, -1432, 843, 767, -2562, -3785, -621, 2372, -504, -2824, -964, -136, -1746, 39, 2198, -1170, -3830, -824, 1736, 30, -482, -185, -1116, -1177, 102, 1100, 1198, -215, -2834, -1304, 3348, 2488, -1422, -1358, 1836, 985, -1081, 1176, 3813, -156, -3414, 383, 4376, 1082, -1349, 868, 872, -744, 1247, 2116, 234, -596, -1036, -353, 2207, 2099, -2242, -1411, 2232, -43, -1670, 1840, 1962, -2718, -2503, 1768, 2297, -678, -2562, -673, 541, -961, -1189, 1448, 190, -3380, -1552, 1618, 587, -1407, -1337, -1058, -1038, 136, 324, -222, -691, -1853, -2291, 1034, 1990, -2235, -2939, 913, 690, -2352, 388, 2460, -1374, -3237, 651, 2560, -65, -1358, -620, 146]
868A46L5O7N15M17j511n43J428J466n63k017m88J905J003j094J64J093k095j259
886a331L642J225l564m76K087k37r55P99J009j510j176L3K194J136k575j870J576
903GJ296m86m37O9m44j64r28J289K267k307l395K670K893l175p74L382k047l265
921c549L179L096k895k091J428O76Q6j33j56j77j45j343P68K799j020l598J270
938a805K485o34j214P38M8p88q02J120K364j321l437J511L335j865j381K403m68
955B89k834J788K810j774j054M64Q4K87J295j093n26J196j040j295L065J055l471
972g54j402L131J207j930o18J202J40j565K75K667j33l465Q8K522J99j607R41
989H98K68j558L96J332J84o16q18p28J290K084j801j298J867l07j984J896K137
$$ y = [146, 181, 248, 763, 1180, -331, -874, 554, 2020, 1457, -560, -1048, 857, 1860, 766, 930, 2023, -72, -1331, 2311, 3536, -28, -504, 1583, 1346, 391, 1190, 2199, 689, -487, -454, 1740, 2876, 301, -1569, 7, 1303, 817, 380, 449, 5, -159, -1087, 202, 2469, 162, -3233, -563, 2330, -845, -1619, 1763, -284, -3549, -370, 2726, -169, -2260, -832, -156, -70, -203, -359, -536, -681, -2024, -1256, 1543, 523, -3075, -1805, 680, 46, -1168, -430, -382, -1170, -1972, -852, 1512, 191, -3246, -1735, 1600, -265, -1646, 757, 289, -2545, -757, 2053, 279, -775, -311, -227, 60, 1355, 262, -264, 932, -108, -1403, 1662, 2717, -754, -2156, 975, 2182, 252, -366, 836, 976, -589, -314, 2353, 2220, -1245, -1157, 1365, 1564, -43, 898, 1166, -392, 4, 1336, 1520, 904, 86, -642, 648, 2732, 931, -367, 1500, 1193, -791, 1105, 3242]
1006C242k564k111J791J247p23p93n7Q1l98q5P77N41j094j738P83J704k67j360
1024a024l84N32j62P6N10O64n44j858O02K498o84k465J410J166j836N03K287p56
1042E35k586Q71J612l13j07m52l81L33O88p24Q12R52j941j624K780J543j995j124
1060a121J217L89r04Q02Q08o85j446J22K284K13j377q31J635K81j560Q99J384
1077B110j602j538J269J282m37p19p56O07R94p68r83J776p9l720J364L732k211
1094C21k475J704M68j843R97J599j792o64L14N44R63p16j659Q02J323j118l30
1111a562J368J23j707J5J181O27P7j649k68K038j71j428J074R41k166l73K648
1128G68K14k181K86N49k31O40O05j134o9M41n65O31J622j852j156K463oj652J393
$$ y = [3242, 678, -1433, 358, 1605, 882, 89, 32, 113, -285, -370, 407, 948, -146, -1884, -1101, 603, 336, -1024, -1408, -876, -1038, -962, -452, 212, -332, -2190, -1588, 910, 226, -2239, -829, 337, -1499, -996, 1291, 535, -2051, -1180, 432, 119, 12, -440, -821, -488, 200, -524, 288, 1240, -701, -2325, 455, 1998, 3, -1121, 96, 485, -419, 383, 1191, 506, -940, -818, 1466, 1679, 302, -529, 1106, 1387, -173, 726, 2110, 508, -1030, 239, 1521, 1084, 365, -391, 216, 1210, 442, -541, 1235, 1156, -2564, -1200, 2532, 321, -2154, -450, 18, -1825, -828, 771, -1021, -1685, -1371, -827, 136, -580, -2239, -1437, -114, -1232, -1562, -194, -71, -1778, -1763, -582, 45, 122, -1527, -1795, 243, 72, -1356, -282, 659, -1507, -1880, 768, 982, -1199, -913, -364, -595, 45, 650, -484, -553, -112, -677, -46, 1576, -276, -1432, 1031, 1025, -627, 766]
1147G66J214j601o68L92J417R14j903j461K475P31k135O04J955k638j183L211
1163B090J97j855P2l25k08J745P4k591J237J252k554P65K674k119k054K245M65
1180A110j434O47O38n42n64o69L63K278n64k976R16K575j618j157K167j106k063
1197a999K094J205j561J31m57r65J984N27k790Q80K213k669j134M108n00m016
1213b949J885J766j910L73J603j728J3R87j318J369J646l181j033L667q5k272
1229a167J332K35j523R26J288p89J4j91j368J690J277k399j73K536j643j859K650
1246H36J181k665j57J323n96J63P77p19l22Q41o88N1J651j243k277J731J903j466
1264C24n88O45k45k23M25q5K22l38j045P07J442j346p86J322l14j435J152R10
$$ y = [766, 1980, 379, -289, 103, 1520, 2434, 531, -930, 1545, 2276, 141, 745, 2700, 62, -1121, 2090, 2287, 432, 504, 179, -29, 1716, 1790, -801, 436, 1688, -866, -101, 2573, 454, -1600, 645, 1110, -324, 323, 961, 419, -145, -814, -451, 1827, 1263, -1713, -797, 1778, 160, -997, 1170, 64, -1999, 95, 1300, -261, -130, -587, -1552, 432, 959, -1831, -951, 1262, -1407, -2541, 1567, 1067, -2949, -1064, 702, -1208, -835, 768, -960, -947, 40, -1278, 91, 1737, -1444, -2477, 1190, 1105, -1167, 165, 400, -1123, -197, 1091, 302, 316, 125, -1243, 447, 1724, -675, -848, 1688, 45, -1814, 836, 2017, -648, -805, 518, -78, 85, 862, 143, -179, 662, -26, 25, 1676, 433, -1844, -113, 1790, 324, -264, 381, 136, -87, 338, 253, 475, 137, -908, -201, 1241, -105, -891, 431, 117, -1318, -166, 744]
1282G44j072M3m67n64J725M11k454P38J523j723k94K521j048j934M34J377K60
1299B20n46q87N30J159m45j133J822Q0k063M19K056r51j000J008j64p20O48k2
1317A1N54M44j401q74K177Q46k467M40J693j047j276K472q1k146K88J315k3j22
1335H03k80p60J122N47j738Q60J255j746r78J822M97j332L30K2k14Q08l00n60
1353A58R32o61j488J609J365k135r99K404j033j193J451Q02j647l22O24J82L36
1370C85m81r18M51P83q88LJ092p61j259P79R85j14r34K04m7M96m18n6P67n60j103
1391a594M41J519o29q07L0M89LL16p6mj82r19M13J443q5j665M29J099k34n19R68
1412D36k13q55j57P58R40k92j510N98J192o77r34J629J1j506K56J625k82p27l33
$$ y = [744, -328, -285, -752, -1316, 409, 820, -1634, -896, 627, -1096, -1390, 1131, 83, -1851, -1417, -40, 220, -326, -1213, -683, 476, 31, -1102, 720, 800, -1263, -844, 1212, 261, -739, 269, 105, -615, 33, 11, 565, 1009, -392, -1266, 911, 1757, -710, -270, 1423, 376, -900, 1572, 1491, -655, -367, 948, 925, 803, 523, -237, 885, 1432, -306, 554, 1809, 63, -915, 907, 1404, 72, 402, 424, 210, 1018, 718, 158, 1090, 429, -1059, 550, 1915, -220, -1219, 1185, 152, -1041, 410, 1212, -435, -757, -133, 49, 385, -96, -1014, -563, 220, -668, -665, 427, -334, -1593, -814, 171, 57, -877, -673, -720, -224, -642, -698, 69, -491, -1594, -1153, 366, -263, -1070, -1040, -551, -548, -232, -308, -312, -494, -1413, -1000, 443, 358, -1307, -878, 221, -13, -532, 436, 223, -632, -789, -31, 909, 617, -893, -295, 897, 220, -714, 915, 926, -580, -324, 1301, 1019, 292, -41]
1431d1q8N37O43j323L79J165j594p16K335L70k166j07J339l99j35O29p90m1jn11
1451e15O77J293k165p39K104K89j766P48N69r60k40P50K22j62l90o71P93R84j182
1470c61l60J528p98j844J925J372j941o33J538k37m25N63j05q12N15k78L2J273
1488I52o33j599R09J303j169p8O89r08j17Q97R1J86k74j050M52J066k19j110J145
1507E33J79j447J037Q97q89p79O39j79M78L89o21n64J098o97n03J497N8k008M42
1526d40J386l78l83J47m0j70j18O0O66k6j252k51J585Q5j475P01M12j090k9R68
1546C58r7j82n51m94Q85R68j570n26J665o20j200J342Q42j857l42R66L34k30K9
1565b80p19O00n5l93K58J016j324j125J852N03j183q5P46m80n02P31M65l75L2
$$ y = [-41, -129, 408, 1051, -272, 107, 1272, -322, -1038, 1297, 1667, -499, -606, 733, 334, 199, 828, 38, -3, -4, -515, 162, 1455, -710, -1449, 655, 944, -822, -74, 495, -465, -705, 45, 267, 105, -285, -956, -163, 821, -361, -721, 807, 9, -1835, 90, 1462, -479, -1112, 426, 189, -236, 327, 222, -590, -75, -353, -321, 952, 319, -1280, -371, 932, -237, -315, 374, -534, -651, 246, 337, 523, 249, -801, -349, 717, 498, -612, 533, 712, -735, 302, 1199, 310, -469, 170, -9, 469, 858, 237, -327, 771, 74, -429, 1068, 1126, -882, -440, 946, 568, 185, 332, 292, 122, 4, 64, 730, 704, -548, -799, 786, 871, -604, 97, 509, -581, -610, 358, 261, 79, -472, -966, -81, 887, -683, -1209, 456, -164, -1364, -22, 820, -1037, -1379, -413, -79, -309, -280, -999, -399, -454, -847, -589, 427, -897, -2022, -170, 333, -850, -935, -189, -669, -1171, -440, 25, -350, -318]
1584c18q53Q12J061q81r26J222J89j197R83R54j213n78P91L85K01n62m26N10K82
1603D36k17j43P89l1j407P12J045n49m34K37j51j97P35r4q9m8n84J61J295o83
1623G83p88L54M33o09J5O10n0p96k4J29N40K59r87l07Q44k44n80M43J82q64m7
1644g04R50o3k86k20k07K98K54n44J18N08n12p89J082M30q97l5M78j36k01L12
1664a64N0q9J07n93P99O46q53o69P73N43q50K19M01k81m73L14N24N9o48k17O28
1685B26M35q07K9R51n60r49N56J284n98j049J52Q78j62l93K63K59m67n06O65N81
1705G88j14r16J46Q31l44p17O65L28j006k10Q20K17n30n57O24M16o92k57L95K12
1725I9m62l49Q06J42o84q0K59K64j94q1L92m98p41O29Q74l02o50k31N37M63m20
$$ y = [-318, -1171, -359, 702, -179, -1105, 117, 306, -891, 92, 1046, -167, -745, 46, 431, 632, 70, -356, 154, 436, 219, 76, 865, 834, -573, 139, 1184, 635, 201, 438, 287, 90, 825, 731, 642, 594, 10, 171, 1466, 783, -5, 349, 782, 173, 188, 798, 748, -48, -72, 57, 597, 856, -131, -438, 406, 162, -418, 25, 207, -657, -704, 246, 183, -103, -323, -530, -232, 22, -522, -404, 104, -408, -1197, -115, 315, -582, -617, -139, -275, -476, -164, -114, -203, -96, -689, 110, 756, -97, -766, 7, 550, -300, -81, 320, 39, -434, -120, 404, 463, -185, -402, 226, 661, -146, -117, 834, 274, -675, -119, 1165, 567, -482, -330, 548, 386, -7, 256, 515, 48, -458, 207, 788, 674, -242, -96, 735, 391, -326, 339, 667, -339, -549, 271, 488, -42, -599, 25, 441, -251, -508, -113, 99, -363, -712, 94, 236, -448, -528, -269, -5, -199, -280, 112, -386, -1127, -498, 376, 74, -576, -807, -270, 193, -227]
1746b27l55j9M05k78K20P00p68k78M60j18J09l14K48K16k87l32J59Q52L6p91j66
1767e28O91J24j48k21J96J64l37L22K96k33m82M12M32q3o19J54O13l53l13L77
1787D64J26j84n00N09L05m12M8J46J94k22m99P85J12m06o28M01K48j69k34o0O7
1808I1K14k29K99o8n96k00R34N7o03j37L29j68r9j08P7L55n29N1L52N04q74m31
1830g79N87j34n66R91O9o53l22J83O16J51n25j45L20K6l50K75P49n85o76M31L69
1851C2j64k57L18j71J06J6j18P26m10o91L12Q20o6j020N74J37l46N04J13j44m42
1872a71o1M00P4K7n16o8J076m12n04N80J85q57k3Q28k05j18R4j89o7J18j86O18
1894F23j15n17k94R25n6o52QK82j27j40m5L32J73p51J43K83J62p05J1N10l39q4
$$ y = [-227, -582, -601, -196, -474, -254, 446, -322, -600, -140, -258, -149, -463, -215, 1, -286, -618, -459, 393, 429, -362, -528, 163, 287, 139, -82, 114, 278, -59, 263, 559, 326, -156, 256, 688, 605, -14, 140, 753, 400, 87, 464, 590, 406, -94, 415, 720, 308, 356, 502, 696, 474, -25, 760, 872, 466, -162, 239, 487, 318, 84, 24, 91, 305, 76, 375, 307, -289, -489, 445, 502, -101, -238, 91, -77, -176, -284, -207, 148, -381, -330, 22, 526, -348, -779, -192, -326, -892, 99, 168, -485, -807, -624, -8, 143, -382, -527, -207, -181, -531, -256, 493, -92, -768, -337, 32, -132, -389, -71, -242, -136, -120, -238, 488, 78, -613, -301, 519, 453, -567, 7, 144, -202, 302, 415, 271, -171, -232, 168, 242, 269, -247, -315, 761, 349, -155, 425, 610, -247, -270, 558, 353, 235, 329, 140, 73, 191, 5, 623, 508, -9, -303, 622, 566, -86, -78, 204, 77, -63, -108, 224, 397, -354, -211, 72, 234, -471, -460, 50, -289, -373]
1916c73K60K9r1n9m45P33K74p61J87K63o8l73L23J08j31m85N04M27m93m63K31
1937d03N57K6k48l21N87k27o38Q98N78r16k33Q17k18j05J73q2J52m96l8L07P10
1958H80q40l72J109k69l94L08K54n52m25P01L26m46m0m66J62R11o40m96R88j5
1978F84r87N72K38l78j23K83l94J20K55l31l4K01l16L4M44j01p86M67O09o13m5
1999b01L97m57R5j94j5M81Jk72m08O01j65n61P61k26l94J72L73j58r7j27k32L53
2021b73K0k10j56Q95o90k83P93J92j002L98K44j11P7N1j99L42N9p52P24P2k48
2042e7m38Q10p0l65J75L76n28O8L42k17M53m92m11M60N63l99m01R23n64m06L60
2063A82M29m59m07L57J35J68J7o94N65J07n24j09J000k77q72P73J64m09j49N6
$$ y = [-373, -113, -84, -175, -234, -679, 54, 328, -433, -246, 17, -51, -424, -101, 7, -124, -609, -105, 322, -171, -634, -403, 154, 180, -68, -389, 198, -29, -667, 231, 809, -107, -340, 477, 259, 154, 327, 245, 397, -99, -137, 170, 880, 40, -332, 777, 508, 114, 422, 676, 124, -301, 400, 726, 280, 240, -226, -64, 847, 207, -289, 699, 684, -303, 269, 507, 129, 6, 289, -105, 15, 270, -61, -95, 106, -210, -176, 268, 167, -619, -152, 457, -156, -201, 196, -261, -166, -360, -375, 106, 107, -165, -573, 28, -137, -698, 63, -163, -557, -385, -12, -170, -267, -394, -626, -273, -253, -463, -619, 276, -414, -697, 96, 288, -714, -316, -72, -183, -106, -55, -254, 88, 147, -605, 119, 191, -57, -495, 315, 245, -120, 55, 431, -97, -29, 313, 96, 549, 57, -354, 106, 669, 270, -131, 792, 228, -178, 182, 611, 152, -255, 102, 237, 405, 422, -272, 293, 400, -124, -233, 767, 490, -382, 391, 555, 146, -3, 53]
2083E3k68L48P8OJ58j84p72K40P40l3o91M25Q8p07K76M15p2j94J31n50N31M02
2105D20q33K74K47o65J07Q00k71o96O73J35k26j29L49l96J50l7j89J19L72m34
2125b30k64Q99l22o99M87K72m25L11K67P6J6m61m14P05L85o57j29M93k87o3K48
2146B08L34n15n7L48k02M01L0p98M44N57p51q3N64l89l73L59L11m91j00L68l00
2167a35j52M20j03L00n17k96M13L42k65o43L99M11o22K66K01k28j59K53J58l10
2187b67J51n39M03L94m61o1M19l24m58L96J68J71j95k95L11J04L1k24M21j17k46
2208b18m21P32M3l46k6M65j64lq8N2N5k27R1L62R4o89M50J10j56J16K20j91k0
2231B41mk5J91r8m35M17k4J5j13L7J98r0m10O75j39m89j00K98L56k99K3k6Q2K9
$$ y = [53, -215, 133, 211, 217, 375, 191, -581, -341, 399, 366, -325, 100, 188, -519, -243, 172, 100, -94, 37, -513, 18, 420, -413, -139, 108, -557, -450, 350, 79, -617, 56, 191, -35, -164, 185, -211, -61, -98, -287, -168, 204, -230, -494, 405, 83, -616, -129, 143, -282, 29, 296, 372, 388, -73, -487, 218, 603, -54, -183, 310, 23, -40, 208, 542, 27, -30, 318, 116, 517, 547, -251, 193, 750, -1, -84, 480, 91, -282, 77, 388, -103, -203, 165, -135, -287, 133, 30, 330, -187, -483, -70, 272, 7, -636, -237, 174, -448, -182, 19, -209, -368, -115, 43, -267, -116, -655, -252, 142, -319, -380, 39, -285, -743, -347, -179, -8, -203, -498, -187, -83, -52, -276, 145, 28, -218, -639, 93, 136, -210, -236, 229, 65, 62, -26, 26, 81, -146, -55, 307, 401, -288, 162, 272, 116, 232, 452, 261, 241, 237, 212, 403, 305, -130, 287, 263, 278, 165, 202, 400, 310, -100, 575, 436, -53, -153, 145, 501, 202, 225, 199, 281, 310]
2255C10r7K5J40m78j91L12Q6j03j87J96l2P0l2mK12l21m03O06o1j68o3K26p4p29
2279g60M65K98q4k55l17N74R9j55mrQk69K01K61j69j92m16N85n7oK98j9l77K15
2303h5MM46n11j81j87N49r9k63M63j23k14j72P02J8n72l3M41R4J42m29j31L61
2325B20L2l45K71L5k69k95M62J62l60j50M97k78J3Q9%K36k06m13L37J63j97k7
2347b3j16J3k10L68K02j68j73m4L28l67l0j9R6J26k88k24N77j65k14J11K16q1
2369h5j10M2J43m82J54J71K16M5l98l4N70k12m19K50J43l86rO93l27j66LM51k71
2392a8O2j89Q1L22j36j23L39N1l13j57L16Q8l21N5K5L8P6k12K04j19J70m28N35
2415C46K29k06n02R7L28O9J4p4k52K90m05L0M11j92l26M68L73j089M23M00l71
$$ y = [310, 213, 238, 378, -100, -291, 21, 107, 4, -183, 13, -19, 51, 19, 15, 227, -94, -497, 109, 48, -120, -183, 43, -31, -760, -295, 3, -81, -336, -653, -79, 20, -135, -139, -148, -140, -409, -208, 53, -116, -308, -724, -139, -196, -202, 96, 77, -300, -85, -81, 365, -146, -327, -514, 35, -64, -327, 136, 13, -201, -373, 329, 347, -225, -258, 183, 277, 419, -10, -141, 220, 252, -93, 178, 213, -56, -351, 111, 273, -87, -237, 260, -18, -5, 84, 84, 320, 114, -299, 38, 201, 4, -23, -139, -126, -336, 32, 234, 66, -107, -151, 177, -190, -220, -239, -143, -17, -305, -529, 48, -117, -331, -220, -4, -85, -195, -153, -10, -492, -338, -167, 49, 94, -304, -338, 232, 20, -399, -149, -6, -392, -401, 292, -35, -201, -198, 253, -18, 44, -145, -64, 258, 122, -1, 338, 389, 76, -81, 235, 323, 2, 57, 82, 120, 196, -16, 188, 69, 239, -189, 346, 575, 369, -133, -36, 292, 361, 375, 301, 49, 339, -66, -36, 375, 183, -143, 325, 698, -391, 32, 432, 61]
2436F1k28P9J28L45l65nJ7K2o6m2J41l0m53N24p7l38l35N25n2q7m4q9L09k7m63
2461e50L23L27k88l45P2L28j88n5K78J23k49J21n9r3J69l6k7lJ44k33L25J55n02
2484b63j23O53k91j83L68k21J67j09k8Q4m3j63k08M25J51l42J75J71l46K57K81
2505D12j52o5J28l01j52O11m89k05N06k3m67L33L16k93l25L86l7m5j01o9l7N73
2527E04o10o2L69J9m50L52K90l76M4j77j7O1J1k13K96Qo1o1L50l55l57L02M07
2550B74p32L44J96m12L07j04j66N46k33l23L72M8k16k9K49l6l61K44N15n91M8
2571f0k2Q5J46P6k46O1L01m33m5N40k33m34M38K21m35J59j82K57k54K58j00J27
2593B25K8m18k3O00j88m18J78J47K2j97K08n8j29J44k26K46M3o4p0J36j82j05
$$ y = [61, -167, -88, 40, 385, 20, 15, 32, 54, -12, -54, 87, 57, -396, 128, 51, -287, -622, -97, -149, -236, -280, -369, -60, -87, -550, -227, 100, -188, -533, -461, -133, -321, -376, -98, 25, -224, -103, -162, -255, -86, -122, -149, -152, -8, -241, 84, 239, -263, -386, 267, -24, -207, 161, -60, 107, -2, -30, 54, 11, -152, -360, 65, 216, -126, 49, 220, -126, 131, 412, 260, 195, 323, 22, -130, 481, -8, -213, 293, 270, -197, 136, 452, 159, -166, 220, 183, 138, 37, -32, -69, 504, -106, -168, 201, 220, -230, 122, 412, 36, 80, -97, -114, -53, -42, -255, 41, 49, -12, -73, 277, -78, -435, -133, 274, -458, -114, 82, -330, -23, -127, -293, 253, 20, -303, 69, 117, -99, -128, 121, 85, -276, -32, 483, -108, -60, -82, 3, 149, 225, -21, 40, 341, -92, -137, 403, 170, -264, 174, 395, -40, 119, -63, 194, -60, 198, 98, 225, 253, -165, -188, 412, 224, -194, -16, 131, 153, -44, 164, 106, -23, 121, -105, 141, 184, 120, 50, 186, 4, -101]
2615a01J60O6j32l0J64l61J1M70l02m2J77m55L21J01k03J12L32n13j46K49P7j09
2637a54mJ57l5P2l39m8K32L43l46k35K18k3j51J49N9q3K1J22k81K83kk88L30P6
2661G3j64kM25l25k21M01j74j40J31k2l1L0j04P5L6P4j34L6M65k60j50N4K21l79
2685h5K09K2k4J97j54O6j40L11m25n9N92l89q5L02j31j40M5Q7O0m9k28J50K34
2708C66k50k37J30M88m79k32L97q4l4j0K14l43J59l2k57J65L2m03n5N97k27k5
2730a20J03r8J03J57j92J20k50J31j90J20J50k18K30j37m19N85K15m31j80N01
2750A80l02l33O23l38K3K02J84m71J02K14m9n5K71k83K8Q4J9k29J08pj09M75j24
2773B13l62K86K47l60J10K65n40L05K1r8K17K8l00o1K70k46j52L10p2p9J66O6
$$ y = [-101, 59, 125, -7, -37, 127, -234, -223, 247, -55, -97, 80, -375, -54, 47, -156, -44, 288, -225, -371, -122, -45, -154, -158, -1, -36, 36, -303, -351, -119, 224, -122, -357, -139, -162, -313, -164, -105, -188, -167, -45, -326, -43, -45, -333, -3, 73, -91, -93, 332, 7, -214, 187, 13, -127, 4, -18, -49, -19, -123, -48, -12, 62, -72, -36, 429, 169, 19, 73, 294, -85, 124, 146, 122, 319, 165, 231, 91, 402, -23, -82, 510, 121, 36, 338, 207, 67, 112, 199, 259, 210, -18, 132, 366, 116, -121, 9, 497, 18, -214, 183, 99, 65, 55, 269, -74, 85, 53, -204, -39, -7, -410, -465, 132, -95, -120, -17, -115, -12, 145, -47, 73, -177, -46, -236, -116, 34, -184, 46, -91, -510, 75, 290, -141, -321, 180, -122, -455, 168, -170, -147, 55, 239, -232, -130, 84, 35, -20, 251, -32, -4, 80, 99, -130, -22, -29, -138, 337, 213, -149, 137, 384, 24, 134, 399, -141, 164, 185, 87, 304, 332, 32, -29, 241, -5, -157, 153, 81, 2, 168, 234]
2795B34m44r8L99j61K8O8j5J10r3j53q8L78k52J0K46q4k44K8L52q8m27K31ql73
2819d44K22K09K2o6k51k70N47j4j07O2j22K26j37J8Ok8M8J58k60J51j63Q3J06
2842dK8j12r0J39N5j80N19m66P6J00r1J73l0p5K04n4p8l33L43K79m44j8K26j09
2866E8J28M7p5n8K45j21n6L7Q4l76K15k0r5K5J62j05j57J76m4R4r3l60K84K05
2890B00o8k51K00J60n94K03J44j01J65k7r4kQ3k40QM85n17k1J89J37l15J35Q7
2913c4j70OK25j52j99L6j33M51K21n24m0K95J71l72q4M90l97K24j41P9r0j36J36
2936a38Q1J31r2k32K86k44K3L41J65l93j07N34m12J30k98M84k53k24K5K45n3j92
2958a93J68J30J09j13q4K03k3k78k03L39J30j19k55J93j56L37l56J78J93l01J92
$$ y = [234, -210, -308, 91, -70, -42, 26, 11, 121, 28, -125, -213, 165, -87, -77, 169, 85, -159, -131, 221, 133, -294, -63, -71, -444, -222, -13, 9, -57, -308, -578, -31, -45, -152, -90, -212, 14, -123, -105, -99, -127, -79, 79, -181, -30, -193, -110, -4, 24, -88, -178, -39, 16, -164, 355, -111, -35, 65, -26, 147, 117, 42, 246, 192, 114, -219, 124, 403, -41, -59, 167, 58, 186, 233, 158, 100, 345, 224, 168, 205, 289, -87, 128, 108, 13, 38, 200, 95, -62, 114, 70, 164, 71, -289, -5, 200, 132, -119, 81, 241, -353, -150, -6, -107, 58, 31, -63, -65, 18, -222, -214, 271, -246, -267, -78, 59, -256, -121, -34, -204, -198, 27, -125, -324, -288, -421, 30, 251, -273, -313, -18, 153, -219, -303, 187, -210, 14, -127, -48, -138, -274, -138, -57, 74, -18, -250, 36, -208, -185, 156, 321, -72, -179, 355, -57, 73, -225, 259, 6, -218, -193, 52, -1, -193, -25, 105, 214, 101, 17, 220, 197, -81, -284, 55, 185, 66, -189, 4, -152, 185, -171, 7, 200, -101, 91]
2979I1K03l30K04L5j0l05K53j54Q3m7Q5j28J50o6k23R5J77l55L20r4J36J07m31
3002b04P6J28k02J4J34J19O9j03omk60p9K95J91r4j31j50K03J3j07K41J4p1k42
3026a56K74K0J26k3o7k24O8l9J11M1n2j00O2J98j62q0M0J18j11O3j03M19l83l2
3050HNn0K79N2l62p9K55Ll5R1m44K24J2J86k28Q2J14J40r3n46M33L1j60J16J07
3075A41n8k54J61K44l44Q2K2j70J22k06j37L16k6m26M98k56K28j71J48K7Q9j44
3097a14J83K9j40j37J00J57l18q6M24j07j36J6LJ62N5j56k23M53l15p3J52K30
3119A59m45N63k50o0L2l1L8oK77l77M83m00m4j29L22r3j12K1J06N0j11Q7k63L32
3143A49j28k07O9P8O3%K8J15k47K33l7j68J43Q8J18j57k35O3r4K73j35K1R2m9
$$ y = [91, 294, -36, 168, 203, 193, -112, 141, -13, 70, 23, 108, -20, 130, 64, -159, -64, 113, -242, 78, -16, 120, 227, -204, -128, 0, -202, -188, -54, 65, 134, 31, 25, 21, -239, -318, -23, 168, 74, -57, -207, -4, 9, -98, 143, 157, 86, -156, 118, 138, 264, 241, 174, -50, 18, -21, 90, 131, 79, -21, 41, 239, 77, -3, 37, 155, 44, 107, 4, 423, 40, 8, 13, -37, 242, 294, -68, -147, 108, 111, 76, 167, -277, -53, -41, 145, -83, -1, 113, 253, 160, -386, 47, 78, -82, 34, 141, 83, -171, -10, 234, -110, -28, -6, -176, -54, -260, -397, -81, -107, -533, -35, -291, -63, -234, -86, -59, 30, -114, 69, 98, -42, -179, -79, 78, -240, -326, 98, -9, -145, -129, -126, 36, 91, -65, -288, 165, -150, -223, -71, 159, -286, 277, 27, -33, -1, -32, 6, 0, 277, -100, 383, -17, -61, -190, 132, 39, -73, -52, 54, 104, -7, 80, -183, 149, 21, -186, -117, -39, 24, 24, 52, 167, -80, 153, 116, -52, 91, 179, 297, 140, -95, -32, -126, 147, 12, 33, 125, 76]
3167G6j92K88l42P1j06J63l5l1J14n3J2j22R1k52M88N5m30q8J59J43j44J76rk53
3191b21J40m8OL26k89K48j16n9j86L26r1k19K26k21K84j68p1J34M8J17K3j82N1
3214E8k02J07J82p0j26n2J34k97L10j82K00n1K8p7k1J61k58J4Q3L21m38M22j74
3237G2J33j44J39Qq6L2m27Q6M12l73K62o9r7O0Nj10j93L48j38K30j41N2k31m4
3261b14R1l9P4o1n4J77K1j79Q3L03l31j49L62j90n2L2p7J72J72r4k23p5K75j32
3285a08k22L58j07Q7J28q4j18K60l12R0J59J13m32J45O6jl51N85j60J41l06Qj67
3308b28M36j05j34J84l73K24K4j0K5J06k42J91N9j3q5J25j00N8p1o1P1k24K71
3331A28Q1j74Nl1j00m6L20j62l7r6L08j65J1k2r5K85m7j79j95J57q0M8J03J57
$$ y = [76, -116, 172, -170, -99, -205, -42, -77, -108, 6, -47, -35, -157, -66, -318, 170, 225, -205, -293, -134, 9, -135, 41, 32, -221, -81, -129, -123, 203, -86, 162, 46, -13, -199, 127, 36, -183, 43, -178, 106, -62, -133, 1, 49, 166, 189, 7, 58, -144, -37, 145, 75, -51, -103, 31, -266, 44, -138, 62, 11, 39, -38, -59, 102, -156, -142, -59, 262, -176, 246, 72, 205, 61, 200, 208, 122, 154, -273, -187, 225, -148, 114, 45, -52, 8, 13, -97, -290, 58, -80, 150, 9, 61, -170, -214, -123, -162, -88, -149, -203, -26, -5, -184, -101, 202, -129, -278, 84, -106, -158, -126, -203, -31, 141, 47, -176, -251, 24, -108, -330, 28, -79, 8, 136, 52, -66, 194, -118, -28, 131, 244, -188, -43, 23, 22, -329, 256, 96, 237, -69, -61, -228, 208, 103, -31, 153, -220, 4, 28, 18, 43, 149, -93, 98, 157, 144, 59, 184, 84, 142, 71, 10, 81, -143, 128, 209, 35, 40, 9, -91, -137, 183, 21, -16, -112, 196, 31, 42, 20, -75, 210, 163, -16, -211, -54, -134, -86, 17, 174]
3355A74k73K01k20L0j1%m1N1J59l19J31Q2OJ01M5k69PK56m16K81j39J51k44R2
3379a65l0p2L22L0rj11R8j13R1j13J64n6K94k46j81J93o3n8P7N2k33J10K04k82
3403i7J43j32R1n5J8J2O2k57L31p6m8q1j2M6K66k91O2p4J73j07m05K44K98j39
3427b8J58j05m6l5J25j28j08K50n39M62k28J68K32m16K86r7L00l93J20m6j40L66
3449A58k67J82k26J91n2j04j0n0J97k11m6L01J06l76K2M6J80j65K54R3J14m31
3471i4J81j56O8j19M2o2O03j43m16k5L80l01L70k33Qk32ML66k27J38L1m2k9k9
3495H3j94K71l11Q8q9R2J51K5r2N6j10J80k05O3MJ19q2R2j41J54k77L35k62M1
3519ij15K13j22J07j91K8R8L6nl4p0P0q0K00j39R9k67Q7KK08k30n5K14Q6l44P5
$$ y = [174, -99, 102, -118, -88, -99, -99, -140, -89, 70, -249, -118, -36, -30, 71, 116, -153, -146, 110, -306, -25, -164, -13, -257, -165, -195, -267, 55, 85, 76, -35, 63, -50, 41, -72, 92, 36, 330, 84, -97, 96, 33, -25, 52, 104, -129, -19, 185, -97, 46, -86, 5, -50, -32, -20, 42, -215, 116, 40, -8, -89, -101, -55, 211, -80, -18, -92, 81, -26, -431, -187, 111, -28, 130, 25, -21, -56, 69, -59, -167, 83, -456, 6, -222, -54, 178, -238, 48, -49, 251, -142, -22, -68, -208, 158, -109, 73, -153, 38, -14, -118, -128, -178, 19, -192, -238, 63, 169, -207, -185, -139, 41, -124, 130, 223, 337, -94, 87, -69, -1, -120, -78, -140, 463, 320, -96, -121, 259, -42, 328, 95, 103, -129, -125, 241, 14, 152, 183, 141, 112, 83, -111, 160, -151, -63, -152, -60, 91, 116, 24, 80, -30, 150, -55, 8, 12, 131, 49, 141, 0, 154, -123, 212, -50, -9, -124, 89, -33, 74, -117, -89, 9, 45, 40, 6, -64, 6, -74, 126, -13, 86, -181, -94, -92, 116, -114, -169, 45, 131, -213, -138]
3545a38K23l02J41J14l07M22j0l14j29J68K9K3K11j47j10K55j40n6K09J75l74
3566e7R4K65k95J12j76M4J80j05k62P9j71K84L5J04K18m82M0J39J96k91J38J8
3588A07l37L28M5O4r2J59m24K09N2q5p3J59j70K0j5J72j13k25K60j2O9j2j12l2
3612e8L62j19k24J38k17J35K8K9o6k09J88jjR8k58j16J53M5j4K47M9j62Kk01M
3637a68J30J65j7l03K94l36L43l56J90r3j10K21q2L39k59J14p6r3M36j23n47J90
3659a41K09j78J53P3J7k83j26M34n3j92J00k6k5p1K64L8j6j26j93M38m56Q7J26
3682E3j87J11P9R3q5k02K64N2k87K1R5p0j36L66j15q8J09k65N8K39k03J9M4Oj26
3707a55Q9J09J12k34J33l20m7J36o0L07k79K05m82N39L1Q3m77J66R1j47J34j36
$$ y = [-138, 85, -217, -76, 38, -269, 153, 143, -171, -300, -132, -103, -80, 131, -16, -126, 129, -11, -67, 142, 317, -57, 37, 302, 7, 119, -57, -13, 167, 62, -200, -121, -292, -8, 27, 131, 349, -133, -93, 46, 242, -49, 89, 107, -230, 98, 143, 207, 115, 274, -150, 59, 111, 26, -47, 112, -58, -38, -53, 119, 6, -219, 41, 29, 98, 86, -26, -58, 304, 185, -39, 99, -118, 17, 45, 74, 8, -201, -13, -14, -15, 83, -175, -291, -138, -93, -107, 140, 189, 27, 29, -172, -168, -38, 127, 110, -193, 101, -235, 108, -248, -58, -151, -261, -40, -122, 217, -42, 72, -4, -97, 339, 216, -331, -141, 68, -110, 43, 116, 133, -150, -276, 158, 105, -87, 13, -13, -38, -109, 155, 193, 177, 51, -142, 296, -160, -73, 53, -134, -23, 56, 149, 64, -138, 126, 178, -109, -88, 7, -63, -199, 167, 52, -36, 73, -192, -134, 105, -98, -79, -35, -29, -155, -66, 43, 155, -79, 54, -266, -313, -177, -237, 70, -209, -4, -486, 53, 84, 167, -310, -144, -53, -200, -66, -202]
3729b02K38r9J63r8j29j59J89j10J12L4k84K27j3O7j43M49k98K06j83N5J24k12
3751f6J23k39M35m31J66N3J85k07J29Ok3J17q7p0j90O5J00l7O0Mj57J79K27n03
3775a61J90L5K19l21O2p9m5J04k7J7Q9o8n7J04Ol3j54N6K18j21p7j28M47l87j25
3800b36K04l3N4k8j29q2K48J72l62j03L60k45M5K54P2m99J67P9J7m8J30j31P6
3823a8q2L6R2o2J41k04j76J81QM4N7J31n0j34L0k18J30R3j30j4L59j19k1l85M25
3848A14k8l07OL7N3J23n4K87m16J09M6J52k35J33k81L57MN0MO0j23j28j32J87
3872A8n3q3K90j66J18%k55L74k76o8Q4J34o9l18K48j96L18J80j67j21j04N8l9
3895i3k26J85M7j67J23J85j25j78M58k03j08J64j41Q2K60k24j39K86lk19J66k84
$$ y = [-202, 36, -63, 100, 2, -127, -286, -97, -207, -95, -61, -345, -118, -131, -64, -207, 242, -56, 150, -33, 22, 146, -66, 57, -182, 253, -178, -12, 41, 226, 19, 148, 154, 131, 248, 161, 91, -99, -34, 66, 29, 89, 93, -64, 115, 342, -161, 29, 64, 283, -38, 24, -55, -100, 4, -23, -6, 83, 15, -42, 62, 68, 35, -119, -63, 155, 34, -43, -171, 276, -111, -236, -32, -65, -11, -39, -168, -250, -2, 170, -192, -295, 65, -180, -135, 119, 191, -308, -141, -62, -45, -93, 37, -94, -18, -100, -64, 28, -34, 107, -97, -273, -92, -84, -40, 17, 148, 98, -36, -6, -224, -94, -1, -131, -145, 214, 95, 74, -311, 114, 86, -221, -215, -178, -125, -2, -56, 231, -185, -76, -30, 122, -113, 20, -261, 96, 100, 150, 154, 214, 91, -37, -169, 18, -35, -118, 172, 6, 124, 124, -131, 243, -33, -101, -17, 117, 48, -270, -22, -218, 100, 280, 113, -8, -112, -54, -93, -319, -134, -87, -254, -131, 54, -71, -249, 209, 6, -102, 62, -79, 3, 263, 39, -100, 186, 183, -36, 130, -154]
3917a54J90j49K4p2o4M03p6j58j2k5r3L03j6j90J20Q5r2K6J37k20Q3r7q2P6J82
3942A29N3j6k93K68j64k9K48k98K24k35K69O7j64o2m0J39j55J62o6k1JN5Nq9p0
3967h2J40L5p9P9m6M7j41n8L65k10r6o2K74r9k4j43J49oj01K8q3J0O4q3K51l39
3993b10p2J01J08M8L90m34P9k70N5L32j26k61K16Q7J05j23j08m7M6j38J04K25
4015A07rj67J56K1j63J36KJ41l37J64k14l2P6O9J88j59R4L9J42k57k10L33j01
4038A9j5J21m1O2q8l2k04J07K85m0j80j69J91R7nk12L0k3Q0Q0r0J36j51K87j53
4063I2r7q2J87k32J37J55j64K6m69O62l34L3L11k39J59j08j17m6J89k0k31J56
4085c2K94m78L7K55O2k86J19J8o7J27n8j96J6L00k07J22J79k02j6L31k58K3L48
$$ y = [-154, 36, -113, -89, -161, -225, 178, 102, -56, -68, -93, -186, 117, 101, -89, 31, 116, 24, 50, 187, -33, 50, -47, -129, -53, 129, 182, 166, -127, 141, -23, -52, 196, -102, 122, -113, 156, 223, 59, -3, -43, 96, -59, 103, 37, 16, 17, 72, 77, -12, -82, 58, 93, 14, 93, 47, 94, -47, -105, 260, 50, -46, -108, 166, 67, 43, -100, 49, 43, -58, -30, -113, -103, -39, -122, 129, -210, -282, -181, -73, -25, 365, -69, 10, -260, -205, 127, 1, -260, -44, 43, 148, 25, -83, -130, -84, -222, -118, 107, 98, -69, 87, 108, -55, 81, 83, 224, -113, 51, -163, -195, -119, -50, 138, -21, 73, 112, 254, -3, -213, 120, 19, 4, 125, 84, 146, 58, 26, -178, -71, 214, 174, -6, -175, 16, 113, 108, -104, -74, -97, -17, 63, -27, 109, -42, 245, 92, -5, -87, 100, -132, 5, 160, -4, 22, -447, 215, -119, -86, 225, -14, 145, 37, -80, -126, 63, 43, -188, -32, 262, -216, -179, 76, 138, -148, -29, -11, -78, 49, -9, -205, -189, 111, -96, 26, 205, 3, -13, 318, 60, 83, 431]
4108D31n22K44j58q0j17J92J99j31N1j13j5J27k06K73k14J99j14o1K32l68K12
4129F1q3J49k3r4j12K51K66k00j96N4q6l7l6J65K7l8k01R2o2o7K42pJ16R8l19
4154d0L56l38J61k20J13j05q4J13J48l8J22k30j46L08j47J40k85L7J86J26m09
4175b32j1L3L44k33O8mJO4o4J57k64J13pJ41N4j99RR5j93J44K6l40L28J34m36
4200b72L90p6k96K65q2J6M17l11R1k83J45J20k6l29J15O2J14J22m72L13Q2k33
4222a28N8J27j24R1K09j53J48l39Q5J90J63m91k2M17k27J07lK35l79J81l63L42
4244A24m35L46K4N8j36J13J18l69p1J05J48K34j88j09J61Q0k45J04Q3p5R1n8p3
4267C0j51R1O0L0Q1l20J13p0J47qM2r8m5J30m7J93L1k46l7J88M7O0k71K17j98
$$ y = [431, -91, 153, -5, -85, -202, -10, 189, 58, 109, -4, -19, 108, -98, 175, -39, 160, 46, -15, 217, -151, 61, -22, 127, 104, 10, -102, 149, 415, 215, 19, 73, -13, -50, -86, 79, 106, 68, -133, -41, -103, -170, 72, 65, 181, 279, -40, 316, -22, 139, -81, 32, -73, -157, -44, 104, 66, 188, -42, -188, 120, -27, 113, -172, -135, 51, 177, -232, -243, -210, 134, -99, -31, -35, -34, 30, -34, 123, -141, -28, -35, 106, 160, -39, -30, 65, -128, 16, 42, -298, 30, 164, -272, 118, 42, -254, 11, -71, -55, 362, 51, 142, -141, 4, 124, 98, -231, -116, -54, 60, 182, -290, 23, 105, -128, -70, 57, -67, 24, 233, 80, 228, -111, -26, 164, 327, -164, -186, 231, 4, 111, 108, 343, -36, 145, -218, 124, -311, 35, 59, 117, -19, 94, 212, -157, -228, -123, 25, 259, 71, -38, 123, 203, -42, 62, 145, 70, 161, 103, 30, -121, -30, 30, 60, 141, -179, -66, -136, 11, 3, 45, -53, -98, 32, -15, 178, 209, -37, -74, 114, 161, 221, -50, 167, -31]
4292c1J52k81J72K5J01j67J48k31Q7l9J14k2l6L2M9j7k17L30k15N5l7Q6j24M3
4316b3R0j59K30j32L5n2J27j39J16k33K18N6r1L9r9j10jL99m15j75K91N18l08
4339A82j82j02j9J80pk41J57j9l07K47rJ55j4k94N4M59j19m37L61K25m04Q6J46
4362I8l34o2Q7j6K14j3M1l35J27J81P9j81K20P2k95O3m4J05l3J11o1j41Q2K20
4386A85k00J70j64j09M89m80L5J15j52K28jk31K64k46L05P7p6j85R8k11P2O8K
4409E3q5J99j4k71L72rl96J90q5N2P9k86J72Rj17K15m5j58J62j08K17j13r3p3
4433a33J22j23K87k30K31j47m4P5j73L40k35O0J13lj38M2J02l50L65j65n8Nj32
4456a89K64j40j20J63J6n5J99j11j3J26l27J46J83l40K76j19M5k79K59K08j9m4
$$ y = [-31, 121, -160, 12, 37, 138, -29, 119, -112, -25, -64, 50, 28, -8, 24, 73, 56, -161, 169, -46, 9, -28, 58, -66, -23, 67, -92, 138, 6, 41, -11, 116, -23, 93, -140, 78, 134, 43, 82, -17, -127, -128, 271, -144, -319, -28, 490, 182, 0, -102, -121, 59, 52, -189, -32, -51, -358, -111, -120, 35, 21, -273, -219, 240, 121, -316, 45, 270, -134, -48, 98, -236, -298, -211, -227, -13, -26, 15, -320, -193, -12, 67, -114, 106, 178, -117, -54, -98, 7, -26, 85, 24, -117, -35, 185, -15, 155, -9, -118, 371, -109, -74, 41, -111, 117, 116, -115, 149, -97, 208, 285, 209, 24, 122, -89, -17, 51, 53, -32, 167, 153, -118, 254, 245, -151, 39, -46, 6, 85, -201, -29, -20, -137, 78, 33, -125, 37, -71, 146, 33, -60, -133, -11, -134, 153, -77, 154, 7, -37, 38, -135, 205, -30, 30, 143, 140, 2, 44, 146, -204, 161, -4, -62, -57, -189, 75, -65, -185, -22, -6, -61, 138, 27, 14, 140, -187, -41, 142, -198, 78, -41, 4, -275, -16, 192, 173, 129]
4478A29n5j64J1O5M3j3J20k3k21L1k4j07K50O7j52L4k03L11j18P0l87K16J16q2
4502h6j84M23J33j53j98J71K5j66Q7q0n3k70O07k24K37l31J54o6k0%Pk70K71K30
4526B44j46l15K18J0j2k36J52N5J42K67n68L85j88kJ19K6k48L38p8j65K3J5O9
4549A05k02rK16q5J42j68J7j22j31L2N3NL05l79L57k47L38l72K34P4l99L92k86
4572a30J14j11L60j45k4L03k58o2M1k74K35N2m0o6J07J54k10k63K04m5R9K48j50
4595A39qj19k59K72J43l07K02k58K42j47M0J04j4k02J28J94k09O9k6Q6r0q0J95
4618I5j65pJ84j36l8m4QQ3r7P5k52J91J10j78OO1J1J3Mm5n8L34j79o9J19j21j9
4645a14J40j65L27l67J35n6l8J08l4K60l33L17m62K17J22P0j42k9k55L20o5O3
$$ y = [129, 74, -90, -79, -14, 29, 16, 136, 113, -108, -77, -101, -208, 42, 109, -43, -9, -212, 99, -19, 51, -336, -120, -4, -86, -270, 153, 286, 133, -65, 106, 131, -35, 52, -28, -81, -351, 256, 32, 269, -62, 92, 26, 6, 6, 13, -257, 14, 244, 98, -217, 1, 11, -1, -237, -85, -30, 112, 379, -189, 196, 8, 6, 125, 151, -97, 241, 163, -2, 21, 36, 105, -97, -106, 110, 25, 167, -1, 16, -106, -237, -205, -152, -147, 158, -221, 136, -111, 227, -145, 89, 163, -236, 156, -130, -16, -127, 233, 88, 64, 367, 109, 47, 88, -186, 49, 101, 61, -5, 102, 256, 46, -217, -13, -58, 41, 289, 139, 131, 12, -247, 25, 168, -139, 63, -195, 47, -100, -60, 44, 30, -172, -44, 150, -59, 10, -16, 70, -20, -100, 95, -70, -77, 107, -29, -67, -111, -103, -20, -117, -42, -294, -103, 7, -171, -165, -104, -93, -80, -76, -121, -179, 155, -24, -93, 26, -95, -114, 26, -139, 188, -179, -44, -100, -138, -30, -64, 196, -137, 180, -282, -65, 57, 127, -15, -44, -299, 21, -44, 19]
4667A9j47N1N3r1J64k4J23k46L8J63j9L9o0k69L60k65J57o5r8K93l97K57M9r3
4691hk21K59k36K58J84j24j91K35l42K47n6j3K55m50L81l00L7nP4J94k64k7j91
4714c04M57j72j15k5K2M8K77k39O3l6Lj3K47j43q8k41J83R8P1p2P6on5j08N4J51
4740A33k06J83j19J7p8nJ29r6nO6m5O7j3J9J0P2l1jO0k77j93N94j71J08j38j31
4766e1o5K94q6o4K38M6k32j56J9n2K06k71J17k03m5L85j46O4k11L70k72Q7J78
4789A50k30L3Q7O4l2k4K19r8l66J11K06k60L4%RoJ86j96k1M8P7j24J82J48j83
4814A4P1Mo7J78m36L16j23P8o6J64r5k48K62L9j7J5m4o2p0J55j40j05K22j01K86
4839B30n6k02L67k05L7k77L8K02o3j6jj56L47k27m6J77j47K9J18P6J3m33K47j06
$$ y = [19, -128, -77, -24, -115, 49, 25, 148, -98, -60, 103, 84, 123, 63, -206, 154, -111, 46, -19, -117, 176, -221, 36, 85, -8, -229, 30, -206, 52, 236, 112, -79, 156, -186, 61, 5, -8, 247, -203, 178, -122, -85, -90, -16, 178, -86, -113, -304, 153, -19, -134, -159, -137, -89, 188, -51, 12, -24, -21, -34, 213, 70, -18, -259, -76, 22, 93, 21, 97, 91, 36, -72, -18, 133, -73, 110, -9, 8, -70, -75, 54, -42, -47, 19, -26, 41, 28, 47, 57, 129, 98, 97, 157, -120, -313, 281, 110, 218, 80, -51, -116, 178, 92, 28, 266, 312, 80, -76, -57, -109, 97, -174, -57, -260, -305, 80, -66, -2, -213, 157, -115, -28, 150, -80, -47, 40, 104, 72, 48, 267, 169, -197, -86, 120, -140, -106, -106, -97, -103, 83, -113, -134, -86, -9, -133, 49, 197, 14, 85, 89, 22, 200, -236, 80, -43, 35, -31, 133, 38, -210, 52, 91, 74, 89, 45, -17, -87, 68, -72, -177, 45, -56, 230, 174, -28, 339, 134, 171, -106, -68, 134, 71, 55, 54, -102, 245, 18, -28, 149, 2, 31, 149, 225, 238, -195, 52, -54]
4863e4L3L45j64j39L2J40q8m1j83k0M04j63o1K6l7Kj9P7j61O9n0m9%J42l42l8
4889c39K11J85k10J77mo7k4Q6k81M98k15o5O8R8q9j05jJ22l3j22J17q0K30k32
4913g5P5l14M53K3n6j31k4M0l4J75k92J40P4j01Q3j08m4K21q5L7j28J57l08J98
4937b4Q2n5R3j86M16m82J45K49k53k50K41L0j59L47j39K24m19N2L89j55o0p9j9
4960a2J05m59L39m2o7K49J21j43J70o09L22j76J81r2L62k91j28J80j35J3l4L87
4982B41q3m14L50j47L8J49J00n21K33J02j47R4r8O9N3K40j29j77k41M14J2j50
5004a2j35J05o2j81K67J09r9K09k14k2J32l92L45j65L43l58K43j27L7o5l7L47
5026B68j60P8q6k42K24m9k4J20k25J57j44K32k12j75K44j55K60J24l57M64j55
$$ y = [-54, -21, 324, 160, 21, 53, 193, 105, 64, -119, -139, 265, 102, 41, 67, 30, 32, 13, 90, -71, -2, -52, -101, -101, 41, -301, -339, -128, 57, -153, 24, 20, -47, -71, 15, -266, 232, 17, -48, 20, 118, 29, -76, -77, 45, 12, -110, 7, -73, 157, -75, 0, -314, 139, 162, 106, -25, -49, -9, -43, 132, -160, -20, 54, -47, 36, -72, -116, 105, 20, 57, -71, 86, -222, -24, 58, 3, 96, -90, 326, -156, -11, 238, -15, -265, -24, 6, -153, 194, 55, 279, -140, -88, 301, 146, 86, 7, -12, 93, -366, -27, -69, -136, 113, 234, 91, 261, -348, -26, -202, -21, -113, 249, -42, -170, 10, -125, -112, -146, 241, 158, -256, 94, -53, -15, 134, 234, -287, -54, 48, -99, -5, -103, -34, 19, 259, 130, -47, -288, 126, 138, -12, -147, -42, -104, -285, -18, 91, -8, 201, -13, -35, 97, -295, 50, -115, 228, -130, 113, -14, 23, -42, -79, 268, 108, 186, 100, -142, 82, 33, 9, 129, -96, 61, -83, 149, -63, -238, 6, -149, 111, 235, -122, 342, 187]
5047A87k31J06J16k05K16O8l21K03l99k8L22q9k72K13J1K19k38K4j05K17k26K22
5069A0J3j34L67k85j5PJ40M3j64k14M33k86J13j02K4j97J74m2j9Q3j13J46LL8
5093B3j61j05L28O2k23M34l07K16l91J52n9q0J16n2J1P5j65J98m2k03O9jl7L75
5117B33j38k24J91k57K49m3L78k79L0K3L9j0j86J95j80j10K8Q9k83J26J78l69
5139c20K70Ok7K55l33NL94M4o8jl40J68l44K01L20j90j57j54L80r8j43O1J75k21
5163a17J72K43j74j05j44J82k17r4K19j22QJ33j39J42J48l80K55Mr4k5j30K57
5185B2l20K28K21k96O1K19m17L72K72m72L9o5M40l85q2L77k75P0J79j45o4L9k8
5208a0O3j50J81o9j49LJ32J66j59KJ0J3j70K82j32J03l71J54K35l5l21J47J05
$$ y = [187, -44, 62, 178, -27, 189, 257, -64, 139, -260, -288, 34, -55, -327, -114, -103, 116, -122, -98, -203, 14, -212, 10, 23, -111, 256, -29, -44, -37, 103, 146, -18, -232, 201, -85, 28, -74, -50, -247, -73, -115, -134, -51, -164, -18, -15, 23, -138, -243, 85, 147, -76, 358, 51, 267, -124, 28, -31, -111, 5, -47, -36, 39, -126, 72, 30, -173, -104, -105, -142, 233, 95, -129, 62, -195, 54, 11, 389, 110, 140, 163, 202, 192, 6, 201, 21, -89, -61, 28, -255, -129, 49, -320, -50, -44, -71, 184, -149, -144, 250, 294, 226, 225, -115, 53, -291, -90, 230, 40, -117, -271, 109, 11, -132, -71, 104, -117, 55, 298, 124, 19, -125, 57, -160, -254, -35, -157, -149, -16, -155, -13, 135, -245, 10, 14, -80, -105, -235, 22, -298, -70, 151, -145, -84, 135, -282, 90, 362, -110, -71, -136, 304, -81, -163, 214, -61, 9, 188, 43, -21, 18, -10, 53, -97, 84, 15, -134, -131, 1, 167, 8, 10, 20, 33, -137, 145, 13, 116, -255, -101, 134, 99, -222, -75, 30]
5231C0o1Mj44K12QN2N0L4k08j17J02M6j31J67J85j50n6J31j77q4J89j29K34J15
5255C02m36K88l09L09j39%L9p3jK01l12J62l7N4q5P7j55J24Q9j65J22l2Q5j89
5279h1J39r3P3J0m4M3n7P5k07J91J7j59J34k25M80j87l33J18j85K07j28j0M10
5302A88o9j16j98J72L1j12k6k53L73j40oJ66j57O9j37K73j7p5O0o4r2J47L4j11
5326f0k18M61j46k0k10K11K0q3K41Qk84K90j11l78K75Q0n7j27K46j39k25L6N5
5349a35J43J17M4m00L21j1j3J87k71o9M5J44P5j45J06l95K46K1l56N00M9l03J29
5372B9J93o3m11L51q2l2j32L88j83j03J80q8m4K13j78J4k9m7J28M2k93Q7J32Q0
5396A52j05l9j03J69L13m11O3Ol0p8Q6L4J0l5M7m5k1K4m6p4J82j28O1O6o6J76
$$ y = [30, -31, -27, -171, 41, 49, 101, 151, 185, -23, -140, -38, 8, -123, 44, 229, 79, 23, 154, -23, -107, 82, -47, 187, 302, -134, 154, -155, 154, 15, 15, 54, -19, -20, 181, -131, 31, -6, 48, -37, 40, -115, 9, 98, -67, 55, 23, 108, -81, 58, -35, 38, 48, 4, 47, -10, 65, -142, 49, 66, -93, 41, -184, 296, 109, -224, -106, -291, -84, -212, -222, 188, 119, 3, -195, -23, 8, -104, -130, -383, -10, -150, -156, 10, -147, -78, -215, 58, 41, -34, 26, -38, -130, 17, 51, -60, -278, 183, 37, 17, -193, 18, 38, -45, 196, 204, -80, 210, 99, -279, -4, 76, 19, -108, 138, -1, -226, -190, -135, 8, 125, 169, -231, 90, 79, 66, 253, -18, -87, -42, 102, 177, 32, 138, -257, -11, 10, -346, 154, 203, -100, 29, 222, 159, -252, 99, 17, -15, -147, 241, 58, -45, 135, 47, 3, 216, 38, 52, 23, -24, 104, 146, -147, -60, 72, 152, 47, 8, -95, 74, 387, -24, 39, 45, 15, -63, 23, 57, 67, 32, 79, 34, 13, 37, -9, -83, 99, -29, 32, 98, 32, 208]
5422B08j75q8J84O3k23J75L6Mk84K00j32j7m0J24l6j80K79N2j79j66M48l10o7
5445a24M2K18k61J11p0O7o1Q6j5J11k36N6J09k33J23L15j39j33J26l7p5o0lN3
5469c0K07m1j17R7j09J28j49K4K53l52j9K4j00L68j68M7J16k20m4N3P6K36k41
5492C9kJ6l02K38Q1j70J35J50k54k04L85m9k54K44k10K98k20L3K18k09M5p0j03
5515a65J86k06K08K96m20M4J10n6P5J8l01J30O1n8m0P0P1r9K43l01J26p0P4M9
5539D5j67K0N1j97K58J89q7j82K96j27j50r0m7J08J01pj20Q6L0rj02J68Pk66K25
5564C3j32j21K50M9j60K08p1p9N3J11l86L12p2j61O3M8P1J0n1m7Q1j69K57k32
5588a35Q4O5p6o4K2Q6J12r1m8L16k60K11k28M2j82Q3K20l22R5j99K63J6m3o4J03
$$ y = [208, 33, -55, 129, 192, -31, 144, 180, 184, -100, 100, -32, -49, -89, 35, -1, -181, 98, 150, -29, -195, 253, -57, -124, -82, 136, -125, -14, -84, -17, -78, 8, -7, 104, -132, -76, 33, -200, -77, 238, 99, -34, 92, 55, -20, -80, -83, -30, 177, 136, 19, 116, 7, 135, -14, 10, 263, -89, -108, -84, -184, 184, 16, 63, 179, -41, -85, -32, 44, 280, 39, 37, 53, -249, -11, 70, -100, 35, 185, -69, -273, 112, 63, -191, 53, -157, 141, -79, -46, 172, -37, 8, -62, -165, 21, -185, 23, 319, -101, -57, 53, -3, 72, 90, -211, -81, -20, -78, -118, -48, 23, -76, 167, -134, -8, -78, -4, 45, -122, -102, -51, -248, 10, 199, 112, -70, 226, 99, -51, -141, -188, -80, 21, 14, -106, -20, 10, 1, -101, 67, 74, -192, 33, -99, -220, 30, 79, -81, 127, 56, -23, 30, 141, -245, 67, -5, -166, -103, -55, 16, 26, -25, -72, 9, -160, 97, -135, -51, 14, -62, -126, -104, -18, 94, 3, -45, 271, 11, 222, -6, 36, -146, -63, 157, -165, -70, -269, -6, 10, -33, -97, 6]
5613Fj6o8L0O0k80L18j30Q3O5j29R2J20Rm05R0o9J40J10l5j25R6j46J12K16j89
5638d5O0j1L9j01M6K20j56L9J67l07r1O3l7O2L48k88o1N3K04k72L43l91O0J33
5662G7N7m1l72M73k11j39L23p6j74K25Rj57M5j07M1qo9K47k77p3J38J75k57J04
5686d7J45k96J83j87M56l93r5L59l8j23O3R6J14Pl14K15l49J99j12L53l56m4O5
5709i9J26k4q0K01K9j66Q4k29K8J47jn5Q2jm0J14m4j58pJ55o3l3q2j40K41k7q0
5736a22r4K95l51P01k37l18K12k43J30r6J7K14pj29n8RJ83m6j26nR6j31J24k4
5760fK46R0m36J97n7m5o0o4j15j8M88l61J74r5O4j81K53m2J1J2J15l17J10j09
5784a46M1M5j14L32k07L09r5j65j49M8O4q9J93K3j1j8o0Lr3K47q7j59J29Pj00
$$ y = [6, -10, -78, -48, 12, -268, 50, -80, 3, 68, -61, 31, 151, 160, -245, -155, -224, -84, 26, -9, -134, -38, -184, -72, 144, -45, 15, 4, 43, -58, -12, 208, 52, 91, 258, -49, -140, -77, -114, -52, 296, 8, -53, 0, 204, -68, 275, -116, -56, 77, 134, 93, -279, 194, -17, -156, 167, 91, -83, 142, 151, -6, 39, -68, -27, -35, -104, 143, -134, -207, -69, 106, -151, -47, 98, -198, -15, -202, 254, -139, -234, 125, 87, -36, 27, 123, 237, 244, -70, 145, -204, -5, -117, 236, -120, -164, -99, 27, 3, -77, 124, 153, -13, 71, -158, -130, 17, 16, -39, 43, 42, 2, 116, 72, -86, -93, 62, -1, -34, -116, -256, -15, -42, -122, -216, 79, -272, 429, 192, -126, 86, -157, -27, -123, -106, 108, 101, -28, -86, -77, 106, 60, -66, -71, 25, -106, 18, -6, 240, 330, -106, 91, 34, -11, -71, -135, -250, -268, 220, -141, 33, -62, 2, -179, 74, 32, 43, 55, 170, -147, -37, -146, -105, -60, -174, 158, -49, 260, 165, 0, -149, -101, -37, -126, 67, 90, 79, 61, 1, 4, -89, 158, 71, -88, 41, 48, -52]
5809e2J66Oj60j56R3N60n92J13K10l77J37L7J07N0j67o5j17Q5J96j5k53K30j84
5832a48J91j4k23N8R7l2L21m33K9K63r1m0qq3J57j19K80k33N6P9j33O3J59M2m51
5857b13K48j62O1M9M0j23L0J05m2p5K22k4l45K48j07J06kK30k93Oq6R5r6J25Q8
5882H5j82k7L24k85%J07l9j79K70j19k76L52k04J33J12j83J7L0j50J89m7k3r7
5905a92K70j4m7j68J94n3m6q8N8Q0j39J43N7n6J12r1r5J83m02L73r4J34j27P4
5929F6R5j72N5j14L27m72L59k13m3Q2k9J82j20j42p7L06Q5j22k73L17k6j54L04
5952B21n66N59l10K9J20l80L91K2J3k25K62o3L0j69j83J14O9Q4P9j49J99j68j46
5975a67j34J68k7L56k47l03J46L16m7j74J41r8n6P4J70j73K9j64J37J89j48m3
$$ y = [-52, 114, 120, -40, -196, -103, 457, -135, -22, 188, -189, -52, -15, 92, 142, -25, -90, -207, -122, 74, 59, -194, 36, -148, 43, 29, -194, -136, -39, -71, 250, -183, -154, 109, 18, -22, -30, -113, 44, -75, 205, -28, 28, 107, -26, 37, 196, 238, -213, 35, -127, -66, -17, 23, -100, -70, 35, -7, -82, 140, 116, -229, 19, -88, 18, 16, 246, -47, -41, -127, -32, -128, -3, 85, -97, -124, 200, -85, -85, 22, -17, -196, 74, -45, -321, 31, -173, -40, 72, -111, -94, -64, -214, -25, -72, -95, -192, 78, 64, 17, -151, 43, -10, -56, -144, -86, -6, -145, -2, 55, -1, 111, 20, -75, 108, -294, 79, -15, 119, -8, 66, 161, -11, 44, -70, 257, -215, 144, -69, -112, -30, -59, 123, 3, -139, -216, 90, 175, 53, -220, 97, 71, -83, 221, -345, 214, -96, -67, 53, -327, 64, 86, 99, -126, 136, 73, 103, -66, -249, -135, -66, 18, 97, -52, 147, -21, -167, -301, -133, -160, 196, -51, -354, -208, 108, 61, -113, 28, -70, -126, -52, 118, -55, -26, -190, -53, 136, -12, -55]
5997e5K88l34L6Q2Q9j93J74k5l67N16jk06k2j00N1J50R7k34M8J07j56K10o9O3
6021A49j06p3o0J29k53K46k1rJ14k6q7r0O3j34Q2J36m2p0R5j89l3L39l07K27j80
6046a00M22m25O1J28j38j4J63k93K44K7k11J92l11J58L25k68j77K77k88M03k56
6067h1O5k9q4R7j67M03j61j0K33l41M5K62J05l14P2n2r8p3P8n8l1J15k32M70k96
6092h2R4l8rmK51j60k89K39L05m23K11J7j73J16p6K6o3N4J33l20K37j13J98j78
6116d7R8j04n6q3Q2K42J8O8j51j86P1J77n1r7J44j79j42K8N7n0M18l45K51r9p8
6141a4j74K31q5q8J19k78N30l47m2q7J76q6M5J46q5L9L9n5R8O3K20l46k21J98
6165dk28J83N6j20k22K57j9j1P5M1J46k37L5J28J1r5j39N20j35l79K62K3j91J26
$$ y = [-55, 233, -101, -65, 17, 106, -87, 87, 62, -305, 211, 210, 4, -18, -118, -67, 83, 180, -54, -6, 101, -55, 155, 86, 149, 43, -30, -90, 39, -214, 32, 11, 2, 116, 90, 3, -87, -24, -158, -76, 60, 18, -52, 43, -146, -179, 160, -147, 80, -100, 322, -103, -42, 86, -52, -66, 97, -196, 48, 75, -136, 56, -255, -97, 228, -40, -217, 60, -228, 175, -81, -16, -45, -129, -32, -199, 204, 43, 33, 266, -75, -30, 232, 337, 23, 95, 43, -55, -128, -50, -108, -139, -24, -256, 214, -82, 12, -26, -35, -39, 212, 52, -237, 2, 307, -116, 95, 112, -61, 55, -21, 5, -58, -4, 129, -191, 46, -67, 131, -47, 51, -53, -109, -192, -110, 132, 150, 218, 67, -119, -48, 129, 78, -19, 125, -54, -196, -168, -111, -161, 257, -88, 163, 64, -14, -188, 43, -42, -130, -11, -289, 241, -106, -148, -235, -59, -145, -100, 46, -39, 0, 39, -16, 82, 145, 365, 19, -202, -4, -232, -49, 7, -113, -335, -78, -97, -108, -33, 8, 154, -83, -48, 80, 91, -4, -143, 377, 242, -137, 125, 148, -43, 83]
6189H3J54j80k04J85N1j69J79p0O3j25J05P0j61N3J4j06j98N1J41J79n2N2q5k2
6213HJ40j49j31L80j92J77j87j27R8j6r7J53R5j9Ml98J96Nj1J51j52r4L8K42j47
6238c3O8J0j4P1l07K95O5j25J00l21J56j1P2Ll2O1j72k2J61O7qj85K08r2Q3r7
6264Ak51N9J92Q2nK18l03O5j49k3l3o2L54j62j13m5J71Q8k33M87k37P2ok70K78
6289A75q5l3N9J00l1j92k0K52l53J39j9R6l44L93j73R2q4J35p9N4k7j33L12k56
6313b2L3J16j4M7Q3j38k69K55l44K86k70J77J06J16m37L17l7k05R5Q2n8rL87j36
6337A61O8j79Pl65J96Q5J2R7l63M47n9k37l2J40N1ok19N3J26K21J7l60L76l02
6361f5q6L30j9j92J14k45R6k20L56N3k46J21J47k99m0K27k02K30o4J74k84O3o4
$$ y = [83, 237, 57, -147, 38, 89, -80, 99, 29, 92, -33, 72, 142, -19, 34, 48, -58, -256, -205, -64, 115, 63, 115, 30, 8, 148, -1, -132, 248, 56, 233, 46, -81, 17, 1, -96, 57, 152, 133, 137, -261, -65, -60, -71, 80, -72, -166, -128, 114, -33, 35, 45, 31, 102, -205, 90, 155, 30, 130, -191, -35, -46, 26, 29, -3, 58, -114, -136, 25, 92, 84, -101, 107, 15, 98, 1, -250, -191, 1, 83, 78, 296, -7, 58, -91, -114, -147, -209, 145, -17, -130, -175, -4, 84, -149, 338, 101, 173, 167, -103, 175, 90, 57, 116, 216, 185, -7, -27, 225, -128, 11, -8, 88, -256, 137, -36, 56, -28, 107, 28, 82, 55, -78, 234, -22, 11, 127, 113, 160, 243, 105, -164, 91, -253, 33, -237, -60, 46, 162, -275, 42, 5, -200, -105, -23, -81, -90, 297, 161, 229, 50, 57, -308, -112, -27, -15, 82, -281, 166, 107, -130, -162, -22, 29, 23, -196, -143, -17, 204, 221, -139, 237, -65, -151, 179, 160, -32, 82, -163, -67, -287, 69, 122, -124, -3, 144, -155, -195, 32, -170, 60, -4, 170, -114, -51, -115]
6384a15K06l6o1K8k82K94j27J96j65l18N19l55K8L05J07m33L02P9l20R9Q7l41
6406c03K31l53L32R1J94j61J9L16j52j13k00J53p0J95k42J22j98K70j17j26L76
6427B64l14q3L31j96M8q6j19j29K42J52j32k6k1J67k8k42L2K06J97j98L9k76M09
6450B37k56P4K9K35k91k9J40j56j06k7J24j02K99j57J66k87M3p3J31O0J21j98
6472b3j19J76N1j44m0RJ85Q0k30J60q2M7o8j37K19k75L17j60j84n7m7K5K97J49
6496A49k9R4k11o2k67L29J45q4j49J85J46k4l63K42M6k43k5j16K86n0M0j45P9
6519b7JL02k21J54l10J42r7J12k13J03N4Q6j78O2J86j88Q5k76K34j01J87j12o9
6542h4J44k56K06P6j68J29l2m3J02l00J41K70l7k28K46j93J20q9J59q8j84K63
$$ y = [-115, 91, 55, -6, 22, -260, 34, -93, 103, -62, -380, 139, -216, -188, 117, 224, -209, 93, 172, -148, -49, 38, -303, -72, -425, -93, -2, 192, 31, 50, 366, 214, 101, -99, 54, -16, 179, -63, 59, -139, 131, 14, -112, 264, -50, -133, 198, 2, 50, -36, -155, -284, -42, 110, -22, -48, -69, 98, 70, -172, -140, 66, 263, 65, 104, -172, 237, -19, 55, 84, 319, 28, -1, 139, -17, -123, -150, -26, -128, 171, 14, 180, -107, -64, -137, -6, 54, 175, -23, -142, 34, 85, -59, -99, -90, 95, 175, -55, 105, 23, 70, 2, -135, 84, -191, 126, -34, -218, -275, -322, -297, 0, 149, 120, 214, 3, -59, -326, 3, 148, 64, -85, 100, 246, 222, -141, 101, 147, -96, -121, -237, 49, -1, 39, -106, -27, -26, 276, 55, 209, -101, 41, -56, 56, -157, -54, 0, 86, -92, -30, 156, -32, 53, -223, 11, -90, 97, -15, -84, 60, -196, 10, 86, -82, 47, 15, -28, 74, -226, -85, 185, 148, -80, 166, -27, 93, 4, 163, 75, -109, 154]
6564A54k86K35Oq0K1l09N24k43J05j47rL53j39O8k87K24j32q1MJ29L5K2j12Q6
6588A41j60L1j34Q0K63n7k25J51j97K1K30j66J27n0m7q4j04L02N6j33j21k3j26
6611b25m9J53K13k51K26nj92L80k07k1j80J44j37P6K89k37J12j71K09m7l9K5j82
6634a16O0J51P0j47J05k12J42o6P6j21J62j52K7O0j8L0j01n0m7K56m8o4rr5J35
6659B8l7r3J27j50p0L19P4k86O1q2K49k24L73k63j86K27J54l18m0M57l04m1J6
6682iK4n9J34j54j90L73k21J63k57J95j6j19L10J79m07J13p9j77K40j4j76L07
6704A60j69J50Nm02K94k54K29j39K59M7O8k73j93L40k76R6O3J05l01L32l29J90
6726Bj2K01k95J26j62L52l53L9r9M62k10k44K58j25J81Q1l29L05j99K07m01j3
$$ y = [154, -132, 103, 109, 29, 50, -259, 265, 22, 127, -20, -29, 324, 185, 253, -34, 190, 58, -23, -19, 110, 145, 167, 55, 141, -19, 12, -122, -42, 221, 164, -61, 90, -107, -86, 144, -22, 105, 55, 8, -76, -180, 122, 178, 45, -76, -99, -225, -274, -121, 92, -159, 67, 62, -130, 250, 43, 22, -158, -14, -151, -75, 214, -23, 89, -82, 127, 80, 41, 66, -116, -56, 95, 165, 18, 123, -89, 53, -13, 63, -58, 104, -48, -21, 39, 21, 51, -50, -100, -147, 109, 61, -3, -12, -107, 28, -9, -102, 25, -125, -195, 124, 198, -88, -27, -109, 140, -84, 289, 26, -160, 67, 221, -97, -137, 320, 16, -25, -9, 15, -44, 90, -64, -254, 119, -102, 61, -196, -1, -17, -136, 174, 353, -54, 59, -20, -197, 43, 29, -147, 160, -9, 141, 146, -256, 38, -216, 13, -126, 133, 180, 248, -25, -218, 122, -154, -58, 5, 110, -191, 141, -188, 2, -10, 191, -104, 22, -140, 212, -141, -102, -201, 261, 51, -193, 65, -60, 121, 202, -127, 178, -21, 186, -215, -228]
6748b28M88k03J52k31PL03l22J05mk78L57lk53M5o1J12K14k42l03L47J03O5j03
6771F7o8J08k39K90j44k72P0J95k18L76l44K41O5l67nM13J11m48R3J80k13Q4J7
6794hk1k32J14J77j16K42j50J44j3j87o9R6m1R8k96M64m10L46j85J14Nk39K92
6817A25j82K65j92P7j62J37j99J70J50k40Q7J50j37M8p5j93L70k68k7L7q9J21
6839b7J13k14L95j46n4o3O9J70l15oj29K48Q3m12K24L95l25j88J5M3L25m1l8k1
6863A01j14Q9k03J9l0K21m0Q9n57O13k82o5r8L47J12p3m3q6l05O0L16r8J14j50
6887f3Q5J69j07l0k81N57k40k12K50q8J61j16k97M21j90n8j39J85N6L26l66l13
6909b90L47J05p2O3k28K50r7j66Q4OP6l0K29k52N1j9K8r1N8j43N7K3Q1q8j27K57
$$ y = [-228, 260, 57, 209, -22, -15, 288, -34, 71, 67, -211, 146, 143, -110, -65, -126, -14, 200, -42, -345, 2, 105, 170, 67, -1, 107, -132, 158, 14, -258, -188, 7, -211, 165, -179, 62, 127, -240, -245, 168, 279, -169, -76, 104, -109, -25, -8, -29, -261, -147, 30, -86, 156, 6, 150, 137, -50, -119, -23, -64, 34, -262, 202, -208, 138, -47, 67, 72, -167, 125, -57, 208, 16, 93, -69, 68, -131, 39, 189, -51, 36, 186, 49, 97, 22, -171, 199, -69, -96, -59, -148, -27, 86, -128, 267, 121, 67, 4, 73, 243, -72, -78, -207, 41, 124, -288, -64, 331, 6, -182, -167, -124, 201, 160, 122, 101, -13, 76, -127, -108, -138, 83, 43, 132, -425, 188, -94, -159, -257, 90, 202, 129, 86, 0, -305, -245, 71, -27, 87, -63, 22, 191, 84, 54, -227, 330, 90, -122, 128, 40, 201, 85, -212, 209, 19, -39, -178, 7, 63, 389, 23, -290, 57, 162, 90, 153, -75, 175, 78, -88, -4, 2, 78, 48, 277, 25, 76, 57, 85, -6, 52, -91, -34, -11, 70, -18, -145, 112]
6935A12Q5k62N8k3K5j3O9k03R6R3L0j5j37k19M42j41K30n31j6K43K26k54J21M7
6959F3P0O6l17o6K14N3O9p7L2n4j32n4k4K05J13j23j53J67m2J44Nm2n16M61Jo6
6985cpJ64L8j23k36o1L65k10Q6K42k08l2O7k3M8j33Q0J24j99P0Q6qr8J6l5J91
7011B01n19M13j6o1P7j10l09K86K92k19p4%Q5P0n8k61J21j21J03J10j44K94J62
7034C22k98M7j93K81l79K7J84j84O4L05j62j84J47J93j14J04m73L04k01P1m9R3
7056i5J73J00o0l4l76J91J43k93j1L15k6J5J54l61L60k74L10k10j67K88k20M9
7078b9OJ22J65l27J91Or1J6q9J58k05J07n1K31j06l0L4n0j99J77J32j98M9j86
7102a67L01k44J39J03j3k11j3L47k48k09J92m4K3j49J27K10k30q7J56N4j51J95
$$ y = [112, 197, -65, -7, -30, -5, -18, 51, -152, -56, 37, 67, 52, -85, -304, 138, -3, 227, -304, -320, -77, 149, -105, 16, 63, 133, 199, -118, -184, 30, 83, 152, 75, 107, 53, -79, -133, -157, 48, 161, 38, -115, 52, 10, 154, 159, 117, -399, 62, 63, -3, -10, 154, 192, 69, -167, -228, 137, -73, 13, 255, 47, 15, 82, 59, 107, -26, 54, 178, -21, 49, 135, 127, 29, 45, 10, 201, -318, 95, 79, 18, 95, -15, -324, -38, 254, 35, -39, -39, 46, 116, 58, -203, -82, -203, -100, 10, -134, 160, 322, 24, 71, -122, 159, -220, -193, -9, -193, -129, 176, 14, -170, -23, 170, 56, 160, -313, -9, -210, -139, -188, -95, 78, 178, 118, 84, -292, -101, 42, -251, -262, 53, 27, 42, 196, -165, 195, -79, 231, 21, -146, 142, -78, -29, -23, 99, 264, -63, 128, 134, 43, 59, -30, 128, -77, 30, -21, 210, 104, 74, 108, 58, -141, 36, 168, -30, 19, -167, 134, -110, 29, 132, 119, -92, -105, 242, -6, -215, -23, -67, -44, -193, -66, 144, -86, -173, -17, 37, -114, 81]
7124H1l64M16j6k75q0K61p0J2l52L89r1L52l35N8MO1j56N2N1J58l41Q1K43k09
7148g0J79j94nK14k2k21P1R9K6J3k91K29J13J68j73n36N23m00K52j27J29R4m3
7171B8n1Q5K25j94j75L42l24J61m0j08J85n22K91K24Pl23J60j03K30r3qJ89l61
7194a75J74k51M46j04m7R5j61j3j19j12L23k8J86j67j9K06K1l10R4j38j72M84
7216B13l48K25K59k00k11p7K09k97M45j44k8p4r8l9P0K2j19J84j18J51k03J56
7238b2k1J39K2j95K6K07l32l1L45p9k58j33J76oQ1RJ19M9j64p5n8K09M5J04k29
7263g2P7j58M40l05K5n1K06m12K94j15J44J24k93J97J22Ok12Po2K63j41p8n6j71
7287b21K00J4P7J6r8J18M0pl4k39K24J16j71k3p9P7R9k80J2J86j25R4j3J62j25
$$ y = [81, -283, 133, 117, -158, -238, 23, -47, -35, -387, 2, -89, 263, -72, -14, -10, 51, -105, -53, -2, 156, -185, -104, 139, -70, 109, -85, -90, 124, 102, -119, -48, 51, 77, 90, -201, 28, 141, 309, 136, -400, 123, -277, -25, -152, -23, 71, 28, -23, 62, 287, 93, -82, 260, -64, 97, 57, -51, 134, -388, -97, 127, 134, -189, -29, -132, 98, 5, -3, 186, -175, -1, -252, 194, 90, 43, 138, -23, -36, -155, -267, 56, 28, 214, 47, 28, 234, 255, -55, 39, -99, -271, 213, -135, 90, 349, 149, -62, -139, 70, -227, 218, 74, 46, -28, -126, -165, -95, -73, -192, -8, -126, 25, -178, -22, -43, 96, 118, -77, -51, 156, -176, -207, 138, 59, -199, -332, -156, -162, -81, -72, 47, 96, -68, -143, -201, 8, 53, 157, -72, 5, -153, 287, -18, 7, -44, 162, -250, 44, -71, 73, 197, -96, 101, 223, 229, 17, 24, -38, 225, 84, 6, -50, -221, -21, -7, 70, 86, -12, 106, 146, 139, 105, -134, 90, 206, 35, 12, -67, 10, 109, -171, -159, 27, -98, -4, -17, 145, 20]
7312B0o3q6Q5qk13J43K42l03N6m2J87N0k95L85j3m83L13K87l34K14oN9j54J6j88
7337a31JK33j50Q0j54K32j52p4M19k43k9Q5j04k8K7R7pk13J03j33p2J78L30k83
7361A2j01K54k43J57j39J31l5K43m0o5J43k06j74J12J43l19K29j00j54M00k77
7382b9J59r4l6R8j70R2j9J51j8j30K0P3j40J37k66L03J70m42K9LK96q9n6l4O7
7407G5j81K3K27j44Lk31N2N3J63O3l50L22j69O4J32l8pk77K34Q0l69L43J4j89
7431a07J33k78J58J37r2j33K19J26m76L28J49k25K21jm9l27L55m0n7J53N1j99
7453D6j59L16j77m9J31m0k19J18K29k98m7L81q5j80q1K52j69K40k47L3J31j33
7475gR3R3M7j61N2kj80K3m3J34l22J25mO8J06n0M8kJ40J5m10lK3M57m06K99j01
$$ y = [20, -43, -129, -44, -52, -265, -122, 120, -183, -127, -169, 18, 68, -227, 158, 145, -338, -25, 262, -72, 142, 136, 195, 41, 57, -131, -130, 103, -47, 33, -121, 111, -41, -115, 304, 61, 32, 117, 13, -15, 12, 109, 102, -111, -8, -141, -213, -35, 295, 12, -89, 165, -78, 79, -60, 71, 36, 279, 239, 174, 317, 111, -63, 49, 192, -127, 102, 2, -152, 248, -29, 130, 36, 0, 98, -72, 20, 1, 152, 134, 4, 24, 97, -43, 94, -172, 131, 301, -141, -112, -109, 187, 98, 42, 8, 75, -106, -83, 144, 0, 3, -228, -176, -123, 40, 103, -247, 75, -94, -30, 102, 64, 57, -220, 14, 94, -275, 68, 82, -107, 26, -252, -94, 43, -49, -182, 37, 163, -313, 15, 164, -61, 160, 159, 110, -217, 138, 98, 41, 194, 245, 46, -113, 203, 26, -23, 108, 68, -151, -33, 196, -102, -149, 232, 147, -33, -114, 138, -31, 209, -38, -5, 126, -7, 86, 179, 226, 65, 117, 115, -65, -42, -85, 49, -273, -148, -152, -84, 22, -28, 20, 18, 158, 173, -237, -240, -217, 240, -166, 133, 32]
7502C2K29k04l72L22o0m1K73q9k39J4K08J84n52L40J82o31L57k4K01j42L81l10
7524E9K7j15L9q1K64j06P0J8k01j16L2L96j96J20k31k1l5o4K20j17J29K2k37J37
7548A3n1j07K59j58p7J98j85K32l4k24l7J40O9N4J62l66j09K92o5n6p4N4P6p2
7572f6o2M33n85M48l10J85Q4J5j16K0p6Qk5j84L07j70J12J71j50k52J82K72o5
7595A76j84J83m4k64J19P4j55M9Q6K6l0k69K44l46L05L2J37o0k5J85l14J66j31
7618d0J39j27j2J04p2m6r2K93j03K20p1k15J35J9J49l09K5Kp0J30J5N6k47q1L05
7643A07kj70M0j93L17j69Rj49j20J83J4J61j78K65l66K47L39l92L52k07q0r8K35
7666A45q1k8J51j05j7m9M65m42J10k27R1j62p9K79J2J2K69l67J20m1P6k38L7j1
$$ y = [32, 261, 57, -315, 7, -53, -94, 179, 90, -149, -135, 73, 257, -295, 45, 227, -404, -47, -71, 130, -12, 369, 59, 86, -29, 10, -71, 193, 87, 157, 175, -26, -142, -110, 286, 90, 210, -21, -42, -77, -141, 79, -38, 91, 113, -124, 13, -38, -145, 114, -44, -121, 77, -108, 124, 90, -134, -171, -31, 38, 92, 254, -112, -221, 71, 6, -50, -124, -70, 6, -66, -128, 305, -280, 168, -142, 43, 127, 142, 26, 46, -30, -22, -47, -231, 76, -94, 18, 189, 39, -213, -31, 241, 176, -8, 175, 131, -133, -14, 60, -95, -46, 40, 66, 36, -233, 11, -335, -30, 2, 139, 79, 54, 239, -75, 91, -40, 99, -28, -40, 64, -8, -54, -146, 147, 44, 264, 193, -22, 113, 132, 281, -28, -3, -1, -71, 59, 74, 130, -117, -198, 107, 105, -65, -25, -218, 99, -70, -61, -210, -330, -147, -133, 28, -150, 115, -251, -4, 335, -57, 295, 88, 8, -90, 145, 64, 36, 187, 82, 65, 16, 481, 39, 149, -78, 13, -149, -228, 51, 63, 75, 344, -23, 97, 56, 132, -106, -69, -80]
7690h0j51L80l14P9k63N38k54J77j98J52J16p4l12K39k19n1L76j20K75m36M48
7711C08n24K01Q1j96J29MJ57l02m9K56p3K78l01p1K68o6p9j11J06m7j66K10k26
7734b13J04K87q6r5R1j04K20q3j63kJ85q2K3r6K10l33L87m46J93J01p7k60J66
7757g3K65j46j94L4M3r6K91m1j87R3K9%R1l5K1j51K00o2M3j5j92J77k31K23r5
7782hk0q9Q9L0J49po2J9l2M8j17K62n21M10k57J33j25qJ37kr8M27l25l0j13O7
7808d3k13M77l36L49p4M1m58M12o0j09J99j67j21p4K27L9J2o5J10k19M0q8Q1j53
7832a93J80O2q8m3K71k96l4L15k76K55j11l03K88l7J14J6j83M6j2k6k8K86k98
7855i5NK39k51K9K98j73n9K3k41L26m15K05J2O9j09N1J89n7qK82j59o5o6l4oJ46
$$ y = [-80, -231, 149, -165, -86, -349, 189, -65, 112, -86, 66, 182, 108, -204, 35, -184, -235, 141, 21, 296, -140, 308, -216, -15, 66, -130, -1, 3, 160, -142, -191, 65, -8, 270, -31, -102, 166, 100, 21, -90, 16, -31, -197, 13, -213, -109, 178, 92, -3, 88, -16, 204, 121, -42, -44, 141, 59, 82, -14, 196, -137, 250, -196, -3, 98, 21, -239, -73, 192, 46, -148, -114, -71, -167, 124, 83, -104, -11, 18, 18, 109, 74, 95, -56, 144, 82, 125, 110, -82, 95, -136, 87, -8, -28, -117, -28, 2, 151, 144, 82, 101, 69, 117, 0, 262, -259, 151, -106, 27, -98, -106, 31, 29, -69, 358, 33, 3, -110, -43, -256, 221, -115, 234, 160, 201, -257, 155, 95, -14, 185, 18, -103, -177, 50, 89, 101, 36, 146, -73, -33, -121, -40, -193, -13, 49, -39, -82, 189, -107, -141, 174, -102, 153, 42, -261, 27, -10, 104, 120, -63, -17, -29, -55, -83, 203, -95, -90, 149, -102, -73, 225, 52, -7, 16, -225, 101, -314, -109, -97, -28, -137, -86, 103, 46, 38, 320, 161, 96, 30, -4, -10, 136]
7881A36j51J08l43N13k32j30M06k48PK12r3j52Oj14k02K77Q8j56K46m13K22q1
7903i4J25q0J31P3m0k38J47j32J45j45J45J88k47K46k81j56K17j61J17K36k42
7924d6j60K52r8L59k95k6J35k5o3n3m3l3j91M17np8q9J05Q2qJ8k24J65j9o9j35
7950a27Q7MK74K4l59M7N3K2J5j22L15l81K06q3J10l53p1K93J44p6q3J52J97n01
7974b13j2L19R0p0k05L8J7j35J47J64k78K15k10L4J56o4N6n7q0R3J72l90K38M4
7998F9j48J74j81L38o12M01J80j47M4k2j93P1j25K34P2q6j48L4J10N9Ml02K40
8021F6N0l26J00n7K71k59L3r0J84j89K42K4j74J36O4j23o3J18nJ46j75m2M5Q6
8045F2k2P9l6o4m2K7j40K65n2l7L04j24j47K22k04k5m8N8j51J34j5L7J4k11k1
$$ y = [136, -15, 93, -250, 263, 31, -99, 307, 59, 66, 278, 185, 33, 39, -75, -277, 0, 88, -68, 178, -235, -13, -94, 31, -49, 82, 155, 115, -123, 24, -108, 37, -108, 37, 225, -22, 224, -57, -213, 4, -157, -40, 196, -46, -206, 46, -52, 307, 12, -14, 121, 96, 33, -20, -63, -96, -287, 130, 125, 47, -42, 63, 145, 137, 155, -69, 96, 77, 8, -127, -40, -36, 238, 262, -97, -50, 3, 25, 40, -82, 233, -148, 58, -25, 85, -268, -339, -46, 98, 22, -61, 91, 288, -213, -225, 94, 184, 114, -91, -53, -36, -171, -24, 140, -138, 77, -133, -99, 57, -7, 49, -8, -88, 5, 177, -213, 25, 69, -79, 95, -86, 252, -360, 41, 221, 74, 118, 96, -97, -26, -151, 83, 155, 69, -79, -45, 65, 124, 128, -174, 66, 116, -210, -110, -167, 104, -155, -122, -212, -28, -217, 25, 49, -125, 11, 75, -48, -111, 7, 2, 148, -27, -69, -24, 62, 40, 119, 83, 19, -23, 4, -136, 129, 77, 40, 344, 220, 73, 295, 91, 66, 18, 76, -75, 59, 44, 81, 95, -116, -137]
8070a37L05j24L8J92l65j7K14k31J91r8P7j84q6l5M21j29l88L3L46j15j92N57
8092B73j71k58N8L29j83j54R9J8k1R8k6j10J95o5J08l02K49j82k8J16j72k6L47
8115A92j62j19Rk1J08j22N6P5J14k07K13j89J35J81k26J1r1m0l8k9J90k63K91
8138F8j55J37j69J94r0j07J3J39J14p6P4J52k98J9j3j86Q2J91J40j96k8r0J07
8161B2O2o8N5k39K64M6m10K0L36j36LN1L37m03K5k9n1j10N3O8K5N9L8k0N6k59
8187b05K63Rn6J92
$$ y = [-137, 168, 44, 82, 274, -91, -108, 106, -125, 66, -32, 45, -139, -225, -260, 161, 32, -356, -323, 23, -92, -284, 273, 102, -156, -98, 231, 48, -106, -7, 11, -10, 88, 62, -48, 147, 82, 190, -112, 137, -45, -73, 43, -129, -155, 192, 30, -89, -80, -101, 7, -115, -59, 16, 130, -77, 136, -53, 82, 263, 37, 48, -43, -83, -121, -150, 40, -223, 68, -87, 50, -119, 75, -15, -122, -109, 30, 144, 68, 142, 294, -4, 15, 2, -184, -102, 89, 229, 33, 5, -85, 22, 84, 16, 71, -168, 96, 142, -268, -248, 88, -48, -45, 6, 343, -60, -35, -64, -115, -225, -172, -104, -79, -20, 18, -2, 54, -205, 58, 67, 11, 203]
8191B03
$$ Imaginary data points
##PAGE= N=2
##DATA TABLE= (X++(I..I)), XYDATA
0@%%%%%%%%%%%%%Qj6J6j6J6k4L2l2M0m8N6p1Q0q9J04j21J42j65J88k13K42k75
35a46L10l50L94m40M91n48O10o76P50q31R19j016J121j235J361j499J650j818
53i53K006k214K447k711L011l356L759m237M810n518O419p605R247j1695J5772
68I182k4206P5119j33872l6827K17651p2342q8050Q7992K4008q7727L1501K5244
80B7673k5910J4482J838n3421K5409L9019k5460r218J9030k6457l303K5500j1146
93a964j5068R778j1473J1480K9656k8890k3991M2141j6147n0367N9624N1167q0609
106b4663l0361O9397m608l5086M0404p72n1674K3052K9242k9390J3649K2753n2401
119c0458r172O5819l051m7603J3696J2982k4914Q688K7796q583k0364K69J4105
$$ y = [0, 0, 0, 0, 0, 0, 0, 0, 0, 0, 0, 0, 0, 0, 8, -8, 8, -8, 8, -16, 16, -16, 24, -24, 32, -39, 41, -48, 56, -65, 77, -88, 100, -113, 129, -146, 164, -186, 208, -232, 259, -289, 321, -355, 395, -436, 483, -533, 588, -647, 714, -785, 865, -953, 1053, -1161, 1286, -1425, 1586, -1770, 1989, -2248, 2562, -2956, 3463, -4142, 5105, -6590, 9182, -15024, 60095, -73777, -110604, 107047, 34705, -53345, 34647, 58655, -29072, 2429, 27673, 1763, 16245, 18083, -35338, -9929, 29090, 3630, -5588, 13442, -13015, -16318, 9182, -1964, -17032, -7254, -18727, -7247, 22409, -6481, -30472, 11669, -4478, -54845, 4779, 55946, -24663, -55024, 14373, 9765, -25321, 15083, 14311, -37363, -14311, 14931, -14459, -810, 21943, -30458, -39630, 26189, 23138, -24465, -10769, 2213, -22701, -14013, 13783, 5200, -15164, -14895, -790]
132g90P906j0492l721R459j3708j4000L5140K1284l4166j2005K3834m750j1117
145g126J2758k418r275J5603J862j4219J4542P801l2858q827L3439N855k0229
158c092L329P119j3031k731J8241K948k0960j5623J1722K1840Q24j1165j030n197
172f806j1478J1654J6241q976r005K610l181R247J3894k0031j3752K6273P41k7805
186b0374J8631K3557l1064j2827L2650N26k2019Q189O019j1482L861O902l014
199d45L744n090j5502J3121K2178j2984j7492O803L541l421P346O657l137p198
213a879p577Q143J6769q511j9096J0159J1591j1168N641J7529j7331k0066J8975
226C179J1743j5583N84Q934p928L26J0868p792n587Q766j0547j0419K2861R826
$$ y = [-790, 7116, -3376, -7097, 2362, -11346, -25346, 9794, 31078, -3088, -15093, 8741, 3991, -7126, 5632, 3214, -6061, 9542, 11404, -2815, 11727, 19528, -13330, -22157, 11282, 17137, -3092, 237, 7356, -5675, -8406, 9835, 12783, -8177, -23800, -12078, 9762, 10586, -579, -1609, -6806, -18284, -6630, 9611, 635, -8370, -5760, -8941, 306, 14200, -5831, -19583, 6690, 7431, -20374, -1743, 21814, -9250, -22077, 10573, 11099, -10920, -2731, 3288, -8194, -4333, 2569, -445, 3299, -1791, -17293, -4172, 18006, 5022, -12470, -5667, -2126, -5547, 1799, 8456, 5319, -1879, -9456, -1313, 15456, 6945, -12151, -1992, 9599, -1569, 4072, 21601, 4270, -15796, 3179, 14922, -661, -77, 8857, 929, 1255, 12123, 4331, -1256, 7510, -3037, -13456, 9405, 19231]
240A9231k4459j325J8907j0033j2667J5480M774j7276j130J3839L712l796n602
253c45m436K916K962j242M338J503r180l560R236N822k804o125q008K771J1898
268E746m87p683L214k459r807J0726J3705j6439j1898J8238L038j8019N544J5612
282I031j0381j0715R317M762k303l25p782l115J3844K197j2047N498Q166j3678
296g531l985J7791N69j5967J144J0496j970k529O841K295j1649r469J1792J4916
310A2744q861j2398Q582O864q967J734Q707q004q372P236N632n35K571o337o822
325f226J0223M595j2268J326J2313q787r265J5154O976j4805m855Q164L49j960
339I34L046N88k718k879M09N611J961o734l176L566M75R37L780l417m923J173
$$ y = [19231, -5228, -6553, 12354, 2321, -10346, 5134, 9908, -7368, -8498, 5341, 9053, 5257, -345, -4781, -1865, 1097, -145, 4193, 5696, -3484, -7044, 2192, 8014, 5210, -915, -8923, -6152, 5746, 5259, -2424, 790, -1669, -11476, -750, 12955, -3484, -15382, 2856, 5894, -12125, -6581, 9031, -1350, -12065, -2748, 2014, -289, -614, -8396, -11511, 2333, 4530, -7517, -2019, 6147, -7531, -11516, 6275, 6844, -9123, -7979, 2517, 547, -1982, 4859, 7154, -4495, -13964, -2172, 12744, 3883, -8515, 67, 6931, -2036, -302, 8405, 401, -7971, -735, 4897, 4362, 6933, 596, -6226, 3997, 8592, -3676, -2350, 9963, 1176, -8089, 7065, 14041, -764, -5619, 2545, 2894, 934, 3980, 4568, 1850, -1029, -620, 4991, 6952, 218, -2958, 608, 1083, 2020, 5800, 2383, -2540, -1367]
355a367M55L193O558p682j2309R090J1077r260l605Q815n441q017R904N955r422
370b056k244L036k690L347O219n511m220M107j296k577O484M37q231Q80P705P1
386C461l534n69J20m83k259J497Q145p64j1363P76J0740j992o433M524j475o710
402f319O300P168m601k505J22m964L291Q227m314o950N532J608n933N710O784
417I156j0411p213R793O006n735k752K738N91j800o61L639J557n221m522N417
432E82N075m021k962J275j105q89J790J505K96l405o230M109R732n434q791O172
448b301K982q177K324R960o341r597N057P169j339k194p88j345M4J967J241J394
464E6j536m208J010O373J548n680k516K610K552k032L91M000j295o997J267Q862
$$ y = [-1367, -912, 2281, 8839, 1157, -11152, -2062, 9015, -245, -3850, 4965, -476, -8493, 1411, 7366, -2056, -4300, -1264, -3954, -607, 5612, 101, -4119, -12, -1308, -3885, 2599, 3036, -5195, -4315, 3390, 3461, -73, -642, -522, -1005, -3264, -1767, 6378, 5614, -5749, -4973, 5767, 3775, -2658, 1866, 391, -6319, -19, 7149, 2548, 43, 165, -4799, -1508, 6719, 2405, -4545, 987, 2595, -3338, 2372, 9156, -1255, -8468, 1325, 7331, 1596, -1156, 1582, 2173, 373, -288, 3351, 4908, -313, -4835, 582, 5657, 1636, -1326, -51, -1156, -2045, -255, 1250, 1546, -1859, -8089, -3980, 5752, 318, -8473, -2301, 681, -7496, -5172, 4788, -1553, -11150, -6093, 1076, -263, -2457, -3245, -4590, -4546, -2579, -1338, 56, -1480, -5688, -4678, 1695, 3243, -2437, -4953, -2343, 209, -1823, -1432, 2568, 1273, -5724, -4457, 4405]
480D405j514p935K583M174n009J164P876l279q326L184M326m19J128j372m421
495c435L499M365m471M36N862n428p077Q158O776o021m171K397M56r7J968L00
511C517j522l610j419O841K341p274j983N237j578k576N230l80o218Q58L354n76
527B42J910K47o430P69P765l693m482P965k60j0831M478J1171n503p338N245J108
543B363l658K935K170k913n55j450j247O336K231r210k711P407P87l078J443j295
559d45k718J585R12Q78J246m497k612P213Q41o887M034M957q929k151J1048l08
575D167p931K378K986l314K732L021m961j073L933l127K43P053l668q376M933
590a004O328m843j992L789k114l436L542K922j373k071j906J465L138j455j249
$$ y = [4405, 2891, -5044, -2461, 1713, -3296, -2132, 5744, 2465, -5861, -2677, 1649, 1230, 2358, 986, -3435, 64, 4429, -42, 394, 6256, 828, -6249, 1909, 8685, 2664, -1507, 890, 1346, 1249, 3217, 3517, 1995, -1615, -3034, 3807, 6148, -1126, -3109, 2128, 550, -2026, 3204, 2824, -3394, -2536, 818, 242, 2152, 2399, -4031, -3262, 4503, 810, -3672, 4293, 4033, -6798, -2320, 8851, 3348, -3990, 1255, 2363, -1295, 1640, 3810, 897, 342, -1108, -2355, 3981, 6212, -2998, -5709, 1698, 2485, -593, 850, -445, -3163, -1578, -666, 212, 1458, -3039, -5651, 1562, 2403, -4484, -450, 4507, -4422, -6573, 4475, 4167, -3764, -1386, 1600, -1714, 1018, 4039, -922, -1995, 1938, -1189, -946, 6107, 2439, -5937, -1004, 5324, 481, -1511, 2278, 164, -3272, 270, 3192, 1819, -252, -2158, -693, 2445, 990, -259]
605b59K105j175m031M164M535l362k529K41K88K736J431m217l53L293l180o80
621i93O671k350p987K815O586l263l607L406k58l491K79L109M20k272k352L86
637b901K043J080o89j164n39k28n9J306K021o18n149n5P064Q86o460Q66M312l874
655b158j645P219j62p607J219N434j377j281R10j445l11J720j175L55L727l309
671A14m507M846L111l778l58J728j860k38K291J045J136l628m203O155N507p008
687C53l618P494j360o069O280L576p202o81L644j441O92K597m693j284M803k402
703F89l134O810r16r356K756Q389l649n167L360L52l014J888J954q09j455k505
719c807N79N672p39o033J808L373l926L41N260k796l888K676J107o58K827k272
$$ y = [-259, 1846, 671, -3360, 804, 5339, 1977, -552, -311, -23, 2713, 4144, -73, -426, 2867, -313, -993, 5678, 3328, -4659, -1844, 4742, 1479, -2128, 1278, 1020, -2471, -2192, 917, 1337, -935, -3287, -2901, -858, 222, -467, -1631, -2170, -2398, -2457, -1151, 870, 252, -4897, -4952, 2112, 2998, -3462, -2596, 1716, -2158, -3803, 3416, 3254, -4353, -3134, 2300, 923, -358, 552, -893, -1204, 516, -659, -304, 3423, 114, -4393, 453, 3564, -214, -572, 1156, -704, -942, 1349, 2394, 3530, -98, -4301, 1854, 7361, 353, -3265, 4229, 2869, -3200, 3080, 6656, -546, -1227, 2417, 976, 1668, 4265, -428, -1712, 3091, 689, -2445, 4365, 3449, -5907, -3151, 5238, 1589, -3578, -218, 134, -2880, -992, 962, 153, -1302, -3807, -3228, 2444, 1705, -4328, -2520, 853, -3073, -2732, 2528, -268, -4156, -1480, -373, -1031, 1796, -476]
735d76m228L765K228m527K794L936p432k290Q246P52n639J280J525k829J142L177
751A424j023j818n84p73L050K571l107l376K926K030j658K7J705j70k598r28L867
768A565K205l074k943K419J836j612P59J657k787k643L451K796k117j967Q66P
784D18k57J368J69m24j329j385J625L352r61m652J69M019m80k261Q86K085l067
801g25k943M409L363l750l086K956J107k168J339J160k565j151J183Q73J695p37
817I60m068R15M265j746k719K928R12m417K45M531K32l664j605K506J898j636
833d63k27J463m78l102J618L547j324k293K77J202o8P36K56j526l06K29R2K531
851B164N65m066p01M244M35l540J331K696l571j803M222J664l252j701J672R59
$$ y = [-476, -4704, -939, 1289, -3238, -444, 3492, -3940, -6230, 2016, 2768, -2871, -1591, -66, -2895, -1753, 1424, 401, -1417, -2001, -2774, 276, 2847, -260, -3636, -710, 1320, -338, -311, 1394, 1224, -1374, -2302, 1565, 3770, 696, -2247, 172, 2008, 396, 1155, 2812, 25, -2618, 833, 3629, 1512, -455, 411, 418, 161, 1529, 1698, 1274, -55, -1440, 185, 3537, 2576, -2076, -1907, 2112, 1632, -629, 257, 2342, -725, -3668, 741, 4104, 354, -2732, 224, 1331, -837, 502, 1662, -903, -2054, -871, 2, 1697, 960, -3108, -2193, 2072, 326, -2393, 535, 1447, -2970, -2725, 1806, 2038, -1626, -3231, -725, 1173, -463, -690, 773, 295, -2807, -1189, 2358, 1034, -1259, -982, 220, 152, 888, 1144, -382, -688, -459, -367, 2164, 2729, -1337, -2038, 2206, 2641, -899, 432, 3128, -443, -2246, 1976, 3640, 388, -1313, 359, 1318]
867A318o5n94L49k60o21l21J382R06r88j926j30K021P72j512o21J335j212j180
885a347L023J301m039j168L116L12j829O62P61j255r91P74J960O2k485j419K046
902e16J439r16j074J0nM03p14Q65J392j879k794K739K860k900j512K843o79l159
920c597K857K886l194k495K392J315o08P9l31l71L53k78O47K233j122l398J438
937a194L133o91k247P83J028p49o7P70J361p20l449J268L830j563k502J946Q52
954A789k841J185L260k021j977Q83O85O1R86j120j025J460l21j183K133J174l618
971d90j298L849J021k794p88J617j9j445K56J914m06l202J71K934N6k767R40O66
989B15j751K53K002j103q17k73n30J264J751j730k046J993O44k073J158K425k324
$$ y = [1318, 1253, 659, 1008, 748, 127, -194, 1188, 2094, 1106, -820, -950, 1071, 1843, 331, -290, 1045, -167, -1347, 1676, 2977, -1062, -2230, 886, 1198, -631, 31, 792, -463, -1454, -680, 1280, 1342, -1143, -2562, -516, 923, 7, -1067, -1057, -1062, -659, -1373, -508, 884, -995, -3789, -1050, 1810, -1090, -2602, 241, -438, -3597, -740, 2146, -1048, -3543, -1151, 164, -444, -365, -696, -1067, -714, -992, -345, 1888, 766, -2632, -1194, 1939, 1248, -999, -216, 812, 63, -4, 766, 2127, 1407, -2042, -774, 3056, 1493, -1009, 937, 1789, -1052, 133, 3393, 1372, -605, 278, 963, 1024, 2010, 890, -135, 1325, 1004, -179, 1954, 3128, -490, -1788, 2061, 3082, 288, -500, 1117, 1098, -347, -91, 1823, 1417, -1785, -1614, 1320, 1376, -1391, -451, 215, -1536, -1283, 719, -384, -1201, -1474, -2004, -740, 1011, -719, -2765, -772, -128, -2201, -1043, 1382, -942]
1006i42k249K312J779j150j026O92L8r0L25L63O91j146j069P97J753l69j655j3
1024i59P97L54mJ60j08n36j261J191K191j068k422Q95K230j538q51K324l44k564
1042a513Q79J986l43r51k36oM36P64n93P2O41j567j183K430J828k706j554J624
1060HO05j118K80R26j105j099P67J604J01j944r05K047L48j429K0J761j317j863
1078b313J831J470r27q40o37R74J058m33j088J634Q4k995J230L590j564l461J790
1095e97J518j614L80J666j626j341J088R12n1k24j608M13J762m65j257J335Nj567
1113a271L42J619K50q96r56J7J710N63j703O21J070j383o98K709K86k760K73J175
1131I68m11O46N52j084n42J196o88K64J169j505j465K225M10k055P62J483j805
$$ y = [-942, -3191, -879, 900, -250, -1276, -584, -546, -636, -311, 52, 743, -403, -1472, -675, 1078, 709, -946, -959, -162, 192, 188, 348, 240, -296, -1557, -366, 1825, 757, -1665, -770, 1460, -78, -929, 1395, 1051, -1513, -634, 1352, 1009, 58, -178, -184, 252, 1016, 423, 495, 1136, -431, -1614, 816, 2644, -62, -1616, 8, 613, -505, -225, 701, -404, -1503, -736, 868, 969, -975, -1880, 167, 515, -914, -894, 867, -450, -2313, -482, 988, 61, -779, -1416, -442, 616, 183, -905, 729, 813, -2182, -952, 2638, 1074, -2387, -597, 921, -693, -313, 1353, -273, -1614, -526, 386, 335, 111, -1497, -1084, 678, 213, -1044, 291, 296, -1271, -929, 690, 940, 44, -912, -895, 815, 1378, -325, 296, 1366, -17, -715, 1994, 2280, -480, -207, 968, 557, 1203, 1755, 671, 129, 1325, 637, 901, 2070, 565, -900, 1325, 1735, -320, 442, 1925, 120]
1148A20q24J483Q89K0j306j435J817J375k504N0K315k009j496L102O42k672l8
1165d71R93p88Q47L80k427R88J958k500j68K725j683k757K248J363k071M46P92
1182a25q47l41l8K52J239l18k776P60L399j418j744J586J58k129J756J550j875
1199i11j24M12o51J210J099k491J7K849j731j894L935K19m646J775K948k119o23
1216g26K127j685m48J483q15L77J431k405j422L677L17k984J171J002j465N89
1232B24J267j446J27L19q18J031J411k297p89K526o85k116J970J451k791k56J807
1249I35o04n72Q21o18r31J236j93l17J147j040j784J381K292j994j029J213k86
1266c43m52O88J68o75M55q41M95J430p98j820J689L63j320O03R29r47l16L43n09
$$ y = [120, -704, 779, 1668, 1688, 382, -1053, 764, 2139, -365, -315, 2000, -9, -1505, 1597, 2239, -433, -471, 522, -266, 581, 961, -1466, -478, 1480, -1020, -1188, 1537, -146, -2903, -655, 708, -1363, -917, -125, -972, -1313, -1351, -1099, 140, -178, -2954, -2194, 1205, -213, -1957, -371, -213, -2342, -586, 964, -911, -1035, -623, -1274, -64, 1035, -1456, -1439, 1410, -321, -2215, 1720, 1939, -2707, -932, 2016, -103, -726, 1401, -284, -732, 751, -64, 313, 1744, -661, -2083, 1594, 1911, -1073, 98, 1100, -365, 224, 1491, 45, 172, 491, -327, 704, 2115, -182, -971, 1555, 870, -1246, 724, 2175, -616, -872, 935, 331, -241, 580, -38, -969, 267, 74, -243, 904, -136, -1920, -539, 1753, -241, -1270, -57, -343, -795, -107, 61, -614, -159, -1000, -505, 925, 127, -1693, -4, 359, -961, -358, 571, -376, -692, -349, -858]
1285h58J413O53k593N61J938j201q27J992j84k491J151J696n44o58p19N89J166
1302A084n59r83J257N03j912K5K261n49j575J075K81o57N15L57m32K31n76q59
1320e13K009P67k824p0K143o65j646J887J69j947L01J455n82k10k79q83J179N03
1338G94j245j88J855j481j501K296O05j800l77R23o02L5P59n36L97m31j299J360
1356d36J601j829j450K003N3j809J489R37j635m44J208k6ll09o73M59J117r47
1374f94j69J250p24j274J077J062n88p78KO79J41j32k74O48k34j084J085J208
1392A201m69j469N60M57n3L16j27m63j2j0M3J006J56j512L63J085q9q02M99K35
1412I15r45K27O25O35l22j531K0J528l56j063R17L44j520J97J429q5j035j9r7
$$ y = [-858, 555, 1208, -1385, -824, 1114, -87, -914, 1078, 894, -1597, -446, 1250, 706, 48, -671, -82, 1084, 525, -458, 799, 1302, -610, -585, 1676, 1127, -448, 627, 908, 251, 766, 1123, 691, 922, 346, -513, 1496, 2263, -561, -631, 1512, 847, -799, 1088, 1257, -690, -389, 1066, 484, 274, -5, -888, 291, 794, -451, -639, 1216, -265, -1766, 530, 1135, -665, -1042, -119, -721, -686, 73, -463, -66, -497, -1796, -436, 1165, -664, -2114, -111, -58, -1867, -378, 559, -1076, -1520, -312, -338, -341, -650, -1323, -864, 253, -694, -863, 387, -337, -1611, -534, 528, -60, -838, -836, -157, -16, -148, -422, 226, -8, -1092, -7, 1201, 732, -737, -177, 280, 227, 543, 416, -47, -59, -69, -26, 980, 1136, -376, -13, 1072, 983, 181, 680, 915, -30, 197, 822, 1457, 1135, -396, -376, 1152, 796, -267, 650, 994, -526, -329, 1100, 1015, -20, -39, -136]
1431a36Q71N61j309j98J343q75j265J919P46k505n96K263l89q01M13J6n70M25
1449h7k72L65O38j234j046J903N54j682L29Q73j069l75J477M5o09n44p8N86P91
1468E65r59p82J639m74j446J771J190j849q71J525M09r70R17m77l66N22o0k79
1486EP47L8j708J001J383q46r03P48j51m91Q51M4m02N9q19O9J467l39j320J011
1506D44N16j308K94J092r71q88Q10J45M0N39j019n47J290l02r70J196P6j772K70
1525a065J671k96j132L66K90m72M58l05K91N2j092k62J826N3j579J28R96r44k06
1544a222J208k86n01n4j6O48Q25j114q84J477J81j511R63J311j280q48J346N12
1562G55p42j06j47M37K57k52j58Q61n85j277J469J270j885m30J448m61k69L36
$$ y = [-136, 735, 1296, -13, -211, 1132, 257, -1008, 911, 1657, -848, -1444, 819, 430, -371, 42, 58, -512, -87, -359, 6, 644, -590, -1636, 267, 821, -861, -532, 341, -728, -1103, 374, 419, -190, -734, -812, -226, 565, -394, -1176, 463, -11, -1457, 314, 1504, -345, -1216, 309, 718, -252, 665, 188, -178, 344, 284, 5, 752, 790, -918, 83, 1466, 620, -283, 465, 314, -177, 674, 718, 316, 375, -444, -375, 1092, 753, -567, 444, 960, -348, -54, 1038, 67, -821, -11, 134, 174, 713, -306, -853, 437, 135, -835, 361, 437, -1335, -1065, 606, 310, -822, -456, -166, -638, -180, -485, -194, -142, -1234, -1496, 330, 383, -1196, -1068, -72, -1016, -1222, -14, -300, -801, -855, -871, -223, 602, -512, -1396, 81, 262, -1249, -286, 1025, -255, -1103, 243, 755, 13, -93, -240, 197, 454, 202, 44, 905, 320, -957, 512, 1782, -103, -533, 915, 454, 185, 521]
1580E21N63q41l03k91O92R31n30j473J650L16j262p3J545r41p78O18N25m4m15
1599D10k76R5O58p02k72Q96n1j274N25R87p86l96k3R6j11L92j09j6L80o30j02
1620c09J115l72j407O44P84p69p9O24l48m94N7L45K73J2o80k96P58N90r70K80
1640b42N05r63l1Q72J14p30j24J3K11M41j70k71L70m81n59J092O77j240j75Q05
1660A14j59jj42M40k82j9n05O53P22p57r84P94J034q41o9L21q9k93O6P71l04o15
1682a45j22R03l39j90l18O08m1r73N49R99n50j044O50L40r8k80J97j34k7m73L42
1703a46R67p87j120O22Q85m40l53J85L47o28K8P03j5j000o6P12o1j20l62N18J52
1724B1p35K76N16J69p60j20N11N10n53l84M34R7n33K15N98J37o61j02N72L68m04
$$ y = [521, 1084, 243, -60, -351, 341, 1272, 742, -731, 919, 1235, -27, -100, 1445, 504, -274, 344, 869, 825, 410, 134, 229, 887, 185, -87, 809, 758, -516, 9, 996, 210, -186, -209, -113, -224, 168, 59, 43, 423, -207, -309, 806, 434, -973, -329, 455, -314, -393, 231, -117, -611, -554, -209, 64, 76, -604, -900, -142, 448, -522, -242, 263, -700, -731, 141, 255, -475, -599, -586, -375, 66, -104, -375, -5, -486, -1045, 47, 724, -516, -691, 114, -45, -46, -188, 252, -30, -49, -554, 99, 821, 64, -920, -126, 908, 67, -2, 319, 230, -63, 3, 774, 470, -145, -267, 636, 297, 107, -211, 397, 356, -617, -68, 931, 381, -663, -13, 327, 229, -51, 146, 12, -15, -488, -146, 821, 34, -1086, -464, 421, -19, -372, -187, 160, -468, -440, 263, 248, -752, -818, -106, -167, -287, -649, -131, 21, -714, -438, 78, 247, -513, -633, -122, 388, -165, -549, -115, -18, -551, -336, 262, 399, -262, -364, 208, 576, 172]
1745A72n54O58j31J1L0L01J4n02L07J57l24M0K5K16J06l77O1N75J50j118L09N93
1767G19J10n88P7J33j17J6L22k72q7l38J72N04K71r39J10O04n34k60L28K64k89
1788B06l98K10J68o7l67J23L10n62J2L19K96o67m29O29P34q22p4QK44j64L1q2
1810c42J41m13l61O71N14r60n3O50mk49k45M86J42p13j59N76L59n15l71O73Q9
1831h4n68N10N52o02n75N94N09l10k64l49O83P6n58K78N79m52l72O54N31p03j27
1852BK70j03j03n1L63r5j53p3P0P29l17q85M96K68l43J62L74k43n48J82M54j45
1874C11q0m27oP80m37l50M42p4l82l7N99j6l18r6N3O6N9k25J85J86o63j48R78
1897D00j66n77j43K65M28j63k16J48k72j41m2N89K15o66j32Q72r5m39J92L7k9
$$ y = [172, -382, 276, 145, 156, 186, 487, 501, -1, 306, 463, 139, 179, 204, 420, 526, 149, 210, 785, 935, -183, 126, 719, 829, 241, 318, 451, 334, 350, 672, 400, 313, -25, 147, 651, 922, -17, 93, 697, 163, -97, 231, 495, 206, -192, 18, 186, 119, -248, -125, 185, -377, -365, -46, 250, -417, -846, -217, 517, -305, -379, -371, -127, -291, -260, -342, -201, -614, -975, -304, 210, -750, -803, -153, -157, -406, -651, -165, -23, -736, -895, -319, 40, -475, -846, -173, -84, -652, -142, 410, -192, -767, -173, 336, 26, -238, -587, 96, 172, -386, -108, 471, 19, -353, 301, 832, 129, 2, 272, 169, 66, 15, 378, 283, 130, 57, 127, 856, 539, -346, 150, 418, 75, 237, 611, 368, -180, 2, 456, 311, 231, -196, -202, 578, 141, -209, 233, 159, -223, -260, 339, 323, 5, -91, -38, 28, 87, -138, 47, 233, -430, -578, 400, 234, -343, -486, -221, 207, 44, -172, -24, -296, -437, -479, 110, 325, -341, -473, 399, 304, -135, 57, 94, 65]
1918F5m76L72J94K54n58j31P45o5m38K35M35m88k88K77L88k92k17l26P79J34p19
1939a20M4M28l38m99R71M22j209K71K79K37n68q3N06p4n7k25P0O28p02n45P62
1960A98M17o84k42Q45n54m67O70j33p1o5j78j01Q37n96m53O58K34j212N74O57
1980C34n72l21J60M24k21M16m08j21L03n15l40Q60r6n97l2Q11k17l34M38j79j89
2001c96J80j88J74M03m34l90O85r1m89N54K9n66L42O07n85K28L7kj90N67l96p2
2023GN79l73n71O97L05p01K9M71k98l3R1p6K75M16p40K62N75o08o41J011K78j023
2045f8K02M70n62J49M83k09k68J20o06K60N70o21j63O20j62n37N23K42o17j80
2065c54L88J12J01n40O8j68M97n16K5J033q14n21N66L29o57L6M30m34J10L05p7
$$ y = [65, -411, -39, 155, 409, -149, -280, 465, 400, -38, 197, 632, 144, -144, 133, 521, 229, 12, -314, 465, 599, -120, -76, 352, 14, -485, 486, 908, -301, -30, 249, 486, -82, -165, 341, 267, 210, -15, 55, 683, -19, -564, 198, 615, -69, -311, 534, -20, -487, 183, 50, -21, -86, -264, -365, 472, -124, -577, 81, 315, -897, -323, 334, -238, -559, -399, 25, -196, 220, -188, -309, -6, -521, -861, -1, -97, -694, -726, 85, -132, -466, -28, -207, -396, -216, -404, -230, 173, -261, -651, 34, -57, -546, 8, 37, -529, -187, 420, -165, 63, 100, 98, -92, 475, 79, 7, 586, 213, -358, 339, 644, -57, -28, 443, 145, 112, 203, 127, 402, 818, 78, 340, 915, 307, -334, 677, 955, -68, 134, 604, 42, 191, 674, 465, 197, 317, -289, -29, 541, -80, -243, 377, 215, -322, 201, 443, -174, -354, 34, 146, 247, -293, -225, -393, 104, -412, -387, 646, -168, -689, -123, 206, -451, -415, 15, -419, -309, -4, -81]
2086h1J46Q2n61k70R96k8j158N75P27q73kJ042p27k2J44K0J11J01p32M03O19n25
2108a3k41P36ro84j12Q71m84r5K15j42P3K15l29j08M83m78j88Q49n8n88N1N35
2130D99n28r2N70l72O9j48j18M23j02k80l58M83J83o13R7M88j70k81pN9L60j89
2152b7k04L25J5k78l26Q37m44m41K15O66m89k46K11Q1j36L30l77J40M6j64J07
2173a59M85l39n89M24J99j38j70M35j24j90j60K50p0J79n73N04M15l25Q6P6n2
2194A64m51J17N86j06k95N7J42L47k66k19K32K04o51L70K30J81o84Q5K13n5j41
2215F0O4J67o0l56N10k1J91n32K0N25l05m35K33L56m60r9K98M2j85M4K65p8k02
2238D2j00P2K64k29l88O83J21o88k18K68L62n16L85o1m89K84j11OQ0Mj81Q0K73
$$ y = [-81, 65, 147, -414, -684, 312, 284, -874, -299, 428, -445, -447, 595, -132, -154, -10, 10, 121, 222, -510, -107, 512, -13, -254, 482, 473, -211, -323, 548, 64, -31, 184, 42, 115, 330, 1, -107, 376, -102, -290, 559, 501, -87, -36, 499, -29, -121, 449, 77, 146, -2, -120, 303, 201, -79, -437, 46, 229, -384, -287, 201, 31, -250, -257, -198, 162, -27, -231, 94, 109, -169, -495, 342, -102, -543, -328, 338, -151, -397, -186, -105, -241, 89, -288, -148, -102, -266, -159, 326, -13, -602, -178, 21, -117, -287, 148, 24, -166, -326, -76, -146, 33, -540, -36, 379, 54, 140, 216, 164, -287, -170, 416, 310, 15, 72, 214, 561, 295, 76, 308, 512, -139, 231, 461, 642, -42, 43, 256, 201, 60, 124, 291, 231, -125, 385, 364, 555, 23, 43, 568, 263, -172, 61, 417, -43, -142, 156, 198, 13, 57, 322, 244, 42, -58, 14, 278, 49, -339, 344, 465, -223, -441, -173, 189, -327, 58, -3, -492, -208, -319, -313, -233, -229, -410, -330, -57]
2261e7j68k29K12K32j95k94K26j34R8j20M13O7m41J89J30k8j64j15L94J88p43
2282e39K99P4k4J97j70J52J52j86j9J59J1m25R6L60M08o24j52M13r5j24K3N02
2304D88m02j14j81K66J95l58j2L91j40j19L78L1m58j68N20l30J5p1N7K72rm97
2326b46J34K90l85k7L51P5n20J98L22k10o9K98q6J46l49k62L76K00n2l82O7J27
2348dK5j00N27q03J83J22o2N0k56K14K0q5R9j67J96K31l80M7M16l56o3J62J06
2371A22m90K39K58J86m99p4K12N87J15p66J40L27p8l5l4J15m54J37P8J81n5L0
2393B42j57L02O1m64L43L12m25l94N07N9k54K6j09N9L0M4k84M03j66o09N31M83
2415E40o02l94N15J00l81O6L3l2j99J88R8K40k37k76O8K18k05Q7K91m07o4K34
$$ y = [-57, -225, -454, -242, -10, -205, -499, -273, -407, -309, -429, -16, 51, -390, -201, -71, -99, -263, -378, 16, 204, -539, -240, -166, -190, 7, -163, -11, 141, -45, -64, 95, 106, -319, -223, 137, 545, -79, -231, 182, 87, -37, -14, 488, 86, -28, -209, 57, 252, -106, -118, 273, 133, 14, 392, 423, -35, -203, 317, -13, 2, -69, -12, 260, 251, -246, -112, 178, -207, -234, 117, 192, -328, -130, 192, -18, -87, 211, 125, 271, -78, -340, 36, 236, 184, -198, -131, -4, 21, -79, 448, -355, -172, -50, -112, -62, -318, -104, -84, -169, -70, -237, -41, 190, -190, -143, 273, -83, -146, 16, 122, -368, -129, 129, 315, -184, -258, -46, 541, 656, -110, 30, 357, 279, 244, 210, 325, -129, 8, 86, 267, 212, 242, 85, 387, 448, -16, 327, 639, 214, -180, 327, 386, 132, 158, 49, 108, 138, 182, -102, 301, 135, -474, 57, 540, -62, -456, 59, 159, -222, -156, -123, -155, -354, -166, -68, 172, -65, -341, -273, -55, -260, -173, 118, -289, -353, -119]
2437a19J01m37L21j45j9K59o7l76K76K08o51M68J60l05r8L11M96m48J40j16R0
2458D9J1l45J00M83k52n53M80M6k41M3J67J73l31K23K46j5M4l45K3P00n29k42
2480f5k2K73m45L24N55n05j59J61j64R9J15o6k52L31j33r6K22J18l48j73O84k20
2502B34j04K82k94k99J28K04j33L54n7k59J21O0o10J71K36O4j76K92j13K5l13
2523a87J52j74M47p3l69L53o8n20M48J27j80j85L51j03r6J60k57k27N57m29j2
2544b85N06l52j98L51M18m34N0l37K24k27M66k66J93N9j33l31N52J1n88J07M13
2565A99k05j74M34k03k85K59J98n6L5j58mM0j42l33O95k6m62J48L27m55oJ19M1
2588a4J15j20J41k15J96j37k31N12k70l76N85k26O1j78K46l61RK43n0j31J41j57
$$ y = [-119, -18, -455, -134, -279, -298, -39, -106, -482, -206, 2, -649, -181, -21, -326, -424, -113, 383, -65, 75, -41, 49, 60, -285, -185, 298, 46, -507, -27, 19, -222, -179, -12, 161, -170, 53, 299, 284, 328, -17, 6, 706, 177, -65, -87, 186, -259, 65, 620, 115, -44, 117, -47, 52, 167, 101, -151, 180, 47, -49, 173, 291, -57, -230, 454, 234, 130, 412, 118, -181, -53, 151, 18, 372, 315, 56, 177, 237, -373, -202, 34, 98, -78, 214, 101, 126, -187, -35, -209, 238, 165, -204, 149, 81, -439, 9, 136, -44, -229, 122, 19, -77, 83, -174, -401, 156, -273, -285, 221, -131, -329, 22, 440, 6, 56, -281, -57, -284, 182, -84, 109, 168, 35, -296, 256, 267, -321, -214, 199, -6, -180, 254, 51, -234, 25, 223, 167, 202, 44, 40, 80, -62, -395, 300, 274, -188, -40, 287, -168, -174, -55, -14, 101, -19, 122, -93, 103, -34, -265, 247, -23, -399, 186, -40, 21, -157, 89, -272, -263, -20, -70, -201, -60, -217]
2610b17k53N61m40J70J89j5n64L15L77r0kj29J3J10j02j97j23N58k97l63N05J21
2632A27k70N4q5K12m7J83l13J49K19m41K78j56r8jL96q2m39M49J52l10j04K33
2654A06j39L76r2l46K26K93J1n09L12r0m02K94N38n79J36J44k32L32k84j16L22
2675C01n5l57j20O88M4n09K08J08p0m11M06m3j94j3j15K77k4m63K88j9n0j72K6
2698b69M38n53P8M01k50R1J30l26L61J70p60N26K12m30L2K53k87l22K28N06k81
2719e2J75J55n28J97M7j92J09R1l30K9K10J17k90J88J68m45L31j02j34P05k76
2740A73k29p8M58m60j30O04l75PK39r9l00K06J71k93K7K91j09j04L59m21K0J81
2762A38k59j21K45N1j34Q7L60n28J48N7j80K84J90n29J53L58k53j71N0J41n7Q9
$$ y = [-217, -470, 91, -349, -179, 10, -5, -569, -254, 123, 33, 31, -98, -85, 25, -77, -274, -397, 161, -136, -499, 6, 127, -143, -89, -174, 38, -9, 174, -139, 10, 229, -212, 66, -90, -188, -189, 207, 125, -314, 135, 287, -23, -127, 106, -33, 343, 251, -95, 131, 424, 435, -74, 238, 148, -254, 40, 578, -1, 135, 279, 47, 379, 95, -21, 301, 246, -111, -231, 457, 501, -8, 200, 308, 238, -173, 233, 190, -4, -17, -132, 145, 121, -342, -54, -73, -123, -295, -269, 169, -384, -306, 95, -155, -64, 66, -260, 101, 271, -489, 37, 249, -181, -149, 104, -183, -505, -277, 229, -52, 123, 278, -250, -53, -6, -198, -89, 2, -328, -299, -89, 28, -262, -74, 94, -351, -20, -122, -256, 449, 173, -56, -134, 324, -136, -266, 338, -37, -30, 209, 110, -190, 16, 187, -106, -79, 212, 103, -1, 358, -63, -43, 138, -121, -242, 3, 54, -80, 7, 367, -161, -13, 44, -136, 148, 338, -191, -38, 320, 67, -104, -54, 87, 30, 119]
2784A19Ok76J48j56j54J51O6j57l2M84o53M86J33l00L08m26K45p7J4k50j17P20
2806B82m83O3K34J93l10j95K82n1l56N41j97k38K26K77k98J92j68K8K0K18j50
2827A10k04L99l79Q3J70pm7k17M97m24J09j33k0N28j31m21k0L92l60J46K7j1k75
2850a88K85K1k64M30j03J45l40J86k46K67J93l44j70L69j11k65K30J62k63M8k03
2871a61M9M4J90n79L43Q9k27P5J90Q7l22J46Rk01L90l31J27oQj49K00N2l92J99
2895a70N44m17l00L67k01l5L03m36J80J41J43m17K35L79o10J30J62o0j83K08j40
2916a77q7K39O7j48J33J04M5M7j26j8Q1k52J26m12J05M88k62L97l48J40j08l8
2938dO5J24J31n11M21N7m17O0M20k00p1Q1L2k99j0J87m0J21r0j43K52k97J39j07
$$ y = [119, 125, -151, -3, -159, -313, -162, -96, -253, -285, 199, -454, 32, 165, -135, 173, -253, -8, -85, -71, -321, -438, 282, -201, -138, 96, 289, -21, -216, 66, 15, -341, 200, 3, -235, -9, 268, -30, 162, -6, 22, 42, 260, 110, -94, 305, -74, 9, 179, 172, 125, -92, 405, -19, 90, -43, -63, 465, 334, -87, -107, 285, -75, 71, 98, 87, -188, 97, 118, -146, 284, 181, 326, -14, 172, -74, 193, 386, 42, -128, 241, 130, -135, 95, 257, -6, 42, -161, -112, -68, 122, -457, -114, -25, -252, -177, 13, 100, -222, -76, -67, -268, 122, -209, -82, -88, -80, -229, -29, 23, -369, -170, 374, -43, -343, 24, -177, -212, 91, -345, -165, -24, 119, -298, -63, 316, -294, -164, -2, -62, -245, -37, -177, -264, -25, 42, -106, 27, 131, 176, 223, 97, 79, 160, -92, 34, -378, -273, 215, -47, 350, 2, 142, 34, -4, 61, 185, 316, -195, 226, 283, -134, -74, 346, 146, 75, 156, 188, -111, -121, 66, 26, 147, 57, -86, 166, -131, 8, -99]
2962i9J22%p4J19J62k61P5j10K45j35j78K78l3K1l68K28L9l31K36J53j28K48k10
2985aO3J16m13n8K93j62O0mJ29R4k18K14r3j15J30k39K1L28k26J90l64L58j13
3008a0j89K25j3K26p5k0k62J63N3l16L09n2q4k5J68O2j41l9J54J17l04M9K17k34
3032b1j75M38k68Q2j14L12j21Rk64J20Q4k9K7m5j27M7J4j35NmK29o4%L1j79o8
3058b16J52Q3j66J34j68p0J01K37JK9p2M0j78j83K83J60k74L40n04K35qk76J58
3081a62P0R6M1l86K75J36j44qq0K89p1j33lM8j2j7n0J25k75L94J02k82J3K25o3
3106A28k41O1P7Q9k71LJ86K86n8N6j70K10l93K08OP0j17M8n5q6P2j46O9K00j48
3131H4j83L57k98k9J41L07m26R2j57J32k1Q6J38j89Nr5M9j10N9j9K17l7k27m0
$$ y = [-99, 23, 23, -51, 68, 230, -31, 44, -66, 179, 44, -134, 144, 111, 132, -236, -8, 31, -300, -64, 89, -39, 209, -1, 62, 178, -235, -293, 0, -162, -102, -106, 23, 117, -101, 113, 20, -95, 35, -204, -183, 145, -81, 109, -255, 103, -10, -199, 26, 13, 239, 164, 144, -118, 45, 98, -218, 91, 39, -45, -70, 98, 160, 19, -20, 134, 251, -53, -4, 213, -21, -196, 242, -26, 56, -58, 254, 133, 142, -122, -2, 82, 53, 80, 35, -92, -45, -31, -166, -161, -165, 64, 0, 0, 31, -148, -216, -64, 19, -147, -13, -181, -251, -150, 87, 88, 117, 45, 85, -93, -276, 7, 167, -107, 233, -271, -36, -44, -320, -162, -92, 4, 45, -341, -66, 70, -74, -82, -162, 127, 56, -77, -80, -32, -44, -61, -111, 14, -261, 133, 235, -47, -34, 191, 128, -113, -52, 25, 114, -157, -154, 32, 318, 260, 316, 146, 356, -37, 171, 177, 247, 130, 178, 123, 37, 109, -37, 32, 232, 84, -99, 258, -40, -69, 72, 379, -47, 45, -112, 20, -1, 85, 223, 34, 39, -56, -7, -117, -58, -77, 140, 103, -124, -164]
3155a64L47m89J77J14j73K99k35J9J6j55K22j70J08J92j07j0j06l7j4L6k02L06
3177b6N2k64L08j75N1J83Po5l81K71J40j17r4J91k35M6O1M0l44K69R8k18L75k85
3201a12J20J56m2N7k88J32n9Q5J87l57l7k1J72k51M85j13k35R3J23j51m8R5J70
3224A61lMl9m04L68m2k30L66l69K03M5P0m58K08Q3k52K33j2m2J4j43J39qR0R4
3249G6l97M88j53l06K77P4j30j12j71J32L93k06j3j70L97j40m47P02l93J53j04
3270e0lN3j6O6R0m19K29o3J23j49K37l11N18j22j35k67K51J62k69J38k7O2J26
3293B24j6k10M8K73j46Q1k5j69L08j98j26JJ54l02J15N9k7J63j54L0O9K32l40
3316D4l8L21j87j21p3p1K67o8j2k37L49o1m63O0L91j41J00J0N2kl5j06j5l6l20
$$ y = [-164, 183, -306, -129, -15, -188, 111, -124, -105, -89, -244, -22, -192, -84, 108, 1, -9, -115, -152, -166, -130, -332, -26, 26, -238, 70, -105, -54, 129, 136, 71, -310, -39, 101, -16, -110, 81, -154, -108, -47, -7, -351, -82, 16, -202, 173, -112, 8, 164, 122, 179, -109, 23, -36, 49, 236, -121, -158, -179, -7, -258, 227, 114, -121, -28, 95, -56, -104, -9, 161, 158, 162, 123, -281, 87, 45, -185, 181, -188, 15, 60, 130, -328, -120, -37, -289, -56, -68, -110, -96, -239, -100, -108, -18, 76, -321, 167, 14, -292, -15, 59, -71, -183, -354, -222, 171, -35, -48, -218, 179, 39, -408, 294, -99, 54, -50, -53, 0, -16, 50, 140, -279, -50, -113, 10, -139, 98, -213, 305, 183, 48, -219, 32, 194, -75, 63, 36, 98, 224, 208, -2, 46, 319, 173, 254, 229, 60, 368, 170, 44, 45, 199, -103, 12, 71, 44, 207, 53, 83, 152, 384, 44, 6, 327, 140, 19, -54, -125, 142, 74, 62, -175, 174, 113, -350, -290, 101, -40, 60, 70, 122, 120, 85, -21, -36, -72, -392]
3341c92K28R3p8J30k25L52k10J99L4j41l22K89K5k46K89j95K59K7k98Q6K53O7
3363B24l19J05j11m4k22L07J65j43J03r5N8l8J68k18K87l97J93j1k32K04ol8J18
3386E8J02o6J12m84K29k7J23M4R9l13r9M71k24l4k6k5O2J7k2K0J50j36j09P7j85
3411a86M2N2J98j19j34K54Ol63J80N3r8J63J32k06J83m0j52M3P5j80k8N2J80l31
3435b24J8K30RKj69m8J02j3l2K67j41M4j83j2k7l1M34m3j81r7oJ99j90J0n1Q6
3461d7J77k47K00J09l24K83k33P1O2J3J34k28j30j91L30K31j49l64N91k52k50
3482b14K30N5J4j23k2K32j26N3N6l50O1J50J82k57J35r8l0k37K72k36J18K9j1
3505a17j11q5j6M24j90k3j67L12k26P9M6j48M2K62J43j48M9l06J91nl83J18J69
$$ y = [-392, -164, -71, -149, -19, -244, 108, -102, 97, 131, -10, -332, -43, -18, -264, 25, -170, 89, 116, -182, -96, 157, 224, -95, 10, -101, -145, -367, -60, 105, -38, 65, -30, 28, -10, 158, -60, 227, -170, 23, 12, -220, -16, -22, -60, 58, 160, 94, 206, -278, -49, -76, 47, 91, 190, -123, -222, 249, 25, -9, -35, -60, 2, 19, -3, 17, 167, 31, -78, -1, -186, -144, -92, 106, -13, -147, 107, 113, -250, -70, -17, -115, 48, 180, -26, 157, 117, -35, 8, 83, -97, -125, -73, 107, -224, -206, 24, 33, 35, -134, -182, -80, -93, -125, 142, 1, 45, -138, -150, -177, -208, 226, 183, 2, -95, -101, 98, -92, -82, -133, -47, 130, -117, 83, 192, -132, 151, -82, -11, 51, 64, 198, -30, -160, -351, -21, 210, 61, -303, 288, 36, -214, 16, 71, 85, -38, -60, 172, 46, 99, 155, -195, -134, 16, 198, -59, 76, -22, -52, -289, -17, -253, -135, -106, -117, -228, -313, -329, 95, -95, -118, -285, 27, -199, -120, -74, -222, -180, 82, 225, 77, 126, -180, 11, 6, -377, -259, -90]
3528i0Rq6M3K57l94J45k9J39O0j16J39k40J32k34L27J06j31j70J79M1j68K4K15
$$ y = [-90, -81, -167, -124, 133, -261, -116, -145, -6, 54, -62, 77, -163, -31, -265, 62, 168, 37, -133, 46, 87, -81, -57, 158]
$$ [...]
8191I8
##END NTUPLES=NMR FID
##END=
