##TITLE=1H_SL-89-Dau-Alpha(f4)
 CDCl3, 8 sc, 
 7.06.2021
##JCAMPDX= 6.0         $$ Bruker NMR JCAMP-DX V2.0
##DATA TYPE= NMR FID
##DATA CLASS= NTUPLES
##ORIGIN= UXNMR, Bruker Analytische Messtechnik GmbH
##OWNER= root
$$ XWIN-NMR		Version 3.5
$$ Mon Jun  7 10:28:47 2021 Russian Standard Time (UT+4h)  she@DPX200
##.OBSERVE FREQUENCY= 200.131506
##.OBSERVE NUCLEUS= ^1H
##.DELAY= (6, 6)
##.ACQUISITION MODE= SIMULTANEOUS
##.ACQUISITION SCHEME= undefined
##.AVERAGES= 8
##.DIGITISER RES= 18
##SPECTROMETER/DATA SYSTEM= spect
##.PULSE SEQUENCE= zg30
##.SOLVENT NAME= DMSO
##.SHIFT REFERENCE= (INTERNAL, DMSO, 0, 15.7039)
##AUDIT TRAIL= $$ (NUMBER, WHEN, WHO, WHERE, WHAT)
$$ ##TITLE= Audit trail, XWIN-NMR		Version 3.5
$$ ##JCAMPDX= 5.01
$$ ##ORIGIN= Bruker BioSpin GmbH
$$ ##OWNER= she
$$ F:/spectra/data/she/nmr/H-F/1/audita.txt
$$ ##AUDIT TRAIL=  $$ (NUMBER, WHEN, WHO, WHERE, WHAT)
(   1,<2021-06-07 10:27:31.18 +0400>,<she>,<DPX200>,
      <created by zg, POWCHK disabled, PULCHK disabled
       configuration hash MD5:
       00 E9 B6 7A A2 85 ED C7 34 08 36 98 17 FE 4E 26
       data hash MD5: 16K
       06 6D 67 FE 99 85 75 C8 FB A1 32 41 11 3F 54 43>)
$$ ##END=
$$ 
$$ hash MD5
$$ 13 3E F6 18 E5 65 47 71 4C 93 C0 65 DB 25 B2 8E
##$RELAX= 
##$RELAX= 
##$RELAX= 
##$RELAX= 
##$RELAX= 
##$RELAX= 
$$ Bruker specific parameters
$$ --------------------------
##$DU= <F:/spectra>
##$EXPNO= 1
##$NAME= <H-F>
##$PROCNO= 1
##$TYPE= <nmr>
##$USER= <she>
##$AMP= (0..31)
100 100 100 100 100 100 100 100 100 100 100 100 100 100 100 100 100 100 
100 100 100 100 100 100 100 100 100 100 100 100 100 100 
##$AQSEQ= 0
##$AQ_mod= 1
##$AUNM= <au_zg>
##$AUTOPOS= <>
##$BF1= 200.13
##$BF2= 200.13
##$BF3= 200.13
##$BF4= 200.13
##$BF5= 200.13
##$BF6= 200.13
##$BF7= 200.13
##$BF8= 200.13
##$BYTORDA= 1
##$CFDGTYP= 0
##$CFRGTYP= 5
##$CHEMSTR= <none>
##$CNST= (0..31)
1 1 145 1 1 1 1 1 1 1 1 1 1 1 1 1 1 1 1 1 1 1 1 1 1 1 1 1 1 1 1 1 
##$CPDPRG= <>
##$CPDPRG1= <>
##$CPDPRG2= <>
##$CPDPRG3= <>
##$CPDPRG4= <mlev>
##$CPDPRG5= <mlev>
##$CPDPRG6= <mlev>
##$CPDPRG7= <mlev>
##$CPDPRG8= <mlev>
##$CPDPRGB= <>
##$CPDPRGT= <>
##$D= (0..31)
0 1.2 0 0 0 0 0 0 0 0.06 0 0.03 0 0 0 0 0.0002 0 0 0 0 0 0 0 0 0 0 0 0 
0 0 0 
##$DATE= 1623047250
##$DBL= (0..7)
120 120 120 120 120 120 120 120 
##$DBP= (0..7)
150 150 150 150 150 150 150 150 
##$DBP07= 0
##$DBPNAM0= <>
##$DBPNAM1= <>
##$DBPNAM2= <>
##$DBPNAM3= <>
##$DBPNAM4= <>
##$DBPNAM5= <>
##$DBPNAM6= <>
##$DBPNAM7= <>
##$DBPOAL= (0..7)
0.5 0.5 0.5 0.5 0.5 0.5 0.5 0.5 
##$DBPOFFS= (0..7)
0 0 0 0 0 0 0 0 
##$DE= 6
##$DECBNUC= <off>
##$DECIM= 32
##$DECNUC= <off>
##$DECSTAT= 4
##$DIGMOD= 1
##$DIGTYP= 9
##$DL= (0..7)
0 120 120 120 120 120 120 120 
##$DP= (0..7)
150 150 150 150 150 150 150 150 
##$DP07= 0
##$DPNAME0= <>
##$DPNAME1= <>
##$DPNAME2= <>
##$DPNAME3= <>
##$DPNAME4= <>
##$DPNAME5= <>
##$DPNAME6= <>
##$DPNAME7= <>
##$DPOAL= (0..7)
0.5 0.5 0.5 0.5 0.5 0.5 0.5 0.5 
##$DPOFFS= (0..7)
0 0 0 0 0 0 0 0 
##$DQDMODE= 0
##$DR= 18
##$DS= 0
$$ [...]
##$SUBNAM2= <"">
##$SUBNAM3= <"">
##$SUBNAM4= <"">
##$SUBNAM5= <"">
##$SUBNAM6= <"">
##$SUBNAM7= <"">
##$SUBNAM8= <"">
##$SUBNAM9= <"">
##$SW= 20.0188882624521
##$SWIBOX= (0..15)
0 0 2 0 0 0 0 0 0 0 0 0 0 0 0 0 
##$SW_h= 4006.41025641026
##$TD= 16384
##$TD0= 1
##$TE= 0
##$TE2= 300
##$TE3= 300
##$TEG= 300
##$TL= (0..7)
0 120 120 120 120 120 120 120 
##$TP= (0..7)
150 150 150 150 150 150 150 150 
##$TP07= 0
##$TPNAME0= <>
##$TPNAME1= <>
##$TPNAME2= <>
##$TPNAME3= <>
##$TPNAME4= <>
##$TPNAME5= <>
##$TPNAME6= <>
##$TPNAME7= <>
##$TPOAL= (0..7)
0.5 0.5 0.5 0.5 0.5 0.5 0.5 0.5 
##$TPOFFS= (0..7)
0 0 0 0 0 0 0 0 
##$TUNHIN= 0
##$TUNHOUT= 0
##$TUNXOUT= 0
##$USERA1= <user>
##$USERA2= <user>
##$USERA3= <user>
##$USERA4= <user>
##$USERA5= <user>
##$V9= 5
##$VALIST= <valist>
##$VCLIST= <CCCCCCCCCCCCCCC>
##$VD= 0
##$VDLIST= <DDDDDDDDDDDDDDD>
##$VPLIST= <PPPPPPPPPPPPPPP>
##$VTLIST= <TTTTTTTTTTTTTTT>
##$WBST= 1024
##$WBSW= 4
##$XGAIN= (0..3)
0 0 0 0 
##$XL= 0
##$YL= 0
##$YMAX_a= 207132
##$YMIN_a= -154094
##$ZGOPTNS= <>
##$ZL1= 120
##$ZL2= 120
##$ZL3= 120
##$ZL4= 120
##$ABSF1= 10
##$ABSF2= 0
##$ABSG= 5
##$ABSL= 3
##$ALPHA= 0
##$AQORDER= 0
##$ASSFAC= 0
##$ASSFACI= 0
##$ASSFACX= 0
##$ASSWID= 0
##$AUNMP= <proc_1d>
##$AZFE= 0.1
##$AZFW= 0.1
##$BCFW= 1
##$BC_mod= 2
##$BYTORDP= 1
##$COROFFS= 0
##$CY= 11.3945322036743
##$DATMOD= 1
##$DC= 2
##$DFILT= <>
##$DTYPP= 0
##$F1P= 15.9154993809931
##$F2P= -4.1035820241983
##$FCOR= 0.5
##$FTSIZE= 0
##$FT_mod= 4
##$GAMMA= 1
##$GB= 0.15
##$INTBC= 1
##$INTSCL= 1
##$ISEN= 128
##$LB= 0.24
##$LEV0= 0
##$LPBIN= 0
##$MAXI= 10000
##$MC2= 0
##$MEAN= 0
##$ME_mod= 0
##$MI= 1.114404
##$NCOEF= 0
##$NC_proc= 0
##$NLEV= 6
##$NOISF1= 3.799351
##$NOISF2= 2.8
##$NSP= 1
##$NTH_PI= 0
##$NZP= 0
##$OFFSET= 15.70392
##$PC= 1
##$PHC0= -11122.14
##$PHC1= 11.20101
##$PH_mod= 1
##$PKNL= yes
##$PPARMOD= 0
##$PSCAL= 0
##$PSIGN= 0
##$REVERSE= no
##$SF= 200.130013532006
##$SI= 16384
##$SIGF1= 3
##$SIGF2= 2
##$SINO= 400
##$SIOLD= 16384
##$SREGLST= <1H.CDCl3>
##$SSB= 0
##$STSI= 0
##$STSR= 0
##$SW_p= 3612.71676300578
##$SYMM= 0
##$S_DEV= 0
##$TDeff= 0
##$TDoff= 0
##$TI= <>
##$TILT= no
##$TM1= 0
##$TM2= 0
##$TOPLEV= 0
##$USERP1= <user>
##$USERP2= <user>
##$USERP3= <user>
##$USERP4= <user>
##$USERP5= <user>
##$WDW= 1
##$XDIM= 8192
##$YMAX_p= 0
##$YMIN_p= 0
$$ End of Bruker specific parameters
$$ ---------------------------------
##NTUPLES= NMR FID
##VAR_NAME=  TIME,          FID/REAL,        FID/IMAG
##SYMBOL=    X,             R,               I
##VAR_TYPE=  INDEPENDENT,   DEPENDENT,       DEPENDENT
##VAR_FORM=  AFFN,          ASDF,            ASDF
##VAR_DIM=   8192,          8192,            8192
##UNITS=     SECONDS,       ARBITRARY UNITS, ARBITRARY UNITS
##FACTOR=    0.0002496,     1,               1
##FIRST=     0,             0,               0
##LAST=      2.0444736,     0,               0
##MIN=       0,             -154094,         0
##MAX=       2.0444736,     207132,          0
$$ Real data points
##PAGE= N=1
##DATA TABLE= (X++(R..R)), XYDATA
0@%%%%%%%%%%%%qJ6j6J6j6K4l2L7m5N6o4P2q8J04j20J36j56J80k07K36k67L03
$$ 0 0 0 0 0 0 0 0 0 0 0 0 0 -8 8 -8 8 -8 16 -16 21 -24 32 -32 40 -48 56 -64 72 -84 96 -111 125 -142 161
34A61l42L85m32M83n40O03o73P49q30R19j018J125j238J365j506J660j829K014
$$ 161 -181 204 -228 255 -285 318 -355 394 -436 483 -535 590 -648 717 -789 871 -958 1056
52A056k220K450k707K995l323L701m142M659n277O037o992Q234r923J2360j6197
$$ 1056 -1164 1286 -1421 1574 -1749 1952 -2190 2469 -2808 3229 -3763 4471 -5452 6908 -9289
67i289K3138l9493J44451Q8325l37967O8462J66943r9161p1281J18749j4343n9187
$$ -9289 13849 -25644 118807 207132 -130835 -62373 104570 5409 -65872 52877 38534 -20653
79b0653K1703Q186j0688M1409k3317n3068J7441L5513q672K056l217r448Q488
$$ -20653 1050 9236 -1452 39957 16640 -36428 -18987 16526 7854 9910 6693 -2755 5733
92E733N837r844O877j1867j9731L3674K9393m2792j535M8059m7620o0363Q7434
$$ 5733 11570 1726 8603 -3264 -22995 10679 40072 -2720 -4255 43804 -3816 -64179 23255
105B3255N9746r3558l6428O6874q113k4692M2340j2112m2858L0857l262l5078
$$ 23255 83001 -10557 -46985 19889 11776 -12916 29424 17312 -25546 5311 2049 -33029
117c3029O1520K2868j03440n009J03269r812o5007K1016J9340k7961M07K3952
$$ -33029 28491 51359 -52081 -57090 46179 36367 -28640 -7624 11716 -16245 -15838 8114
129H114O508j4333j8007J3672K2231j3270k076J3630l6749j8680O0772J8512m7703
$$ 8114 14622 289 -17718 -4046 18185 4915 2839 16469 -20280 -38960 21812 40324 -7379
142g379O83K1015j8154j101R391j4927J1336J5462l2356m6M9324j3216n4521Q592
$$ -7379 -6696 14319 -3835 -4936 4455 -10472 864 16326 -16030 -16076 33248 20032 -34489 -25897
156b5897L1212l889n537K153n622q14M045O013P776j5403k6039J2455K7040J737
$$ -25897 5315 1426 -4111 -1958 -7580 -8394 -4349 1664 9440 -5963 -32002 -19547 7493 9230
170I230J714q34k9622o185L4414M854j7725P634o925j4863L2511J2442m3068M481
$$ 9230 10944 10110 -19512 -25697 8717 13571 -4154 3480 -3445 -18308 14203 26645 -16423 -11942
184a1942L8163l3791k2892N2482M213n1501J3382L0174k2253k899J7993k1001
$$ -11942 26221 -7570 -30462 22020 26233 -25268 -11886 18288 -3965 -6864 11129 -9872
196i872p331K3549o621q088J8537j3985k6032K5342K5472j8711j3622K699l517
$$ -9872 -17203 6346 -275 -8363 10174 -3811 -29843 -4501 20971 2260 -11362 -8663 -12180
209a2180M062J0154L868K712j3700j8830K2672K5061k8886j8427K8826p06k1366
$$ -12180 -8118 2036 5904 8616 -5084 -23914 -1242 23819 -5067 -23494 5332 4626 -16740
222a6740K6041J5569l8749o866L0205p663j2649J7643o739j5958K4008O041k5135
$$ -16740 9301 24870 -13879 -20745 9460 1797 -10852 6791 52 -15906 8102 14143 -10992
235a0992J0420J2038l3299o99M3331l019k8849R871Q883j5973K935J5140l452
$$ -10992 -572 11466 -21833 -22532 20799 17780 -11069 -1198 7685 -8288 -5353 9787 6335
248F335j0898k802R804J3749o714j2402O769m28j2455J3845J5314j6531r561J0213
$$ 6335 -4563 -7365 2439 16188 9474 -2928 3841 3413 -9042 4803 20117 3586 -5975 4238
262D238J640L955N877k1013j1545K5254Q780j8282L586Q891j8257n079K2684L692
$$ 4238 5878 9833 15710 -5303 -16848 8406 17186 -1096 2490 11381 -6876 -11955 10729 14421
276A4421j8761k929J0707l482p065J0152R201j3642j2802J1286J2136o883q447
$$ 14421 -4340 -7269 3438 -44 -7109 3043 12244 -1398 -14200 -2914 9222 2339 -6108
289f108Q96K012K526J530j317J381J196j0409l974J7598N604k0452n630J7813
$$ -6108 -5212 -3200 -674 856 -461 920 2116 -8293 -12267 5331 10935 -9517 -15147 2666
303B666K081r916R542L224k3562m963K5876P799j6923l650O354j174P1K501j968
$$ 2666 4747 -5169 4373 7597 -15965 -20928 4948 12747 -4176 -7826 -1472 -2646 -2575 -74 -2042
318b042j743k413j692Q718Q882q711j0319M606O066k172l051K912L889m511m993
$$ -2042 -3785 -6198 -7890 828 9710 999 -9320 -4714 1352 -820 -3871 -959 2930 -1581 -6574
333f574J1368R810j8413j1879J7513O876j2990O587J1322j5222q811J4353M444
$$ -6574 4794 14604 -3809 -15688 1825 8701 -4289 2298 13620 -1602 -10413 3940 8384
346H384n470J493o110n753J2850P223j0698j123M014r477J420J6510l332j7715
$$ 8384 2914 4407 -1703 -7456 5394 12617 1919 796 4810 -4667 -3247 13263 9931 -7784
360g784K974J2963j197o947J066L634n377n704R265R349j1226j0926Q607O832
$$ -7784 -4810 8153 6956 9 1075 4709 -668 -6372 2893 12242 1016 -9910 -1303 5529
374E529m000J702J346q639p96O340j641J984N765r523p017J2604M886j1610J144
$$ 5529 1529 3231 4577 -4062 -4858 1482 -159 1825 7590 -1933 -8950 3654 8540 -3070 -1926
389a926O550r002l325J5163M609j4881n550R363L807m641k037K397j314l326M465
$$ -1926 4624 -4378 -7703 7460 12069 -2812 -8362 1001 4808 167 -1870 527 -787 -4113 352
404C52Q100l453j1135k261O498N335J120l497m907K933K514k617L306M022j0533
$$ 352 8452 4999 -6136 -8397 -1899 3436 4556 1059 -3848 -915 1599 -1018 2288 6310 -4223
419d223n587J4629M758j2608K020Q754r055n358J1992K493r078j153K994J393
$$ -4223 -9810 4819 9577 -3031 -1011 7743 -1312 -6670 5322 7815 -1263 -2416 578 1971
433A971M284j120q252P24M683k807R12O820m175j1407J906J1598J930q376l948
$$ 1971 6255 5135 -3117 -2393 2290 -517 395 7215 3040 -8367 -6461 5137 7067 -1309 -5257
448e257L901k02l958O150P157j0332j0154J0722R025q079m269M711k430j550O827
$$ -5257 -1356 -1558 -5516 634 7791 -2541 -12695 -1973 7052 -1027 -5296 -585 -3015 -4565 2262
463B262N40n920J282K86j542O169J295j0613N93R641l836n768R859K656j5361
$$ 2262 2802 -3118 -1836 -1550 -3092 3077 4372 -6241 -5648 3993 157 -5611 4248 6904 -8457
478h457l906J4547O113j1461n324P528J067o377L776O967p863p504O084L939n24
$$ -8457 -12363 2184 8297 -3164 -8488 -960 107 -6270 -2494 4473 -3390 -10894 -4810 -871 -1395
493a395K518l839o863O347N434n922P84M225q152r66J3820N04j3150j44R387j360
$$ -1395 1123 -2716 -9579 -3232 2202 -3720 -2936 1289 -6863 -7829 5991 6495 -6655 -6799 2588 1228
509A228n482M463N837o110q426P071J0352o540q435N652L202n558K448N603m875
$$ 1228 -4254 209 6046 -64 -8490 -1419 8933 2393 -6042 -390 2812 -2746 -298 5305 430
524D30m130L300J055N48L810m931p183Q357P848r242l207J0845m831j0789J1838
$$ 430 -3700 -400 655 1203 5013 82 -7101 1256 9104 -138 -3345 7500 2669 -8120 3718
539C718J0199j2815n116Q249j112k223P546J24q892q01L346K834K955m692n911
$$ 3718 13917 1102 -4014 4235 3123 900 8446 8570 -322 -1123 2223 5057 8012 3320 -2591
554b591M955K885m743J496K829n243j854K874L54J510j531o696L695P722p217
$$ -2591 2364 5249 506 2002 4831 -412 -2266 608 962 2472 941 -5755 -2060 5662 -1555
569a555n742Q715K9r839O033R399q055o746O185R46k753M654J720n947k098L492
$$ -1555 -7297 1418 1447 -8392 -2359 7040 -1015 -7761 -1576 -630 -3383 1271 2991 -2956 -5054 -1562
585a562K111K834L60q152j657Q455J459n867K497K857o640o67P544P98n903j820
$$ -1562 549 3383 3743 -4409 -6066 2389 3848 -2019 478 3335 -3305 -3972 3572 4370 -1533 -3353
601c353K849K611q40k398J747J736m469p59O353Q87n170j700K707K701O58k987
$$ -3353 -504 2107 1267 -1131 616 2352 -2117 -2876 3477 4364 -806 -2506 201 2902 3560 573
617E73n79K862j837l016O597L269q966l345Q416L558o304k108L990p27m455K908
$$ 573 -6 2856 1019 -1997 4600 7869 -1097 -4442 3974 7532 1228 -880 3110 2383 -2072 836
633H36N435l985o337K546L658j946n5M90l273o15K395q99K009K189o586m962Q771
$$ 836 6271 2286 -4051 -1505 2153 207 152 642 -2631 -3246 -851 -1750 259 2448 -4138 -9100 -329
650c29N375q448k606O456j165n698N662N410p198m631O854K248l888M67J248j644
$$ -329 5046 -3402 -6008 448 -717 -6415 -753 4657 -2541 -7172 -318 1930 -1958 -1491 -243 -1887
666a887J586Q7r75K624n25n562K126O828k913m193J804j11j99J667m60J334p09
$$ -1887 -301 -214 -1189 1435 910 -4652 -2526 4302 1389 -2804 -1000 -1111 -1310 357 -103 1231 522
683E22o803K624J0681m314r458P339L010r558M931R580q711o058Q650J176m316
$$ 522 -6281 -3657 7024 2710 -6748 591 3601 -5957 -1026 8554 -157 -6215 2435 3611 -705
698g05L486n11n028M285L124n775J787N436n853m792Q369K874o990j393M138j659
$$ -705 2781 2270 -2758 1527 4651 -1124 663 6099 246 -4546 3823 6697 -293 -1686 2452 793
714G93j167K934N42k880l141P08N798J268p635o09O196k669l927O865M80q041
$$ 793 -374 2560 3102 222 -2919 -2211 3587 4855 -2780 -3389 2807 138 -3789 3076 3556 -4485
730d485J450N166j867N8J198n314J325N694m093j576O186l772p471P865N713p997
$$ -4485 -3035 2131 264 322 1520 -3794 -2469 3225 -868 -2444 3742 -30 -7501 364 6077 -1920
746a920k314M697q70j780K621O44j739k684l61L753K436l398l197J988J580o42
$$ -1920 -4234 463 -407 -2187 434 1078 -661 -3345 -3706 47 2483 -915 -4112 -2124 -544 -1186
762a186k07O19l96j338j304L656L324m285m299M356L419m440jM496k168n269L841
$$ -1186 -1393 -774 -1170 -2508 -3812 -156 3168 -1117 -5416 -1060 2359 -2081 -2082 2414 246 -5023 -1182
779a182N742k913m015R15J543O98N02q7l40q42j957J905M109j770m256Q60K858
$$ -1182 4560 1647 -2368 -1453 90 788 1290 1203 863 21 -1936 -31 4078 2308 -1948 -1088 1770
796A770m4n92l73J74K86k828R08N663j636p969L635N847m807j156N006k932m538
$$ 1770 1726 1134 761 935 1221 -1607 -699 4964 3328 -4641 -1006 4841 34 -1122 3884 952 -3586
813c586M631J781k307J347k245l285O059K254n970j6M289m202j557O363J14n661
$$ -3586 1045 2826 519 1866 -379 -3664 2395 4649 -1321 -1337 2952 -1250 -2807 3556 3670 -1991
829a991l73L257J60m43p89M3N65k129j53M970j73o647J88O033j308l427K784j30
$$ -1991 -2364 893 1053 610 -179 -136 429 -1700 -1853 3117 2944 -3703 -3515 2518 1210 -2217 567 437
847D37l300K110K431j395L86q66m142L480N436m614l871N773p29n353N211M004
$$ 437 -2863 -753 1678 283 669 -197 -4339 -859 4577 -37 -3908 1865 1136 -4217 994 4998
863D998o223k183M086M49p36J115j475p76J214p23J253K268l120k853L294K264
$$ 4998 -1225 -3408 678 1127 391 1506 31 -745 469 -254 999 3267 147 -2706 588 2852
879B852j417j235N2l31P83m01O76L320l329n394M340N645m450l832M305L00l653
$$ 2852 1435 200 252 -79 704 303 979 4299 970 -4424 -84 5561 1111 -2721 1584 1884 -1769
896a769J457L786j942l194O85J550J237j06k136j027J890L41q85J489J65l326
$$ -1769 -312 3474 1532 -1662 -977 573 1810 1704 -432 -1459 431 772 -113 1376 1541 -1785
912a785n40L790J109l063k098K192J043j994J96L671j799n982K424N784k522l979
$$ -1785 -2325 1465 2574 -489 -2587 -395 648 -1346 -1150 2521 722 -5260 -2836 2948 426 -3553
928c553K636K32k325J516J769j634q75L65j530K861K446l883k479L440J605k562
$$ -3553 -917 -685 -3010 -1494 275 -1359 -2234 -1869 -3399 -538 1908 -1975 -4454 -1014 591 -1971
944a971J111J517k454j864K973L029j555k991N84J879k28q11K610l88l493M78
$$ -1971 -860 657 -1797 -3661 -688 2341 786 -2205 -1621 258 30 -781 1829 1441 -2052 -1574
960a574L823J65k490J89Q3j39R73N59j048M75m81k156K101L892l340m094L648
$$ -1574 2249 2414 -76 113 196 57 1030 1589 541 1016 535 -1621 480 4372 1032 -3062 586
977E86K404l293M37K584k160k550K264K761j332k211j20J351J00LN48L98k227
$$ 586 2990 -303 134 2718 558 -1992 272 3033 1701 -510 -630 721 821 824 1372 1770 -457
994d57j383K352J691j073j961m52J331J374j040j063Q99nl192J546M443k327m726
$$ -457 -1840 512 2203 1130 -831 -1283 48 1422 382 -681 218 213 -2979 -1433 3010 683 -4043
1011d043K610K561k377mJ613q11k220J006K083L71j305j314J08K015J84j719J290
$$ -4043 -1433 1128 -1249 -1253 360 -451 -2671 -1665 418 789 -516 -1830 -1722 293 477 -1242 48
1028D8M25k006K12K627O93k057j898J456K392o22k128R89J533l122K59M017r27
$$ 48 473 -1533 -1321 1306 1999 -58 -1956 -500 1892 1270 -858 131 1664 -1458 -1199 2818 1891
1045A891m018O11K474p8k15R4j294k94R08n36J059J045k392k257L784J469k677
$$ 1891 -2127 -1516 958 880 665 759 -535 -829 79 -457 602 1647 -745 -3002 782 2251 -426
1062d26l65K394j828j990L157J941k209k075Q41J571N09j307l34J082q13j129
$$ -426 -791 1603 -225 -2215 942 2883 674 -1401 -560 1011 1520 213 -121 961 148 -981
1078i81K179R04k146j297J615P16r2J72j875O4J806j400m97L269j524m002K373
$$ -981 1198 2102 -44 -1341 274 990 898 1070 -805 -741 1065 -335 -832 2437 913 -3089 -716
1095g16L786l032j383K175j313j520K621J534j809j622k3J329J609r70j435O30
$$ -716 3070 38 -1345 830 -483 -2003 618 2152 343 -1279 -1302 27 1636 666 -769 -139
1111a39L01l59L66J080o18j451o62J014K584j329k424Q32J629j964j94L286j206
$$ -139 162 -197 169 1249 631 -820 -1482 -468 2116 787 -1637 -805 824 -1140 -1334 1952 746
1128G46l769J163L537j284j807J170k07j092J305J383r48j106n20N70K107J16
$$ 746 -3023 -1860 1677 393 -1414 -244 -451 -1543 -238 1145 197 -909 -1429 -859 1248 1364
1144A364k370k45J909j07p86J280N59j406j132M57K910l3l254J26K952k031r47
$$ 1364 -1006 -1251 658 551 -235 1045 1604 198 -934 -477 2433 2400 -854 -728 2224 193 -754
1161g54L403j28m132R61K420p64k12M34k490N39K468j258n74J270j785j140L200
$$ -754 2649 2521 -1611 -650 1770 1006 794 1228 -1262 -723 1745 487 -87 1183 -602 -1742 1458
1178A458P43l033m01J604j89j53j6M87k54j601l79K371J489l230j257K504m3j741
$$ 1458 2201 -832 -1233 371 182 29 13 500 246 -1355 -1734 637 2126 -1104 -2361 143 100 -1641
1196a641J524J312k997p85K561K09j36n02j789J46K764p76k202K335k0l438K426
$$ -1641 -117 1195 -1802 -2587 -26 183 47 -455 -2244 -2098 666 -110 -2312 23 3 -3435 -1009
1213a009L035l125j641K558j76j267J687L07j138L36j158O16K690r58k635J217
$$ -1009 2026 -1099 -2740 -182 -358 -1625 62 369 -769 -433 -1591 -975 1715 757 -1878 -661
1229f61J672j153N03N17r74m31K12O97J565r54k636Q64L219j575j778J819N4k121
$$ -661 1011 -142 361 878 -96 -527 -315 382 1947 993 -1643 -779 2440 865 -913 906 960 -1161
1247a161J025K092j147j389K65J176j98l86P9L51k70q71N46J550K31k535n17J697
$$ -1161 -136 1956 809 -580 -315 861 663 277 356 707 437 -434 112 1662 1893 -642 -1159 538
1265E38P51q42l69M56k49p94N06J876o08k708L2K917l55j875J155J94k107J157
$$ 538 1289 447 78 534 285 -509 -3 1873 1265 -1443 -1411 1506 1151 -724 431 625 -1482 -325
1283c25J488j271l64J09q58J015J457k041m31J910j514j341L166N87k808j075
$$ -325 1163 -108 -472 -363 -1221 -206 1251 -790 -1221 689 -825 -2166 1000 1587 -1221 -2296
1299b296K068O01J67j205m89J326k14j328J949R47k792p70K711N50j808P21m5
$$ -2296 -228 373 540 -665 -1154 172 -42 -1370 579 1526 -1266 -2036 675 1225 -583 138 93
1316I3j006R13O66p60O29Kj837R04K075j189j636J688M49k572J918K288k256j942
$$ 93 -913 0 666 -94 535 537 -1300 -396 1679 490 -1146 542 991 -1581 337 2625 369 -1573
1334a573J842J003p28J44r67J55R39o71O1J384n76k677J179K375j096r98M31k20
$$ -1573 269 1272 544 688 -279 -124 815 144 205 1589 1013 -1664 -485 1890 794 -204 227 7
1352GJ62M88p87N81L57j874l35K785k92k569J147P79j604K69K333j239j863R18
$$ 7 169 657 -130 451 808 -1066 -1401 1384 1092 -1477 -330 449 -1155 -886 1447 208 -1655 -737
1370g37P22J26L2j188k6O39p4j06N87L42j340o77J901M87j170q85O35P06k52l91
$$ -737 -15 111 143 -1045 -1071 -432 -506 -612 -25 317 -1023 -1700 201 688 -482 -1367 -732 -26 -278 -669
1390f69P37K1j343k12K043N89j925l69J089Q4l51P07K31j151m4N79K97Q12r83
$$ -669 68 89 -1254 -1466 577 1166 -759 -1128 -39 45 -306 401 632 -519 -563 16 313 1125 142
1409A42j212J016J067j262P49N90j096j358J362J312o09q12m43J534j7r99L62
$$ 142 -1070 -54 1013 -249 500 1090 -6 -1364 -2 1310 701 -111 -554 980 963 -36 326
1426C26J395k146n82K113N30j429k15M39k09N71K34o83K36p1j095J077J248j390
$$ 326 1721 -425 -1007 1106 1636 207 -8 431 222 793 1027 344 580 509 -586 491 1739 349
1444C49j562J473J039j433L00J059o51j198L88Q38L14n62j251L32J162n29r01
$$ 349 -1213 260 1299 -134 166 1225 574 -624 -236 602 916 354 -897 -565 597 68 -833
1461h33J119j11j525P70J777r29j027j43M10P12m37l87R3Q75j604k72K307j62
$$ -833 286 175 -1350 -580 1197 268 -759 -902 -492 220 -217 -604 -511 364 -1240 -1512 795 633
1479F33k516L12K018q72p68J363m31r34M00Q29j80n2r90j92J253M94p93j08O37
$$ 633 -1883 -1571 447 -425 -1193 170 -261 -1195 -795 34 -146 -198 -1188 -1380 -127 367 -426 -534 103
1498A03q68o8R99P58j207m60J51Q98J27n77j06P50o85l90J549N21j539o12J223
$$ 103 -765 -833 166 924 -283 -743 -592 306 433 -144 -250 500 -185 -575 974 1495 -44 -656 567
1517E67J69l31O0n3j90K83j09M4Q13q83j370J443J053j248o59R14j86p86O89R80
$$ 567 736 405 465 412 222 505 396 440 1253 370 -1000 443 1496 248 -411 503 317 -469 220 1200
1537A200q86q07j54J188j12m70l55Q23q66l18J082N63j477n32R13Q2L63k15p46
$$ 1200 314 -493 -647 541 429 -41 -396 427 -439 -757 325 888 -589 -1121 -208 -126 237 22 -724
1556g24j1Q28q86J81J183n09j801P33J939n77j101L86M22p64m3J024Nr39k29L40
$$ -724 -735 93 -793 -612 571 62 -1739 -1006 933 356 -745 -359 63 -701 -744 280 285 -654 -883 -543
1576e43J573j047l24K85K88n36J11P72l87l92k8L14M72L64j073J44J035m57o26
$$ -543 1030 -17 -341 -56 232 -304 -193 579 192 -200 -228 86 558 922 -151 -7 1028 571 -55
1595e5J210O2j740K99J375K8j255J94M72j07kk3M39k24j018K24J104K83j198k33
$$ -55 1155 1217 -523 -224 1151 1179 -76 118 590 483 481 458 897 673 -345 -121 983 1266 68 -165
1615a65K84K88n34P09P6o25o88R6J472l72j118p3J354r61m23Q24L11r89n06R57
$$ -165 119 407 -127 582 658 33 -655 -559 913 541 -577 -650 704 -257 -680 144 455 -534 -1040 -83
1635h3L59m20l25r7J57M00n09M71M46j134k88O31R71p70o73K30K92K35n81L59
$$ -83 276 -144 -469 -566 -409 -9 -518 -47 399 -735 -1023 -392 579 -191 -864 -634 -342 -107 -688 -329
1655c29K52p49l17J112Q24j652k24Q88J27l34oM20m23j52K8N35M27p68m87N72
$$ -329 -77 -826 -1143 -31 793 -859 -1083 -195 -68 -402 -408 12 -411 -563 -535 0 427 -341 -828 -256
1675b56N39j91l86Q46m49q00J68J541k75j281K83P89N1n76K37K04m03n23P45O07
$$ -256 283 92 -294 552 103 -697 -529 1012 737 -544 -261 528 579 3 240 444 41 -482 263 870
1695H70p66l22RR37n33k94O19j34l34m34P41Q28n76j303M94Q07n5n49J90K58n03
$$ 870 104 -218 -209 728 195 -99 520 386 52 -382 359 1187 611 -692 -198 609 554 5 195 453 -50
1716e0j93J101J40j238m12J018M83n86j91j97K9j78j1L92K66l07q73M70P36l18
$$ -50 -243 858 998 -240 -652 366 849 263 72 -125 -96 -274 -285 107 373 66 -807 -337 399 81
1736H1p58P32N0q70OJ074R7j236J73R86J7j89m67L44j30m07M45M20m79o75K72
$$ 81 -677 55 105 -765 -759 315 412 -824 -651 335 352 163 -304 40 -90 -497 -52 368 -111 -786 -514
1757e14R10o4m09n6L2K02k04J29M28l51n78O50N59k15p17Q6M95m62k79Q60J71
$$ -514 396 332 -77 -133 -101 101 -103 26 454 103 -475 175 734 519 -198 -112 383 -79 -358 502 673
1778F73n76q12Q10N19n51j87O7O6J58J8M54m0o21m36P33Q77r44l90K46L10o13
$$ 673 97 -715 95 614 63 -124 -57 9 167 185 639 599 -22 -458 275 1152 208 -182 64 374 -239
1799b39pN84M8p36j83Q94Q5r63K39K37k83j36O52L26n30o65j45J000J11p17O1
$$ -239 -246 338 386 -350 -533 361 446 -517 -278 -41 -324 -460 192 518 -12 -677 -822 178 289 -428 -367
1820c67Q8j06K8K78j53k39n42M48P19J18q35k27J187m98n46K87N36o41k11M95
$$ -367 -279 -385 -357 -79 -232 -471 -1013 -565 154 272 -563 -790 397 -101 -647 -360 176 -465 -676 -181
1840a81J91Km61J64m8K61k57O85J12p64n94Q16O21m02n18J86O37m30j27N74k82
$$ -181 10 12 -449 -285 -333 -72 -329 356 468 -296 -890 -74 547 145 -373 -187 450 20 -107 467 185
1861A85l17q7O09L26m63l95P72j09n09j94Q94k96o44L94N31L9k27m42n7R16k73
$$ 185 -132 -219 390 716 253 -142 630 521 12 -182 712 416 -228 166 697 736 509 67 10 926 653
1882F53n76K77K73p78K28O35r5p51N2N21J69n38l0N37l8j017M01Q05l68o32L14
$$ 653 77 354 627 -151 77 712 617 -134 -82 439 608 70 40 577 539 -478 -77 728 360 -272 42
1903D2l3l0k54O3K51l94j55L37P50n43r45M68Q12m07l00L66j45m89j28O68K64
$$ 42 9 -21 -275 -212 39 -355 -510 -173 577 34 -911 -443 369 -38 -338 28 -117 -606 -734 -66 198
1924A98l72p25M58O74n11l57O38k88j47k7L08Q5k75J99k59L98N4m10K6L55l52
$$ 198 -174 -899 -441 233 -278 -635 3 -285 -432 -459 -151 -66 -341 -142 -401 -3 51 -359 -333 22 -330
1945c30r6O24M87j066n94J505n7j005P35L13p53K93K75pj13l10j40N62J93l34
$$ -330 -426 198 685 -381 -975 530 473 -532 203 516 -237 56 331 324 211 -99 -239 323 516 182
1965A82k14N42q36r8P14K74l84o52K79L91J22n81j38N20K9n63P18L93p66n26P16
$$ 182 -32 510 -326 -424 290 564 180 -472 -193 198 320 -261 -399 121 150 -413 305 698 -68 -594 122
1986A22J41j13k61l9Q2Jq8K39R5l24n43P59K80j72o18M32Q4l42k4M25J36p75n
$$ 122 263 150 -111 -150 -68 -67 -155 84 179 -145 -688 71 351 179 -439 -7 77 -265 -289 136 272 -503 -508
2009e08P85R9l85n57O84l92r5M15K48j62o65O6O49J43l14k41J67J42m55L30M26
$$ -508 277 376 -9 -566 118 -274 -369 46 294 132 -533 -467 182 325 11 -230 -63 79 -376 -46 380
2030C80k2r48L13N41P3o42J77Q5Q6K01j83M37m07o40P10L31k24l39K40K62l78
$$ 380 358 -590 -277 264 337 -305 -128 -43 43 244 61 498 91 -549 161 492 268 -71 169 431 53
2051E3J1N16l67o1k32L4N70K8q77L78M24k97n2L74J48o44k44R95o0o50k38M19
$$ 53 64 580 213 152 -80 -46 524 552 -325 53 477 180 128 502 650 6 -238 757 697 47 -191 228
2073B28j33j86L45o2n1o02L19J65L21p54k35P30J16l95K96l6l33l82L30K23L74
$$ 228 95 -91 254 192 141 -461 -142 23 344 -410 -645 85 201 -194 102 66 -267 -649 -319 -96 278
2094B78o61m45N82L53n63K78J13m24m26N21L46l20j87J11J93j87N7p2K52j69m85
$$ 278 -383 -828 -246 107 -456 -178 -65 -489 -915 -394 -48 -368 -555 -444 -251 -438 -381 -453 -201 -370 -855
2115h55P54J31J09j151L79P02j56k31J46K37n47k03N63N58l51o51O00L12k87k12
$$ -855 -101 30 139 -1012 -633 69 -87 -318 -172 65 -482 -685 -122 436 85 -566 34 346 59 -153
2135a53L78L5k97j59R18k35l77l99N28r4K26j11j67M14m93r1M73J27m75q1M71
$$ -153 225 260 -37 -196 722 487 110 -289 239 145 371 260 93 507 14 -77 396 523 48 -33 438
2156D38Q1l79oK01j3m13j7N15On88RM20L28k93m60M38q7m82M10L93j91m82j47
$$ 438 519 140 134 335 322 -91 -108 407 413 -175 -166 254 582 289 -171 267 180 -302 108 501 310 -172 -319
2179c19P07m13j19j31L12j39k20L40N03n81l15L06R8R4j98Np7j18k5N66J58o40
$$ -319 388 -25 -144 -275 37 -102 -322 18 521 -60 -375 -69 29 123 -75 -70 -147 -265 -290 276 434 -206
2201b06m38L72O05p44K9K97K0k08L79j36M10p22O6J95N41m30k59M14O6m56oP02
$$ -206 -644 -272 333 -411 -382 -85 -65 -273 106 -30 380 -342 -276 -81 460 30 -229 185 251 -205 -211 491
2223D91k50l88k6M41N4l84j45K85j5j0J99L00k20n20o6P64j8p18K04J66M3n8K47
$$ 491 241 -147 -173 268 322 -62 -207 78 63 53 252 552 332 -188 -254 510 492 -226 -22 144 187 129 376
2246C76j62Q7n33j53J117n44n95K58K70j41j83M07j32p8k74J23L03jo66K97K63
$$ 376 214 301 -232 -385 732 188 -407 -149 121 -20 -203 204 72 -6 -280 -157 146 145 -521 -224 39
2267C9k33k22N92J75j233M45L61J52n53J39j40L22k03j6Q2L9m06R0J54M92n71
$$ 39 -194 -416 176 351 -882 -437 -76 76 -477 -338 -478 -156 -359 -375 -293 -254 -660 -570 -416 76 -495
2288d95P5N35m87K68l73M95J42m83L8K19M58p93j53Q18J12o45K91M97o82J15K98
$$ -495 -420 115 -372 -104 -477 18 160 -323 -285 -66 392 -401 -554 264 376 -269 22 519 -163 -48 250
2309B50J81l00Nk34J78M62l79q0L63j34p32O43J99j84j40K15P6m69L36R4l45M8
$$ 250 431 131 136 -98 80 542 163 83 446 312 -420 223 422 238 98 313 389 -80 256 350 5 53
2331E3q3J61N51j76p49K30L93k83j35M24l96j35K94q1jj12j51K00K90k94n46O79
$$ 53 -30 131 682 506 -243 -13 380 97 -38 386 -10 -145 149 68 67 -45 -196 4 294 0 -546 133
2353A33L04q94K21N08m18k4q9L62j57k02K29j80J86m40J65L18J13q46J41N65n8
$$ 133 437 -457 -236 272 -146 -170 -259 103 -54 -256 -27 -207 -21 -461 -296 22 135 -711 -570 -5 -63
2374f3k74J87J25k02l08J90J06M00l83l09Q25l45o64M69N32m33k30K12K76O7o11
$$ -63 -337 -150 -25 -227 -535 -345 -239 161 -222 -531 294 -51 -715 -246 286 -147 -377 -165 111 178 -433
2395d33J74L71J54l91J81K76m57L6K46J16l80m2L57J2l20K87m26K22Jn4M22j00
$$ -433 -259 112 266 -125 56 332 -125 -89 157 273 -107 -149 208 220 -100 187 -239 -17 -16 -70 352 252
2417B52l06k5N00R1l47M3M9o0l54N73k9j15j23m48N43J60m24r3J64L17n35J16
$$ 252 -54 -79 421 512 165 208 257 197 -157 416 387 272 149 -299 244 404 -20 -113 51 368 -167 -51
2439e1L94l90P1J10Kk99K54n10N63K15l28k49M78m02m88N58L51n49j09O87l75
$$ -51 343 -47 24 134 136 -163 91 -419 144 359 31 -218 260 -142 -630 -72 279 -270 -379 308 -67
2460f7j04o4K73M3j42m27J32P76k53p04O35k8j60k62N61j55k22m6N21k19K76l86
$$ -67 -171 -235 38 81 -61 -488 -356 420 167 -537 98 70 -90 -352 209 54 -168 -214 307 88 364 -22
2482b2k44L56Q8n24M16K76o09Q5L55J58l70j6N4K02p3p4K6K85n36L2N88J93o59
$$ -22 -266 90 178 -346 70 346 -263 -178 177 335 -35 -51 3 205 132 58 84 369 -167 -135 453 646 -13
2505a3J26N26n08pJ14Q3n0k86J96K07K82o44l7M11j09k16O8j76j73J56K00L4J2
$$ -13 113 639 131 124 238 321 271 -15 181 388 670 26 -11 400 291 75 143 -33 -206 -50 150 184 196
2528A96n92K86r0J09j67q5M57k26m35N20K32l68k63J87K36l50o2L69p1j32k24
$$ 196 -396 -110 -200 -91 -258 -343 114 -112 -547 -27 205 -163 -426 -239 -3 -353 -415 -46 -117 -249 -473
2549d73L45L83n33l70O88n7n65K27M78k33k37j02M99j08j27j34O5O55o21k02P00
$$ -473 -128 255 -278 -648 40 -17 -582 -355 123 -110 -347 -449 50 -58 -185 -319 -254 401 -220 -422 278
2570B78j43p41K52N16l54p6K24J92J6k75n9J82M16m80j68N69l26j11L75J41m34
$$ 278 135 -606 -354 162 -192 -268 -44 148 164 -111 -170 12 428 -52 -220 349 23 -88 287 428 -6
2591fM1J14J35J73j98k59O18r9m43m2L74J25m73P8K94m15l3L17l2l6k92L8L95
$$ -6 35 149 284 457 259 0 618 519 76 34 408 533 60 138 432 17 -16 301 269 233 -59 -21 374
2614C74j33k76K33K23m27k23L17J80n42k8L97J48l92M06m41M42j03l83N11K56
$$ 374 241 -35 198 421 -6 -229 88 268 -274 -302 95 243 -149 257 -184 258 155 -228 283 539
2634E39o65l10O39j13o06M01R5q1m7J85l9m2j61j38O72j91m40n1N51m2n51K38
$$ 539 -126 -436 203 90 -516 -115 -20 -101 -148 37 -2 -44 -205 -343 329 138 -302 -353 198 156 -395 -157
2656a57R9k10J26J12Q9J56p1l32K18j71k28N07K67l13k77M08qQ2p9n9P8j67p0
$$ -157 -58 -268 -142 -30 59 215 144 -188 30 -141 -369 138 405 92 -185 223 215 297 218 159 237 70 0
2679@J26M3Qm43N15K49m22l1K35j33k31M29k9n9l43P2J12J55J9o26L03J62j82
$$ 0 126 169 177 -266 249 498 76 45 280 147 -84 345 316 257 -86 -14 98 253 272 -354 -51 111 -71
2702g1QM63j41o90K35K81p1r3j68K47J03m35J79J14J19o20K90M27j35k18J81k20
$$ -71 -63 400 259 -431 -196 85 14 -79 -247 0 103 -332 -153 -39 80 -540 -250 177 42 -176 5 -215
2724b15p9K62k23J71N8n36P1O48m51J0Qj6k48L14L20j23J19k22J5J96Q1l21j70
$$ -215 -294 -32 -255 -84 -26 -562 -491 157 -294 -284 -276 -292 -540 -226 94 -29 90 -132 -117 79 160 -161 -331
2747c31M83j35j19K81J04o46L03K33L48m77k07J52L33k03k37L29K15l53m00O91
$$ -331 152 17 -102 179 283 -363 -60 173 521 44 -163 -11 322 119 -118 211 426 73 -327 364
2767C64O8m33l26N46j18J06l9p7o1r1j6J00O21m47k49K55J62n04L79K80m86p1
$$ 364 432 -1 -327 219 101 207 168 91 30 -61 -77 23 644 197 -52 203 365 -139 240 520 34 -37
2789c7L13K10k27k02k94L61L36l83j4K23p4k28j62N51n25Q2oj94j5k26L52J57
$$ -37 276 486 259 57 -237 124 460 77 63 286 212 -16 -178 373 -152 -70 -76 -270 -285 -511 -159 -2
2811bk90p1q1N52j51o16M81L49m52K2K33K8k27L4o4L73j32l28l1M89m05j95L80
$$ -2 -292 -363 -444 108 -43 -659 -178 171 -281 -259 -26 2 -225 -191 -255 118 -14 -342 -373 116 -289 -484 -104
2834a04K4p8j10J98J06k74K11k08M34l76k07J65K65j37o0L14j78k73nL90r5O0
$$ -104 -80 -158 -268 -70 36 -238 -27 -235 199 -177 -384 -219 46 -91 -151 163 -15 -288 -293 97 2 62
2856F2j15J60j15K13j55J05J93J7k18K29rm99L83J99k04l03L15J64l10j90J6L61
$$ 62 -53 107 -8 205 50 155 348 365 147 376 367 -132 251 450 246 -57 258 422 112 -78 -62 299
2878B99n4j79k21L40k90L8K33J18o34L78r3L24J47n11j03M36k07k39m6M73k92
$$ 299 245 66 -155 185 -105 -67 166 284 -350 28 -65 259 406 -105 -208 228 21 -218 -264 209 -83
2899h3J03J10R7k80k41J56m8J59m8k7K41l29J82k41M39k72J40Op6K7J32M42p66
$$ -83 20 130 227 -53 -294 -138 -186 -27 -75 -102 139 -190 -8 -249 190 -82 58 64 -12 15 147 589 -177
2922a77J88j56L36P9n48Q0K98Q8o53L96K09R1n82K79L26l1k39K80Op7L4k50L74
$$ -177 11 -145 191 270 -278 -198 100 188 -465 -69 140 231 -351 -72 254 223 -16 264 270 193 227 -23 351
2945C51k42j98M0N61k33k99J88J09j3n9J36L2n95L29L77j01m10o2K77J63k89j20
$$ 351 109 -89 -49 512 279 -20 168 277 264 205 341 373 -222 107 484 383 -27 -89 188 351 62 -58
2967e8L45j84j06k25J86K82l85P2L0K19l43m2J56K27l28j58L60n6k66l29M42r8
$$ -58 287 103 -3 -228 -42 240 -145 -73 -43 176 -167 -209 -53 174 -154 -312 48 -8 -274 -603 -161 -259
2989b59j11P2L87j01m04K13J92j17l27K46K00o9k36q1L50o2k89K72K24J06n88
$$ -259 -370 -298 89 -12 -416 -203 -11 -128 -455 -209 -9 -78 -314 -395 -45 -107 -396 -124 100 206 -382
3010c82J11K41j16k69J11L52j96l84N81O7j08j87K15j61j7J88r0J44K2k18K32
$$ -382 -271 -30 -146 -415 -304 48 -148 -532 49 116 8 -179 36 -125 -142 46 -44 100 122 -96 136
3031A36l7l71p7M14K76j01j17J3K27k64O1J07L09n44j47K18M29l05M7Jk09k10
$$ 136 99 -272 -349 65 341 240 123 136 363 99 160 267 576 32 -115 103 532 227 274 275 66 -144
3053a44L40k6J90l58m6M43j51m43P1J92%k88K48J55nl02j3K48L7j37p0m5j45M13
$$ -144 196 170 360 2 -44 399 248 -195 -124 68 68 -220 28 183 178 -124 -137 111 148 11 -59 -104 -249 164
3077A64l00M10k62j80M2K55j33R0j46Jq9j74K55L68l19j53K09N0l01l27K45J78
$$ 164 -136 274 12 -168 -126 129 -4 86 -60 -59 -148 -322 -67 301 -18 -171 38 88 -213 -540 -295 -117
3099a17j68m8M66rj47k54M33l27J12k96J92J13k9j09L91m0l77j30M09J33k61Q1
$$ -117 -285 -333 133 124 -23 -277 156 -171 -59 -355 -163 -50 -79 -188 203 163 -214 -344 65 198 -63 18
3121A8j15J37J86j99R6l09K37J9K69k74j5l0J07J28k13R9K01j25n27J54M87j95
$$ 18 -97 40 226 27 123 -186 51 70 339 65 50 20 127 255 42 141 342 217 -310 -156 331 136
3143A36m9j9K2N8l57J66O0K37l12j6L12j78p6j12J65k19L9K20Q6j76l95J04N28
$$ 136 87 68 90 148 -209 -43 17 254 -58 -74 238 60 -16 -128 37 -182 -143 77 163 -13 -408 -304 224
3166B24q6k50J35k23n9J31Q6K9k43L4L39P6n14j14J13J42L2m5L4J26j12o0M08
$$ 224 138 -112 23 -200 -259 -128 -42 -13 -256 -222 117 193 -321 -435 -322 -180 -148 -193 -159 -33 -145 -205 203
3189B03k13l18L9L92j19l84K08K49K71m17k8M32j87k54J10L10k68j34J82K70j87
$$ 203 -10 -328 -289 103 -16 -400 -192 57 328 -89 -117 315 128 -126 -16 294 26 -108 74 344 157
3210A57k6M5K22l63P0J32Q5r8j79J1j03J81j44q8M85j03j53r8L59j55J13k74k1
$$ 157 131 176 398 35 105 237 322 224 45 56 -47 134 -10 -98 387 284 131 33 392 237 350 76 55
3233E5K37l41L79J87l11j77P1J41k4k71L93j65l4j62J47k2K0l43K35r4K40k86
$$ 55 292 -49 330 517 206 29 100 241 217 -54 339 174 140 -22 125 103 123 -220 15 -79 161 -125
3255a25ql8l7o2K29j40j40J44j48J88k5J06j69k4k20l5M73J7m98J89L67n6k80
$$ -125 -133 -171 -208 -270 -41 -181 -321 -177 -325 -137 -162 -56 -225 -249 -469 -504 -31 -14 -512 -323 44 -12 -292
3278b92j08J67J39N8R2j65m4J40j76M01j38l17K8M0J17j17J65P0L7m45J92J66
$$ -292 -400 -233 -94 -36 56 -109 -153 -13 -189 212 74 -243 -215 -175 -58 -175 -10 60 97 -348 -156 10
3300A0J62k42J75PP1l28K45P3l45r4O80l06k3q3K57o0k30J06K4J15n9j86M28k29
$$ 10 172 -70 105 112 183 -145 100 173 -172 -266 414 108 85 2 259 199 -31 75 99 214 155 -31 397 168
3324A68K7o8J29j06j19R6r5j0j12k34J22L50l67qL45l84J66K89K6l07j37N78n64
$$ 168 195 127 256 150 31 127 32 22 -90 -324 -202 148 -219 -227 118 -266 -100 189 215 -92 -229 349 -215
3347b15J89q7N9M9K06n41L28K5K31m89L5L31j23p4N6J69k63J22m3Q5m9k04L00
$$ -215 -26 -113 -54 -5 201 -340 -12 13 244 -245 -210 121 -2 -76 -20 149 -114 8 -35 50 1 -203 97
3370I7J18k31k4j04J89k95K50L79k53j82K57j90M9K70j86kJ89p6r9m5K79m87R3
$$ 97 215 -16 -40 -144 45 -250 0 379 126 -56 201 11 60 330 144 142 331 255 156 111 390 -97 -4
3393dM46l92m3o6L75j68l9J26J78k85r00J029M7L8j11k14k37L86p06R98P9J85
$$ -4 442 50 7 -59 316 148 109 235 413 128 -772 257 304 342 231 17 -220 166 -540 458 537 722
3415G22j278N87M04j08m07k4J50M7L09o10R42j792P31O22j49n51o32O33L1J31
$$ 722 -556 31 435 327 -80 -104 46 93 402 -208 734 -1058 -327 295 146 -405 -1037 -404 -373 -242
3435b42p71L79M70m20J045K03j130K72k76N72J10j24k08j32L19p51K48J36P59
$$ -242 -1013 -634 -164 -584 461 664 -466 -194 -470 102 212 88 -120 -252 67 -684 -436 -300 459
3454D59o52j52j16M56k10K42k86J65j19m8K79m93L13k07M23n8K77m62L81k44j44
$$ 459 -193 -345 -461 -5 -215 27 -259 -94 -213 -261 18 -475 -162 -369 54 -4 273 -189 192 -52 -196
3475a96K79J1o8l54Q94m22K76k56m0l9k3J39j65L75k35l20K13K90n0j92R6l03
$$ -196 83 94 26 -328 566 144 420 164 124 85 62 201 36 411 176 -144 69 359 309 117 213 -90
3497i0j61K59L67l44K66k06O9K5k2RO9j86R8J62L4k69k79R8J28l2j19K49l0Ll23
$$ -90 -251 8 375 31 297 91 160 185 163 172 241 55 153 315 349 80 -199 -101 27 -5 -124 125 95 98 -225
3522b25J65K24k2m42K46J65j42L5J29l20Q3j75K13J68j46k8j69j4N6m0r3J59L82
$$ -225 -60 164 142 -300 -54 111 -31 4 133 -187 -104 -279 -66 102 -44 -72 -241 -255 -199 -239 -332 -173 209
3545B09k38j10K10j48k94Q8M44k43j42J78K44j40k19K75Q2k19p1R8J16k06L18
$$ 209 -29 -139 71 -77 -371 -283 161 -82 -224 -46 198 58 -161 114 196 -23 -94 4 120 -86 232
3566B32k64lj40K12j5K18k71P1o9L23m29n6K44M5n9l7K45k09r9R3J13j5M4m64
$$ 232 -32 -35 -175 37 22 240 -31 40 -29 294 -135 -191 53 98 39 2 247 38 -61 32 145 130 174 -290
3590b90N30P0k39J64q7r3m0m4J59P7k47J56J01l07K32k59J8rj18J98K95m7n82
$$ -290 240 310 71 235 148 55 15 -29 130 207 -40 116 217 -90 142 -117 -99 -108 -226 -28 267 220 -362
3613c62J48M2L88k71K21R4l39j11j03J92M0K25k35k4Q7j25j16M77n17Q0J32J75
$$ -362 -214 -172 216 -55 166 260 -79 -190 -293 -101 -61 164 -71 -95 -8 -133 -249 228 -289 -209 -77 98
3635I8M8j38j1K09k3k64M0L1o2j70K9N68n94n6M70j02J44j8O3j31J25k96J25J82
$$ 98 146 8 -3 206 183 -81 -41 -10 -72 -242 -213 355 -239 -295 175 73 217 199 262 131 256 -40 85 267
3659B67m47K76K65q0j89k57L87l8q0n9N47n63J52L3j79J70M6j35J83L6j04J4M5
$$ 267 -180 96 361 281 92 -165 222 184 104 45 592 29 181 214 35 205 251 116 299 335 231 245 290
3682B90N8j30p5o1p2k2K57j63K80m67K82o3k15P7P6j66J60k10K42j30j4o2J20
$$ 290 348 218 143 82 10 -12 245 82 362 -105 177 114 -101 -24 52 -114 46 -164 78 -52 -66 -128 -8
3705hj81J55k14q8M64l42J40j39J94l93J63J40J82m39QK99j47j9M03j42Q2k88
$$ -8 -189 -34 -248 -336 128 -214 -74 -213 -19 -412 -249 -109 73 -366 -358 -59 -206 -225 178 36 118 -170
3727a70j09L04M9j62p7L6k09K76l48K49Q9j89L78m05J35J74l43M36j45O8j16J84
$$ -170 -279 25 74 -88 -165 -129 -338 -62 -410 -161 -72 -261 117 -288 -153 21 -322 114 -31 37 -79 105
3749A05k03J0J06J98m50K19p4J48K07k33K4J87n9k47K54q2K50m05K58j65J32r8
$$ 105 -98 -88 18 216 -234 -15 -89 59 266 33 57 244 185 -62 192 110 360 -45 213 48 180 82
3771H2j58K7N1j27J01j0K31l30K18k4N9j60j8J03j41Q1L7K10k92r3M44l18P1N0
$$ 82 -76 -49 2 -125 -24 -34 197 -133 85 61 120 -40 -58 45 -96 -15 22 232 -60 -153 291 -27 44 94
3795I4l8J31l43J40K21p7P9l12J38K02l02Q2J66l22J23L28m39o5K89l42K71j53
$$ 94 56 187 -156 -16 205 128 207 -105 33 235 -67 15 181 -141 -18 310 -129 -194 95 -247 24 -129
3817a29K41m57J3L05L7o8J1J4Q2j41J77N5k54L30k52R1J87j29J71l14J79p5O6
$$ -129 112 -345 -332 -27 10 -58 -47 -33 49 -92 85 140 -114 216 -36 55 242 113 284 -30 149 74 140
3840A40j19k39J20N03k21j97J50l6q7L9m3P8j74J26J94r1j41K4K31j58m17M26
$$ 140 21 -218 -98 405 184 -13 137 101 14 53 10 88 -86 40 234 143 2 26 257 99 -318 108
3862A08o0L4N0P6M4m58L19j6J7l4l54K27J6M3K10l73M12k98j17J76j40J54j2l21
$$ 108 48 82 132 208 252 -206 113 97 114 80 -274 -47 -31 12 222 -151 261 -37 -154 22 -118 36 24 -297
3886b97L39j0l58k43L46M67n07O2m7N5m54M97J02J5k86J4K22R1k30K23l4j20j3
$$ -297 42 32 -326 -569 -223 244 -263 -201 -248 -193 -647 -150 -48 -33 -319 -305 -83 8 -222 1 -33 -153 -166
3909a66R4M9o3p4q0K89q7N5j46M6K2Q2j47M02k30r6k61L94L9j71J36k24L43k08
$$ -166 -72 -23 -86 -160 -240 49 -38 17 -129 -83 -61 21 -126 276 46 -50 -311 83 122 -49 87 -137 206 -2
3933bj0K34m18L63R3k32J14p2Q5P4l18K68M4l1k24OJ07N8m3k37K93k2p3m0L41
$$ -2 -12 222 -196 167 260 28 142 70 155 229 -89 179 223 192 -32 -26 81 139 96 -141 152 130 57 17 358
3958C58j96lj29n2o6K40p0l9K72q4l94k25N39j35PP1j4M6q3L5J40k21P6K31n48
$$ 358 162 159 30 -22 -88 152 82 43 315 231 -163 -388 151 16 23 94 80 126 43 78 218 -3 73 304 -244
3983b44K99l22O04j61l37j92L00J46rj19L39k16k76K63m0k35J22m0K51j49P8j38
$$ -244 55 -267 337 176 -161 -353 -53 93 84 -35 304 88 -188 75 35 -200 -78 -118 133 -16 62 -76
4005g6O9n2j55K62J80k39j17K90l22J71j01J22r9M24m04N7j33K45m63N87k12j49
$$ -76 -7 -59 -214 48 228 -11 -128 162 -160 11 -90 32 -67 357 -47 10 -123 122 -341 246 34 -115
4027a15K15m3L86n41K62k62K94k48P8P0J62l99J19J13j13J92P3M8k09j97L02J8
$$ -115 100 57 443 -98 164 -98 196 -52 26 96 258 -141 -22 91 -22 170 243 291 82 -115 187 205
4049B05m19L66j18j74K6J53o6J43l63J65p3K02n9k28K03L50l98L0n6O0RJ04k32
$$ 205 -214 152 34 -140 -114 39 -27 116 -247 -82 -155 47 -12 -240 -37 313 -85 -55 -111 -51 -42 62 -170
4072a70J71k39M9J83K06l79J64m0Q5k81p0J72OK8l2M25k06j53LJ29O0pj74K67
$$ -170 1 -238 -189 -6 200 -179 -15 -55 30 -251 -321 -149 -143 -115 -147 278 72 -81 -78 51 111 104 -70 197
4096A97Q7k34k31R3K62l5j01r3L65l96M61l09k41J6J9K25j15J20P1j59K78l66
$$ 197 284 50 -181 -88 174 139 38 -55 310 -86 375 66 -175 -159 -140 85 -30 90 161 2 280 -86
4118h6%K98k07K12k22K70j92j0j31J61q4K1J78j37K47j15Q6j76%q7l9L47l83j79
$$ -86 -86 212 5 217 -5 265 73 63 -68 93 9 30 208 71 318 203 289 113 113 26 -13 334 -49 -228
4142b28L85j47L8L24k67j09J1j42K9j0K18l8j22j2J57k09J75j2J00k43N6j18J52
$$ -228 157 10 48 372 105 -4 7 -135 -106 -116 102 64 -58 -70 87 -122 53 41 141 -102 -46 -164 -12
4165a2M4O6Qo0l5N4K06o84L17J11R2l76J37j22L85J1p2j98J00n5j54L25r3J0m26
$$ -12 32 98 106 46 11 65 271 -413 -96 15 107 -269 -132 -254 131 142 70 -128 -28 -83 -237 88 -5 5 -421
4190d21J70K64J62j69J65l60K34J21l11K16l8j18K86r9k65K14j0o9J65j7Q7l73
$$ -421 -251 13 175 6 171 -189 45 166 -145 71 33 -85 201 102 -163 51 41 -28 137 120 207 -166
4212a66o4M83l19J7K04N5j70J22k05K39Kk31n0J31m2j78J7K13l4n8Nl9K5l62N67
$$ -166 -230 253 -66 -49 155 210 40 162 -43 196 198 -33 -83 48 6 -172 -155 58 24 -34 -29 -68 -43 -405 162
4237A62k54M02k11P5k57j01K95l80K64K7P5m6p5J2M7N9j31oK8P4P6m85M11L5J14
$$ 162 -92 310 99 174 -83 -184 111 -269 -5 22 97 51 -24 -12 35 94 -37 -43 -15 59 135 -350 61 96 210
4262B10k84P1k20K42j6k16N1K48k94L63j54J11j51m67O42j21j08J33l35M61j77
$$ 210 -74 -3 -223 19 3 -213 -162 86 -208 155 1 112 -39 -506 136 15 -93 40 -295 166 -11
4283a1j15O5L35l18M3k3K15j71j25J78J01M6l3P1j19k77J07J78J2K9l62M20P6
$$ -11 -126 -61 274 -44 -1 -24 191 20 -105 73 174 220 187 258 139 -138 -31 147 159 188 -174 246 322
4306C22m59n3L92j0j84k47L76j28r7J12N7j67q5p2L53l54K36O2J93m33N0r4N39
$$ 322 -137 -190 202 192 8 -239 137 9 -88 24 81 -86 -171 -243 110 -244 -8 54 247 -186 -136 -230 309
4329C09l36r7J02J55j4J44m97J58J26j28J16m5o8q9k7J32o6k20L53k28K36k5n2
$$ 309 -27 -124 -22 133 119 263 -234 -76 50 -78 38 -7 -75 -164 -191 -59 -125 -345 8 -220 16 -9 -61
4352f1l00K29R8j27j83L06j41K48j17%M9J9q9k3J04pN4k14J24N2j01K77k41J09
$$ -61 -361 -132 -34 -161 -344 -38 -179 69 -48 -48 1 20 -69 -92 12 5 59 -155 -31 21 -80 197 -44 65
4376F5rJ20k67L27m3m51L37lKP4m0K99m24q2kJ80N3k6j33K24K01j97j98m5J06
$$ 65 56 176 -91 236 193 -258 79 76 78 152 112 411 -13 -95 -97 83 136 110 -23 201 402 205 7 -38 68
4401F8M8k43J98j70L12n1J83O3n73J64O6o8j4R2j02J79k64m3L65O3m01J42J05
$$ 68 116 -127 71 -99 213 162 345 408 -165 -1 65 -3 -17 75 -27 152 -112 -155 210 273 -128 14 119
4424A19j59L4m3l9O4j51K04J09k01J73k21K17j76J21p5n8J05N2J06j34Kl96J40
$$ 119 -40 -6 -49 -88 -24 -175 29 138 -63 110 -111 106 -70 51 -24 -82 23 75 181 47 49 -347 -207
4447b07K30j8l6MK07j77K8k33K3J89K5J2k28K13N0j06L1J07J6n1k07J63J7k6j54
$$ -207 23 5 -31 -27 180 3 31 -202 -179 10 35 47 -181 32 82 -24 7 114 130 79 -128 35 52 26 -128
4472a28N9J21N5Q7l54K34K66m04J52Kj00o4M9k0N9R6k80N7K56j98n8K38j73J92
$$ -128 -69 52 107 194 -160 74 340 -64 88 90 -10 -74 -25 -45 14 110 -170 -113 143 -55 -113 125 -48 144
4496A44j19m6R7k90K1LM46l74k22J58K2J48J96J6k34j60J14J61l05K51j16J12
$$ 144 25 -21 76 -214 -193 -190 256 -118 -340 -182 -160 -12 184 200 -34 -194 -80 81 -224 27 -89 23
4518B3o9j52Q5j40M55j43l67K95J88l05j06K49k30J8J53Q0J04n2qL8k22j47K67
$$ 23 -46 -198 -113 -253 202 59 -308 -13 175 -130 -236 13 -217 -199 -46 34 138 86 78 116 -106 -253 14
4541A4J43n6j36Q6j1j84m4M07j63N7K4o7L1j05p4j0J12l41J85K42J49l8k69L54
$$ 14 157 101 -35 51 40 -144 -188 219 56 113 137 70 101 -4 -78 -88 24 -317 -132 110 259 221 -48 306
4565C06k14r5q3k2P1m6K32j64J21j02o7J51L09l33j37J44k2mj42j41M76k92j08
$$ 306 92 -3 -86 -108 -37 -83 149 -15 106 4 -63 88 397 64 -73 71 49 45 -97 -238 238 -54 -162
4588a62L22j25k4m5N6J91j96J4o8J39m83K74K31j7k36J95J5j43O0n0o6j4R6K9
$$ -162 160 35 11 -34 22 213 17 31 -37 102 -381 -107 124 107 -129 66 81 -62 -2 -52 -118 -132 -36 -7
4612gJ26k93J61k50L12l15L3J47J06j30O5j57K60j14p9l9J4Q6K6P2J1nk0l2j52
$$ -7 119 -174 -13 -263 49 -266 -233 -86 20 -110 -45 -202 58 -56 -135 -174 -160 -74 -48 24 35 30 10 -22 -174
4637a74J97O3k09n3Qm2j3M45k21R7O0j84p3k7K9J34q3O7l6k6L5pN4m4J91j63l23
$$ -174 23 86 -123 -176 -168 -210 -223 222 1 98 158 -26 -99 -126 -97 37 -46 21 -15 -41 -6 -13 41 -3 188 25 -298
4664b98M72o8M6Q0j48olN7j60J30k42R8R2M3M2j82J99j02j03J82k6K6k24M13l47
$$ -298 174 106 152 232 84 78 75 132 -28 102 -140 -42 50 93 135 -47 152 50 -53 129 103 129 -95 318 -29
4689b9J52k93L3J53M1r7P1R4j93Q3J46J00l82m9J45K4p6l4R0k31K67J19nm12R5
$$ -29 123 -170 -137 16 57 -40 31 125 -68 15 161 261 -121 -170 -25 -1 -77 -111 -21 -252 15 134 129 -283 -188
4714a88L45j8k48J07J71K11j94l13L17j61N3j5j24J24k86J10K50j11j18R0L1K14
$$ -188 157 139 -109 -2 169 380 186 -127 190 29 82 67 -57 67 -219 -109 141 30 -88 2 33 247
4736B47k37J9P1q0NJ8O1n5N7J31j13k41J13N0L52k23J5l14L29O8m56M55k87J23
$$ 247 10 29 100 20 25 43 104 49 106 237 124 -117 -4 46 398 175 190 -124 205 273 -183 272 -15 108
4760A08M1m19K71J69l0k62J15M6p8J54j55n2p7M26q5j84K6r8K27M0j95j62J35
$$ 108 149 -270 1 170 140 -122 -7 39 -39 115 -40 -92 -169 257 172 -12 14 -84 143 183 -12 -174 -39
4783c9l2k3qj7J23K2k06K06j98p7J27o3j01K61K41m70K2J87j88k2m4L30N3l50
$$ -39 -71 -94 -102 -119 4 26 -180 26 -172 -249 -122 -185 -286 -25 216 -254 -232 -45 -233 -255 -299 31 84 -266
4807b66J26j37K41J36l31O8J66k4j80J83P3n5J5M8j2J58k62L71l05k3J22L0J52
$$ -266 -140 -277 -36 100 -231 -163 3 -21 -201 -18 55 0 15 63 51 209 -53 318 13 -10 112 142 294
4830B94j61j55R6j27Q4J72j8k43J38r9k9M7J03RQk47J07l1J52n8l5J39L1o7j38
$$ 294 133 -22 74 -53 31 203 185 -58 80 -19 -48 -1 102 111 119 -128 -21 -52 100 42 7 146 177 110 -28
4855b8O8Q7l4k9j79K78M9j13L5oK09k21pp6Q3k45K54r9K05l45J15k87K06q6J09
$$ -28 40 127 93 64 -115 163 212 99 134 128 337 116 109 33 116 -129 125 26 231 -114 1 -286 -80 -166 -57
4880e7K00j65Q0j79Q5k28L34k63J77p4J37J08k91N4J5j01J27J74k10l9K23l51
$$ -57 143 -22 58 -121 -36 -264 70 -193 -16 -90 47 155 -136 -82 -67 -168 -41 133 -77 -116 107 -244
4902b44N9K29j32O7k12N36k36l77K48O8p9P7J11m4j33N0j46M17n2p8j18K05k93
$$ -244 -185 44 -88 -21 -233 303 67 -310 -62 6 -73 4 115 71 -62 -12 -158 259 207 129 11 216 -77
4925g7J2J33R8j53q0j7k8K20m5j75q7L49q1j49R9K55l1k41M0j3Q3q5j54M2k75
$$ -77 -65 68 166 13 -67 -84 -112 108 63 -112 -199 150 69 -80 19 274 243 2 42 29 112 27 -127 -85 -360
4950c60L45J72j6k13J30Q4l89K62J02j75Q1mJ9j85J58O3J5r1J40k67J53l5j41
$$ -360 -15 157 141 -72 58 142 -247 15 117 -58 23 19 38 -147 11 74 89 -2 138 -129 24 -11 -152
4973a52K45r4j55J91Q9j94J70j95J35j04J19j7L9k9j08J89j29m1K09k09J10j16
$$ -152 93 -1 -156 35 124 -70 100 -95 40 -64 55 38 77 48 -60 129 0 -41 168 -41 69 -47
4995d7r8R4m7K81j95JK13j86j0N0R9lPk18K01l51J32lK65N3j51r4K46k37O2l9
$$ -47 -145 -51 -98 183 -12 -11 202 16 6 56 155 152 159 -59 142 -209 -77 -80 185 238 87 -7 239 2 64 25
5021B5k06L65j7l03L21O6J05p8k53Q2n4L13k68k19n0L43j16J51q6k45P5L9J86
$$ 25 -181 184 167 -136 185 251 356 278 25 107 53 366 98 -121 -171 172 56 207 121 -124 -49 -10 176
5044A76k80L39l75K96r3J0m4P7r5J50m15K41J00lj59K68l49K50j29l9J17J11j74
$$ 176 -104 235 -140 156 63 73 29 106 11 161 -254 -13 87 84 -75 193 -156 94 -35 -74 43 154 -20
5067b0j63K3q0L67m43L24r0N4j46K11k28J65L9J85l76J59k56O05l46j11J19K54
$$ -20 -183 -160 -240 127 -316 8 -82 -28 -174 37 -191 -26 13 198 -178 -19 -275 330 -16 -127 -8 246
5089B46l68P9L7k1J5L8J27l57L01Rk49J01K72k02n9J7K3K35k02J01m8K16k08k79
$$ 246 -122 -43 -6 -27 -12 26 153 -204 97 106 -143 -42 230 28 -31 -14 9 244 42 143 95 311 103 -176
5113a76L76l66K87k53K19O7n2j60P3J72k72k0K59Oj69k21M38k40j9k5J06L01m58
$$ -176 200 -166 121 -132 87 154 102 -58 15 187 -85 -105 154 160 -9 -230 208 -32 -51 -76 30 331 -127
5136a27K17k9J92k0l14L47o5j92N1k7n5j11J95p6m0J20j86j70K17J35k4N9m0k32
$$ -127 90 61 253 233 -81 266 201 9 60 33 -22 -133 62 -14 -54 66 -120 -290 -73 62 38 97 57 -175
5160a75P3K05J92k95K4q1q7J82j0Q9k00K02j00J28k39M6L46j33j62k08K42P9L9
$$ -175 -102 103 295 0 24 -57 -144 38 28 117 -83 119 19 147 -92 -46 300 167 5 -203 39 118 157
5183A57j95K29j95p9J85L55k29l07K0L26l80o8M21j44N3K1k24P9J42k89L67j70
$$ 157 -38 191 -4 -83 102 457 228 -79 -59 267 -113 -181 240 96 149 170 -54 25 167 -122 245 75
5205G5r3J84l0j13q1K8O2J06l4j8k7J72l54P2J70l0J60j7l21M8J35k17L6m8Q2
$$ 75 -18 166 136 23 -58 -30 32 138 104 86 59 231 -123 -51 119 89 249 232 -89 -41 94 -123 -87 -135 -53
5230e3o1J28j31j76J08L58K6m09J07j32J50k7Q9k11J43k5L12r9k06j08P4J04k33
$$ -53 -114 14 -117 -293 -185 173 199 -210 -103 -235 -85 -112 -23 -234 -91 -116 196 97 -109 -217 -143 -39 -272
5253b72J91n4K65o7q8J80k42j04P7r0m1L77n84O02k72j35J43P7l2N8l03K26J2
$$ -272 -81 -135 130 63 -25 155 -87 -191 -114 -204 -245 132 -452 150 -122 -257 -114 -37 -69 -11 -314 -88 -76
5276g6j44J79q5N3k70M38J7j03j79M61m17Q9O6L5r7J47k22J19k08Q0J34L6K0J98
$$ -76 -220 -41 -126 -73 -343 95 112 9 -170 291 -126 -37 29 64 -33 114 -108 11 -197 -117 17 53 73 271
5300B71k77J19L12k42k08K16j50K22k32j56K32%j21q5J51j74M50k55j77K1J99
$$ 271 -6 113 425 183 -25 191 41 263 31 -125 107 107 -14 -99 52 -122 328 73 -104 -83 116
5321A16K3o7k9j21R0m5J56N3m11L63k51m2J59J52K5j68j5P2j27j54J85J56m35
$$ 116 139 72 43 -78 12 -33 123 176 -235 128 -123 -165 -6 146 171 3 -12 60 -67 -221 -36 120 -315
5344c15J41J82K9j8q9J20L8K08l13J59l17J84j71K97j15n8L50k33j22J27mk62
$$ -315 -174 8 37 19 -70 50 88 296 -17 142 -175 9 -162 135 20 -38 312 79 -43 84 80 -182
5366a82J81k21J57K59j39Rj74L02r0q4k66L11Q6j41q8J62k8K31j73p1j4R2j32
$$ -182 -1 -222 -65 194 55 64 -110 192 102 18 -248 63 149 8 -80 82 54 285 112 41 27 119 -13
5389a3K05k68K04j35N5J21j70j21M73j00l43K76l5k23J86l4J07l22L30m5p9q2
$$ -13 192 -76 128 -7 48 169 -1 -122 351 251 -92 184 149 -74 112 78 185 -137 193 148 69 -13
5411a3k57K59l8J76k05l6J09l59K30J96m7J30l30l5J05J81Nj92J66j03j56L87
$$ -13 -270 -11 -49 127 -78 -114 -5 -364 -134 62 15 145 -185 -220 -115 66 71 -121 45 -58 -214 173
5433A73j14J30l16J37N3m14L32R4k10J87J1k57J84l1J57j07k56J97k68L29k51
$$ 173 59 189 -127 10 63 -351 -19 75 -135 52 63 -194 -10 -41 116 9 -247 -50 -318 11 -240
5454b40J76J59j24J15j05J57j25K44k23M5P0k9k06J23L0O4k11K80k11R5rJ12k12
$$ -240 -64 95 -29 86 -19 138 13 257 34 79 149 120 -86 37 67 131 -80 200 -11 84 75 187 -25
5477b5J52p5o9J01L62j62k74P6k78K23K01k94j17M62k13N6k2j71J16k22j23M07
$$ -25 127 52 -17 84 446 284 10 86 -192 31 232 -62 -179 283 70 126 104 -67 49 -173 -296 111
5499A11j45R9R0j91J50m0j20J51l12Oj1J48J03j3J01l58J27M8l72M67j66J15j09
$$ 111 -34 65 155 -36 114 74 -46 105 -207 -201 -212 -64 39 26 127 -231 -104 -56 -428 39 -127 -12 -121
5522a21K10j8j94L0k6M2M4P3o2J22k84R6J35K80m16j7R0Q5K8k02J72j13J49k36
$$ -121 89 71 -123 -93 -119 -77 -33 40 -22 100 -184 -88 47 327 -89 -106 -16 69 97 -105 67 -46 103 -133
5546a33M08l07J1j16kL30m19R9J57J0K52m41J63m6J22j2L51l08j5o1KM5k17J00
$$ -133 275 -32 -21 -137 -139 191 -228 -129 28 38 290 -151 12 -34 88 76 427 119 104 43 45 90 -127 -27
5570b7RJ54J26j10j31j12K9q7J76r2R8o6P3J57j05q0m0J87k12m1K2O3l14K42k8
$$ -27 -18 136 262 152 21 -91 -62 -149 27 -65 33 -33 40 197 92 12 -28 159 -53 -94 -72 -9 -323 -81 -109
5595a09R3j22J07R2j79PK52P6l91M7L06j13j35J14j26N1q7K51l14K3L7mj14J97
$$ -109 -16 -138 -31 61 -118 -111 141 217 -174 -127 179 66 -69 45 -81 -30 -117 134 -180 -157 -120 -124 -238 -41
5619d1K8k37J31l1L60j14m7O4n94M00j27J24K8j26M5m0K46N7N2p5o0J5k96K15
$$ -41 -13 -250 -119 -150 210 96 49 113 -481 -81 -208 -84 -56 -182 -137 -177 69 126 178 103 43 58 -238 -23
5643b3Jr1L06j70l37K62pMK06P6l1k45J87p8L8j29O7j92K91M3p4p0K8j54J80p2
$$ -23 -22 -113 193 23 -314 -52 -59 -55 151 227 196 -49 138 60 98 -31 36 -156 135 178 104 34 62 -92 88 16
5669A6N5j53J65n5pr2K17l64K13J40j70R6j10J99q9j70N03k06l06o1K84k41J1
$$ 16 71 -82 83 28 21 -71 146 -218 -5 135 -35 61 -49 150 61 -109 394 188 -118 -179 105 -136 -125
5692a25J06k6N1l18M0K89k54j9kl8K92L8K6k82k2K16l07K99j47J3O44n54j20L53
$$ -125 -19 -45 6 -312 -272 17 -237 -256 -258 -296 -4 34 60 -222 -244 -28 -335 -36 -183 -170 474 -80 -200 153
5716A53j91P8j08J20m29L45K32p1N4k88R2O1J49r6nl7M8k99L34n3k51O2J18K3
$$ 153 -38 40 -68 52 -377 -32 200 129 183 -105 -13 48 197 101 96 59 107 -192 142 89 -162 -100 18 41
5740D1J60k25R9O3m28K22J40j25K34j95j33J42j33oP2K6K74j47J55k95R4R3k1
$$ 41 201 -24 75 138 -290 -68 72 -53 181 -14 -147 -5 -138 -144 -72 -46 228 81 236 -59 35 128 107
5763A07J09q6P1j0j74J8K20j36p9Q3l8Q8k09j85K75J4k3J08j06k72M20n13L31
$$ 107 216 130 201 191 17 35 255 119 40 123 85 173 -36 -221 54 68 45 153 47 -225 195 -318 13
5786A3j18J23r1K41j80J91k82k13M22j81J04j99L46j82J07j38j52J63p9L4j27
$$ 13 -105 18 -73 168 -12 179 -103 -316 106 -75 29 -170 176 -6 101 -37 -189 -26 -105 -71 -198
5807a98M00j20j45j4q9K73J64j66k63K34K11k89K1m3j2J42P3k61N1J71m1j25m2
$$ -198 202 82 -63 -77 -166 107 271 105 -158 76 287 -2 19 -24 -36 106 179 -82 -31 140 99 -26 -68
5830f8j43J30j49K97L7l5J28j54K30k78O2J0q5j08J76k8O2k26K18j15Q1L7k3j80
$$ -68 -211 -81 -230 67 104 69 197 43 273 -5 57 67 -18 -126 50 22 84 -142 76 -39 42 79 56 -124
5854a24j47K66m7L03l33J46j99n7J07rP5n1O5j51K36N3N7k42Lj64K85K0j49J29
$$ -124 -271 -5 -52 251 -82 64 -135 -192 -85 -94 -19 -70 -5 -156 80 133 190 -52 -49 -213 72 92 -57 72
5878G2k7n0L1J58l71J40o4K11K46m77l4M2K32k63P2L4j35K29Kj5n7K56n33M27
$$ 72 45 -5 26 184 -187 -47 -111 100 346 -131 -165 -123 109 -154 -82 -48 -183 46 48 33 -24 232 -301 126
5902A26k73J52J52j93P3j75K37j45k96J68J43K17k79L2K25m44M15J12j46k58N85
$$ 126 -147 5 157 -36 37 -138 99 -46 -342 -174 -31 186 -93 -61 164 -280 135 247 101 -157 428
5923D28l97J4J04k4j0J65k16j48J53k58J19Q7l9q7K54l34K07l2n7p1J86O4j50
$$ 428 31 45 149 125 115 280 64 -84 69 -189 -70 17 -22 -109 145 -189 18 -14 -71 -142 44 108 -42
5946d2k05J74L3J5J84m95L58J27j17k24K57J82k53K9p6p2K55j63l4K45l0j14k3
$$ -42 -247 -73 -40 -25 159 -336 22 149 32 -192 65 247 -6 23 -53 -125 130 -33 -67 178 148 34 11
5969A1j17j54M43j70q6P5j45K9L93j74n8j36J27j58K3K22l03K44j32K04K3r9j04
$$ 11 -106 -260 183 13 -73 2 -143 -114 279 105 47 -89 38 -120 -97 125 -178 66 -66 138 161 62 -42
5992d2J2K92n43K04R8Nl6o7l3k1l8J88K9j29K94k33lJ68O9j27j51K94o7j04J45
$$ -42 -30 262 -281 -77 21 26 -10 -77 -110 -131 -169 19 48 -81 213 -20 -23 145 214 87 -64 230 163 59 204
6017B04m12L06k9j8Oj81L19l23L63j24j02j74K42k76J25K29j03O3k3q8q9K09r5
$$ 204 -208 98 69 51 57 -124 195 -128 235 111 9 -165 77 -199 -74 155 52 115 92 4 -85 124 29
6040B9K08j83r4mK06k97Q7O5j5j45q7p3N23j44k24K87j15J6k12J21J57j26J42
$$ 29 237 54 -40 -44 162 -135 -48 17 2 -143 -230 -303 220 76 -148 139 24 40 -172 -51 106 -20 122
6063A22m73L82K28n68J59L58l63m1j5L07k86K4M39m00Q5M9J1P7J17l21L9p4K43
$$ 122 -351 31 259 -309 -150 208 -155 -196 -211 96 -190 -166 273 -127 -42 7 18 95 212 -109 -70 -144 99
6086I9j07j35op0K29L1Kk29J24k55M86j69J45p2J22l76K65K37k04k35J92K7j96
$$ 99 -8 -143 -149 -219 10 41 43 -186 -62 -317 169 0 145 73 195 -181 84 321 117 -118 74 101 -95
6109i5J3ML94k40K8k72L65l46J95k36K37k43K63j07J18j29j04j08M05l17K53p0
$$ -95 -82 -78 316 76 104 -168 197 -149 46 -190 47 -196 67 -40 78 -51 -155 -263 142 -175 78 8
6131HJ17o5r4P3J2j10K2lj33L36j92J42j04j16o3J3J66m6J0n7m9K33nR2l74J97
$$ 8 125 60 -34 39 51 -59 -37 -40 -173 163 -29 113 9 -107 -170 -157 9 -37 -27 -84 -133 100 95 187 -187 10
6157A0p0N1k26r4J92J96p7k48J83N9p1m5n1j94L61k13K5R6K34k96J31K21k88M6
$$ 10 -60 -9 -235 -329 -137 59 -18 -266 -83 -24 -95 -140 -191 -385 -24 -237 -212 -116 118 -178 -47 174 -114 -68
6181f8p7K14J49k62J6k44Q4J19J05J10mk2j13j02J76k4J60l76L2K00q6P2l40M63
$$ -68 -145 69 218 -44 -28 -272 -188 -69 36 146 142 120 7 -95 81 57 217 -159 -127 73 -13 59 -281 182
6205A82n3k71n0K43k16J07m8R6N1j75K27j72O8Pj85K03k1n2K87ql47N6O8J26k0
$$ 182 129 -142 -192 51 -165 -58 -106 -10 41 -134 93 -79 -11 -4 -189 14 -7 -59 228 220 -127 -71 -3 123 103
6230A03j93R7R5Mn3K31l70r7M73k68rL18l34M4lJ7k67L2N2k10L21j25L71m17J51
$$ 103 -90 7 102 106 53 284 -86 -183 290 22 13 331 -3 41 38 55 -212 -180 -128 -338 -17 -142 229 -188 -37
6255c7j08L41l07J21j23K93o2l65P6J99j27Q9q9k11J86K60lR2k84j1K3j49K76
$$ -37 -145 196 -111 10 -113 180 118 -247 -171 28 -99 -10 -99 -310 -124 136 133 225 -59 -70 -47 -196 80
6278H0r1J62k31J44j65J50j71L58r3J13l77J71N8Q5N2m18M1J15J25j86k6M1j4
$$ 80 -11 151 -80 64 -101 49 -122 236 143 256 -121 50 108 193 245 -173 -132 -17 108 -78 -104 -63 -77
6301g7J07j62L09k64k5J64k04K62ql00N8J57P7n1q0R6j40j59K59j64R2n2J93l95
$$ -77 30 -132 177 -87 -112 52 -152 110 102 -198 -140 17 94 43 -37 59 -81 -240 19 -145 -53 -105 88 -307
6325c07N60l14J80l4q3j08K10r3p5J00J35l56J9J58o5J15n9j64K28o1J88k50K
$$ -307 253 -61 119 85 2 -106 104 11 -64 36 171 -185 -166 -8 -73 42 -17 -181 47 -14 174 -76 -74
6348g4M3k6j79J79J56Kj68J31P8k34O7L8k01K11O4r1j04J59j22J68J08m08J74
$$ -74 -31 -57 -236 -57 99 101 -67 64 142 -92 -25 13 -188 23 87 -4 -108 51 -71 97 205 -203 -29
6371b9R7J65j76m1L3J20J7k04J50m1Q0K4m13K27j8O4q3N4j85J99k6K05p1l4j75
$$ -29 68 233 57 16 49 169 186 -18 132 91 171 195 -218 9 -9 55 -28 26 -159 40 14 219 148 114 -61
6396f1r6L26k93K28k5o1K39o5k05J13j30j10R7K29q4P7j76j83J1Q8N9q6K81j29
$$ -61 -157 169 -124 104 79 18 257 192 -13 100 -30 -140 -43 186 102 179 3 -180 -169 -81 -22 -108 173 44
6420D4o1L8J1p1l9O9j59J75Q2J9j12K1j78K63K1j47K83l34L17k55j2O7j2k9O2
$$ 44 -17 21 32 -39 -78 -9 -168 7 89 108 -4 17 -161 102 123 -24 259 -75 242 -13 -25 42 30 1 63
6445F3k41l4J50M3m3k9L7N8m5r8J54rP7j26J22j37J99l21J77N7P0J5k83q5J08
$$ 63 -178 -212 -62 -19 -62 -91 -54 4 -41 -139 15 6 83 -43 79 -58 141 -180 -3 54 124 139 -144 -229 -121
6470a21J19J98j70l3k48J34L33k09m3K38j06j61j21J68J38l2M7nk49J64k0k04
$$ -121 -2 196 26 -7 -255 -121 212 3 -40 198 92 -69 -190 -22 116 84 131 126 -123 41 21 -183
6492a83L65j12Q6l75L19K0j06J37j17J08k59K78j56L7O0k60J28k7J21j13j41L67
$$ -183 182 70 156 -219 100 120 14 151 34 142 -117 161 5 42 102 -158 -30 -57 64 -49 -190 177
6514A77l08K55m1j13R7j1j08L09k21p4J47M3j08m5J76k26LR9M4K17r8o50M40j11
$$ 177 -131 124 83 -30 67 56 -52 257 36 -38 109 152 44 -1 175 -51 -48 51 95 312 214 -436 4 -107
6538a07K32J38j38J27j11j17o0J07l47L04q0O3l2p4J05R5j11m2K78r6Mk61K22
$$ -107 125 263 125 252 141 24 -36 71 -276 28 -52 11 -21 -95 10 105 -6 -48 230 134 138 -123 99
6561I9o2L0l36M83M2l68P7j01R5k8j20J27l0J18l4JJk4j12K13Q3k0k50KK02j71
$$ 99 37 67 -269 214 256 -112 -35 -136 -41 -69 -189 -62 -92 26 -8 -7 -6 -30 -142 71 154 134 -116 -114 88 -83
6587h3P0j52L16j81j31K89j97nJ96r3j6K6j18K47k25J38r9JO1k5N4k24k11J98
$$ -83 -13 -165 151 -30 -161 128 -69 -74 122 29 13 39 -79 168 -57 81 -18 -17 44 19 73 -151 -362 -164
6611a64J23m6nJ90Mk32L43Km27J72nj11l6J4K90j21q1K28n5K0k69K24J03j1r1
$$ -164 -41 -87 -92 98 102 -130 213 215 -212 -40 -45 -156 -192 -178 112 -9 -90 138 83 103 -166 58 161 150 59
6636E9l8K0k0J2j05M8J57k1p4J40Mk27K8j98K65k3k8R4j44K78k0L7j57j78P4P2
$$ 59 21 41 21 33 -72 -24 133 112 38 178 182 -45 -17 -215 50 27 -1 93 -51 227 207 244 87 -91 -17 55
6662E5J29j57j43K02lj91o3K78n8M3r1j08J61j39J41o5k07L29j76j2m3J28j04
$$ 55 184 27 -116 86 83 -108 -171 107 49 92 1 -107 54 -85 56 -9 -216 113 -63 -75 -118 10 -94
6685i4j49J29L3No8J75J0r3L3o6Q2LJ3J5j53m7K87l29Q2K80j34M6m5P2l8L71n05
$$ -94 -243 -114 -81 -76 -144 31 41 -52 -19 -85 -3 0 13 28 -125 -172 115 -214 -132 148 14 60 15 87 49 420 -85
6712h5L54j90p7J35j59J23j6k48Q4N6J73j54Q7M8j43J55k75P1J26q9P8Q8M4k73
$$ -85 269 79 2 137 -22 101 85 -163 -79 -23 150 -4 83 131 -12 143 -132 -61 65 -24 54 142 186 -87
6736h7j02K07J10j23l09J27N6N5KN1j06R2rm5L4q1q1J95J00k81R4L44j63k4j3
$$ -87 -189 18 128 5 -304 -177 -121 -66 -64 -13 -119 -27 -36 -81 -47 -128 -209 -14 86 -195 -101 243 80 56 43
6761D3Pl7k51L04o9j20K1J29N0J92l49O1K6j15j01K44q5O0O8k40J94oj14J38J9
$$ 43 50 13 -238 66 -3 -123 -102 27 77 269 -80 -19 7 -108 -209 35 -50 10 78 -162 32 26 -88 50 69
6786F9j83qJ56n3J24k17j03K36j09J80N8j58N3j59Q1P8q2k17J68J91j44Q3o9K76
$$ 69 -114 -122 34 -19 105 -112 -215 21 -88 92 150 -8 45 -114 -33 45 -37 -254 -86 105 -39 44 -25 251
6810B51l40K0j80M61k97J34j98J28K03j70J96m9j32J2Q1L%j22k5k91L87J97k42
$$ 251 -89 -69 -249 212 -85 49 -149 -21 182 12 208 159 27 39 120 123 123 1 -24 -315 72 269 27
6833B7Q2n8k7M1J0Q1o4k99L99m79M3J77L52l75Q6J22j30J82j57j54J95n8j56J43
$$ 27 109 51 24 65 75 156 92 -207 192 -287 -244 -67 285 -90 -4 118 -12 170 13 -141 54 -4 -160 -17
6857a7j19J01P9k21J8NJ23J76j67j0O7oP5o8o6L81k48p6Q9j08j97m8P6J12k86
$$ -17 -136 -35 44 -177 -159 -154 -31 145 -22 -32 35 29 104 36 -30 351 103 27 116 8 -189 -237 -161 -49 -335
6882c35L20L4K4j4j84k14K68M3J57j35q4q9J06M1m9j6J65M3r3n3l7q3K92J14k95
$$ -335 -15 19 43 29 -155 -369 -101 -58 99 -36 -120 -209 -103 -62 -111 -127 38 81 -12 -65 -102 -185 107 221 -74
6907g4K4K52k41O9j18R3k10L7L87k42J22J0j64j08M19o4k18J17J0j68KJ80j59
$$ -74 -50 202 -39 30 -88 5 -205 -168 219 -23 99 109 -55 -163 256 192 -26 91 101 -67 -65 115 -44
6930d4N2K07m69K17rR3j6j31k1NR6M5L03k89n5k6j02K63j03L5J5j59j9K22O6j35
$$ -44 8 215 -254 -37 -46 47 31 -100 -121 -116 -20 25 328 39 -16 -42 -144 119 16 51 66 -93 -112 110 176 41
6956D1M4k76J34o8K37j64K88k88o9r4J68J07l4j01k45L27k81R5m1K60K3k6m2P9
$$ 41 85 -191 -57 -125 112 -52 236 -52 -121 -215 -47 60 26 -75 -320 7 -274 -179 -220 40 63 37 -5 74
6980G4J9k88k1L22k16J63k15R9Q4K4j26J33j51J69o4j53J78k10K95J6j00j82L06
$$ 74 93 -195 -216 106 -110 53 -162 -63 21 45 -81 52 -99 70 6 -147 31 -179 116 132 32 -150 156
7003A56J8l23J67P6K9k05J27j39MJ95r5K56l74o0K6J16j07m1K40k67L55l3j31
$$ 156 174 -149 18 94 123 -82 45 -94 -90 105 10 266 -108 -168 -142 -26 -133 -174 66 -201 154 121 -10
7026a0j6l2j2L8K38k92l4k89L87O8q9m5o7K24k07J8J8L27m45p1J59O6l9M0j43
$$ -10 -26 -58 -70 -32 206 -86 -120 -409 -22 46 -43 -88 -155 69 -138 -120 -102 225 -220 -291 -132 -66 -105 -65 -208
7051b08J81J76l59L54j62j55PK31J72k92J4j39j23j8M41n8j81q6L35r8Q2j81J7
$$ -208 -27 149 -210 144 -18 -173 -166 65 237 -55 -41 -180 -303 -321 120 62 -119 -205 130 32 114 -67 -50
7074e0K37l72J47J64k37n2K6QN0p0K46j83J49r1L4N0P7l40J99J40p2k49M24j79
$$ -50 187 -185 -38 126 -111 -163 -137 -129 -79 -149 97 -86 63 -28 6 56 133 -207 -8 132 60 -189 235 56
7098E6M4K72l61j04N8l3j24L00j11K4J89L6l07K94j75l06J49Q8J63j92J23k69
$$ 56 100 372 11 -93 -35 -68 -192 108 -3 21 210 246 -61 233 58 -248 -99 -11 152 -40 83 -186
7120a86J43L51k99m3j95K28l98M78j17N9k80M61m53K28j49J71P2J03r6k63K73
$$ -186 -43 308 9 -34 -229 -1 -399 79 -38 21 -259 202 -251 -23 -172 -1 71 174 78 -185 88
7141H8k55J90k07K23K5l09J85L33j72r0j8oj3m6J9K40k58L6K04r6k6O6J6r5O8
$$ 88 -167 23 -184 39 64 -245 -60 273 101 11 -7 -13 -26 -72 -53 187 -71 -35 169 73 47 113 129 34 102
7166A02J86l78K71J7k45l2P2j37R7j29L33m7j23J89j25j17M06m04r0L37o3p8N6
$$ 102 288 -90 181 198 -47 -79 -7 -144 -47 -176 157 110 -13 176 51 -66 340 -64 -154 183 120 42 98
7189I8p1J36k26L52j48m41N92N3l99NK16k39J06j69J53K29j32l48K44N4N7k42
$$ 98 27 163 -63 289 141 -300 292 345 -54 -49 167 -72 34 -135 18 247 115 -233 11 65 122 -120
7211a20J3K11k75J80k97K15rJ51j1J37j47j20J11Lj87p0M04k80J63j22J0N4j4
$$ -120 -107 104 -171 9 -288 -73 -82 69 58 195 48 -72 39 42 -145 -215 189 -91 72 -50 -40 14 0
7234@l6j87O6Q7N8Q9j25L6k56K22n1J45J60J17l06j56lNJ94mR7k23L96m02N8K2
$$ 0 -36 -223 -157 -70 -12 77 -48 -12 -268 -46 -97 48 208 325 19 -137 -140 -135 59 55 152 -71 325 -77 -19 3
7260Cj94L6J79M7j3j78J48j47L65m26O2J36r1O8J5P8l3m1o9J07p0j38L61j68j57
$$ 3 -191 -155 24 71 58 -120 28 -119 246 -180 -118 18 -73 -5 10 88 55 14 -55 52 -18 -156 205 37 -120
7285a20k9J87N4J34K4k13Q6n5j83K69R7j93L5j51qk4J68j86o8L30k14Q8j54J93
$$ -120 -149 38 92 226 250 37 123 68 -115 154 251 58 93 -58 -66 -90 78 -108 -176 154 -60 28 -126 67
7309F7p5J13l3o8o2J55j29j68K58j74K27j78l09K56Q3j6l3J34j79L63l23j1Q7
$$ 67 -8 105 72 4 -58 97 -32 -200 58 -116 111 -67 -376 -120 -37 -53 -86 48 -131 232 -91 -102 -15
7332a5L00k53k64K39j59L23l22J36N2j88M4J65k10K19K0J61j62P7l07L3L24k85
$$ -15 285 32 -232 7 -152 171 -151 -15 37 -151 -107 58 -152 67 87 248 86 163 -144 -111 213 -72
7354g2j27K87l1r3pj86L44k31J27k85K64K50j27l17J31J62m7L29k54n7j17n3J07
$$ -72 -199 88 57 -36 -43 -229 115 -116 11 -274 -10 240 113 -204 -73 89 42 371 117 60 -57 -110 -3
7377cr8j12K80L3k6J2p6r5m5J89J9j42j8K24kl8p8j18L21m03L06n3j01P8k06K51
$$ -3 -101 -213 67 100 74 86 10 -85 -130 59 78 -64 -82 142 140 102 24 -94 227 -176 130 77 -24 54 -152 99
7403I9j20n9J1M00l49K28k79J54l8q2M9q4J0N6l24O92l46R7r9O1N8m1k2J89k79
$$ 99 -21 -80 -69 331 -18 210 -69 85 47 -35 14 -70 -60 -4 -328 364 18 115 16 77 135 94 72 261 -18
7428a8K3j33J25R7j86J34k20L21J79n85K63K86j71P8l48pK36j%J08n47M07j00
$$ -18 5 -128 -3 94 -92 42 -178 143 322 -263 0 286 115 193 -155 -162 74 73 73 181 -366 41 -59
7451e9Q8J04j42J03j8m0J6qk03K07j0r9J38r8j02N5kJ27K21l60MJ32j05R6P2o8
$$ -59 29 133 -9 94 76 36 52 44 -159 48 38 -61 77 -21 -123 -68 -70 57 278 -82 -78 54 -51 45 117 49
7477D9J27j89p8JpO9l47M86k1l7j22J30P7j21J69l60J77R4m0m3l06J58p3K24r3
$$ 49 176 -13 -91 -90 -97 -28 -375 111 90 53 -69 61 138 17 186 -174 3 97 57 14 -292 -134 -207 17 -76
7502g6P8j12J24Oj28J57k42K14j45J00J8K7r8j52J60N7K91k48k45K88k5j53R4
$$ -76 2 -110 14 20 -108 49 -193 21 -124 -24 -6 21 -77 -229 -69 -12 279 31 -214 74 49 -104 -10
7525a0j4j40Q3K76l97K11J37k20j39L61j43j38L2M02j84j24j69l8L12j11n0L58
$$ -10 -24 -164 -81 195 -202 9 146 -74 -213 148 5 -133 -101 301 117 -7 -176 -214 98 -13 -63 295
7547B95k67J49j26l9P8k46j2M33nj98K9j07K19j18P1k09KJ08K0Mk2k08K25r1j08
$$ 295 28 177 51 12 90 -156 -168 265 260 62 91 -16 203 85 156 -53 -51 57 77 81 59 -149 76 -15 -123
7572a23n0%K63l5O9j34J26j83L46l65J89m7r5K09j19k11K29j12JK05rj84l3m4
$$ -123 -173 -173 90 55 124 -10 116 -67 279 -86 103 56 -39 170 51 -160 69 -43 -42 163 154 -30 -63 -107
7596a07j34K23P5k69K58j95k1K23K1j16L8lp0K8J88j16r4Jj34L39J2l41K59j37
$$ -107 -241 -18 57 -212 46 -149 -170 53 74 -42 -4 -7 -77 -49 139 23 -71 -70 -204 135 147 -194 65 -72
7620g2J43L04k80J38m30L39j40k26L00J61j47k05L40l40L4mJ8kK09l68J38O5j44
$$ -72 71 375 95 233 -197 142 2 -224 76 237 90 -115 225 -115 -81 -85 -67 -69 140 -228 -90 -25 -169
7643a69L53M5k87j15J25R0j93K60j63j52L18J01l51L17l09L71m8j80j3j61J74
$$ -169 184 229 -58 -173 -48 42 -151 109 -54 -206 112 213 -138 179 -130 241 193 13 0 -161 13
7664A3J34l18K23q2jj16K44k83J95oj8l8J82k05n2j47K52j52j7K92j19M5p8m9
$$ 13 147 -171 52 -30 -31 -147 97 -186 9 3 -15 -53 129 -76 -128 -275 -23 -175 -192 100 -19 26 -52 -101
7688a01J72R0j59KJ42j45q3K73J38j76j19kj07r7K44r5j38J9J35K09L8l90K24
$$ -101 71 161 2 4 146 1 -82 191 329 153 34 32 -75 -172 72 -23 -161 -142 -7 202 240 -150 74
7711G4J49n7j68j71J57p2j80J08p6M80o6K4k42o1K02j9K00k66P7K64j85j11J0
$$ 74 223 166 -2 -173 -16 -88 -268 -160 -236 244 178 202 -40 -101 101 82 282 16 93 357 172 61 71
7734G1j20j36J79r5J63p2P8K12k86j44p5K01j65K73j18K56l35J33j02M0L7K1N
$$ 71 -49 -185 -6 -101 62 -10 68 280 -6 -150 -225 -24 -189 84 -34 222 -113 20 -82 -42 -5 16 21
7757B1P2l55N44m09J17q0J5O2L6q0n5J19M8J2j57J73k76J58M3J18J0j88k26J36
$$ 21 93 -262 282 -127 -10 -90 -75 -13 23 -57 -112 7 55 67 -90 83 -193 -35 8 126 136 -52 -278 -142
7781a42j79L09j49K94k39J55R4k62K20J9L9j06j25M3J58l61L03j33j24J61l4K50
$$ -142 -321 -12 -161 133 -106 49 143 -119 101 120 159 53 -72 -29 129 -232 71 -62 -186 -25 -59 191
7803A91j64r0K74k90m7N2Q5O2J17q0k24p0L68j42j52K91r6R2j63J42q6O7m01M21
$$ 191 27 -63 211 -79 -126 -74 11 73 190 110 -114 -184 184 42 -110 181 85 177 14 156 70 137 -264 157
7827A57k55o0j41J04L43p3l1o1QJ4L3j08Q8j33J4J10J25l4r1j31K00j14j98M91
$$ 157 -98 -158 -299 -195 148 75 44 -17 -9 5 38 -70 18 -115 -101 9 134 100 9 -122 78 -36 -234 257
7851B57k86J36o6q6J25j02N6op7J70q4rk72L01q6J99n8k4R4k08r8L68j39p0m9
$$ 257 -29 107 41 -45 80 -22 34 28 -49 121 37 28 -244 57 -29 170 112 88 182 -26 -124 244 105 35 -14
7876a4Mm0L19j65j88J51k67LL7L72l60L86k50j80L34p5OP0l10J08k3K36L9k46
$$ -14 -10 -50 269 104 -84 67 -200 -197 -160 212 -148 238 -12 -192 142 67 73 143 -167 -59 -82 154 193 -53
7900e3J79j22j7j03k48M33j92l4L35q9q4pj44M96m71L36j19pO0k43j11L39J09
$$ -53 126 4 -13 -116 -364 69 -123 -157 178 89 5 -2 -146 350 -121 215 96 89 149 -94 -205 134 243
7923B43m57L5qK26j02M6K27l60K77o0J84j33O5j9k78K11j48l4L0l56J12K90O1
$$ 243 -214 -179 -187 39 -63 -17 210 -150 127 67 251 118 183 164 -114 97 -51 -85 -55 -411 -299 -9 52
7946E2j87K15j37M6l19M40j32K7J48m0k90K0J21j73L84j70p4q3K29p4p9K32j72
$$ 52 -135 80 -57 -11 -330 110 -22 5 153 113 -177 -157 -36 -209 175 5 -69 -152 77 3 -76 156 -16
7969a6R1r8j43r2K29%L52o6L5j34jk70lK08P7J1n9J92m86L86n6j25N1k02J26j33
$$ -16 75 -23 -166 -258 -29 -29 323 257 292 158 157 -113 -116 92 169 180 121 313 -173 213 157 32 83 -119 7 -126
7995a26M03l57j7Q5J56j27pJ06M8l19M1K67n4k31M28j90J6q8J5o3J06k7k23J59
$$ -126 277 -80 -97 -12 144 17 10 116 164 -155 -114 153 99 -132 296 106 122 34 49 -14 92 65 -158 1
8019Aj89K39n4K65l48M3J10j79M1L25p5k11J35N0k51k4R5K37m06kK56k49J40L01
$$ 1 -188 51 -3 262 -86 -43 67 -112 -71 254 179 -32 103 153 -98 -122 -27 210 -196 -198 58 -191 -51 250
8043B50n25j0M87l52j0J47j53L89l14K03K6k22l1j5j25K93r8K29j19j7k69K9K77
$$ 250 -275 -285 202 -150 -160 -13 -166 223 -91 112 138 -84 -115 -130 -255 38 -60 169 50 33 -236 -207 70
8066G0l8Rj89L68k00rj32j18K12j26K13j65J99p1m0j44J64J08j61k7J29j47K3
$$ 70 32 41 -148 220 20 11 -121 -239 -27 -153 60 -105 94 23 -17 -161 3 111 -50 -77 52 -95 -72
8089g2J92k69L10k67N9o9K79l31m8M07k93M1K29j8j40kJ20l1K22n04J74O7L2j92
$$ -72 120 -149 161 -106 -47 -116 163 -168 -216 191 -102 -61 168 150 10 8 128 97 319 -185 -11 56 88 -104
8113a04l2J12K3kk40J51O3l8j44M68l02L9K1L82o35J43k60O90l10j89J30l22K69
$$ -104 -136 -24 -1 -3 -243 -92 -29 -67 -211 257 -45 -6 15 397 -238 -95 -355 335 25 -164 -34 -356 -87
8136h7M48l17m7P3m8N4j38Q2r2J99p4k55K80k3R0K5k26L25Mk58j06Q7L5J16j81
$$ -87 361 44 -3 70 22 76 -62 20 -72 127 53 -202 78 55 145 170 -56 269 273 15 -91 -4 31 147 -34
8161c4L95m58L20k34J04n4k85L32n9j28P1J18j28K58r0J3l85J06K44m8j80J83
$$ -34 361 -97 223 -11 93 39 -246 86 27 -101 -30 88 -40 218 128 141 -244 -138 106 58 -122 61
8183F1J10o4k14R2j63J72J20n9
$$ 61 171 107 -107 -15 -178 -6 114 55
8191E5
$$ Imaginary data points
##PAGE= N=2
##DATA TABLE= (X++(I..I)), XYDATA
0@%%%%%%%%%%%%qJ6j6J6j6K4l2M0m8N6o5P3q8J04j21J44j67J92k23K54k87L23
$$ 0 0 0 0 0 0 0 0 0 0 0 0 0 -8 8 -8 8 -8 16 -16 24 -24 32 -33 40 -48 56 -65 79 -88 104 -119 135 -152 171
34A71l65M12m66N24n85O54p30Q11r00R99j106J224j353J493j646J813j997K199
$$ 171 -194 218 -248 276 -309 345 -385 426 -474 525 -581 643 -710 783 -863 950 -1047 1152
52A152k423K672k950L262l611M011m471N005n640O405p350Q549j0125J2311j5561
$$ 1152 -1271 1401 -1549 1713 -1898 2113 -2358 2647 -2993 3412 -3938 4611 -5514 6797 -8764
67h764K0964l2116R8038j80590n1626K98262r1349j28997J15215M7329j18834
$$ -8764 12200 -19916 78122 -102468 -154094 144168 52819 -76178 39037 86366 -32468
78c2468K7185L9568k3735R956J03o0887K7057M5225j8997j1858O211k6666J4188
$$ -32468 -5283 34285 10550 20506 20609 -40278 -13221 32004 13007 1149 7360 -19306 -5118
91e118J6629k9249l90J9984k9931J6722M7806m6592l6202O3251k1367p0313Q1298
$$ -5118 11511 -17738 -18128 1856 -28075 -11353 36453 -10139 -46341 16910 -4457 -74770 6528
104F528P0426j08736m6302R1437O537m3953L3679k016m5472K6451J7041k9618
$$ 6528 76954 -31782 -78084 13353 19890 -24063 9616 7600 -37872 -11421 5620 -23998
116b3998L6062K0303q1319p192R6641q31p6273L349L7466j1264j3470J9766J4517
$$ -23998 12064 32367 -48952 -56144 40497 39666 -36607 -33258 4208 -7056 -20526 -760 13757
129A3757k1618k2109K3159K3958k2970q693J6910k4254r939N6746J4997n3195
$$ 13757 -7861 -29970 -6811 17147 -5823 -14516 2394 -21860 -31799 24947 39944 -13251
141a3251p540K8122o288o963R915k314N680Q936j8691k124L2566q603m6134M674
$$ -13251 -20791 7331 1043 -5920 3995 1681 7361 16297 -2394 -4518 28048 19445 -26689 -22015
155b2015M2003M221k2761l218N584l858r45Q055o28j8043j2605J6125K4624r02
$$ -22015 19988 24209 1448 -1770 3814 -44 -989 7066 6438 -11605 -24210 -8085 16539 15637
169A5637j4919r017j4054j419K8637J1794k5067n678R739p787J3861J7579l4365
$$ 15637 718 -8299 -22353 -23772 4865 16659 -8408 -14086 -4347 -12134 1727 19306 -15059
182a5059j1894M2003j1620l5287M3099K1018n7668K068M8779k1223k0558K6743
$$ -15059 -26953 15050 3430 -31857 11242 32260 -25408 -23340 25439 4216 -16342 10401
194A0401j1536j7199K9599M53k2130J6794k504k7946K5187K8509k9586j7794J3281
$$ 10401 -1135 -18334 11265 11718 -10412 6382 3878 -24068 1119 29628 42 -17752 -4471
207d471r30N017J3219o178m823m156j5610J7764K8400k9296k4284L5199Q431k7482
$$ -4471 -5401 -384 12835 6657 1834 -2322 -17932 -168 28232 -1064 -25348 9851 18282 -9200
221i200J8358J7247l7712q164L6051k685j8171J4191p51j4329J6501Q020k4438
$$ -9200 9158 26405 -11307 -19471 16580 13895 -4276 9915 9164 -5165 11336 19356 -5082
234e082J863J5170j9716l638L6930J31l6261J808J8062j0539n309J6098j325j5546
$$ -5082 -3219 11951 -7765 -11403 25527 25658 -10603 -8795 9267 -1272 -6581 9517 8192 -7354
248g354L04J3371O533j0130j1923M533M414n477P122J2284j3039j3933J2084Q282
$$ -7354 -7050 6321 12854 2724 -9199 -4666 -252 -5729 1393 13677 638 -13295 -1211 7071
262G071l598j271j0664q203K1370J4148k1159p233J4351r592r615K2591O588k5051
$$ 7071 3473 2202 -8462 -16665 4705 18853 -2306 -9539 4812 -4780 -14395 8196 14784 -10267
276a0267m114J7812k700q798R836N694j3845q840J1980J1104o780j1388K003P321
$$ -10267 -14381 3431 731 -8067 1769 7463 -6382 -15222 -3242 7862 1082 -10306 -8303 -982
290i82J379j847L19n24j856l941l33J1281O469j7239q560K1087O825j6559L193
$$ -982 397 -1450 -1131 -1655 -3511 -7452 -7785 3496 9965 -7274 -15834 5253 12078 -4481 -1288
305a288P701j8638l329K9096N313k2807l608R779Q6n2R85l306L65K56j263P960
$$ -1288 6413 -12225 -15554 13542 18855 -3952 -7560 2219 2305 2253 3238 -68 297 553 -710 7250
321G250N598j1772q671O817O593j625k968K51M361k098o562Q203Q564j7669j1335
$$ 7250 12848 1076 -7595 -778 5815 4190 1222 1473 5834 3736 -2826 5377 13941 -3728 -15063
336a5063K0874Q828j5514J948R669j2702p902J4343O338q740k691j693j969R883
$$ -15063 5811 14639 -875 1073 10742 -1960 -9862 4481 10819 2079 -612 -2305 -4274 5609
350E609N904j1361m963N704k611n74J1842j809j6791J346J6775j439j2002J568
$$ 5609 11513 152 -4811 893 -1718 -2292 9550 7741 -9050 -7704 9071 7632 -4370 -2802
364b802N879m980l863Q906N766j1179r524R444R227n223l910J182m463j283P106
$$ -2802 3077 -1903 -5766 3140 8906 -2273 -11797 -2353 6874 1651 -2259 -1077 -5540 -6823 283
379B83J611k824K597m961p094J0665P469j2673k932R701m178n871J4142M311j7344
$$ 283 1894 -930 1667 -3294 -10388 277 7746 -4927 -7859 1842 -2336 -8207 5935 10246 -7098
394g098m840J3607L518o509j437K509j11o98K316N059l144j1536K18J1198M052
$$ -7098 -11938 1669 5187 -1322 -2759 -250 -361 -1059 1257 6316 3172 -8364 -8146 3052 7104
409G104l759l004m341J855N201k453j548M679o939o421J4254O128j5461j228J1486
$$ 7104 3345 341 -4000 -2145 3056 603 -945 3734 -3205 -9626 4628 10756 -4705 -5933 5553
424E553p270o747J2559K616j0991k87N441Q78K049k592p138K058O595k065q15
$$ 5553 -1717 -8464 4095 6711 -4280 -4567 874 1752 3801 1209 -5929 -3871 2724 659 -156
439a56M458l913q457K981J0942J209j0831m427O520J970m439L746N439j0308q219
$$ -156 4302 389 -8068 -5087 5855 7064 -3767 -8194 -1674 296 -4143 -397 5042 -5266 -13485
454a3485J1196Q861r416o208M753J107k118M178J057o175j93L299k76K514J344
$$ -13485 -2289 6572 -2844 -9052 -4299 -3192 -5310 -1132 -75 -6250 -6443 -3144 -3420 -906 438
469D38p485m31J0477p05p693O312M749j2881l299J7120N505j3967m939R359K861
$$ 438 -7047 -7478 2999 2294 -5399 913 5662 -7219 -10518 6602 12107 -1860 -6799 2560 5421
484E421n968J804N689n496o926O369O439k550j318k310m492M654O900n612l213
$$ 5421 -547 1257 6946 1450 -5476 893 7332 4782 3464 1154 -3338 1316 8216 2604 -609
499f09M665l504k918J1083J662j4853p44J2306k69p756L440N772o113o673P298
$$ -609 4056 552 -2366 8717 10379 -4474 -5218 7088 6819 -937 2503 8275 2162 -4511 2787
514B787Q953o657r441N239O223m723j210N524l634o340M571L024k316N82k089
$$ 2787 11740 5083 -4358 881 7104 2381 1171 6695 3061 -3279 1292 4316 2000 2582 493
529D93o472O201Q477r576o765J0784j312j1844R338J0731j3532p831J1097K376
$$ 493 -5979 222 8699 -877 -7642 3142 1830 -10014 -676 10055 -3477 -11308 -211 2165
543B165n267N169L76q988O68O086K531N95m296m957N866M132m689l0L983m265
$$ 2165 -3102 2067 2443 -6545 -5877 209 2740 3335 -961 -5918 -52 4080 -609 -639 3344 -921
559i21j518M375Q97m09j280m610K707P530n932p336Q274K409r032L263Q864p162
$$ -921 -2439 1936 2833 2424 1144 -3466 -759 6771 839 -6497 1777 4186 -4846 -1583 7281 119
575A19q269O755M067m162J341K639n625k233N225K688m69j348n394j540R453K699
$$ 119 -8150 -1395 2672 -1490 -149 2490 -3135 -5368 -143 2545 2076 728 -4666 -6206 3247 5946
591E946q010K51M756m974j700Q211M36p634n37M309J651j270k414K26K291k749
$$ 5946 -2064 -1813 2943 -2031 -3731 4480 4916 -2718 -3255 1054 2705 1435 -979 -753 1538 -1211
607a211k264N896R18o737j292M507J803o37l158j301L108j03l170M598L416q268
$$ -1211 -3475 2421 3339 -3398 -4690 -183 1620 983 -2175 -3476 -368 -471 -3641 957 4373 -3895
623c895l554J0058L006p731k076M718O23l217K275M369l443n713L059N293k259
$$ -3895 -7449 2609 5615 -2116 -4192 526 1149 -2068 207 4576 1133 -4580 -1521 3772 1513
638A513j776R75k207q14L327K66q01Q38m110m305Q113N414q766m749P599Q24o447
$$ 1513 -263 712 -1495 -2309 1018 1284 483 1321 -2789 -7094 1019 6433 -2333 -7082 517 1341 -5106
655e106L756N729p107m700P271L352n201q89K702j116P47R35r10R38O51m227J885
$$ -5106 -1350 4379 -2728 -7428 -157 3195 -2006 -2895 -193 -1309 -562 373 -537 401 1052 -3175 -1290
672a290O527k578n153K031K234o33J203k50o60l89l743J841Q935l513j0527N224
$$ -1290 5237 2659 -2494 -463 1771 1138 2341 2091 1431 1042 -2701 -860 8075 4562 -5965 -741
688g41O649p948O22R645p344q348Q920M313o852J063K024m601K242M556n031r91
$$ -741 5908 -2040 -1418 8227 883 -7465 1455 5768 -1084 -21 2003 -2598 -356 4200 -831 -1822
704a822O259l958n940P851M149q184k139N639l57k175K438K38l363j644J657M560
$$ -1822 4437 479 -5461 2390 6539 -1645 -3784 1855 1498 -677 1761 1999 -1364 -3008 -1351 3209
720C209L34o996j587P365j231n659N222J879q010N74P088k047k868J990l517N36
$$ 3209 3543 -3453 -5040 2325 1094 -4565 657 2536 -5474 -4900 2188 141 -2727 -737 -4254 -3718
736c718O026k814m040N268r04o993O564O416q046l870O351Q26k888K193J047k516
$$ -3718 2308 -506 -4546 722 -182 -7175 -611 5805 -2241 -6111 240 1066 -1822 371 1418 -1098
752a098j267Q40L666J364l554k992K960K546j518o17L34q9q46k08K638K063m161
$$ -1098 -2365 -1525 2141 3505 -49 -3041 -81 2465 947 330 664 575 -271 -479 2159 4222 61
769F1l990M413L828m087j627M307j005n085L330N778l546n026J963L235k58m32
$$ 61 -3929 484 4312 225 -1402 2905 1900 -3185 145 5923 2377 -2649 -686 2549 2291 1859
785A859m44q97j36n35J292K881j352m442P44M001m60j378n29M4k8q21J17M182
$$ 1859 1415 518 382 -153 1139 4020 2668 -1774 -1030 2971 2511 1133 604 648 620 -201 -84 4098
803D098j421p228K476P236m156m165N137r48m954M336L040l923m90o3k488M168
$$ 4098 2677 -4551 -2075 5161 1005 -3160 1977 1029 -3925 411 3451 -472 -962 -1025 -3513 655
819F55L488o234j866N248j951k595N129R06n939n14M602O57j825o68o21J373p82
$$ 655 4143 -2091 -3957 1291 -660 -3255 1874 2780 -3159 -3673 929 1586 -239 -907 -1528 -155 -937
836i37m15L911j39o240K84O383n25m707K010J677l342J198L646k104q83Q9k562
$$ -937 -1352 2559 2420 -3820 -3536 2847 2322 -2385 -375 1302 -2040 -842 2804 700 -183 -94 -2656
853b656K436N198m333m716N275J460n475L306M736o335k975N532J466k503J05
$$ -2656 -220 4978 645 -4071 1204 2664 -2811 495 5231 -1104 -4079 1453 2919 416 521
868E21p15p33J419K88L4J110k314k544L135K852k428j659M94K83M44J50o3J502
$$ 521 -194 -927 492 780 814 1924 -390 -2934 201 3053 625 -1034 -540 -257 187 337 274 1776
886A776k119m214L801N744m773m969M598J946l913O70L799k462l412J496K268
$$ 1776 -343 -4557 -756 4988 215 -4754 -156 1790 -2123 -1453 2346 -116 -3528 -2032 236
901B36M84j024j975n46K215O95j195Q00K77k539l31L764J098l838j638K582K040
$$ 236 720 -304 -2279 -2825 -610 85 -1110 -310 -33 -2572 -2903 861 1959 -1879 -3517 -935 1105
918A105k186k81L047j149n112K231O334k392m906K408K408k416P67K041k001j224
$$ 1105 -1081 -1362 1685 536 -4576 -2345 3989 1597 -3309 -901 1507 -909 -142 1899 -102 -1326
934a326J022q7J061K219l575k552L955J736l142P8K114k099j429K603K704k152
$$ -1326 -304 -391 670 2889 -686 -3238 717 2453 -689 -611 1503 -596 -2025 578 3282 1130
950A130l135P09K752k37j381J234N20l251P71M045j69l392j53J666k83Q89O17
$$ 1130 -2005 -1296 1456 1219 -162 1072 1592 -1659 -888 3157 2988 -404 -557 1109 826 1715 2332
967B332j648J03K94j157J108L174l166l984L342L205l161j258K772j190l029K472
$$ 2332 684 787 1081 -76 1032 4206 1040 -2944 398 3603 442 -816 1956 766 -2263 209
983B09K764k063k712P48J694K34p14L4K80j625q72K672J090j686j890M1J936J120
$$ 209 2973 910 -1802 -1054 640 874 160 194 474 -1151 -2023 649 1739 53 -1837 -1796 140 1260
1001A260j198j445Q06N61j827R89L372j810m886K161M232k101k176K156k76k348
$$ 1260 62 -1383 -577 -16 -1843 -854 2518 708 -4178 -2017 2215 114 -2062 94 -182 -2530
1017b530J310J879n25j294q70l7K550L18k228K77J295j518n36K853N93k280j562
$$ -2530 -1220 659 134 -1160 -2030 -2067 483 801 -1427 -1150 145 -1373 -1909 944 1537 -743 -2305
1034b305J847K770j080j917P11J741j940l8L111j96m079P52L429m57j227J5p25
$$ -2305 -458 2312 1232 -685 26 1767 -173 -211 2900 2704 -1375 -623 2806 2349 1122 1137 412
1051D12k34J331m6J06Q51k036k117L166K057l313j212K158n24k211K401J877l181
$$ 412 178 1509 1463 1569 2420 384 -1733 1433 3490 177 -1035 1123 599 -1612 789 2666 -515
1068e15k060K026J758m80j339m55J014m9j044J250J150k384j428K750O19n95m98
$$ -515 -2575 -549 1209 729 -610 -1065 -51 -100 -1144 106 1256 -1128 -2556 194 813 218 -280
1085b80j368K98J833n73j399K349r29l629K296L948k655k794K638r5k118K005
$$ -280 -1648 -1350 483 -90 -1489 860 -69 -3698 -1402 2546 -109 -2903 -265 -360 -2478 -473
1101d73K105k535j570R62J698J168j415j357K40J461n36J79Q33m70o71j19J242
$$ -473 1632 -903 -2473 -1511 187 1355 -60 -1417 -1177 284 -252 -73 760 290 -381 -500 742
1118G42J617q37k730J269K207j522o65K302m15l626J103L883j335k792J017P05
$$ 742 2359 1522 -1208 61 2268 746 81 2383 1968 -1658 -555 3328 1993 -799 218 923
1134I23j121O19J560j539j247K58Q71J277k46k615kK203l70j025J063Mj096r11
$$ 923 -198 421 1981 442 -805 -547 324 1601 1355 -1260 -1262 941 571 -454 609 613 -483 -1394
1152a394Q88K089l07l357R5L555j228k064L114R7l971N83L473r24j350M23j090
$$ -1394 -506 1583 1276 -2081 -1986 1569 341 -1723 1391 1488 -2483 -1900 1573 649 -701 -278 -1368
1169a368k89K630j013j360J355q57j587K853Q99l233m21J818N41j046J96L78j57
$$ -1368 -1657 973 -40 -1400 -45 -902 -2489 364 1263 -1970 -2391 -573 -32 -1078 -882 -504 -661
1186f61p55l61J938J695l314j217K838R74k442J062J364k160r79K813N81j175
$$ -661 -1416 -1777 161 1856 -1458 -2675 163 1137 -1305 -243 1121 -1039 -2018 795 1376 201
1202B01j24j041J30K621m85k497J507Q12k633J256L313k788k669L163P45k022
$$ 201 77 -964 -834 1787 1302 -1195 312 1124 -1509 -253 3060 272 -2397 766 1511 -511
1218e11Q57R07j519R2J3J33K022n64l080J146K546j047n72O38j075l01J121L03
$$ -511 346 1253 -266 -174 -161 -28 1994 1430 -1650 -504 2042 995 423 1061 -14 -315 806 1109
1236A109N57o33k253R67K768j024k357J152R50j734O51K087j319j904N88J364
$$ 1109 1666 1033 -1220 -253 2515 1491 -866 286 1236 -498 153 2240 921 -983 -395 969
1252I69k79n05j26N3l88n05N10J024R0j940q74K098J035j404n70O68l04k37L86
$$ 969 690 185 59 112 -276 -781 -271 753 843 -1097 -1971 127 1162 -242 -812 -144 -448 -685 -299
1271b99R81m40k172K01K955k69k421R76Q32j388M32J583j086j017Q68m85P43J383
$$ -299 682 242 -1930 -1729 1226 957 -1464 -488 344 -1044 -612 971 -115 -1132 -264 -749 -6 1377
1289A377j802r60J774k00j597J902J096k666o93K197O76m66r22p98J366L50j112
$$ 1377 -425 -1385 389 189 -1408 494 1590 -1076 -1769 428 1104 638 -284 -1082 284 634 -478
1306d78P37J481k414j072L018K77k034L11O69o47N85P27r71j54O96j375K98K075
$$ -478 259 1740 -674 -1746 1272 1549 -485 -174 495 -152 433 1160 189 35 731 -644 -346 1729
1324A729j064k323J884R32j772P19J967k037k072J924J642j405o05r6r3R07j46
$$ 1729 665 -1658 226 1158 -614 105 2072 35 -2037 -113 1529 124 -481 -577 -670 237 91
1341I1o62Q39j0k318J220K313j223j762Q63K38n8O98p18k12J156j237p97K736
$$ 91 -571 268 258 -2060 -840 1473 250 -1512 -649 -411 -469 229 -489 -701 455 -782 -1579 1157
1359A157k38l068J242J756j657k25K093q94j952Q27J772m76o29l45o4R00k1m53
$$ 1157 919 -2149 -907 849 -808 -1033 1060 166 -1786 -959 813 337 -292 -637 -701 199 178 -275
1377b75K40N37j303k54J729N91j671m63Q07P88j64r56J026jj429N6J833M63j909
$$ -275 -35 502 -801 -1055 674 1265 -406 -869 -62 726 562 -394 632 631 -798 -742 1091 1554 -355
1396c55n03J684J57q08P94j52p96M3J95P25K24p47j032J293P57j206o4J091q75
$$ -355 -858 826 983 175 969 817 21 64 259 984 1208 461 -571 722 1479 273 209 1300 425
1415D25j141J304J226r55j370L97R35L47j715P30R70j538r69K146O16k183k93
$$ 425 -716 588 1814 859 -511 -114 821 1168 -547 183 1153 -385 -1354 792 1408 -775 -1068
1432a068Q85R6nM26p81k05M31o17L97J583j269k026J638J142j093q21J468l39
$$ -1068 -183 -87 -92 334 -447 -652 -221 -838 -441 1142 -127 -2153 -515 627 -466 -1287 181 -158
1450a58j202M54J397k29j318m53P18J016m0j316J012Nj183M24J827p11j700N78
$$ -158 -1360 -906 491 262 -1056 -1509 -791 225 185 -1131 -119 -114 -1297 -873 954 243 -1457 -879
1468h79Q10K59J31n57o15J106n53m84K061l91k391O56K389r39j234P63M10j263
$$ -879 -69 190 321 -236 -851 255 -298 -782 1279 888 -1503 -847 1542 603 -631 132 542 -721
1486g21O63R32l25j63m42l41J061P60j274l55Q20k55n63P79L43r83o59P87P45
$$ -721 -58 874 549 386 -56 -397 664 1424 150 -205 615 360 -203 576 919 -64 -723 64 809
1505H09r3j076J47P48l66q20J548J32j752m02J582M16j046K07J53k38j89L70J07
$$ 809 716 -360 -213 535 169 -651 897 1029 -723 -1125 457 873 -173 34 187 -51 -240 130 237
1524B37K94o49q93P96J413j117q64J017L81j066N39J059p10j306J73J409M9p61
$$ 237 531 -118 -1011 -215 1198 81 -783 234 615 -451 88 1147 437 -869 -696 713 762 1
1542Ao64Q27m0q90J115P10j512l32P20N09k70k20n95J02J039m35n76J069p4j654
$$ 1 -663 164 124 -766 349 1059 -453 -785 -65 444 174 -46 -641 -539 500 65 -511 558 484 -1170
1562a170M95J783l17j713O92Q08o72p3P15j93o45m31P64J030n87j134N79N32o11
$$ -1170 -675 1108 791 -922 -230 578 -94 -167 548 355 -290 -721 43 1073 486 -648 -69 463 -148
1581a48o6J062l41o85j15O16M99l38r10J92R32l21n89Q49o2j351L95J421l18j163
$$ -148 -214 848 507 -178 -293 323 822 484 -426 -234 698 377 -212 637 575 -776 -381 1040 722 -441
1601d41PR43l20m45M13O8k33o27J89J063J55j073j75M29N62q13j66O71o53k45
$$ -441 -434 509 189 -256 157 225 -8 -635 -446 617 772 -301 -476 -47 515 -298 -464 207 -446 -691
1621f91l1J381m59j320N1J054P3r17M57O24r10o75J158M58q72n47L11L81J71k56
$$ -691 -722 659 200 -1120 -1069 -15 58 -859 -402 222 -688 -1363 -205 253 -619 -1166 -855 -474 -303 -559
1641e59J71K67m46l13R15N63p29r63N51P77j64l65O1L27l58j73J170J6j197p79
$$ -559 -388 -121 -567 -880 35 598 -131 -1094 -543 234 70 -295 -234 93 -265 -438 732 748 -449 -1228
1661a228J543M63q46L33J56P6n98K11N63l0m17m41O35M90l72n39P46J61j056M08
$$ -1228 315 778 -68 265 421 497 -101 110 673 643 226 -215 420 910 538 -1 745 906 -150 258
1681B58J060j78j412K73J035O5q93J14M26n67q4M75K77n26o76L36R16m48l88l
$$ 258 1318 1140 -272 1 1036 1101 208 322 748 181 97 572 849 323 -353 -17 899 451 63 60
1701F0L13m34j36N81K03m36q22K71J052n31p43L27L63n75j44J197j26q88n51P25
$$ 60 373 -61 -197 384 587 151 -671 -400 652 121 -622 -295 68 -507 -651 546 420 -468 -1019 -294
1721b94N94j62n15K73n0k24J74K80j98k20j87O81K80n88m57N82L41p28m70J397
$$ -294 300 138 -377 -104 -154 -378 -204 76 -122 -342 -529 152 432 -156 -613 -31 310 -418 -888 509
1741E09l96r50J55J017j57m33J6K29Q9m04M43N58m13r19K92Q88j37l57l22K24
$$ 509 113 -837 -682 335 178 -255 -239 -10 79 -325 118 676 263 -656 -364 524 387 30 -292 -68
1761f8M25k61j29N30l06n13M08N75J15p45l14P40j67o20P57N3p46m12J065L83
$$ -68 357 96 -33 497 191 -322 86 661 776 31 -283 457 290 -330 427 480 -266 -678 387 770
1781G70q82k60K5L59M7J28j32l20q8k69O26P46r53q79R98K65j47l71K27M1n33
$$ 770 -112 -372 -347 12 59 187 55 -265 -353 -622 4 750 -203 -1082 -84 181 34 -337 -110 -69 -602
1802f02j09O87L71p90k32N75m3m15L21L75l00p26q7J155J15j042K65L98J56k98
$$ -602 -711 -24 347 -443 -675 -100 -143 -558 -237 138 -162 -888 -975 180 295 -747 -482 -84 72 -226
1822b26R4J1j58k04N04L69K32j064m14J353lj011N28P59j148K4M77N44k69l16
$$ -226 -132 -121 -279 -483 21 390 622 -442 -856 497 494 -517 11 770 -378 -354 123 667 398 82
1842H2l31N65L34j28k54L00k52m88R68L24n93p42N28M10l3m89K13N3l11k73O17
$$ 82 -249 316 650 522 268 568 316 -172 796 1120 527 -215 313 723 690 201 414 467 156 -117 500
1863E00N63r02l80N91M99q04q4N80j28q98L96N54Pp21MK38N72k94n84J10L34o07
$$ 500 1063 161 -219 372 871 67 -17 563 435 -463 -67 487 494 -227 -223 15 587 293 -291 -181 153 -454
1885d54J87P92n28n77j92R94K0p06k75O23L6p38N78L47m69k95K26J77J21k19k92
$$ -454 -267 525 -3 -580 -772 222 242 -464 -739 -116 -80 -818 -240 107 -362 -657 -431 -254 -133 -352 -644
1906f44N18J27o41K18R79m12j223N43Q89o43k70N07m1m23N7N27L18n63o23L56
$$ -644 -126 1 -640 -422 557 145 -1078 -535 354 -289 -559 -52 -93 -516 -459 68 386 -177 -800 -444
1926d44J023o90m16O12M4n03J27O65o10K6j43L42K00J27p62L5N35j37k19O20O5
$$ -444 579 -111 -527 85 129 -374 -247 418 -192 -166 -309 33 233 360 -402 -367 168 31 -188 432 497
1947D97q22k27J324Op19L45n2m50J07O20p3k15k0p32R75J53q13k5N48l27l65Q58
$$ 497 -325 -552 772 778 59 404 352 -98 9 629 556 341 321 -411 564 717 -96 -121 427 100 -265 593
1969E93l99J76p86K45L80L09o06l46M16j42m46L59Q88j126n10R92J15k61l56J74
$$ 593 194 370 -416 -171 209 518 -88 -434 -18 -160 -606 -247 641 -485 -995 -3 112 -149 -505 -331
1989c31J74j42M9M9J87q7l94J5Q87m58n32N57J82k17l60Q16m93k63j91P53K14
$$ -331 -157 -299 -250 -201 -14 -101 -495 -480 407 -51 -583 -26 156 -61 -421 395 -98 -361 -552 201 415
2010D15o46j48J94O56n90K34L55k6r83M12R42l40q2m14J11M34j54r3l5J23o23
$$ 415 -231 -379 -185 471 -119 115 470 444 -539 -127 815 475 393 -21 90 524 370 277 242 365 -258
2031b58J81R34k50m78j37N02l29P6k41J34L04p91K82P56l67o62L41K05j85l93
$$ -258 -77 857 607 129 -8 494 165 241 0 134 438 -353 -71 685 318 -344 -3 202 17 -376
2051c76O08l09j25j07J98M63k49j013N04L92j7m39O25j81n68j5Q50j10l37l71
$$ -376 232 -77 -202 -309 -111 352 103 -910 -406 -14 -31 -470 155 -26 -594 -609 241 131 -206 -577
2071e77J35K90l67R9K39K3l75J34M08K26q12l24J050j34l10J88k8q5j74J80L20
$$ -577 -442 -152 -519 -420 -181 -158 -533 -399 9 235 -577 -901 149 15 -295 -107 -135 -220 -394 -214 106
2092A06k7m57k00O54J35n63K71M29k28p42M01P29m12k64k2K26M22m46k22L15J79
$$ 106 79 -378 -578 76 211 -352 -81 348 120 -622 -221 508 96 -168 -190 36 458 12 -210 105 284
2113B84m42M66N30l66o62J33P18n54l64N37J76j77j30K63L19l35r24N32N87l56
$$ 284 -158 308 838 472 -190 -57 661 107 -257 280 456 279 149 412 731 396 -528 4 591 235
2133B35j36J88K69p83K28O07k85l59q0K71J80k63p1Q7K62l87n1K12M21p92j46
$$ 235 99 287 556 -227 1 608 323 -36 -116 155 335 72 1 88 350 -37 -88 124 545 -247 -393
2154c93O30K70o08j44N63m85j76K45M60j29n17j24O86P4n10o8M00m66k52M00Q8
$$ -393 237 507 -101 -245 318 -167 -343 -98 362 233 -284 -408 278 352 -158 -226 174 -292 -544 -144 -56
2175e6o1l21j3O46k3l13l11L05J19o89Q76J93m55m54L81M08l95j7P4J97o0j21
$$ -56 -117 -438 -451 195 172 -141 -452 -147 -28 -717 159 352 -103 -557 -176 232 -163 -180 -106 91 31 -90
2197i0R2M59l73n50O39K35m36l30K42M82m24K28K23o7o32K74J89M35o42k81K78
$$ -90 2 461 88 -462 177 412 -24 -354 -112 370 -54 174 397 330 -302 -28 161 596 -46 -327 -49
2218d9M16n66j25P05k14o86M74L86j24j52p9J93j68j62o7O81l7r92K71Q62o58
$$ -49 367 -199 -324 381 167 -519 -45 341 217 65 -14 179 11 -151 -218 463 426 -566 -295 567 -91
2239i1n22L35N99m22k02M5J51J8j56l8L34J25n24k8N06n08K01L33j04l22k25J92
$$ -91 -613 -278 321 -101 -303 -258 -107 -89 -245 -283 51 176 -348 -376 130 -378 -177 156 52 -270 -495 -303
2261c03M87j7n00j56O11R6o41L09L52m99J8P29j04l21n25M91M94n27l30M76O4
$$ -303 184 167 -333 -489 122 218 -423 -114 238 -261 -243 486 382 61 -464 27 521 -6 -336 140 204
2282B04l50k5M70K18n86j15N03J66l64N2K02l51rJ04J66K87m35k52L03M41o58
$$ 204 -146 -171 299 517 -69 -184 319 485 121 173 375 24 15 119 285 572 137 -115 188 629 -29
2303b9L59J18l21k51M25L14l09Jj44R0J90l13k79J72L03o44Q5Q36l30m92J52J60
$$ -29 330 448 127 -124 301 615 306 307 163 253 443 130 -149 23 326 -318 -233 603 273 -219 -67 93
2325I3j02k5J18K7k04k43K96K73k30n60L52L22k51j74M99k51k54q7K65J27p1n27
$$ 93 -9 -34 84 111 -93 -336 -40 233 3 -557 -205 117 -134 -308 191 -60 -314 -401 -136 -9 -80 -607
2347f07K34M42r8m63K48M70p73l9O88k1m78J23J08m4j5R5j99J72rJ48L26k39n01
$$ -607 -373 69 -29 -492 -244 226 -547 -586 102 81 -397 -274 -166 -210 -225 -130 -329 -157 -166 -18 308 69 -432
2370d32O0P85l96j94J43j6j05M1J91J97j29l65K8M06K32q31L87N75m95l29L80
$$ -432 -372 413 17 -177 -34 -50 -155 -114 77 274 145 -220 -192 214 446 -385 2 577 82 -247 133
2391A33M73p22O6p6M50L23n19r8K81m01j27P25r7m05R6K91O5j12k41J37j13j41
$$ 133 606 -116 -50 -126 324 647 128 30 311 -90 -217 508 411 6 102 393 458 346 105 242 129 -12
2413a2J63j38K90l11k37J95L35m53k64N84j35k23Q2L59l93R3m29L80K50l78m15
$$ -12 151 13 303 -8 -245 -50 285 -168 -432 152 17 -206 -124 235 -158 -65 -494 -114 136 -242 -657
2434f57O95K31n45J08M05k63m47L08O02m47j45k18N91q9k4l69N78k35n84M55N76
$$ -657 38 269 -276 -168 237 -26 -473 -165 437 -10 -155 -373 218 129 105 -264 314 79 -505 -50 526
2455E26m98m15M23l7k68K18J76k57M24o19R5N25j81k68P6K92j40k18K60J48k37
$$ 526 28 -387 36 -1 -269 -51 125 -132 292 -327 -232 293 112 -156 -80 212 72 -146 114 262 25
2476B5Q0K17m6n5l84K99K73r9n79O02j05k77j53P52m80k58Q4K55j02k12L65j50
$$ 25 105 322 276 221 -163 136 409 310 -269 333 228 -49 -202 550 70 -188 -104 151 49 -163 202 52
2498E2k2n8j44J76M49n37l54N35k06l42L92j81Q4o9M43j55J06m42k62N50o9k97
$$ 52 30 -28 -172 4 453 -84 -438 97 -109 -451 -59 -240 -156 -225 218 63 169 -273 -535 15 -54 -351
2520c51K58K40m02l87M11L80m25K2K8K3M93o23J20K49k9n12K80O42m37n96M35
$$ -351 -93 147 -255 -642 -231 149 -276 -254 -226 -203 290 -333 -213 36 7 -505 -225 417 -20 -616 -181
2541a81L16l93J18j31K07L2n53M36L53j50k04J09L49m36O5M41j59o27M87M62k06
$$ -181 135 -258 -140 -271 -64 -32 -585 -149 204 54 -150 -41 308 -128 -63 378 219 -408 79 541 335
2562C35k30j88K66M25m53j90N53l97j74J76P70n62l59L04OL29k5l90J32R1k32
$$ 335 105 -83 183 608 155 -35 518 121 -53 123 893 331 -28 276 282 611 586 196 328 419 187
2583A87j49N18j20o42M90J53m3l55j61N21j81j46J68l3J67n48J6L62j49m63M09
$$ 187 38 556 436 -206 284 437 394 39 -122 399 218 72 240 207 374 -174 -158 204 55 -408 1
2604AJ37n53K56J14J99m63N9m8J81L81p54L6M82j22j16L43r2l97j11L10J41k93
$$ 1 138 -415 -159 -45 154 -309 -250 -298 -117 264 -490 -454 28 -94 -210 133 41 -356 -467 -157 -16 -309
2626c09k3J48o4Q6m6K03nm06J38L46Q1l69K4L08J1l08K16K71m4l51k16M85J03
$$ -309 -332 -184 -248 -162 -208 -5 -10 -416 -278 68 149 -220 -196 112 123 -185 31 302 258 -93 -309 176 279
2649B79n31J07M85n7n28K90j62K26r2j88L54r1j84M4J03K6j98J11N28m50n79P89
$$ 279 -252 -145 340 283 -245 45 -117 109 17 -171 183 92 -92 -48 55 81 -117 -6 522 72 -507 282
2671B82M02o76j2KK15j69Q3l05M42m56j82M37K44l01j51M11m2p96M83mK1k32j9
$$ 282 684 8 -4 -2 213 44 127 -178 264 -192 -374 63 307 6 -145 266 224 -572 -89 -93 -72 -304 -323
2694c23K39j70J77l21J1N66l72k94L86J09m45M73O9l35K71j76j31L03m54K82K77
$$ -323 -84 -254 -77 -398 -387 179 -193 -487 -101 8 -437 36 105 -230 41 -135 -266 37 -417 -135 142
2715A42j26m13K48M94l6p01K91J46J79j06K96j22l31j93J31N22k22m32J54K97
$$ 142 16 -397 -149 345 309 -392 -101 45 224 118 414 292 -39 -232 -101 421 199 -233 -79 218
2735B18P0m70O07N3o07K74LK11k43k13j59M97J48J14K9r4n52K72J79P4n70L49
$$ 218 288 -182 425 478 -129 145 148 359 116 -97 -256 241 389 503 532 438 -114 158 337 411 -159 190
2757A90K53J9j93j1r3M5o4j14J89L28o11j79P06k61l90L58L6j6k18j64K36k6j89
$$ 190 443 462 269 258 165 210 146 32 221 549 -62 -241 465 204 -186 172 208 192 -26 -190 46 20 -169
2780a69l07M42L20o36r4M94q1o59O82Q3m33J3l10N90r0j51k16O42j41m17J27L25
$$ -169 -476 -34 286 -350 -444 50 -31 -690 -8 75 -358 -345 -655 -65 -155 -306 -522 120 -21 -438 -311 14
2802A4j7p05N55j6J19k8l52L21k1j95K25K50k79j2mK39l5l93K57jk52M13L4j61
$$ 14 -3 -708 -153 -169 -50 -78 -430 -109 -130 -325 -100 150 -129 -141 -145 94 59 -334 -77 -78 -330 83 117 -44
2826d4O5m77M53M44l71l32J53L07l04K84q7J92m58J66K91K7k50oNr6J21J13L07
$$ -44 21 -456 -3 441 70 -262 -109 198 -106 178 91 283 -175 -9 282 309 59 53 58 -38 83 196 503
2849E03k55m35K77M82k61j21J49j25J5M6k77r5M94k00m99L73J38n5k05N90o23
$$ 503 248 -187 90 572 311 190 339 214 229 275 -2 -97 397 197 -302 71 209 154 -51 539 -84
2870h4j22K95j52J3J5j68M41p3l44L65M9l66j13K12J69n18j49N54r9l0j40J5K51
$$ -84 -206 89 -63 -50 -35 -203 238 165 -179 186 235 -131 -244 -32 137 -381 -530 24 -75 -105 -245 -230 21
2893B1ml21Q4K51k74j02N38j62j31J31Lq7L9K66l9j27k08k63K70P89o49j93L88
$$ 21 17 -304 -220 31 -243 -345 193 31 -100 31 34 -53 -14 252 213 86 -122 -385 -115 674 25 -168 220
2916B20l4l37K32j54N0l25M13J17j6k73OL18J76k64j71L24r8j32L51p5j71l17
$$ 220 186 -151 81 -73 -23 -348 65 182 166 -107 -101 217 393 129 -42 282 184 52 403 328 157 -160
2938a60K51J8j53j49L21K11k90l35K02J82q3k71J12K50j30o8J95j11M7k64J21
$$ -160 91 109 -44 -193 128 339 49 -286 -84 98 15 -256 -144 106 -24 -92 103 -8 39 -225 -104
2959a04J99k60j11J67J31j96l4K45j22j17k31K30J34k07q4J22J63r8j86L17k1
$$ -104 95 -165 -276 -109 22 -174 -208 37 -85 -202 -433 -203 -69 -276 -360 -238 -75 -173 -359 -42 -63
2980f3m10J65K22qm49J83K24N3J18k83n3L09k06KM68j77k25l4M95k86n55N80J77
$$ -63 -473 -308 -86 -94 -543 -360 -136 -83 35 -248 -301 8 -198 -196 272 95 -130 -164 331 45 -510 70 247
3003B47m42K07K8j35L45n7q5P8M1j1j64K60o1l15M79n0j29n8O2n2J61k75L6J76
$$ 247 -195 12 40 -95 250 193 108 186 227 216 52 312 251 -64 415 365 236 178 240 188 349 74 110 286
3027B86l30J22pK91o17K68L62k66J14k25J75o8k09K22j04L66l56m05N72Pm47L44
$$ 286 -44 78 71 362 -255 13 375 109 223 -2 173 105 -104 118 14 380 24 -381 191 198 -249 95
3049I5M0k98J76l92K51K87n57K13L27j91l46J91K46L0J6j51J60k53l4J07R2l35
$$ 95 135 -163 13 -379 -128 159 -398 -185 142 -49 -395 -204 42 72 88 -63 97 -156 -190 -83 9 -326
3071c26J46j04J83M1j26K18k4l22M6R0K90q9j5k47K61J29k41R9K48j30l54L06
$$ -326 -180 -284 -101 -60 -186 32 8 -314 -268 -178 112 23 8 -239 22 151 -90 9 257 127 -227 79
3093G9J58k33j86L38j22l6%J59q4n3R9k38J30q2O6J12K14k28o67P73L17n21K6
$$ 79 237 4 -182 156 34 -2 -2 157 73 20 119 -119 11 -71 -5 107 321 93 -574 199 516 -5 21
3116B1K61j12J38k04k40L35l83n1M54k3m49L29K06k00j79n4J28L0M0o4q9J93j46
$$ 21 282 170 308 104 -136 199 -184 -235 219 196 -253 76 282 82 -97 -151 -23 7 47 -17 -106 87 -59
3139e9k1l2L26l55J22K7l7j79J51K24k45l32P35l39J9o3pK67j75l66J69J50l65
$$ -59 -80 -112 214 -141 -19 8 -29 -208 -57 167 -78 -410 325 -14 5 -58 -65 202 27 -339 -170 -20 -385
3162c85J18L13J20l38J43o6J90k71J00K27M9l37R2O2L45o08L34J69L3k47j17N23
$$ -385 -267 46 166 -172 -29 -95 95 -176 -76 151 200 -137 -45 17 362 -246 88 257 290 43 -74 449
3184D49m11J84j9j64R0m6L9j38K77l45Q2J34q8k10L14n3K07l7l47J28K34j40r0
$$ 449 38 222 203 39 129 83 122 -16 261 -84 -2 132 44 -166 148 95 302 265 -82 46 280 140 50
3207E0J94J8k78K11L03n61%J21K10l04k4L71l26K9k23M1M67o63J34R5j15R3j03
$$ 50 244 262 -16 195 498 -63 -63 58 268 -36 -60 311 -15 14 -209 -168 299 -364 -230 -135 -250 -157 -260
3230b60J98P6l63K76p9J42l5l17q6J51J19j18J74J1J2j12K04j19j06j07J70J48
$$ -260 -62 14 -349 -73 -152 -10 -45 -362 -448 -297 -178 -296 -122 -111 -99 -211 -7 -126 -232 -339 -169 -21
3252b1Q9k33L3K05k37k28N94k10l08J88J00M6j40k11M53l62k07L29K28J38l69
$$ -21 68 -165 -132 73 -164 -392 202 -8 -316 -128 -28 18 -122 -333 120 -242 -449 -120 108 246 -123
3273a23l8K95j01j35K45j30q4r6J43J94l61J76J5oL89l34k6Q7k6j09K13J81n51
$$ -123 -161 134 33 -102 143 13 -71 -167 -24 170 -191 -15 0 -6 383 49 23 110 84 -25 188 369 -182
3296a82J05l2L29j22J61j53O7j14m04N00j09r8J45q0L74k41q5o8K17J73m80J92
$$ -182 -77 -109 220 98 259 106 173 59 -345 155 46 -52 93 13 387 146 61 -7 210 383 -97 95
3318I5J19m70J89L26M7l58k25K89J83n00N13j87R5p4j65o1J74l7j05J58K41m06
$$ 95 214 -256 -67 259 306 -52 -277 12 195 -305 208 21 116 42 -123 -184 -10 -47 -152 6 247 -159
3340a59k98N97jm63K85L63k30k27k6K31k07KK03kJ1k98M31p8j11q8K0J46J16j39
$$ -159 -457 140 139 -324 -39 324 94 -133 -159 72 -135 -133 70 68 79 -219 212 134 23 -65 -45 101 217 78
$$ [...]
8191a53
##END NTUPLES=NMR FID
##END=
