##TITLE=1H_SL-72-Dau(500)
 CDCl3, 40 sc, 
 16.11.2020
##JCAMPDX= 6.0         $$ Bruker NMR JCAMP-DX V2.0
##DATA TYPE= NMR FID
##DATA CLASS= NTUPLES
##ORIGIN= UXNMR, Bruker Analytische Messtechnik GmbH
##OWNER= root
$$ XWIN-NMR		Version 3.5
$$ Mon Nov 16 10:15:23 2020 Russian Standard Time (UT+4h)  she@DPX200
##.OBSERVE FREQUENCY= 200.1315066352
##.OBSERVE NUCLEUS= ^1H
##.DELAY= (6, 6)
##.ACQUISITION MODE= SIMULTANEOUS
##.ACQUISITION SCHEME= undefined
##.AVERAGES= 40
##.DIGITISER RES= 18
##SPECTROMETER/DATA SYSTEM= spect
##.PULSE SEQUENCE= zg30
##.SOLVENT NAME= CDCl3
##.SHIFT REFERENCE= (INTERNAL, CDCl3, 0, 15.7039)
##AUDIT TRAIL= $$ (NUMBER, WHEN, WHO, WHERE, WHAT)
$$ ##TITLE= Audit trail, XWIN-NMR		Version 3.5
$$ ##JCAMPDX= 5.01
$$ ##ORIGIN= Bruker BioSpin GmbH
$$ ##OWNER= she
$$ F:/spectra/data/she/nmr/H-F/1/audita.txt
$$ ##AUDIT TRAIL=  $$ (NUMBER, WHEN, WHO, WHERE, WHAT)
(   1,<2020-11-16 10:10:39.25 +0400>,<she>,<DPX200>,
      <continue with go, POWCHK disabled, PULCHK disabled
       configuration hash MD5:
       00 E9 B6 7A A2 85 ED C7 34 08 36 98 17 FE 4E 26
       data hash MD5: 16K
       AE 3C 54 7B 72 4B D9 88 6E C3 78 1E 49 D5 71 30>)
$$ ##END=
$$ 
$$ hash MD5
$$ 74 AB A0 E3 A4 34 ED 46 19 32 26 FA E0 E2 8F 36
##$RELAX= 
##$RELAX= 
##$RELAX= 
##$RELAX= 
##$RELAX= 
##$RELAX= 
$$ Bruker specific parameters
$$ --------------------------
##$DU= <F:/spectra>
##$EXPNO= 1
##$NAME= <H-F>
##$PROCNO= 1
##$TYPE= <nmr>
##$USER= <she>
##$AMP= (0..31)
100 100 100 100 100 100 100 100 100 100 100 100 100 100 100 100 100 100 
100 100 100 100 100 100 100 100 100 100 100 100 100 100 
##$AQSEQ= 0
##$AQ_mod= 1
##$AUNM= <au_zg>
##$AUTOPOS= <>
##$BF1= 200.13
##$BF2= 200.13
##$BF3= 200.13
##$BF4= 200.13
##$BF5= 200.13
##$BF6= 200.13
##$BF7= 200.13
##$BF8= 200.13
##$BYTORDA= 1
##$CFDGTYP= 0
##$CFRGTYP= 5
##$CHEMSTR= <none>
##$CNST= (0..31)
1 1 145 1 1 1 1 1 1 1 1 1 1 1 1 1 1 1 1 1 1 1 1 1 1 1 1 1 1 1 1 1 
##$CPDPRG= <>
##$CPDPRG1= <>
##$CPDPRG2= <>
##$CPDPRG3= <>
##$CPDPRG4= <mlev>
##$CPDPRG5= <mlev>
##$CPDPRG6= <mlev>
##$CPDPRG7= <mlev>
##$CPDPRG8= <mlev>
##$CPDPRGB= <>
##$CPDPRGT= <>
##$D= (0..31)
0 1.2 0 0 0 0 0 0 0 0.06 0 0.03 0 0 0 0 0.0002 0 0 0 0 0 0 0 0 0 0 0 0 
0 0 0 
##$DATE= 1605506875
##$DBL= (0..7)
120 120 120 120 120 120 120 120 
##$DBP= (0..7)
150 150 150 150 150 150 150 150 
##$DBP07= 0
##$DBPNAM0= <>
##$DBPNAM1= <>
##$DBPNAM2= <>
##$DBPNAM3= <>
##$DBPNAM4= <>
##$DBPNAM5= <>
##$DBPNAM6= <>
##$DBPNAM7= <>
##$DBPOAL= (0..7)
0.5 0.5 0.5 0.5 0.5 0.5 0.5 0.5 
##$DBPOFFS= (0..7)
0 0 0 0 0 0 0 0 
##$DE= 6
##$DECBNUC= <off>
##$DECIM= 32
##$DECNUC= <off>
##$DECSTAT= 4
##$DIGMOD= 1
##$DIGTYP= 9
##$DL= (0..7)
0 120 120 120 120 120 120 120 
##$DP= (0..7)
150 150 150 150 150 150 150 150 
##$DP07= 0
##$DPNAME0= <>
##$DPNAME1= <>
##$DPNAME2= <>
##$DPNAME3= <>
##$DPNAME4= <>
##$DPNAME5= <>
##$DPNAME6= <>
##$DPNAME7= <>
##$DPOAL= (0..7)
0.5 0.5 0.5 0.5 0.5 0.5 0.5 0.5 
##$DPOFFS= (0..7)
0 0 0 0 0 0 0 0 
##$DQDMODE= 0
##$DR= 18
##$DS= 0
$$ [...]
##$SUBNAM2= <"">
##$SUBNAM3= <"">
##$SUBNAM4= <"">
##$SUBNAM5= <"">
##$SUBNAM6= <"">
##$SUBNAM7= <"">
##$SUBNAM8= <"">
##$SUBNAM9= <"">
##$SW= 16.9725356469052
##$SWIBOX= (0..15)
0 0 2 0 0 0 0 0 0 0 0 0 0 0 0 0 
##$SW_h= 3396.73913043478
##$TD= 16384
##$TD0= 1
##$TE= 0
##$TE2= 300
##$TE3= 300
##$TEG= 300
##$TL= (0..7)
0 120 120 120 120 120 120 120 
##$TP= (0..7)
150 150 150 150 150 150 150 150 
##$TP07= 0
##$TPNAME0= <>
##$TPNAME1= <>
##$TPNAME2= <>
##$TPNAME3= <>
##$TPNAME4= <>
##$TPNAME5= <>
##$TPNAME6= <>
##$TPNAME7= <>
##$TPOAL= (0..7)
0.5 0.5 0.5 0.5 0.5 0.5 0.5 0.5 
##$TPOFFS= (0..7)
0 0 0 0 0 0 0 0 
##$TUNHIN= 0
##$TUNHOUT= 0
##$TUNXOUT= 0
##$USERA1= <user>
##$USERA2= <user>
##$USERA3= <user>
##$USERA4= <user>
##$USERA5= <user>
##$V9= 5
##$VALIST= <valist>
##$VCLIST= <CCCCCCCCCCCCCCC>
##$VD= 0
##$VDLIST= <DDDDDDDDDDDDDDD>
##$VPLIST= <PPPPPPPPPPPPPPP>
##$VTLIST= <TTTTTTTTTTTTTTT>
##$WBST= 1024
##$WBSW= 4
##$XGAIN= (0..3)
0 0 0 0 
##$XL= 0
##$YL= 0
##$YMAX_a= 365314
##$YMIN_a= -345856
##$ZGOPTNS= <>
##$ZL1= 120
##$ZL2= 120
##$ZL3= 120
##$ZL4= 120
##$ABSF1= 10
##$ABSF2= 0
##$ABSG= 5
##$ABSL= 3
##$ALPHA= 0
##$AQORDER= 0
##$ASSFAC= 0
##$ASSFACI= 0
##$ASSFACX= 0
##$ASSWID= 0
##$AUNMP= <proc_1d>
##$AZFE= 0.1
##$AZFW= 0.1
##$BCFW= 1
##$BC_mod= 2
##$BYTORDP= 1
##$COROFFS= 0
##$CY= 11.3945322036743
##$DATMOD= 1
##$DC= 2
##$DFILT= <>
##$DTYPP= 0
##$F1P= 15.9154993809931
##$F2P= -4.1035820241983
##$FCOR= 0.5
##$FTSIZE= 0
##$FT_mod= 4
##$GAMMA= 1
##$GB= 0.15
##$INTBC= 1
##$INTSCL= 1
##$ISEN= 128
##$LB= 0.24
##$LEV0= 0
##$LPBIN= 0
##$MAXI= 10000
##$MC2= 0
##$MEAN= 0
##$ME_mod= 0
##$MI= 1.114404
##$NCOEF= 0
##$NC_proc= 0
##$NLEV= 6
##$NOISF1= 3.799351
##$NOISF2= 2.8
##$NSP= 1
##$NTH_PI= 0
##$NZP= 0
##$OFFSET= 15.70392
##$PC= 1
##$PHC0= -11044.35
##$PHC1= 5.600886
##$PH_mod= 1
##$PKNL= yes
##$PPARMOD= 0
##$PSCAL= 0
##$PSIGN= 0
##$REVERSE= no
##$SF= 200.130013532006
##$SI= 16384
##$SIGF1= 3
##$SIGF2= 2
##$SINO= 400
##$SIOLD= 16384
##$SREGLST= <1H.CDCl3>
##$SSB= 0
##$STSI= 0
##$STSR= 0
##$SW_p= 3612.71676300578
##$SYMM= 0
##$S_DEV= 0
##$TDeff= 0
##$TDoff= 0
##$TI= <>
##$TILT= no
##$TM1= 0
##$TM2= 0
##$TOPLEV= 0
##$USERP1= <user>
##$USERP2= <user>
##$USERP3= <user>
##$USERP4= <user>
##$USERP5= <user>
##$WDW= 1
##$XDIM= 8192
##$YMAX_p= 0
##$YMIN_p= 0
$$ End of Bruker specific parameters
$$ ---------------------------------
##NTUPLES= NMR FID
##VAR_NAME=  TIME,          FID/REAL,        FID/IMAG
##SYMBOL=    X,             R,               I
##VAR_TYPE=  INDEPENDENT,   DEPENDENT,       DEPENDENT
##VAR_FORM=  AFFN,          ASDF,            ASDF
##VAR_DIM=   8192,          8192,            8192
##UNITS=     SECONDS,       ARBITRARY UNITS, ARBITRARY UNITS
##FACTOR=    0.0002944,     1,               1
##FIRST=     0,             0,               0
##LAST=      2.4114304,     0,               0
##MIN=       0,             -345856,         0
##MAX=       2.4114304,     365314,          0
$$ Real data points
##PAGE= N=1
##DATA TABLE= (X++(R..R)), XYDATA
$$ [...]
2342b71N13n12r6n8KM86l29O02j74L05p23l07J27P2J49l10J019p76N73j76j36
$$ -271 242 -270 -366 -424 -422 64 -265 337 163 468 -255 -562 -435 -363 -214 -524 495 -281 292 116 -20
2363b0L6q6j8N22k56R3j004J442p39P1K60n83M34k03L26k8m98M4L09J12q3K72
$$ -20 16 -70 -88 434 178 271 -733 709 -30 41 301 -282 152 -51 275 247 -251 -207 102 214 131 403
2385D03m20L83j05J61k99l28R66r21K63m96J010q19j80k86N60l55O50k50K03l81
$$ 403 -17 366 261 422 123 -205 761 -160 103 -393 617 -202 -382 -668 -108 -463 187 -63 140 -241
2405b41O5m35N21K4o1Q3j74j19J6k47J63J08j31J18J71L37m81J56q2O76m39k42
$$ -241 -176 -611 -90 -66 -127 -44 -218 -337 -321 -568 -405 -297 -428 -310 -139 198 -283 -127 -209 467 28 -214
2427b14N16j43l35J60j89N77k09m52O81j058N47L19j80k74O51J7p0m11l05P79
$$ -214 302 159 -176 -16 -205 372 163 -289 392 -666 -119 200 20 -254 397 414 344 -67 -372 407
2447D07l31RJ41K68q12O75Q4j72k59j01j13M07k74M60r91N05q9l61K5J08L91l40
$$ 407 76 85 226 494 -318 357 441 269 10 -91 -204 203 -71 389 -602 -97 -186 -547 -522 -414 -23 -363
2469c63J62L28n39N86j33l2n94J108j022j0M71j97K68K83l21K7k01o52J55P26
$$ -363 -201 127 -412 174 41 9 -585 523 -499 -509 -38 -235 33 316 -5 22 -179 -831 -676 50
2489E0M15r55J10Q8l1O12n96L9P96m75k15J3Q5L42q54L45P55m34m70N10M1R6k12
$$ 50 465 -490 -380 -292 -323 289 -307 -268 528 53 -162 -149 -64 278 -576 -231 524 90 -380 130 171 267 55
2512E5J7j49k66O06K1m57Q57l90m06K56j43J66k06RN44l25j52J08l83L99m0k12
$$ 55 72 -77 -343 263 284 -173 684 294 -112 144 1 167 -39 -30 514 189 37 145 -238 161 121 -91
2534i1p7K23j52n26Q78K20n41O5K2k13l03M0N4J08K81M3L18j23k46J29j29j95
$$ -91 -168 55 -97 -623 255 475 -66 -1 21 -192 -495 -455 -401 -293 -12 31 349 226 -20 109 -20 -215
2556b15P0L52m02K99P5o50P08j73m48M02oL94o30j81Q60q32J068o08J06J2q61
$$ -215 -145 207 -195 104 179 -471 237 64 -384 18 12 406 -224 -405 455 -377 691 83 189 201 -660
2577f60K35j2N32N0L31p47J78K17R1m13M47J50j32k64l25N1J84M88j98J28Ol40
$$ -660 -425 -437 95 145 476 -271 -93 124 215 -198 249 399 267 3 -322 -271 -87 401 203 331 337 -3
2599cp2O24n61O2O57o30k76J34P5j27j62M55l65l24R10l45l26N88j88n96J359
$$ -3 -75 549 -12 50 707 77 -199 -65 10 -117 -279 176 -189 -513 397 52 -274 314 126 -470 889
2620H89q31l32o4L79o5n19K58k96O86m24JN02j82j141J289k12N6p1K65k81m34
$$ 889 58 -274 -338 41 -24 -543 -285 -581 105 -319 -318 184 2 -1139 150 -62 -6 -77 188 -93 -527
2641e27L83j78N2K65N38m85k94P20n19O95k95m91J02j01L22o73J275j029n7Q8
$$ -527 -144 -322 -270 -5 533 48 -246 474 -45 650 355 -136 -34 -135 187 -486 789 -240 -297 -209
2661b09k50J27j1L30j65j4N31n02M07j41M98j60p91L36P38r51L65P5K73J58j444
$$ -209 -459 -332 -343 -13 -178 -192 339 -163 244 103 601 441 -350 -14 724 -227 138 213 486 644 -800
2682h00J062j64r00K56J67J32Q10m10q1Pk40N1p0l6K81J01o36K59R5K00n4m62
$$ -800 262 98 -802 -546 -379 -247 563 153 72 79 -161 -110 -180 -216 65 166 -470 -211 -116 84 30 -432
2704d32k63R62O8m31k48N53O2K94J07q73J17K22l67L31k07Q84j319M14L67m51
$$ -432 -695 267 335 -96 -344 209 271 565 672 -201 -84 138 -229 102 -105 779 -540 -126 241 -210
2724b10K53K78l0j06K3k64n55J29O97l71M64j65K72m61r9J05j26K06Q6p18Q25
$$ -210 43 321 291 185 208 -56 -611 -482 215 -156 308 143 415 -46 -145 -40 -166 40 126 -592 233
2745B33L7j34M60j132L25j84N88q6k46K51k15J53j61O94n85l3m81J029l68l40
$$ 233 270 136 596 -536 -211 -395 193 107 -139 112 -103 50 -111 583 -2 -35 -516 513 145 -195
2765a95O6M57n05M15l11N37l12M9k7K17K55k71l11l79m70N45K67j89L03k42p4
$$ -195 -129 328 -177 238 -73 464 152 201 174 391 646 375 64 -315 -785 -240 27 -162 141 -101 -175
2786a75J63K7k50N58q51Q01o13N82n86K07k02L35M04p31K90P7nL6l73J75j11L29
$$ -175 -12 15 -235 323 -528 273 -340 242 -344 -137 -339 -4 400 -331 -41 36 31 67 -306 -131 -242 87
2808H7j10L84L04m83j03K53j87o34O14k57J06M59n60J09K28k31R3K30m55K99R3
$$ 87 -23 361 665 182 79 332 145 -489 125 -132 -26 433 -127 -18 210 -21 72 302 -153 146 239
2829B39K7J85q13K53Q7L96n58L10l80k70Q50m15Q9q6k7O18k20o58K73K62P7n73
$$ 239 266 451 -362 -109 -22 374 -184 126 -254 -524 326 -89 0 -86 -113 505 285 -373 -100 162 239 -334
2851c34J45j22M15j31l39J39L54j17j44K01L35j95l41K01j10L57m09k2L87J78
$$ -334 -189 -311 104 -27 -366 -227 127 10 -134 67 402 207 -134 67 -43 314 -95 -117 270 448
2871D48m54Q0J49J18j92p74N53N1L99l9m84L17n95L07K89n25J52M33O3k88k97
$$ 448 -6 74 223 341 149 -625 -72 -21 378 339 -145 172 -423 -116 173 -352 -200 233 296 8 -289
2892b89L79J04O69j155N25k14n92O23k98k89K00P17j133O32M14m7j84k2QL44p04
$$ -289 90 194 863 -292 233 19 -573 50 -248 -537 -337 380 -753 -121 293 246 62 40 48 392 -312
2913c12P04k45m94j3J87M58r1Q9N5m80J44k99L10j71N74m53M30l14K58m83K59
$$ -312 392 147 -347 -360 -173 285 194 283 338 -142 2 -297 13 -158 416 -37 393 79 337 -146 113
2934A13l32M93m96O05J95r36N64j52P6m40J41J27m76K14M26k66k67J7L09m43L9
$$ 113 -219 274 -222 383 578 -358 206 54 130 -310 -169 -42 -518 -304 122 -144 -411 -394 -85 -528 -489
2955d89M82o3L35l45J01j99R0l13M12L12L66n34l11P23m38k79O2m1k71O4K54L82
$$ -489 -7 -70 265 -80 21 -178 -88 -401 11 323 689 155 -156 567 129 -150 -88 -129 -400 -336 -82 300
2977C00K0k40q2l1J92l60M67k33l11P18p29P71l42l83j33L28M7q4K46m80K53J28
$$ 300 320 80 -2 -33 159 -201 266 33 -278 440 -289 482 140 -243 -376 -48 -1 -85 161 -319 -66 62
2999F2J3J68o98K76j19L85K99p31r4J140j053L32K58n04O59l35k25o12N35R4J40
$$ 62 75 243 -455 -179 -298 87 386 -345 -439 701 -352 -20 238 -266 393 58 -167 -779 -244 -150 -10
3020a0P2l33M63J88m85O84p12K58Q2j3o24P59r22M26J80j35K49m03j95L78K59
$$ -10 62 -271 192 380 -105 579 -133 125 207 194 -430 329 -593 -167 13 -122 127 -276 -471 -93 166
3041A66r0j81j15K29j04Q7q5M83p02O96j088R21Q9k66J3r7K90M32l79l35M21k77
$$ 166 76 -105 -220 9 -95 -8 -93 390 -312 384 -704 217 306 40 53 -44 246 678 299 -36 385 108
3063A08k36M16N9m37j59M5N6K49l42j80M72m3K46o55M07j15l12J60L80j81r6L56
$$ 108 -128 288 347 -90 -249 -204 -148 101 -241 -421 51 8 254 -401 6 -109 -421 -261 119 -62 -158 198
3085A98n6o7m48l7M81j97K16J36j42j18N6k84O4L06K99j46k16N8k25PM93m74L68
$$ 198 142 75 -373 -410 71 -126 90 226 84 -34 22 -262 -198 108 407 261 45 103 -122 -115 378 -96 272
3108B72l51N2J0L89o12K59J27l78M38m7J60k84J90J45O7n51k0j11K88m0k0M73
$$ 272 -79 -27 -17 372 -240 19 146 -232 206 159 319 35 225 370 437 -114 -134 -245 43 3 -17 456
3130D56k55J04l47Q2j75m6rR4J66j02P67n94J69o21O53j77J11Lq4L53n82J8J5
$$ 456 201 305 -42 40 -135 -181 -190 -96 70 -32 735 141 310 -311 342 165 276 279 195 548 -34 -16 -1
3153aJ23k06J89j65N65p78p2K69Q0j5p9j19M98q01O28j08N27o14J30j12k80R88
$$ -1 122 -84 105 -60 505 -273 -345 -76 4 -11 -90 -209 289 -512 116 8 535 -79 51 -61 -341 647
3175F47l28q81O64j95j56K48k25O17o99L40r5k62N92l68k94O62o57m89N92O21
$$ 647 319 -562 102 -93 -249 -1 -226 391 -308 32 -63 -325 267 -101 -395 267 -390 -879 -287 334
3195C34l25n71K20K15M41l32O4L44l42Q5l55L8J46J09j16M76k10o87N36o66J97
$$ 334 9 -562 -342 -127 314 -18 46 390 48 133 -222 -184 -38 71 -45 431 221 -466 70 -596 -399
3216c99J023o45N7j32J3R3o4N83l50O2J02j11k10lJ61n54L47K23m17N93o15J4
$$ -399 624 -21 36 -96 -83 10 -54 529 179 241 343 232 22 19 180 -374 -27 196 -221 372 -243 -229
3238b29n0K28M65k58p4q9m2J61j99q3j9k22O60p13L83k34M81K99q59R77n17O2
$$ -229 -279 -51 414 156 82 -7 -49 112 -87 -170 -189 -411 249 -464 -81 -315 166 465 -394 583 66 128
3260A28j72K13k19L54J32n66N81n37p4L91OJ60q15J37j07J60J54j1M37Q8K98q84
$$ 128 -44 169 -50 304 436 -130 451 -86 -160 231 237 397 -418 -281 -388 -228 -74 -85 352 440 738 -146
3282a46J57L19k84J19k12J79m64O65N0l08M41l47K08k68o5j58J75Q4M3J77n30
$$ -146 11 330 46 165 -47 132 -332 333 383 75 516 169 377 109 44 -114 61 145 188 365 -165
3303a65M65m24J06O6o72P89m21J69j87M78m03J06J12J15l00N38j09k19o01N53
$$ -165 300 -124 -18 48 -624 165 -256 -87 -274 204 -199 -93 19 134 -166 372 263 44 -557 -4
3323dk89j00Q90j38l33J64ln7n99M72j85L75j75O5l26K2M31L20p41M40l86jL79
$$ -4 -293 -393 497 359 26 190 187 130 -469 3 -182 193 18 83 -243 -221 210 530 -211 229 -157 -158 221
3346B21m17J30k94N89k44K03m68J68L50j77j48J26j35J34K97j25j74l0m86Q21
$$ 221 -196 -66 -360 229 -15 188 -280 -112 238 61 -87 39 -96 38 335 210 36 6 -480 341
3366C41l93L12o97O15L99j196K64O76K13j134N12K55l46K80k18J31k90M72j82
$$ 341 -52 260 -437 178 577 -619 -355 321 534 -600 -88 167 -179 101 -117 14 -276 196 14
3385A4k77L38N04n93m00N20K90m03J38m7m28L41R0L92n05K33o45M10k04P01j61
$$ 14 -263 75 579 -14 -414 106 396 -7 131 84 -344 -3 87 479 -26 207 -438 -28 -232 469 308
3406C08j74n36P67k70R8n15M86o10M66k96L90q0r5J90m39J034j546Q38j79l51
$$ 308 134 -402 365 95 193 -322 164 -446 20 -276 114 34 -61 129 -310 724 -822 16 -163 -514
3426e14L01j31k57J359j485J65L26r4K19k62M93l88R9N1J94R7J89l56M23n08o17
$$ -514 -213 -344 -601 758 -727 -562 -236 -330 -111 -373 120 -268 -169 -118 76 173 362 6 429 -79 -696
3447f96J083k38K21l49l29J68r6K03l98K40L95n81O34m99m9M50l70M28n70O71
$$ -696 387 149 370 21 -308 -140 -236 -33 -431 -191 204 -377 257 -242 -291 159 -211 217 -353 318
3467C18m66M07l93k77N67j93K49j15K13n20J59m38L77k47N32Qk05%p28O11J100
$$ 318 -148 259 -134 -411 156 -37 212 97 310 -210 -51 -489 -112 -359 173 181 -24 -24 -752 -141 959
3488I59r55l20N77K16j97m85J108n72n33J84L50n54L64m12L11P3j70K39J20m85
$$ 959 4 -316 261 477 280 -205 903 331 -202 -18 332 -222 142 -270 41 114 -56 183 303 -182
3508a82M28N48l38p24r9M34k72M83j10R7j60J58N3K7m03l52O31k93J84l46N59
$$ -182 246 794 456 -268 -367 67 -205 278 168 265 105 263 316 343 -60 -412 219 -74 110 -236 323
3529C23L00q81K70J50j33k80Q0P33o49J41P2j24k73L04m4N9o7j19k13K8j18Q88
$$ 323 623 -258 12 162 29 -251 -171 562 -87 54 126 2 -271 33 -11 48 -19 -138 -351 -323 -441 447
3551D47m68l17K74k84O76n66J28O8l2j99K44M5OJ07m99M8M56k01J91J29o4m91
$$ 447 -21 -338 -64 -348 328 -238 -110 -42 -74 -273 -29 16 22 129 -370 -322 134 -67 124 253 189 -302
3573c02P33n19L56m04M79q2Km64L32j29k40O66j21o50M09j58R2J23k04K97l14
$$ -302 431 -88 268 -136 343 261 263 -201 131 2 -238 428 307 -343 66 -92 0 123 -81 216 -98
3594i8k77p4L75L79p28k03N25K92k26k1m7K11J23Q2k91l88N23R2J60m82k15K58
$$ -98 -375 -449 -74 305 -423 -626 -101 191 -35 -56 -103 108 231 313 22 -366 157 249 409 -73 -288 -30
3616c0N7j18j16P31p77L16L70M8n98K70n56l8L96l45N04n61J009l70k11K91m23
$$ -30 27 -91 -207 524 -253 63 433 481 -117 153 -403 -441 -45 -390 114 -447 562 192 -19 272 -151
3637a51K6L63o37N0K85J06J20l04J62L79m2j036N32L85m71k5L18m65L79O2n7j99
$$ -151 -125 238 -399 -349 -64 42 162 -142 20 399 357 -679 -147 238 -233 -258 60 -405 -26 36 -21 -220
3659b20N48L8J9n28J65O14j99M16p01m0l89K08J34j92L99q7n93K08n5K38o66Q52
$$ -220 328 366 385 -143 22 636 437 853 152 112 -277 -69 65 -127 272 185 -408 -200 -255 -17 -683 169
3681A69q3k97K54J85l18J29R2p07R59k36p36N04J55L08q1M7k41P53r05n41O87
$$ 169 86 -211 43 228 -90 39 131 -576 383 147 -589 -85 70 378 297 344 103 856 -49 -590 97
3702I7l85P42m82J06q1k72J85n6j27N25p13O97l34K88o50O35j51j21l2O4k8j7
$$ 97 -288 454 -28 78 -3 -275 -90 -146 -273 252 -461 236 -98 190 -460 175 24 -97 -129 -65 -93 -110
3724a10J0P1K10l46K90k5M2J07n46K47L7m39M69J64p30N65l82K50j09L17N74j036
$$ -110 -100 -29 181 -165 125 100 142 249 -297 -50 -13 -452 17 181 -549 16 -366 -116 -225 92 666 -370
3746c70P41l65K28k48K71q36M87J25j35K52K62k40K60l69j53L13j95l97M55l8
$$ -370 371 6 234 -14 257 -579 -92 33 -102 150 412 172 432 63 -90 223 28 -369 86 48
3766D8K33j54j48J8j57j92L72k72L87q29J061j84m9k62M23m99Q6k96N96n54J72
$$ 48 281 127 -21 -3 -160 -352 20 -252 135 -694 367 183 134 -128 295 -204 -118 -414 182 -372 -200
3787b00K69l66K60k76L32J22m57M32Lj48l9K47OP15j15q74j03N71j80J37o9l14
$$ -200 69 -297 -37 -313 19 141 -316 116 119 -29 -68 179 185 900 785 -89 -192 379 199 336 267 -47
3809d7R5j92N15j78k05j88k24k70R07k74J85J0K27o99l5L39m25K62P4J95J57l54
$$ -47 48 -144 371 193 -12 -200 -424 -694 213 -61 124 134 361 -338 -373 -34 -459 -197 -123 72 229 -125
3831a25J69J82n49L2J11k97N80n76K55L46M01n23l75R34p68N91p51L89j07L80
$$ -125 44 226 -323 -291 -180 -477 103 -473 -218 128 529 6 -369 565 -203 388 -363 26 -81 299
3851B99l49L33j57l47J37j35M94M2k87L73l38M16j16k04l34K85M05m63l09O04
$$ 299 -50 283 126 -221 -84 -219 275 317 30 403 65 481 365 161 -173 112 517 54 -255 349
3871C49K16n17O8L54n85L96j045O45K41J47j22J61m07k27L4M75pl36J75j87J75
$$ 349 565 48 116 470 -115 281 -764 -119 122 269 147 308 -99 -326 -292 183 176 -160 15 -172 3
3892Cn3L49q20O41p0m6Q7n28L25j22J78l5p7l83L99Q5r1M78K29m57k75Q1J41q8
$$ 3 -50 299 -521 120 50 4 91 -437 -112 -234 -56 -91 -168 -551 -152 -67 -158 320 549 92 -183 -102 39 -49
3916d9R9o43P80M02o57k7m62J015j78k77j54L93k43k93N70j73m0n72L12J51n8
$$ -49 50 -593 187 589 -68 -95 -557 458 280 3 -151 242 -1 -294 276 103 63 -509 -197 -46 -104
3937a04l37K61M18l10L05O62j397L48J94Rp0L60m83j76M22o9m4J99q5J15n07K66
$$ -104 -441 -180 238 -72 233 895 -502 -154 40 49 -21 339 -144 -320 102 33 -11 188 103 218 -289 -23
3959b3L1K39J2n50N97p39N72q17J072J35m63k00l21O59n60M10m82M20m7N4k44
$$ -23 8 247 259 -291 306 -433 139 -678 394 529 66 -134 -455 204 -356 54 -428 -8 -55 -1 -245
3980b45j82P10q0j49o59N95N8q2o06O11J06M36p59N26o49l39R33m19P97j59l8
$$ -245 -427 283 203 54 -605 -10 48 -34 -640 -29 77 513 -246 280 -369 -708 225 -194 603 444 406
4001D06K15o04m38J48Q89k65J60l40r0L38j105M62J99o96Q17J60n57L43K78l37
$$ 406 621 17 -421 -273 616 351 511 171 81 419 -686 -224 -25 -721 96 256 -301 42 320 -17
4021a7N52p19j2P28j55k76N8L4J33p47O6M07J13n42j0N79j58K61n17J25N16K58
$$ -17 535 -184 -196 532 377 101 159 193 326 -421 -355 52 165 -377 -387 192 34 295 -222 -97 419 677
4043F77j058j3K33m26O28l33L11k47j09M23K95o52L52l64O51l18o1M66q16J049
$$ 677 -381 -394 -161 -587 41 -292 19 -228 -337 86 381 -271 81 -283 368 50 -11 455 -361 688
4063F88n38n07J06M70l9K65r59O46o72J028p90M32k66M16m72L09p83J396p23N
$$ 688 150 -357 -251 219 180 445 -514 132 -540 488 -302 130 -136 280 -192 117 -666 730 7 12
4083A2m91k42N86NK04R8N9q05O93K86j09j77J94m79Q9J07n69P06N22p39k34J22
$$ 12 -479 -721 -135 -130 74 172 231 -574 119 405 296 119 313 -166 -77 30 -539 167 689 -50 -284 -162
4105a62K98l64J74L53m15K98p0r08M34P1N12j30l72j94L20J5n3J43j39K06R6j16
$$ -162 136 -228 -54 299 -116 182 112 -796 -362 -291 221 91 -281 -475 -155 -140 -193 -50 -189 17 113 -3
4127cL80j68p29r7L42L36m0kM7O4k47L39O6j99M97o44Q0N40r09J81P3O20o30K32
$$ -3 377 209 -520 -617 -275 61 21 19 66 130 -117 222 288 89 586 -58 22 562 -347 -166 -93 527 -103 129
4151A29o70P02m80O06n30K47j46Q88q06m46N60j72L08k0m7K23m42K56j59j09L27
$$ 129 -541 161 -319 287 -243 4 -142 746 -60 -506 54 -118 190 170 123 346 -96 160 1 -108 219
4172B19K03o12k33L15L3k7j81O6K72j94k1R6J68k73K15K71l48k74K33L08m79O36
$$ 219 422 -190 -423 -108 -75 -102 -283 -217 55 -139 -160 -64 104 -169 46 317 -31 -305 -72 236 -243 393
4194C93o2m02M00p4p51M02L32k12p9l59Q06n41L40p41R82p97O02p18M27k48k4
$$ 393 331 -71 329 255 -496 -94 238 26 -53 -412 394 -147 193 -548 434 -363 239 -479 -52 -300 -324
4215c24N14o9N14r66L71j48j95k63N42o4q1N53n98O2L06j94L6k02n1k24L65k61
$$ -324 190 121 635 -331 40 -108 -303 -566 -24 -88 -169 384 -214 -152 154 -40 -4 -206 -257 -481 -116 -377
4237c77j9O3N68n17J40j95K68p8N19m69l38K79K79O94j033J24K48l44J90k18J80
$$ -377 -396 -333 235 -282 -142 -337 -69 -147 372 -97 -435 -156 123 817 -216 -92 156 -188 2 -216 -36
4258c6J31M6j00o0M75m14J93j98J6j47K20k11L79K28l58m51O8l65O52j53J19N57
$$ -36 95 141 41 -19 456 42 235 37 53 -94 126 -85 294 522 164 -287 -219 -584 68 -85 34 591
4280E91j192O04L5M95l80J6k74P06k40k40K76n76o3J48q0LK36k4q7K52J30m91
$$ 591 -601 3 38 533 153 169 -105 601 361 121 397 -179 -242 -94 -174 -171 65 41 -46 206 336 -155
4302a55j54P58l89J07K45j31n58K42n07P22j80L52m63K71l38m4K88j75k2P0j28
$$ -155 -309 449 60 167 412 281 -277 -35 -542 180 0 352 -111 160 -178 -222 66 -109 -131 -61 -189
4323a89P23k98j63P1J17j83j39M78m47L82l26m3Q76j016J65m2K67m00m6J55J53
$$ -189 534 236 73 144 261 78 -61 417 -30 352 26 -17 859 -157 8 -34 233 -167 -213 -58 95
4344I5j06k20l9l26N24m97J558m93j96k81r1k24P42n35J11m4m82N31m94O24O0
$$ 95 -11 -231 -270 -596 -72 -569 989 496 300 19 -72 -296 446 -89 22 -22 -504 27 -467 157 217
4365B17n48K4O80j68L0k25J15k33k2K98n01L00J45rk8n34J89J65L94l34N35n09
$$ 217 -331 -307 373 205 235 10 125 -108 -130 168 -333 -33 112 103 75 -459 -270 -105 289 -45 490 -19
4387a9K09j10j59N48m77J90l78L71M36p83L68Om79N32m82M04l39p7M80m69j25
$$ -19 190 80 -79 469 -8 182 -196 175 611 -172 196 202 -277 255 -227 177 -162 -239 241 -228 -353
4408c53L58r6l85O71m11K52J75J77n72L19n53P90o30N9N42n36J46l64M70M9P6
$$ -353 5 -91 -476 195 -216 36 211 388 -184 135 -418 372 -258 -199 343 -193 -47 -411 59 108 184
4429A84k58L5k54k3L49j24KL68k25n40Q76k64n78L60j97L63k94K47M47r30N88
$$ 184 -74 -39 -293 -316 33 -91 -89 279 54 -486 390 126 -452 -92 -289 74 -220 27 474 -456 132
4450A32R6n05L77j80j91Q2N19p63J05K77j52O3k1j52K32K86n62k0K20R7k25M65
$$ 132 228 -277 100 -80 -271 -189 330 -433 -328 -51 -203 -140 -161 -313 -81 205 -357 -377 -157 -60 -285 180
4472A80p56O98j94j45%L28j00J53j08l04r0M94n51K44LK15p6pM11p4J54p25N83
$$ 180 -576 122 -72 -217 -217 111 11 164 56 -248 -338 156 -395 -151 -148 67 -9 -16 395 321 475 -250 333
4495C33k76J1O2j16J32K24o94R31k93o09K69N61m14l66L18k36L33O2k8L4m66L25
$$ 333 57 68 130 14 146 370 -324 607 314 -295 -26 535 121 -245 73 -163 170 232 204 238 -228 97
4517I7J38j42l70l03Q83o60K34K5r1p5K82L22n57N37P6o75K45m87m99L93Q32J75
$$ 97 235 93 -277 -580 303 -357 -123 -98 -189 -264 18 340 -217 320 396 -279 -34 -521 -1020 -627 205 380
4539C80J12o54K25n6n74J0O84Q5J33k72m15L41j73J79J12L70l9q05M16k42P16
$$ 380 492 -162 63 7 -567 -557 127 212 345 73 -342 -1 -174 5 117 487 448 -357 59 -183 533
4560E33r84N39M36l81l50M1j55j69L57O9k63J58p4M22N1l66J37M4M17j61q29K13
$$ 533 -451 88 524 143 -207 -166 -321 -490 -133 -64 -327 -169 -243 179 230 -136 1 45 462 301 -528 -315
4582c15j82J161j209Q19o73O74j24j78pJ33r0l87L34j45q7O29p42O5L48o67N55
$$ -315 -497 664 -545 274 -399 275 151 -27 -34 99 9 -378 -44 -189 -276 353 -389 -324 24 -643 -88
4603h8m0J97m99M91K41m17K64k53l90M31j85j48J56k97L34J53J50k64J95k62J91
$$ -88 -128 69 -430 61 302 -115 149 -104 -494 -63 -248 -396 -240 -537 -203 -50 100 -164 31 -231 -40
4624d0K32l2J48J7l76n13J76L99J13m0r7K09j73j28P48k76o63L56q8n40Q66j15
$$ -40 192 160 308 325 -51 -564 -388 11 124 84 -13 196 23 -105 643 367 -296 60 -28 -568 298 183
4646A83N50q33j19K13L00J59q38N77M87l20K1p35J17J50n01M05R0j25M51K03J45
$$ 183 733 -100 -219 -6 294 453 -385 192 679 359 380 -355 -238 -88 -589 -184 -94 -219 232 435 580
4667E80j234M83j08Q84j02o54k59K62o1J35O4J38l23Q4K88L3l31Q7J25j79N01
$$ 580 -654 -171 -279 605 503 -151 -410 -148 -209 -74 -10 128 -195 -111 177 210 -121 -34 91 -88 413
4688D13J41m89l80J28j89O09l17J03J14k43J76P05j176P78k16M7j70l27M13K85
$$ 413 554 65 -315 -187 -376 233 -84 19 133 -110 66 771 -405 373 157 204 34 -293 120 405
4708D05l04k60K98J8m1K21j05J24J80o33J54L12K83o4j09n01n07N94N3k44L56
$$ 405 101 -159 139 157 116 337 232 356 536 -97 57 369 652 588 479 -22 -529 65 118 -126 230
4729B30J42n64L18m60J84N98j53m92O57j37j088J170l01j50K43j5M15o34l80P49
$$ 230 372 -192 126 -334 -150 448 295 -197 460 323 -765 405 104 -46 197 182 597 -37 -417 332
4749C32n45J65J55J62l25k57L13m76O44m14K07L67j56l71O1Q1Q60r89N55o7j99
$$ 332 -213 -48 107 269 -56 -313 0 -476 168 -246 -39 328 172 -199 -138 -57 803 -186 369 302 103
4770A03l93k6j57m4N96k72O05j212Q11j25j32K69J94l24O0K71j4M29r3o31J07
$$ 103 -290 -316 -473 -517 79 -193 412 -800 11 -114 -246 23 217 -107 -47 224 210 639 546 -85 22
4791B2j4MJ22l41M33j1L03j41q48k5L24p7M32m13Q70k20l28N2n53L46p4j51M9
$$ 22 8 12 134 -207 226 215 518 377 -471 -496 -172 -249 183 -230 640 420 92 144 -409 -63 -137 -288 -239
4814b39k3L32m00M75k76k40M03q32L74P1P76l96j93P02n94l0L69k38J65k69j7
$$ -239 -262 70 -330 145 -131 -371 32 -800 -426 -355 421 25 -168 534 -60 -90 279 41 206 -63 -80
4835h0j40k93L60J71p3J34R2j76O72m97K53m20k72J014q31K38K17o55QJ10J97
$$ -80 -220 -513 -153 18 -55 79 171 -5 667 170 423 3 -269 745 -86 152 369 -286 -278 -168 29
4856B9k44P04j136L46L11L46p50N92n02K49K17o0l07J77K85j20j51j50q2J19P7
$$ 29 -215 489 -647 -301 10 356 -394 198 -304 -55 162 102 -205 -28 257 137 -14 -164 -246 -127 -50
4877e0m11R5M56J52q42M22k49L45q9j21N59q02M44l19N23q67J104k26n7m59K72
$$ -50 -461 -366 90 242 -600 -178 -427 -82 -171 -292 267 -535 -91 -410 113 -754 350 124 67 -392 -120
4898a20n3m0K97K64K7o53Q35p51K78j86L32M0o00L26o2j90K59K26l89o3N7J27
$$ -120 -173 -213 84 348 375 -278 557 -194 84 -102 230 270 -330 -4 -66 -256 3 229 -160 -223 -166 -39
4920c9J34l36L82M0M9m50K44J25q41Q61l61N51p3J45p20L27m19J61M72j99N8j51
$$ -39 95 -241 141 181 230 -220 24 149 -692 169 -192 359 286 431 -289 38 -381 -220 252 53 111 -40
4942d0K78o08J37K22M15q86K63R0k36Q59%r57Q94l76n1O0j70K93L10o8m67P4l9
$$ -40 238 -370 -233 -11 404 -482 -219 -129 -365 494 494 -463 431 55 4 64 -106 187 497 429 -38 36 -3
4965cj50J70M0k37K92K78l26k89O31p07K69l10K44j76J86M08k87J67p7j82N06
$$ -3 -153 17 57 -180 112 390 64 -225 406 -301 -32 -342 -98 -274 -88 320 33 200 123 -59 447
4986D47n28J07O7J03p9K12r0jm1m61k2Q0M63q06P1R69k74m04K46J67j71K57l40
$$ 447 -81 26 93 196 117 329 239 238 197 -264 -286 -206 257 -549 -478 491 217 -187 59 226 55 312 -28
5009b8n85J253n05J26J29j64k20J92m55r3k5O56l07o8J88r2l87N93n02N04j75
$$ -28 -613 640 135 261 390 226 6 198 -257 -350 -375 281 -26 -94 94 2 -385 208 -294 210 35
5030C5L4N83j58J37n60m75P7O71k31q7m61K13j05P32j049L09P3pN24Jl32j23q7
$$ 35 69 652 494 631 71 -404 -327 344 113 26 -435 -222 -327 405 -644 -335 -262 -269 255 256 -76 -199 -286
5053b86lL44N5l13k30m6n05J176j31p70M59J24J05l72R9L75M60o36M4n2N19n97
$$ -286 -289 55 110 -203 -433 -479 -984 192 61 -709 -250 -126 -21 -393 -294 81 541 -95 -51 -103 416 -181
5075a81M96n14P2m34N81K76j65n63N6J15N22N59j062Q78o24J08N05j126M32l02
$$ -181 315 -199 -127 -561 20 296 131 -432 -376 -261 261 820 -242 636 12 120 625 -501 -69 -371
5095c71P32n66K99M3j78J19n49K62L84k14j19K03n33N47n89R18m54k39R10n09
$$ -371 361 -205 94 137 -41 78 -471 -209 175 -39 -158 45 -488 59 -530 388 -66 -305 605 96
5115I6l12M73m67M50r6n03m9L64k27M00J7k8L01j87O8o44P26n40K91l92n8j9M12
$$ 96 -216 257 -210 240 144 -359 -408 -44 -271 129 146 118 419 232 300 -344 382 -158 133 -259 -317 -336 76
5138G6k99J29m15L83K70J75k98L57n10L47k67K15q3n94R70l58J58k91j02L62k13
$$ 76 -223 -94 -509 -126 144 319 21 378 -132 215 -52 163 80 -514 456 98 256 -35 -137 225 12
5159A2m06P43k76J41j86j60M44q4p00L02O31jj38m14M33K2k07m06j72P37k12Q9
$$ 12 -394 349 73 214 28 -132 312 228 -472 -170 461 460 322 -92 341 363 156 -250 -422 315 103 192
5181A92l94L2M09o0l36k26J09p2l38N74R3J38K42o9k87l21L2O61p37K22K48m34
$$ 192 -202 -170 239 179 -157 -383 -274 -346 -684 -110 -17 121 363 294 7 -314 -282 379 -358 -136 112 -322
5203c22L22L2j77K99J47p96O43j84L55q00O72j96P5j00p46N66K81M1j37k81K76
$$ -322 0 32 -145 154 301 -495 148 -36 319 -481 191 -5 70 -30 -776 -210 71 112 -25 -306 -30
5224c0M48p64P83k48L14q73N23j24k34P94q01L43r6M5k93K81P6l1K96n25K8K92
$$ -30 418 -346 437 189 503 -370 153 29 -205 589 -212 131 35 80 -213 68 144 113 409 -116 -88 204
5246B04n89J12K60K30n02j35K32M89q2M01n35k16j90K21j26l64M91K59l04P17
$$ 204 -385 -273 -13 217 -285 -420 -188 301 219 620 85 -131 -321 -100 -226 -590 -99 160 -144 573
5266E73l12k84J61q5j24OPM2J31j57o72O39n1l11L37L14Q8j67K85o24O58q99K30
$$ 573 261 -23 138 53 -71 -65 -58 -16 115 -42 -714 -75 -126 -437 -100 214 302 135 420 -204 454 -445 -215
5289b15J17n36J265m32K05M4m75N6J51l22k77K63K72l09L45n76P63l13p9N35m99
$$ -215 -98 -634 631 199 404 448 -27 29 180 -142 -419 -156 116 -193 152 -424 339 26 -53 482 -17
5310a7K91n57L23m5m6k80n02M33K20J50L9k28k1O76k74J38k6l43R3m6K76K7l25
$$ -17 274 -283 40 -5 -51 -331 -833 -400 -180 -30 9 -219 -240 436 162 300 274 -69 24 -22 254 281 -44
5333d4L24J15o32J00J20o25O05q8K5p7p8m90R56o58M36M0K4M36q23K57l04Q47
$$ -44 280 395 -237 -137 -17 -642 -37 -125 -100 -177 -255 -745 211 -447 -11 29 53 489 -334 -77 -381 466
5355D66k51p2K60m37qK22o73N27k09K79m37M08l60J083q75L30n22J48R1pO61m52
$$ 466 215 143 403 -34 -42 180 -493 34 -175 104 -333 75 -285 798 -77 253 -269 -121 -30 -37 624 172
5377A72j9n54J50L97M56m55k29K22m08N87q63j58N05Q8K11p6K89n49N94j10l46
$$ 172 153 -401 -251 146 602 147 -82 140 -268 319 -544 -702 -197 -109 102 26 315 -234 360 250 -96
5398i6L94l49m68O67n03M3R11n2l40j98l4J7K67n03N67o03QO6M44l88K64k55J72
$$ -96 298 -51 -519 148 -355 -312 599 547 207 9 -25 -8 259 -244 323 -280 -272 -206 238 -150 114 -141 31
5421C1OL2q1j93j02J33R1k34K92J03N50r00l87P85k84K10K74m40K18l53K02k55
$$ 31 37 69 -12 -205 -307 -174 -83 -317 -25 78 628 -272 -659 126 -158 52 326 -114 104 -249 -47 -302
5443c02Q78p43J14L1L15k98J35l20M41J98n1l28K29n30N8K39J06m8j150J228j36
$$ -302 576 -167 -53 -22 293 -5 130 -190 251 449 398 70 299 -231 -173 66 172 124 -1026 202 66
5464F6l66N53l24K11k6L37l45k46L31j01n39L12m36K48Q4n0j64k55L85K68j49
$$ 66 -300 253 -71 140 114 451 106 -140 191 90 -449 -137 -573 -325 -241 -291 -455 -710 -325 -57 -206
5485b06J66j2J75n45M54j03%m23P60m44K85o64P15j83n18P81m49R9l35L88K54
$$ -206 -40 -52 123 -422 32 -71 -71 -494 266 -178 107 -557 158 -25 -543 238 -211 -112 -447 -59 195
5506A95l83r6O0l98J67J17m5J46j56M87n04L13Q76r68J67m72K27M21J90m51M49
$$ 195 -188 -284 -224 -622 -455 -338 -383 -237 -393 94 -410 -97 779 -189 -22 -494 -267 154 344 -107 342
5527C42L72j148L54K05l54K5M6N7m7J06K04n88Q41m89L55l42N24q28P94j60n49
$$ 342 714 -434 -80 125 -229 -204 -158 -101 -148 -42 162 -426 415 -74 281 -61 463 -365 429 269 -280
5548b80N57k62k89L21M07k08k21L1nrj56J96k72q3O11n41l44L13K25m62L20M20
$$ -280 277 15 -274 47 454 246 25 56 51 42 -114 82 -190 -273 338 -203 -547 -234 -9 -471 -151 269
5570B69m3o37M80m09M27m55O33p02K32K76m8K96m34Q6m60K85m36M47M68j05l55
$$ 269 226 -411 69 -340 87 -368 265 -437 -205 71 23 319 -115 -29 -489 -204 -640 -193 275 170 -185
5591a85R9o0k46K73M85n9l41N08m29l23L73m27O00m21l87Q05l25r4J81K2J93o4
$$ -185 -86 -146 -392 -119 366 307 -34 474 45 -278 95 -332 268 -153 -540 265 -60 -154 27 49 242 178
5613A78Jk41k00j49L95O6M2k53K65L79l73M28m74l26N3L60l5J94k33m65m2L73
$$ 178 179 -62 -262 -411 -16 50 92 -161 104 483 110 538 64 -262 -209 151 116 310 77 -388 -430 -57
5635e7M80l84j1J09m50l7Q6k3J78K12j51o2k16P5L85j55m91Q43J13m97R9l17L57
$$ -57 423 39 28 137 -313 -350 -264 -287 -109 103 -48 -110 -326 -251 134 -21 -512 331 444 -53 46 -271 86
5658H6N6k26R0l75L16k58L34K7k07J64M26o38p49Q58L03r28J58P4L71K82j81q9
$$ 86 142 -84 6 -369 -53 -311 23 50 -157 7 433 -205 -954 -96 207 -721 -563 -489 -118 164 -17 -106
5680a06P10q58K80l18M43L1m36J40j9k45M73K2o93J015r97N77j52j5k53O67o2
$$ -106 604 -254 26 -292 151 182 -254 -114 -133 -378 95 117 -576 439 -558 19 -133 -148 -401 266 204
5701B04l90L65L05K08j053M49l7k51J028j042L08k26l71R25q88l79J373j010J3
$$ 204 -186 179 484 692 -361 88 51 -200 828 -214 94 -132 -503 422 -466 -845 528 -482 -469
5720d69J161j032K60l92M70N9j73k66M25n16O72l40J20o60J194p48J045p60p17
$$ -469 692 -340 -80 -472 -2 57 -116 -382 43 -473 199 -141 -21 -681 513 -235 810 50 -667
5739f67L53J96K38k74o8j37L57r1R78j492L84O03M9j8p84k20K85K79K64J36l22
$$ -667 -314 -118 120 -154 -222 -359 -2 -93 885 -607 -223 380 429 411 -373 -593 -308 -29 235 371 49
5760D9j5J89j44l9k73O97n54J15j56J153j044J41K95pJ16k98o74j59N10j78R0
$$ 49 34 223 79 40 -233 464 -90 25 -131 1022 -22 119 414 407 523 225 -449 -608 -98 -276 -186
5781a86L31k02k70N37kj63j31R7k9o31R04J19j75N61j083P39O2l60j87O71q59
$$ -186 145 -57 -327 210 208 45 -86 11 -18 -649 255 374 199 760 -323 416 478 118 -69 602 -257
5802b57K73Q4k17J46m9M69n76M21j82o15O27j97j04K47l00J95N3j09N36l66m22
$$ -257 16 100 -117 29 -20 449 -127 294 112 -503 124 -73 -177 70 -230 -35 18 -91 445 79 -343
5823c43O42k8m60M07k17l37P22k92N1j32K6rM63j194K09O19j60R0o35J2J090o08
$$ -343 299 271 -189 218 1 -336 386 94 145 13 39 30 493 -701 -492 127 -33 57 -578 -566 524 -84
5845h4O29r78K69L80j36k08K9OL53l45l6L00m12O22l01M6j64j05j14N18J69l03
$$ -84 545 -433 -164 216 80 -128 -99 -93 260 -85 -121 179 -233 389 88 134 -30 -135 -249 269 438 135
5867A35k3k76n06J065k69m9J68m31N9J20k5l15P45o4l11P2L75o25O8M58m97L99
$$ 135 112 -164 -670 395 126 77 245 -186 -127 -7 -32 -347 398 334 23 95 470 -155 -87 371 -126 273
5889B73k67J5l45P15k21K33l67J24J90L1o27Q68r48L95K36L51o80j96l40J76M35
$$ 273 6 21 -324 391 170 403 36 160 350 381 -246 622 -326 69 305 656 -24 -220 -560 -384 51
5910E1J791j809M21K63l47l47N18J13p56J7r18J325o16J107q61K87q12L91j40
$$ 51 1842 33 454 717 370 23 541 654 -102 -85 -1003 322 -294 813 -48 239 -573 -182 -322
5929c22N19j59M9N8M00p78k04K98J77O72j019M8L56J034j187M6k41j31J52Jj17
$$ -322 197 38 87 145 545 -233 -437 -139 38 710 -309 -261 95 1129 -58 -12 -253 -384 -232 -231 -348
5950c48O04k58nP3M8%r8L03l16o91R57k22q16Q65M41n47N50p74K26p00M21M17
$$ -348 256 -2 -7 66 114 114 16 319 3 -688 269 47 -769 96 537 -10 540 -234 -8 -708 -287 130
5972A30j96k14J49J56K33R2j84k29J81o03N71N3L47l63p91J071m52K86n79J7j75
$$ 130 -66 -280 -131 25 258 350 166 -63 118 -485 86 139 486 123 -668 403 -49 237 -342 -325 -500
5993e00Q82J87o72M4K91l11N4j93K17m14J50N90j4l38L09k21k6n88j73O48J22
$$ -500 382 569 -103 -59 232 -79 -25 -218 -1 -415 -265 325 311 -27 282 61 35 -553 -726 -78 44
6014D4q9J83j48n5J81n57M98j29O17r06L93J17j05K27n68K50O82o07k09O3j61
$$ 44 -45 138 -10 -65 116 -441 57 -72 545 -361 32 149 44 271 -297 -47 635 28 -181 -118 -279
6035b79K63L83p52n8K14k61j05N93K73k2o46M87K00m58M42j3q6k66J69N8l4j47
$$ -279 -16 367 -385 -443 -229 -490 -595 -2 271 249 -397 90 290 -168 274 261 175 -91 78 136 102 -45
6057d5P01l38p58O77m16l10L24J020j233L23O7L58p53O45l51k81L82k48O0L05
$$ -45 656 318 -440 237 -179 -489 -165 855 -378 -55 12 370 -383 262 -89 -370 12 -236 -176 129
6077A29m66N75J82p45Q45o55l79Q72l5r9k24l72N6Q41r65M99L1l54K13m7k59N27
$$ 129 -337 238 420 -325 520 -135 -514 358 323 224 0 -372 -316 525 -440 59 90 -264 -51 -98 -357 170
6099A70K42n64j04J60P16n62K6L75j99n58L05K63N15r66L25n3J72k49K72k11m15
$$ 170 412 -152 -256 -96 620 58 84 459 260 -298 7 270 785 -181 144 91 263 14 286 75 -340
6120c40O92n46J25M28j72k62K99j45J12m51N75k0l40j6L23k55m10P74n65j58l7
$$ -340 352 -194 -69 359 187 -75 224 79 191 -260 315 295 -45 -61 262 7 -403 371 -194 -352 -389
6141c89M9J8q1N55j30l58Q2K0K98r9N78p31L75k66R3r0l07J162j093Q39r05J51
$$ -389 -340 -322 -403 152 22 -336 -254 -234 64 -35 543 -188 187 -79 14 -76 -383 779 -314 525 -380 -229
6163b29K8J26N81n58Mk75J25J74o5L34q8n76n8K15L7K35l75M37j60P40r25J10
$$ -229 -201 -75 506 -52 -48 -323 -198 -24 -89 245 157 -419 -477 -262 -225 10 -365 72 -88 652 -273 -163
6185a63m05J086o28k83m4Q05k49j90J07n5l03L53l13M23l76N50l52R2l21R7J50
$$ -163 -568 518 -110 -393 -437 368 119 -71 36 -19 -322 31 -282 141 -235 315 -37 55 -266 -169 -19
6206a9kK17N7j87L14l21K78L9l00n68N36l3L19r28Q18M86o43l03M11l44k74L46
$$ -19 -21 196 253 66 380 59 337 376 76 -492 44 11 330 -598 220 706 63 -240 171 -173 -447 -101
6228a01M94l08j62K48j93L34l52l46M52K98p40N01jl03L43q5M99M35r28ll20M38
$$ -101 393 85 -77 171 -22 312 -40 -386 66 364 -376 125 124 -179 164 79 578 1013 85 82 -238 200
6250B00k10K42L6p57M91j3l58L48m14K84M14r4p32P41N14j233N82J99n84M03K39
$$ 200 -10 232 268 -489 2 -11 -369 -21 -435 -151 263 169 -563 178 692 -541 41 240 -344 59 298
6271B98l97j58K07L67j31o24L48j22R9j26N65o66k61J390r27K22J36m6M01q17
$$ 298 -99 -257 -50 317 186 -438 -90 -212 -113 -239 326 -340 -601 789 -138 84 220 174 575 -242
6291b42L51n78KK61O46j58o70K95m4K39j83N00j110Q86K51p42J80J18M35q51R58
$$ -242 109 -469 -467 -206 440 282 -388 -93 -137 102 -81 419 -691 195 446 -296 -116 2 437 -414 544
6312E44n89Q7K34j12L07l3q57P13k30K18J99l23n58J55N65o76j8O35m30J79L19
$$ 544 -45 42 276 164 471 438 -419 294 64 282 481 158 -400 -245 320 -356 -374 261 -169 10 329
6333C29m11PJ45j93L27p8K3K87l88k64oM04k64k08lK05M84j44m80R2m01J269l69
$$ 329 -82 -75 70 -123 204 126 149 436 48 -216 -222 182 -82 -290 -293 -88 396 252 -228 -136 -537 732 363
6356C63m16M3L8L71j62J62l56K75N4l03R1m17J57L00K49m00K04J4m63K84J69m84
$$ 363 -53 -10 28 399 237 399 43 318 372 69 160 -257 -100 200 449 49 253 267 -196 88 257 -227
6378b27Q55n52k45L65k39k24J74J7j55L11J48l90l73O1M14M8l50O6O9L65n75K17
$$ -227 628 76 -169 196 -43 -267 -93 -76 -231 80 228 -162 -535 -474 -60 -12 -362 -296 -227 138 -437 -220
6400b20qK36k85P81q96R10o65k1L92n63L27P8q10J161n21L16n34k77K69P74k87
$$ -220 -228 8 -277 504 -392 518 -147 -168 224 -339 -12 66 -744 417 -104 212 -322 -599 -330 444 157
6421A57p36M45J38K77Mrm45N02r40O82J08l56L02j82Q6K6K1n38M99M03n44K56
$$ 157 -579 -134 4 281 285 276 -169 333 -607 75 183 -173 129 -53 33 59 80 -458 41 444 -100 156
6443A56k25l08O11L83n14L70m88O66o25k63J14K51L66j14n26L11M9k90J33l79
$$ 156 -69 -377 234 617 103 473 -15 651 26 -237 -123 128 494 380 -146 165 214 -76 57 -322
6463c22N32m48P19l01r2n18R50n19l25N50j18k89j77N04N28j095NR76p58j01O75
$$ -322 210 -238 481 180 88 -430 520 1 -324 226 108 -181 -358 146 674 -421 -416 560 -198 -299 376
6484C76j058Q03k49J90j72j62K55qJ63O44q88L76M7j47n10M70K03j44n87M52L43
$$ 376 -682 121 -128 62 -110 -272 -17 -25 138 782 -106 270 317 170 -340 130 333 189 -398 54 397
6505C97m65L73m37R9rj46L77L02m35l46L73l77P32J97p19J52j99J35K05q36N25
$$ 397 -68 305 -132 -33 -42 -188 189 491 56 -290 83 -294 438 635 -84 68 -131 4 209 -627 -102
6526a02K69m52J24l1P5O29l76n20M90K72K55m33K44J25p92J88J58m3j41k09K52
$$ -102 167 -285 -161 -192 -117 512 136 -384 106 378 633 200 444 569 -223 -35 123 80 -61 -270 -18
6547a8o87Q15o70J432j111L47k8r4j29m39Q96l19n7j95L73j71Q4M85p29L87o9
$$ -18 -705 110 -560 872 -239 108 80 -14 -143 -582 314 -5 -62 -257 116 -55 29 514 -215 172 103
6568A03N0k88K9l2L73n19k27J025m04J30m32j7q1J85j37L01K00n31k67N81J52
$$ 103 153 -135 -106 -138 235 -284 -511 514 110 240 -192 -209 -290 -105 -242 59 259 -272 -539 42 194
6589A94K83l19o83K11J97N95m12K20j95p16N76k59N52m49L75k88J38j14j38N28
$$ 194 477 158 -525 -314 -117 478 66 286 91 -625 -49 -308 244 -205 170 -118 20 -94 -232 296
6609B96n45O65j068Q87m96J68N46m03o61L38K6P01n03K42k11J83j84n0L54m0m66
$$ 296 -249 416 -652 235 -261 -93 453 50 -611 -273 -247 454 -49 193 -18 165 -19 -69 285 245 -221
6630b21O65j29k65k27K88n16O47K40p71K68K36O08o94n27M50j92M8nn15M20L01
$$ -221 444 315 50 -177 111 -405 242 482 -289 -21 215 823 129 -398 52 -140 -92 -97 -612 -192 109
6651A09kk49K05q5J59J70r68R98n48l82K76P10o82P15n75K73j42K89l72Q4J12
$$ 109 107 -142 63 -22 137 307 -661 337 -211 -593 -317 393 -289 426 -149 124 -18 271 -101 -17 95
6672I5l00O83k04p4l4Q6l69K50k93j60L15M53j035P06L29m73Q81l49l42j06n52
$$ 95 -205 478 274 200 166 252 -117 133 -160 -320 -5 448 -587 119 448 -25 856 507 165 59 -493
6693d93J12Q34n60l92L64M13k97k78L35j01n28R25o29N74o49J57K69r0K53k26
$$ -493 -381 453 -107 -499 -135 278 -19 -297 38 -63 -591 334 -295 279 -370 -213 56 -34 219 -7
6713gp3l12R13m24J53o80M82r1M26k87j30K23n98J90P1k54M17m36O15l14l78L08
$$ -7 -80 -392 521 97 250 -430 52 -39 387 100 -30 193 -405 -215 -144 -398 19 -417 198 -116 -494 -186
6735a86o6n4j53P32q27K21L35kJ67j63o05M71j4P38p86m9L94k31j77M50o67O14
$$ -186 -252 -306 -459 273 -554 -333 2 0 167 4 -601 -130 -144 594 -192 -241 153 -78 -255 195 -472 142
6757A42J17j60k0l18oO1M79o92M91j11r8M48k11k43K08r4o48O38L6k10LM95j52
$$ 142 259 99 79 -239 -245 -184 295 -397 94 -17 -115 333 122 -121 87 -7 -655 -17 19 -191 -188 307 155
6780A55j15qJ87n98K54P33l32r28P43L48l28J08k09n55O90l95O2M45q07P54o98
$$ 155 40 32 219 -379 -125 608 276 -652 91 439 111 219 10 -545 145 -250 -188 257 -550 204 -494
6801d94R0M09k91R8J69M67j55m31N4J53k4k49J78k24k27L61O52j126P27J73p06
$$ -494 -404 5 -286 -188 -19 448 293 -138 -84 69 45 -204 -26 -250 -477 -116 536 -590 137 310 -396
6822c96N0O48j53o16J5N76M64o89J22J03j006J034N02p92K71j49K51n24N38K94
$$ -396 -346 302 149 -467 -452 124 588 -101 21 124 -882 152 654 -138 133 -16 235 -289 249 543
6842E43j21n59o10M14R98j27j232J174j95n49L33r9l12l0L43O21l68r4k04k97
$$ 543 422 -137 -747 -333 665 538 -694 480 285 -264 69 -30 -342 -372 -29 592 224 130 -74 -371
6862c71M98N5m75L64M48l94qj00q9M87j265M43N01K96q1n4l22M77o20L08j06k16
$$ -371 127 182 -293 71 519 125 117 17 -72 415 -850 -407 94 390 309 255 -67 410 -210 98 -8 -224
6884b24OL97k11L36k91m01J29jN4O91n31L59k56m03N61m28j65J80N99p97l73R10
$$ -224 -218 179 -32 304 13 -388 -259 -260 -206 485 -46 313 57 -346 215 -213 -378 -198 401 -396 -769 141
6906A41j04j79L18o60M74K70p05M98j88k05N08j87J55k68P15p19o23O10K48j91
$$ 141 37 -142 176 -484 -10 260 -445 53 -135 -340 168 -19 136 -132 583 -136 -759 -149 99 -92
6926i2L14j97M0K09%m50L89l15l17O87j77l52P97p66L68m69%J60k44M43L9J62
$$ -92 222 25 65 274 274 -176 213 -102 -419 268 91 -261 536 -230 138 -331 -331 -171 -415 28 67 229
6948B29j36p91M33L25j59m3k86P77n64J31k29Q06q61M00j51L10k95l12N63J68
$$ 229 93 -698 -265 60 -99 -142 -428 349 -215 -84 -313 493 -368 32 -119 191 -104 -416 147 315
6968C15n02K58l80N14n22L66P00p83J27P7p6o51O03m67J43j72O5M16q6o26R83
$$ 315 -187 71 -309 205 -317 49 749 -34 93 170 94 -557 46 -421 -278 -450 -385 31 -55 -681 302
6989C02j01n03K03j76L64K81n88n7M42J99l97j91L85J27n17R12r77K42j89L12
$$ 302 201 -302 -99 -275 89 370 -218 -275 167 366 -31 -222 163 290 -227 685 -292 -50 -239 73
7009G3k39m7M66n25L68n07O95l44l62J440m05r65N55K60j20l33k06O17j36k97
$$ 73 -166 -213 253 -272 96 -411 284 -60 -422 1018 613 -352 203 463 343 10 -196 421 285 -12
7029a2j82j08N07N45n64k95K21m90J22P52o76M47n94J84L27l38m95R46n55O96
$$ -12 -194 -302 205 750 186 -109 112 -378 -256 496 -180 267 -327 -143 184 -154 -649 297 -258 438
7049D38l92j20J43K89k8k51R6N4k65LL46l73Q4R0k66k06K72O14j170L05O87q83
$$ 438 46 -74 69 358 330 79 175 229 -36 -33 313 -60 24 114 -152 -358 -86 528 -642 -337 350 -533
7071e33P15j9k99J92k71J7M4j88P02j33k65J55l30j38P33m80K48L19o87q3j53
$$ -533 182 163 -136 56 -215 -198 -154 -342 360 227 -38 117 -213 -351 382 -98 150 469 -218 -301 -454
7092d54L10P63j163j64R77k71k55J45M68n6j15k78j01K94k80J49M40n05P2k0k74
$$ -454 -144 619 -544 -708 269 -2 -257 -112 356 300 185 -93 -194 100 -180 -31 409 -96 -24 -44 -318
7113c18L25j3K77l76J05j70M60q1j69Mj50o1l55N10L54l67N29n82j05Q12q79M25
$$ -318 7 -6 271 -105 0 -170 290 209 40 44 -106 -167 -522 -12 342 -25 504 -78 -183 629 -250 175
7135A75L33m60n02q7J354j031k28J47O64k97q8M07q74R01k30l75J89K09l2n99
$$ 175 508 48 -454 -541 813 -218 -446 -299 365 68 -20 387 -487 414 184 -191 -2 207 175 -424
7155d24N02K83l15K07k38lm32O8L15m28O57p86Q4K68k29L69M3Q7n6K8M94L62q81
$$ -424 78 361 46 253 15 12 -420 -352 -37 -465 192 -594 -510 -242 -471 -102 -59 28 -28 0 494 856 -25
7178b5k5R0J86o5m7L02m18k0k94P13n07k00L87O65n33j34j89K42l47j9J74L87
$$ -25 -50 40 226 161 114 416 -2 -22 -316 397 -110 -310 77 742 209 75 -114 128 -219 -238 -64 323
7200C23J63j99o54N44J60n84k47L82N5J07J92j58m82M58k77m79R83k00n05L74
$$ 323 486 287 -367 177 337 -247 -494 -112 -57 50 242 84 -398 60 -217 -696 287 87 -418 -44
7220d4j2K46m87M61r7J56l04o15P89J59o14Q65j068J395p08j3JL0J02j167Q77
$$ -44 -56 190 -297 164 67 223 -81 -696 93 252 -362 503 -565 830 122 109 110 140 242 -925 -48
7241d8m35L93j0K57K9o44R60K16m52K31j425J295l46K65p7k04J1J70M9k99N67
$$ -48 -483 -90 -100 157 186 -458 502 718 266 497 -928 367 21 286 209 5 16 186 235 -64 503
7262E03k21n46l73J278l38k31J76J52o3o80n5O25m78M15l37J81k55J03K49Q8o30
$$ 503 282 -264 -637 641 303 72 248 400 337 -343 -398 227 -251 164 -173 8 -247 -144 105 193 -437
7283d37L43J79K67k06q08K49Q58M4o10r7K69K01m43N69l50k48j60K09l14O90J82
$$ -437 -94 85 352 146 -662 -413 445 489 -121 -218 51 252 -191 378 28 -220 -380 -171 -485 205 387
7304C87p60M06n1j75P05n10L53l27K57m94k9r4M02k29K57l6k58K14K12p78L47
$$ 387 -373 33 -18 -193 512 2 355 28 285 -209 -238 -332 70 -159 98 62 -196 18 230 -548 -201
7325b01K91n36J3O85n90J82Q0r6O06K7m86j11L30n33n8j95R14j05o80Q08m70l25
$$ -201 90 -446 -433 252 -338 -156 -76 -172 434 461 -25 -136 194 -339 -397 -592 322 217 -463 345 -125 -450
7347d50N26k05M26k77P2L3n06M79j62l15M90J10n60l36P03J04m26L40j04P2J81
$$ -450 76 -129 297 20 92 125 -381 98 -64 -379 111 221 -339 -675 28 132 -294 46 -58 14 195
7368A95m74N51q87N58L17%J85l24l05k70J15j05r4Q59l80M7k67M06j99k38O00
$$ 195 -279 272 -615 -57 260 260 445 121 -184 -454 -339 -444 -538 321 -59 -12 -279 127 -72 -310 290
7389B90p06P58m56j09m18P15K82j10L98p42K23m11J16O2K95l38n1J9K47j0m52
$$ 290 -416 342 -114 -223 -641 74 356 246 644 -98 125 -286 -170 -108 187 -151 -202 -183 64 54 -398
7410c98M33j01l54O81L06J22j36m24p0j11l92M18k24j3K48m5N41j98p0oj39k17
$$ -398 35 -66 -420 261 567 689 553 129 59 -52 -444 -26 -250 -263 -15 -60 481 283 213 207 68 -149
7432a49K66r6O75p94L39n40L58K83j089N77J2j39O26n42L05j94l94J013n52J14
$$ -149 117 21 696 -98 241 -299 59 342 -747 -170 -158 -297 329 -213 92 -102 -496 517 -35 79
7452G9J21q9n9k83N61n0k62l82L12j53j88K09L66k06L98n19J62L5m91K15K13P9
$$ 79 200 111 52 -231 330 280 18 -364 -52 -205 -393 -184 182 -24 374 -145 17 52 -439 -224 -11 68
7474F8J26j90j54M96m12J61K00l82Q2o9M2K71k99k0J06p53P57j46k53L62M83j69
$$ 68 194 4 -150 346 -66 95 295 -87 -5 -74 -32 239 -60 -80 26 -727 30 -116 -369 -7 476 307
7496C07J57k9l85l14M74m17p7n6J17N53n92K14m0J8j41N48l47k35lK48P1N4j33
$$ 307 464 435 50 -264 210 -207 -284 -340 -223 330 -262 -48 -88 -70 -211 337 -10 -245 -248 0 71 125 -8
7519hK00l62j5k09N54n54L77L05l28M39n96J73N30J33j414R05l22l08L61M99j78
$$ -8 192 -170 -185 -394 160 -394 -17 288 -40 399 -197 -24 506 639 -775 130 -192 -500 -139 360 182
7540A82o35Q68r28N66O0n90N3M03J80n83N80j88K65L49n93MJ63k38k11P9L5k74
$$ 182 -453 415 -513 53 113 -477 -424 -21 159 -424 156 -32 233 582 -11 -7 156 -82 -293 -214 -179 -453
7562d53K4O92k35p85R43j11l58J22J49K25o04k40J074m08J12k09K26K4k43L03
$$ -453 -429 263 28 -757 186 75 -283 -161 -12 213 -391 -631 443 35 147 -62 164 188 -55 248
7582B48n56N58l43k67K79j59N65k73j89K74m85L67n54Q79j25m38r6P23m73J31
$$ 248 -308 250 -93 -360 -81 -240 325 52 -137 137 -348 19 -535 344 219 -219 -315 408 -65 66
7602F6n3m16L56j30K91k68k09K03O6k9O56k29J40k14j24J07j04k44L44k45q4N33
$$ 66 13 -403 -47 -177 114 -154 -363 -160 -94 -123 533 304 444 230 106 213 109 -135 209 -36 -120 413
7624D13n60j7K93R8k60J29p7J07k31O87o83k0j64J14R4J58k76M87k09K5k60k0
$$ 413 -147 -164 129 227 -33 96 19 126 -105 582 -101 -121 -285 -171 -77 81 -195 292 83 108 -152 -172
7646a72N38j28m85l10N66M28l89M1m98L02J64l17L75L3k93l32M08K36Q8o95K33
$$ -172 366 238 -247 -557 9 437 48 89 -409 -107 57 -260 115 148 -145 -477 -69 167 255 -440 -207
7667b07K16k91O01m37j24J90k17Q19n93l73R03o24k8K77n68Q06n23k30N95m72
$$ -207 9 -282 319 -118 -242 -52 -269 550 -43 -416 487 -137 -165 112 -456 350 -173 -403 192 -280
7687b80M07k55N3O54p18l51m23J121R7m0n99O50o73L70n0J48n24p2N75m71P27
$$ -280 127 -128 -75 579 -139 -490 -913 208 305 265 -334 316 -357 13 -37 111 -413 -485 90 -381 346
7708C46l15j51J51L18n02k0J98m37N71K2l76r1L64k73K25OM85n34l88L21K68j87
$$ 346 31 -120 31 349 -153 -173 25 -412 159 181 -195 -286 78 -195 30 36 521 -13 -401 -80 188 1
7730AK79J18n97K20J04K66K84l47l66O4J21n79P59m41M8k2K92l8n7n48O13l96
$$ 1 280 398 -199 21 125 391 675 328 -38 26 147 -432 327 -114 -66 -88 204 166 109 -439 174 -222
7752b22O09n53o6P21N8n53M34m73j9L40q13L28K07L48q6l47P75o92n78N55P7p6
$$ -222 387 -166 -232 489 547 -6 428 -45 -64 276 -537 -209 -2 346 260 -87 688 -4 -582 -27 50 -26
7774b6m6N23o09j36M04k17K32l24K01J04L53n72m9k15j09M35l41P56l43l21N21
$$ -26 -72 451 -158 -294 110 -107 125 -199 2 106 459 -113 -162 -377 -486 -51 -392 364 21 -300 221
7795B21m81k07J09L8Q6O86j220P28n5L3Q7k79L50lm0K11j16J3L55n31M55m77k25
$$ 221 -260 -467 -358 -320 -234 452 -768 -40 -95 -62 25 -254 96 93 53 264 148 161 516 -15 440 -37 -262
7818b62K54Q0J01k5K0L1m81J12K0j7L78Q8O0k50m78R67j77q19L66k55L73J08n1
$$ -262 -8 72 173 148 168 199 -282 -170 -150 -167 211 299 359 109 -369 598 421 -398 -32 -287 86 194 143
7841A43j77j59K36n1J7L88q7l70k49M02k72L4J70k39K59K76m19N49l70P17q33
$$ 143 -34 -193 43 -8 9 397 310 -60 -309 93 -179 -145 25 -214 45 321 -98 451 81 798 -35
7862c5L00o97L24K80k71n1L35J39K21o55L20O1k76l45M74P7o63K7J96J96K20J41
$$ -35 265 -432 -108 172 -99 -150 185 324 545 -110 210 271 -5 -350 124 201 -462 -435 -239 -43 177 318
7884C18j80j98m49O23n08n4M23l70O66K33p35N75J8q28L54r4p3J37k6J94L65k50
$$ 318 138 -60 -509 114 -394 -448 -25 -395 271 504 -231 344 362 -466 -112 -206 -279 -142 -168 26 391 141
7906A41k43M14l26j33M10K91r7k80k95J91o91R00m43J20l24M65M1j9k77M47j72
$$ 141 -102 312 -14 -147 263 554 457 177 -118 73 -618 282 -161 -41 -365 100 141 122 -155 292 120
7927A20j99K9m15Q21p89Q35l39j27j27L22k58M84n01o83Q76j42N05p4k22O0lr9
$$ 120 -79 -50 -465 356 -433 402 63 -64 -191 131 -127 357 -144 -827 49 -93 412 338 116 176 173 74
7949G4k41N51L95n54m79M76k42j72L5L98l3j33L19K80p13K13R3m79n5K02k56J97
$$ 74 -167 384 779 225 -254 222 -20 -192 -157 241 208 75 394 674 -39 174 267 -212 -267 -65 -321 -124
7971a24k38O27k76L59m05j83P47j190N27j41Q62l11l97K52J89m87L02M8o07K01
$$ -124 -362 265 -11 348 -57 -240 507 -683 -156 -297 565 254 -143 109 298 -189 113 161 -446 -245
7991b45k37M82nk11J98k41J45j49p3J29P33k82j27K84k17j1k88M38l02l13L37
$$ -245 -482 0 -5 -216 -18 -259 -114 -263 -336 -207 526 244 117 401 184 173 -115 323 21 -292 45
8012D5n47n3jN23K53n59L00o3N17J14o53J37NJ01J29j51L53l51l66j12J38O89
$$ 45 -502 -555 -556 -33 220 -339 -39 -102 415 529 -124 13 18 119 248 97 450 99 -267 -379 -241 448
8034D48n46q0k09M1K84L88p53r1L37QM68j7m80J27K15p9n97Q30Q1n44P98o99k9
$$ 448 -98 -178 -387 -346 -62 326 -427 -518 -181 -173 295 278 -202 -75 140 61 -536 294 375 -169 629 -70 -99
8057i9M04n07M52m24K81o9l26L60L00k86oj67l14N51k86J81n3j18m12p4M63K80
$$ -99 305 -202 250 -174 107 38 -288 72 372 86 80 -87 -401 150 -136 45 -8 -126 -538 -612 -149 131
8079A31R5J8L28k82J07l63l46P7J70M05l92O63q25M43l61N03j3p42O45J30m51
$$ 131 226 244 572 290 397 34 -312 -235 -65 340 -52 611 -214 229 -132 371 358 -384 261 391 -60
8100f0l39N12m2j62J65j56J01P0J0J2K89o65L20P3j69M60p99L56n04O11m27K81
$$ -60 -399 113 71 -91 74 -82 19 89 99 111 400 -265 55 128 -41 419 -380 -24 -528 83 -344 -63
8122f3K03j035J069J47r04O13l2J09m88j4O95L68o87K89l22K81p04M86K03m34
$$ -63 140 -895 174 321 -583 30 -2 107 -381 -395 300 668 -19 270 -52 229 -475 11 214 -220
8142b20J60Q4k92k56J88J1P24k80l30j29J437j415P22p0n28M38o25R83o81M25
$$ -220 -60 24 -268 -524 -336 -325 399 119 -211 -340 1097 -318 404 334 -194 244 -381 602 -79 346
8162C46K15p32N00q23P91m16K85k28K22K81n82j85N2Q6K67j77N41m14k84P9J72
$$ 346 561 -171 329 -494 297 -119 166 -62 160 441 -141 -326 -274 -188 79 -98 443 29 -255 -176 -4
8183dl33N86m06J68k96r0O33l38
$$ -4 -337 249 -157 11 -285 -375 258 -80
8191h0
$$ Imaginary data points
##PAGE= N=2
##DATA TABLE= (X++(I..I)), XYDATA
0@%%%%%%%%%%%%%J7n7Q0q0Q0q1J21j60J86k26K65l05L60m32M83n38O28p39Q38
$$ 0 0 0 0 0 0 0 0 0 0 0 0 0 0 17 -40 40 -40 40 -41 80 -80 106 -120 145 -160 200 -232 251 -287 341 -398 440
32D40r44J067j203J360j526J714j920K140k384K649k935L250l597L975m387M837
$$ 440 -504 563 -640 720 -806 908 -1012 1128 -1256 1393 -1542 1708 -1889 2086 -2301 2536
48B536n332N874o471P132p856Q660r565J0587j1745J3071j4609J6411j8561K1186
$$ 2536 -2796 3078 -3393 3739 -4117 4543 -5022 5565 -6180 6891 -7718 8693 -9868 11318
62A1318k4468K8702l4400M2505n5020P6983j26361M31007k6134o69988N06022
$$ 11318 -13150 15552 -18848 23657 -31363 45620 -80741 350266 324132 -345856 160166
73A60166j27322n8716J65903j43478j8100J04309l7986J0414r0087L9714K248
$$ 160166 32844 -25872 140031 -3447 -21547 82762 44776 55190 -34897 4817 7065
84G065n342O5753l5599p2697M7711K3632j3187m2360N876M1884J7113m7337N253
$$ 7065 1723 67476 31877 -40820 6891 30523 17336 -25024 -19148 22736 39849 -7488 -2235
97b235j1267k9959R9386j6486j15168P6024K442j1702M1545q0406K3631K6943
$$ -2235 -13502 -43461 55925 39439 -75729 295 2737 -8965 32580 -47826 -24195 2748
109B748l2055O8067q3988k8038J15472o4028l483M5394p7831K6565M9044l1211
$$ 2748 -29307 38760 -45228 -73266 42206 -21822 -25305 20089 -57742 -31177 17867 -13344
121a3344j1342N636J9275J864j4707L220j0452N752L3162q266l1948J8336K1165
$$ -13344 -24686 -19050 225 2089 -12618 -9398 -19850 -14098 19064 10798 -21150 -2814 18351
134A8351k3824j196J3054o468O1J3903R018l7095l026M4276k2403p748J8869k5783
$$ 18351 -5473 -6669 6385 -83 -22 13881 22899 -14196 -17222 27054 4651 -3097 15772 -10011
148a0011J3401K2032j8853j3931j145K4088K648k2606J3170p4j2181J5207R380
$$ -10011 3390 25422 6569 -7362 -8507 15581 18229 -4377 8793 8719 -3462 11745 21125
161B1125k3311j0320L1668j100k3765J4358l97j1127Q486L117j0198p402J8509
$$ 21125 -2186 -12506 19162 18062 -5703 8655 8258 -2869 5617 8734 -1464 -8866 9643
174I643K919k4909N942Q405r047N829L85j0365o040J9028L615k7451R293Q615
$$ 9643 12562 -12347 -6405 2000 -7047 -1218 -833 -11198 -17238 1790 5405 -22046 -12753 -4138
188d138j3694J7243k497j9637P681J4235M06j6718M15J1532o448O209M804j2958
$$ -4138 -17832 -589 -3086 -22723 -15042 -807 -401 -17119 -16704 -5172 -11620 -5411 -607 -13565
202a3565L969J1380l733j2786O452J3162r798L918Q277j7871M446J8303j0830
$$ -13565 -9596 1784 -1949 -14735 -8283 4879 -4919 -1001 7276 -10595 -6149 12154 1324
215A324q116J1072L652k523K574m252p151P046J0595k724j2008O412J1760j2403
$$ 1324 -6792 4280 7932 5409 7983 3731 -3420 3626 14221 11497 -511 5901 17661 5258
229E258j979R954o583m678J2821J597j7130M187J1024j0094M8O632r958R49P128
$$ 5258 3279 13233 6650 1972 14793 16390 -740 3447 14471 4377 4425 11057 1099 2048 9176
244I176j801p697k781J0556j833r537N362j264m047N020J994r844k228J2737p379
$$ 9176 7375 -322 -3103 7453 5620 -3917 1445 181 -3866 1154 3148 -6696 -8924 3813 -3566
259c566q035J2476o095l238P021m432k909k861P033N159j1397L990J790m295Q050
$$ -3566 -11601 875 -5220 -8458 -1437 -5869 -8778 -11639 -4606 553 -10844 -6854 -5064 -9359 -1309
274a309m236m301M291L963J562q679K970M535p116Q852P56o980O369O22k990J078
$$ -1309 -5545 -9846 -5555 -1592 -30 -8709 -5739 -1204 -8320 532 1288 -5692 677 1299 -1691 -613
290f13L124j125l192P160j05p233M661M653l007m112N196L848q279N946K221j0926
$$ -613 2511 1386 -1806 5354 5249 -1984 2677 7330 4323 211 5407 9255 976 6922 9143 -1783
306a783P689N754p742j024J977K209m479J476N917j0410J490Q778p349l052L951
$$ -1783 5906 11660 3918 2894 4871 7080 2601 4077 9994 -416 1074 9852 2503 -549 3402
321C402J058l857Q03K719o374L5P062m523o339N254K975n936p48N165n439j079
$$ 3402 4460 603 1406 4125 -2249 -2214 4848 325 -6014 -760 2215 -3721 -4469 696 -4743 -5822
337e822O446m487l610L947J804k991l510O161k893k953O925m178k283M757j217
$$ -5822 624 -3863 -7473 -3526 -1722 -4713 -8223 -2062 -4955 -7908 -983 -5161 -7444 -2687 -3904
352c904j9o66R58J221j834M462j880l723L904J843o88j241K561Q40l210M301r02
$$ -3904 -3923 -4589 -3631 -2410 -4244 218 -1662 -5385 -1481 362 -326 -1567 994 1834 -1376 2925 2023
369B023l850O512j064l781L913P20j987o73K566n01l146M426Q00m306J495J553
$$ 2023 -1827 4685 3621 -160 3753 4473 2486 1813 4379 3878 732 5158 5958 1652 3147 4700
385D700j041p23J341p3m248L655L093n750j19M665l240k240L278j01l946J283
$$ 4700 3659 2936 4277 4204 -44 3611 6704 954 835 5500 2260 20 3298 3197 -749 534
401E34L030n277j80L921k622k135K971p21k668o9K660k612k303L831J464n413
$$ 534 3564 -1713 -1893 2028 -594 -2729 242 -479 -3147 -3216 -556 -3168 -5471 -1640 -176 -5589
417e589J581K978m332K131K003m436J391L411k153j092J050J457k010J51M090
$$ -5589 -4008 -1030 -5362 -3231 -1228 -5664 -4273 -862 -3015 -4107 -3057 -1600 -3610 -3459 631
432F31j745k156L046k72p27K44L65R04k53J348p74j617K838J080l999K750K256
$$ 631 -1114 -3270 -224 -496 -1223 -979 -614 290 37 1385 611 -1006 1832 2912 -1087 1663 3919
449C919k054l21J802k405J421J222r22k29P42K25j328N43J282k523q98M964k994
$$ 3919 1865 1544 3346 941 2362 3584 2662 2433 3175 3400 2072 2615 3897 1374 476 5440 2446
466B446j694J626p48o58O31J454k375k047M499j332m495K447J535k881l33J504
$$ 2446 752 2378 1630 972 1603 3057 682 -1365 3134 1802 -2693 -246 1289 -1592 -1925 -421
482d21j69k049J011Q41k495O35K582k789j340L595j966k737M047j20l183J307
$$ -421 -590 -2639 -1628 -787 -3282 -2647 -65 -2854 -4194 -599 -2565 -5302 -1255 -1375 -4558 -3251
498c251J903m9k193K38K072j954K625K41l921K434J706q59l0j63J223m6j020L374
$$ -3251 -1348 -1397 -3590 -3352 -1280 -3234 -609 -368 -4289 -1855 -149 -1008 -1038 -1201 22 -24 -1044 2330
516B330l228K95K995j767k6Q85o94Q41O39O5q45N4J392q4j734J078P80r72O14
$$ 2330 -898 -603 2392 625 599 1484 790 1631 2270 2335 1490 1544 2936 2852 1118 2196 2976 2004 2618
535B618l02j777K236O9j661N12p63N97J95j224J592k193M15K977l276q93K180
$$ 2618 2316 539 2775 2844 1183 1695 932 1529 1724 500 2092 -101 314 3291 15 -878 1302
552A302j790O8J186p39j548m92L363j809k706K799n89k482L088j246j417R79J273
$$ 1302 -488 -420 766 27 -1521 -2013 1350 -459 -3165 -366 -955 -3437 -349 -1595 -3012 -2033 -760
569g60r75k452K883P87j904L20J185j938J315K71J57m94K68N37j196J365J67m31
$$ -760 -1735 -4187 -1304 -517 -2421 -2101 -916 -2854 -1539 -1268 -1111 -1605 -1337 -800 -1996 -631 -464 -895
587h95j350K781O51k379R63J070l84r9J3M74M73n8k4j205J261J197k024J565R3
$$ -895 -2245 536 1187 -1192 -229 841 457 358 371 845 1318 1260 1236 31 1292 2489 465 2030 2123
606B123r74P75m93N12o83o18J631m35m98K77j373P29J530j570l67J494q99n4n78
$$ 2123 1149 1924 1431 1943 1260 642 2273 1838 1340 1617 244 973 2503 933 566 2060 1161 1107 529
625E29j03o3o94J188j310o29J073l46j159P24M77j140J0M77O39k148L8J913j129
$$ 529 426 363 -331 857 -453 -1082 -9 -355 -1514 -790 -313 -1453 -1443 -966 -327 -2475 -2437 -524 -1653
644a653r2J079j643R79J254j147j773J592M76r15l76J304L14j398J578K64j218
$$ -1653 -1745 -666 -2309 -1330 -76 -1223 -2996 -1404 -928 -1843 -2219 -915 -601 -1999 -421 -157 -1375
661a375N88J105q53K64O24o50p61K173L63k203O51K160n29j530R11J61J71N69
$$ -1375 -787 318 -535 -271 353 -297 -1058 1115 1478 -725 -74 2086 1557 27 938 1099 1270 1839
679A839l31l72j39j32o0K10O57M0k26K92J17n22Q7Kk23k41o96n7M18M26m00o72
$$ 1839 1508 1136 997 865 805 1015 1672 1712 1486 1778 1895 1373 1460 1462 1239 998 302 245 663 1089 689 17
701A7j98R53q18m60j31j71K41M07m35j467J220N73p72o60L34j20j01O37M2j657
$$ 17 -181 772 -46 -506 -637 -808 -567 -160 -595 -2062 -842 -269 -1041 -1701 -1367 -1487 -1588 -951 -909 -2566
721b566J519M64j479M10N97M6r88P26O64j130M8R03o6k14Q6J085r81O00O82j602
$$ -2566 -1047 -583 -2062 -1652 -1055 -1009 -1997 -1271 -607 -1737 -1689 -786 -852 -1066 -980 105 -876 -276 406 -1196
741a196L77J614o66n33M80J158o75K15N7j5l10J196l92j031L92J10J0j88M21M42
$$ -1196 -819 795 129 -404 76 1234 559 774 831 816 506 1702 1310 279 671 781 791 603 1024 1466
761A466o74P58l5j169J277n40j27k08L49o42L57K23R9j280Q50m62J90KM7j56r26
$$ 1466 792 1550 1515 346 1623 1083 956 748 1097 455 812 1035 1134 -146 704 242 432 434 481 325 -601
782f01M09k21J60P6l83K3o79Q49r69L00M41m37l60N32N04j576R27m4p3K70R7p01
$$ -601 -192 -413 -253 -177 -560 -537 -1216 -367 -1336 -1036 -595 -1032 -1392 -860 -356 -1932 -1005 -1049 -1122 -852 -755 -1456
804a456o0K01Q45r19P6J161k89l65N66L44q68N38P38o44o79R37N15j89K95L46
$$ -1456 -1516 -1315 -470 -1389 -1313 -152 -441 -806 -240 104 -764 -226 512 -132 -811 126 641 452 747 1093
824A093j461L05J926j803J58P29l10k07N83K82j68k30O32r70m2L65k77J7L43K07
$$ 1093 -368 -63 1863 60 218 947 637 430 1013 1295 1127 897 1529 559 517 882 605 622 965 1172
844A172k60m47M18l58k97L70m56N02j094M10J59m4J78L21j424M76L91K5k73k92
$$ 1172 912 465 883 525 228 598 142 644 -450 -40 119 75 253 574 -850 -374 17 42 -231 -523
864e23N96j056R87m36o08K26J8M7M47j84q60Q82p11M59k72N54j20n58R02j20p33
$$ -523 73 -983 4 -432 -1040 -814 -796 -749 -302 -486 -1346 -464 -1175 -716 -988 -434 -554 -1112 -210 -330 -1063
885a063M07K69q36N55L58k50K80N96l98ML6r1M25k16p5p2K5M18j6J36N1K48j77
$$ -1063 -656 -387 -1223 -668 -310 -560 -280 316 -82 -78 -42 -133 292 76 1 -71 -46 372 356 492 543 791 614
908F14M20o4Q97r17q44J078r76J80P30l89r36M78J61K55m64L70Jl82MK09m59j68
$$ 614 1034 970 1867 950 106 1184 208 388 1118 729 -207 271 432 687 223 593 594 212 216 425 -34 -202
930b02R2O15j60j70L95j122J62Q52o09j9k17p20R98l38k55L94l94J97J78m78K2
$$ -202 -110 505 345 175 570 -552 -390 462 -147 -166 -383 -1103 -105 -443 -698 -304 -698 -501 -323 -801 -779
951g79K51k06N67m02L08K12j018J067k11l24n50R91J78l09o00N21J56LM95K92
$$ -779 -528 -734 -167 -569 -261 -49 -1067 0 -211 -535 -1085 -94 84 -225 -825 -304 -148 -145 350 642
971F42j052N38K82n50p6M91N85o29J54L48o39J2Q23R6j012K41P27k37M48p05N58
$$ 642 -410 128 410 -140 -216 275 860 231 385 733 94 106 929 1025 13 254 981 744 1192 487 1045
992A045p76O00O4j567J222K80o84l90N25L28l38p34Q05k05r5j00j01l40N82k19
$$ 1045 269 869 933 -634 588 868 184 -206 319 647 309 -425 380 175 80 -20 -121 -461 121 -98
1012i8m81O42l91l79K14K57j71l5L26j02K6m55N80n74M55j38j2j87O45l12k28
$$ -98 -579 63 -328 -707 -493 -236 -407 -442 -116 -218 -192 -647 -67 -641 -186 -324 -336 -523 122 -190 -418
1033d18M02q7K87K56p75k99Q47m6K32J3q52N38J35l61M18k53r6L87n97M08j66
$$ -418 -16 -103 184 440 -335 -634 213 167 399 412 -440 98 233 -128 290 37 -59 328 -269 139 -27
1054b7L90k18L76n15J36K88K04l58j60P26j51p73N26Q02j051j61Q1r2m9N21m86
$$ -27 363 145 521 6 142 430 634 276 116 842 691 -82 444 1246 195 34 115 23 -26 495 9
1075IK90j064R35p25M13L20M3J83o13N77m08m73N70L23n82Q1m83K86lM10m59N6
$$ 9 299 -765 170 -555 -142 178 221 404 -209 368 -40 -513 57 380 -202 -121 -604 -318 -321 89 -370 -314
1097c14Q1L46l92j1m20Q5N5l16L55Q25k74R6n79M68p47K05N51p47N63L07L94m04
$$ -314 -233 113 -279 -290 -710 -625 -570 -886 -531 294 20 116 -463 5 -742 -537 14 -733 -170 137 531 127
1119A27m52J98J58k30J97j53Q11r26P68n09o32J834l11j255O83M84n01n32L67
$$ 127 -325 -127 31 -199 -2 -155 656 -270 498 -11 -643 1191 880 -375 308 792 291 -241 126
1138A26j07o23Q52k37L07N6l4p38N19O15q08l06N04l96L06j19l46Q45j104O56
$$ 126 19 -604 248 11 318 374 340 -398 121 736 -72 -378 126 -270 36 -83 -429 416 -688 -32
1158c2N9q72R11j27n50M85R2m98J82K43l04j81K04M99l87q32J144k54J13l09m34
$$ -32 27 -845 66 -61 -611 -126 -34 -532 -350 -107 -411 -592 -388 111 -276 -1108 36 -218 -105 -414 -848
1179h48Q07km12L78m2k98O11n38N89n51M07J76m72M30q4m02J58L83k68L9J09J64
$$ -848 -41 -43 -455 -77 -119 -417 194 -344 245 -306 101 277 -195 235 151 -251 -93 290 22 61 170 334
1201C34k17M12k96O85l29l18l39N15K41k66n85M79k00Q50p60l65K73k21J11j11
$$ 334 117 529 233 918 589 271 -68 447 688 422 -163 316 116 966 206 -159 114 -107 4 -107
1221a07N22l36J87j31k23L70j30K13j60n53N39j82j83K24l88l21P86k88P3J12
$$ -107 415 79 266 135 -88 282 152 365 205 -348 191 9 -174 50 -338 -659 127 -161 -88 24
1241B4j37k07O04m73m95k5L2J096p11j94j31K61M07q03M37M05n69O89q55L52K46
$$ 24 -113 -320 284 -189 -684 -709 -677 419 -292 -486 -617 -356 51 -752 -315 90 -479 210 -645 -293 -47
1262d7O7M80n34K62o31M80j89L23q49Q61K81k89j83J55j92L48l35R6k84O59m83
$$ -47 20 500 -34 228 -403 77 -112 211 -638 223 504 215 32 187 -5 343 8 104 -180 479 -4
1283dN70j78n22J010p07J17L63o64P2N80L40j229J90N9K77M3k58J25r2n4Q81q36
$$ -4 566 388 -134 876 169 286 649 -15 57 637 977 -252 -62 -3 274 317 59 184 92 38 919 83
1305H3o4o35K1P68p41K23J86P57r24l8M19l76K35j55p38P27l87M05k62N32k51
$$ 83 19 -616 -595 173 -568 -345 -159 598 -326 -364 55 -321 -86 -241 -979 -252 -639 -234 -496 36 -215
1326b15J42l1J68k3MJ62o32J27k8J01m54P54m45J42j08J05J03j39R84o55n75K87
$$ -215 -73 -104 64 41 45 207 -425 -298 -326 -225 -679 75 -370 -228 -336 -231 -128 -267 717 62 -513 -226
1348b26O03p19K49L4P16j6l55k52N61j17q6R3l50K54M67p09K76j42K48m36l03
$$ -226 377 -342 -93 -59 657 641 286 34 595 478 392 485 135 389 856 147 423 281 529 93 -210
1369b10L75j11K29K06J8n00p9L17M05m84N2K84m00L55n77K78o29K37k48N68n75
$$ -210 165 54 283 489 507 7 -72 245 650 166 218 502 102 457 -120 158 -471 -234 -482 86 -489
1390d89M66N0n31P7L24P5jm2q74R96k09k92J02l38M32k23M07L7l4N51j326N76
$$ -489 -23 27 -504 -427 -103 -28 -29 -71 -945 51 -158 -450 -348 -686 -254 -477 -70 -33 -67 484 -842 -266
1412b66Q2N01j26n73J32n17R57M84p40k29R66o15J50J19j52K71p25O47l11K69
$$ -266 -184 317 191 -382 -250 -767 190 674 -66 -295 671 56 206 325 173 444 -281 366 55 324
1432C24l34L55j02J9k95L22k64K47l13J95M24m27J04j07K0N52r78J67K23J18J59
$$ 324 -10 345 243 262 -33 289 25 272 -41 154 578 151 255 148 168 720 -258 -91 132 250 409
1453D09p41L78l1J86j83J74l72j97k25N43n64L09M88p87J02l4K6P7K07J21j2l47
$$ 409 -332 46 15 201 18 192 -180 -377 -602 -59 -623 -314 174 -613 -511 -545 -519 -442 -235 -114 -126 -473
1475d73L61q25J111k31k73N9K0J00J03m88L22J37n24L69j76Q96r23L05L32l96
$$ -473 -112 -937 174 -57 -330 -271 -251 -151 -48 -536 -214 -77 -601 -232 -408 488 -435 -130 202 -194
1495a94l11J165n46j29J98k69J61L66j37m55N05Q5k72K8L64m40j20R5K84k73N51
$$ -194 -505 660 114 -15 183 -86 75 441 304 -151 354 439 167 195 559 119 -1 94 378 105 656
1516F56N8p97j01L94P00p20n94R24r53K92L93K34p31O20m24J93l18K18r2j14K98
$$ 656 714 -83 -184 210 910 190 -404 520 -433 -141 252 486 -245 375 -49 144 -174 44 -48 -162 136
1537A36o16k54P32QN3P0k29J32l26L9L89M0k68m61O19m54P74l67J46k03k18J82
$$ 136 -480 -734 -2 6 59 129 -100 32 -294 -255 134 174 -94 -555 64 -390 384 17 163 -40 -258 -76
1559g6n21J34M99m9k1m30K95q2J34j59L83k79Q51l33o76K99J25M0L92J10o0n85
$$ -76 -597 -463 36 -13 -34 -464 -169 -251 -117 -276 107 -172 679 346 -330 -31 94 134 526 636 576 -9
1581iM93l4l02K78Or2n48O33L7L5m97J00M07r4m70M24m17N51q33N28l34J13P91
$$ -9 484 450 148 426 432 340 -208 425 462 497 0 100 507 413 -57 367 -50 501 -332 196 -138 -25 766
1604G66r37l49P08j98o0j5l3k85Q17n75j32k59N14k5n51P59j75l97L17J69l23
$$ 766 -171 -520 188 -10 -70 -85 -118 -403 414 -161 -293 -552 -38 -63 -614 145 -30 -427 -110 59 -264
1625b64k17nK25k12Q37q27P8M35q4k7K0p9J22j49N93m02k82q3M95n5J52k39M40
$$ -264 -481 -486 -261 -473 364 -463 -385 50 -34 -61 -41 -120 2 -147 446 44 -238 -321 174 119 271 32 472
1648D72o84N63l23oJ41J24P6N04o12j33M6q8L96n21O57q67K15J0L26J36k99j98
$$ 472 -212 351 28 22 163 287 363 867 255 122 168 80 476 -45 612 -255 -40 -30 296 432 133 -65
1670f5R7J88K56o40N47J25n37O5j92l31M76K21j32k52J40J96k79L2k17l0J78K90
$$ -65 32 220 476 -164 383 508 -29 36 -156 -487 -11 210 78 -174 -34 162 -117 -85 -302 -332 -154 136
1692A36o22L95K31k06j43n5k9K60M62J50j034N75r79O76M68p86N61m25L28k62
$$ 136 -486 -91 140 -66 -209 -264 -293 -33 429 579 -455 120 -859 -183 285 -501 60 -365 -37 -299
1712b99K92k13J94L86k74J09n20N83q2p06Q21J95l58O05k56k83k67l5M03r36J091
$$ -299 -7 -220 -26 360 86 195 -325 258 176 -530 291 486 128 733 477 194 -73 -108 295 -641 450
1733D50j022O82L68lm46j76N38ol52J61l26J39N71l44K21o01M32l79K76k38K58
$$ 450 -572 110 478 475 29 -147 391 385 33 194 -132 7 578 234 455 -146 286 -93 183 -55 203
1754B03r6l58L27k26P4Q76r23K48J93l21K78l21P2n32R18l52N93j171J53l4Q4
$$ 203 107 -251 76 -150 -76 800 -123 125 318 -3 275 -46 26 -506 412 60 653 -518 -365 -399 -315
1775c15L34o71N0K57J35k62K52K7j54K37M82j94k56N38o85O35J7k26k14p16O68
$$ -315 19 -652 -602 -345 -210 -472 -220 -193 -347 -110 372 178 -78 460 -225 410 427 201 -13 -729 -61
1796f1j21K30m01l34J17O92m64P73m87J7M30n01M06R9l35m97Q62o8J60q54N88
$$ -61 -182 48 -353 -687 -570 122 -342 431 -56 -39 391 -110 296 395 60 -437 425 357 517 -337 251
1817B51p4n1k03n6K30N8k6J30l6K6K50l59J6l34J97J25k11N06k25l67N78m30l50
$$ 251 177 126 -77 -133 97 155 129 259 223 249 499 140 156 -178 19 144 -67 439 214 -153 425 -5 -355
1840c55J96N3p5L02m63J25l46j79J33O84k52l0J06J4Q6K95l57o59M74J19J41o30
$$ -355 -159 -106 -181 121 -342 -217 -563 -742 -609 75 -177 -207 -101 -87 -1 294 -63 -722 -248 -129 12 -618
1862f18J05M51O4M63n38l52J41O29l43L6n3l75R94o33k18P04n94M42l89m8l7L81
$$ -618 -513 -62 2 465 -73 -425 -284 345 2 38 -15 -390 604 -29 -247 457 -137 305 -84 -132 -169 212
1884B12J73p0j33j9J94k81r54J144k60L18Lk1J76p00J49O13q15J35k36K97R2j42
$$ 212 385 315 182 163 357 76 -878 266 6 324 327 306 482 -218 -69 544 -271 -136 -372 -75 17 -125
1906a25N64m21M54o78N41k36p0l33n0P92q62M04p3O04q83M82n04L37N87p94J0
$$ -125 439 18 472 -206 335 99 29 -304 -354 438 -424 -20 -93 511 -372 110 -394 -57 530 -264 -254
1927b54O96n46j18l71L95o4K80k59L47m41K93k1q8O52q63M08n79O08M9Q0n41K64
$$ -254 442 -104 -222 -593 -198 -262 18 -241 106 -335 -42 -63 -151 501 -362 46 -533 75 124 204 -337 -73
1949g3j87J28J04M57l24m01M44J76p99R81l67J13p5J85l46L74l06M08J5p28L43
$$ -73 -260 -132 -28 429 105 -296 148 324 -475 506 139 252 177 362 16 390 84 492 507 -221 122
1970A22o1pJ6L80J4k23jk1k95L49j06l72L75r78J026M03o92K99p07N79j94O26
$$ 122 61 54 70 450 464 241 240 219 -76 273 167 -205 170 -808 218 621 -71 228 -479 100 -94 532
1992E32j162N32N27j81k12l29K72j44J89j69J31l14K47m8K24j98L15o38N3k08
$$ 532 -630 -98 429 248 36 -293 -21 -165 24 -145 -14 -328 -81 -129 95 -103 212 -426 -373 -581
2012e81P68k75l35N06k03L56k06J69p40M92m01L01m49M26J44m15J15K52j133J186
$$ -581 187 -88 -423 83 -120 236 30 199 -541 -49 -450 -149 -598 -172 -28 -443 -328 -76 -1209 -23
2032b3j15L66j42j02J71J31K0k30K90n36M08m47o2L54L16p96L69m40Q63j86L97
$$ -23 -138 228 86 -16 155 286 306 76 366 -170 238 -209 -271 83 399 -397 -28 -468 395 209 606
2053F06m48j13J57J18l56N5K00K52n64L1L43q1J42o47K53l01M38N08r77P55j58
$$ 606 158 45 202 320 -36 19 219 471 -93 -62 281 200 342 -305 -52 -353 85 593 -384 371 213
2074B13k08l66N42K94p62m2j14l42R01o05L54j54l87L21R2K26j66j74M02j00o88
$$ 213 5 -361 181 475 -287 -329 -443 -785 116 -489 -135 -289 -676 -355 -263 -37 -203 -377 25 -75 -763
2095g63L59N66m97n33N85Q4j50L49K64J65l57k10K53l6K68J00l43J92J07o5l12
$$ -763 -404 162 -335 -868 -283 -199 -349 0 264 429 72 -138 115 79 347 447 104 296 403 338 26
2116B6J09n82N56N4M02o11k66O79k49n73L54M36N7J24l29j63M12l90O40k03N8
$$ 26 135 -447 109 163 565 -46 -312 367 118 -455 -101 335 392 516 187 24 436 46 686 483 541
2137E41n01m86O94m40j54O75o67M79k1J22l24p51J313n14l10l3J78M36K87o95
$$ 541 40 -446 248 -192 -346 329 -338 141 120 242 -82 -833 480 -34 -344 -377 -199 237 524 -171
2157a71K21n11L63j50J35m43k4R82o63m2k54L00J62l15k1R9L88O3k66O1M78n59
$$ -171 50 -461 -98 -248 -113 -556 -580 402 -261 -303 -557 -257 -95 -410 -431 -332 56 119 -147 -86 392 -167
2179a67J32r5l1N99q84N76l03L46p0Q9J57n06M31k29r3K44K8o0j15j60R33n51
$$ -167 -35 -130 -161 438 -446 130 -173 173 103 192 349 -157 274 45 -48 196 224 164 49 -111 822 271
2201B71q4K09m19l48J198q36N33k64j77J08m3O2r7J66m07j93k7L57k54J19n4O0
$$ 271 187 396 -23 -371 827 -9 524 260 83 191 148 210 113 279 -128 -321 -348 9 -245 -126 -180 -120
2223a20l44K26N87m32K01N0m63N16m41K07N4Q9m26J28j56J27L24j10K5j11k46
$$ -120 -464 -238 349 -83 118 168 -295 221 -220 -13 41 130 -296 -168 -324 -197 127 17 42 -69 -315
2244c15K97K48m88L27j89K90J58o13N09k2m29j17M29o0m92Q66l15l12o06J065
$$ -315 -18 230 -258 69 -120 170 328 -285 224 202 -227 -344 85 25 -467 399 84 -228 -834 231
2264B31j67k43K94P8L81l66J33K64r02P20l4q77N87K86q3k5l25P68o08k7L06j15
$$ 231 64 -179 115 193 574 208 341 605 -297 423 389 -488 99 385 302 277 -48 720 112 85 391 276
2286B76j28j4n14N57q5L07k13l14j34M95k1l56l38M60N62o83J86l55K70j35M58
$$ 276 148 134 -380 177 92 399 186 -128 -262 233 212 -144 -482 -22 540 -143 43 -312 -42 -177 281
2307B81Rp50R03m22J9p2l39k10N00l62NO85k12j61K09j78j79k9J09M90k90l92
$$ 281 290 -460 443 21 40 -32 -371 -581 -81 -443 -438 247 35 -126 83 -95 -274 -303 -194 296 6 -386
2329c86K34K94m51N1m22L70k82P53m07N33j31l64P03k28O8m78L21J9J5K93J00
$$ -386 -152 142 -309 -258 -680 -310 -592 161 -246 287 156 -208 495 267 335 -143 178 197 212 505 605
2350F05j55l35K52j94K34K22J90p78o58P43n01O88p38O13l60L05J54P8J25o78
$$ 605 450 115 367 173 407 629 819 41 -617 126 -375 313 -425 188 -172 133 287 365 490 -188
2370a88K98J95j06j47L91m8m93Q74n21m0K4k60N0q01N73N08k21j07J5l54l39M92
$$ -188 110 305 199 52 443 395 -98 776 255 215 239 -21 29 -772 -199 309 88 -19 -4 -358 -697 -205
2392b05K65o40K51O49l78K07O5l95K85K3k16QQ7r4J51j81j56O01l58p2k85P26
$$ -205 60 -580 -329 320 -58 149 214 -181 104 127 -89 -81 6 -88 63 -118 -274 327 -31 -103 -388 338
2414C38o66L49M37j12Q5j32N9O7k21J10k71k70M82m74M11N5j17j83l12O00n33
$$ 338 -328 21 458 346 431 299 358 425 204 314 43 -227 255 -219 192 247 130 -53 -365 235 -298
2435b98M57P1n94K2J02L41J94o19L65j24m72J47R9J10k93O30P9n82j80M87j90
$$ -298 159 230 -364 -342 -240 101 295 -324 41 -83 -555 -408 -309 -199 -492 138 217 -365 -545 -58 -248
2456b48J13N72p85J47QM05n68J09M11P1l68L50j76l50M40l03N0l69N18k7N5j73
$$ -248 -135 437 -348 -201 -193 212 -356 -247 164 235 -133 217 41 -309 131 -172 -122 -491 27 0 55 -118
2478a18M91o82J59k05L07l57M74n2M34n25J58j45j58M30l49l4o1O08p38R82n72
$$ -118 373 -309 -150 -355 -48 -405 69 17 451 -74 84 -61 -219 211 -138 -172 -233 375 -363 619 47
2499D7j96R3K07QJ10m53K69R0j50m42K03J38N40l2n71N82k24j62j57m5L55l16
$$ 47 -149 -56 151 159 269 -184 85 175 25 -417 -214 -76 464 432 -139 443 219 57 -100 -145 210 -106
2521a06J53L40n24K89j86k18Q62k00r76O95R2j48m37N07M9k61R3o08O52m81k9
$$ -106 47 387 -137 152 -34 -252 610 410 -566 129 221 73 -364 143 192 -69 24 -584 68 -413 -442
2542d42O91r92M87m72R74J28j48K12o23K17j67m92N13J65l95L7nL90P29j041N69
$$ -442 249 -743 -256 -728 246 374 226 438 -185 32 -135 -627 -114 51 -344 -307 -312 78 807 -234 335
2563C35n80J83l01k3L82K18j0o12M73M68m34l53N64k35j1m31q0P21L45o48J57
$$ 335 -245 -62 -363 -386 -4 214 204 -408 65 533 99 -254 310 75 64 -367 -447 274 619 -29 128
2584A28q0o9O4J89M1n34N50o7M78o27K58O33j472K65J58k96M60K6j11J93N2k44
$$ 128 48 -21 43 232 273 -261 289 222 700 73 331 964 -508 -243 -85 -381 79 105 -6 187 239 -5
2606el72O47k38K94m95K65J97o83O74n82R7j58Q15o10n8j18M72j16L02k40J38
$$ -5 -377 270 32 326 -169 96 293 -390 284 -298 -201 -359 456 -154 -212 -330 142 26 328 88 226
2627B26k54n53J048j24J46j054M80k28L27r5J44K74PNMJ3k35j64J65n44J40M04
$$ 226 -28 -581 467 343 489 -565 -85 -313 14 -81 63 337 344 349 353 366 131 -33 132 -412 -272 132
2649A32R5J60K14r97M43l71Q3O51m86M15m86N5O93l89K44J2p37P63j42m13n2k54
$$ 132 227 387 601 -396 47 -324 -241 410 -76 339 -147 -92 601 212 456 468 -269 494 352 -61 -113 -367
2671c67j0K97J16n1l09P53q5o0o45k3K42l6r8m46R41k37p2l27L91N1M00n89m95
$$ -367 -377 -80 36 -15 -324 429 344 284 -361 -384 -142 -178 -276 -722 219 -18 -90 -417 -26 25 425 -164 -659
2694f59K58P07k72J05k47l45m80M77N7N91n59J046o07p55Q03m51M1j8R75o21K47
$$ -659 -401 306 34 139 -108 -453 -933 -456 -399 192 -367 679 72 -683 120 -331 -290 -308 667 46 293
2715B93n02k75J57K68O9j81O3N46j34j23j32K1j4k77m8O51k43M33l49k96J36Q2
$$ 293 -209 -484 -327 -59 10 -171 -108 438 304 181 49 70 56 -221 -269 382 139 572 223 -73 63 145
2737A45o6M7k43K09P3J91n01j46k64R30l81L18J74n50L07m71K0L15k43jK89m18
$$ 145 79 126 -117 92 165 356 -145 -291 -555 375 -6 312 486 -64 243 -228 -208 107 -136 -137 152 -266
2759b66K56K8nm70L02l34N80p76R57n06j42M4J4M82m78L76j9k99k99N4qM13j35
$$ -266 -10 18 13 -457 -155 -489 91 -685 272 -234 -376 -332 -318 164 -314 62 43 -256 -555 -501 -509 -96 -231
2782b31j93L66j26K76j18j35l46M70K86%k34O6K32l6j23k53k0L6J94J14p0k38
$$ -231 -424 -58 -184 92 -26 -161 -507 -37 249 249 15 81 313 277 154 -99 -119 -83 111 225 155 -83
2804h3J24N67j02n4l67j24l00N90k37J14l3L06j30k43m57P82j48j69Q1j88J88
$$ -83 41 608 506 452 85 -39 -339 251 14 128 95 401 271 28 -429 353 205 36 117 -71 117
2825A17j32k14N4K08j92K34pJ79k14l9l13M34k49O49l62o34N53n75N73q0r3O23
$$ 117 -15 -229 -175 33 -159 75 68 247 33 -6 -319 115 -134 515 153 -481 72 -503 70 -10 -103 520
2847E20K2p23M74J27l25n37o0M84Rr4r1j13K99m11L81K02m0l95K92q9K40n65L32
$$ 520 542 -181 293 420 95 -442 -502 -18 -9 -103 -194 -307 -8 -419 -38 164 124 -271 21 -68 172 -393 -61
2870f1P35r25L69l1o44J053j48m98Q98n02o1L64k52m9P5r04J072n80K33m19L43
$$ -61 674 -251 118 87 -557 496 348 -150 748 246 185 549 297 248 323 -581 491 -89 144 -275 68
2891F8n34N20j36L51k14J94K5m29K10k84L53o35M71K73l46r6M80n06k98K49L98
$$ 68 -466 54 -82 269 55 249 274 -155 55 -229 124 -511 -40 233 -113 -209 271 -235 -533 -284 114
2912A14l31M91K90m36K37m26jj81m2J60k17N98m25L1J59l19k55N98n29L95n5J77
$$ 114 -217 274 564 128 365 -61 -62 -243 -285 -125 -342 256 -169 -138 21 -298 -553 45 -484 -89 -144 33
2934C3O1l35L99Q7k67m2M36j70K07j008K29O89L18m38m98M06M40m19k59L61m9
$$ 33 94 -241 158 245 -22 -64 372 202 409 -599 -370 319 637 199 -299 107 547 128 -131 230 181
2955A81m47L87O4l99K96j82k74M67J54m38O25l64k85k97P31p0k89j24N63j74k03
$$ 181 -266 121 185 -214 82 -100 -374 93 247 -191 434 70 -215 -512 219 149 -140 -264 299 125 -78
2976g8R9m88O83rk17J39J70L09p2j82m08n7j04Q5M82j50k93N97l67j46l00J62
$$ -78 21 -467 216 207 -10 129 299 608 536 354 -54 -111 -215 -130 352 202 -91 506 139 -7 -307 -145
2998a45K3j44K79l11O56q34j14Q61k08J93k60k95O91n09O7q5J50L94m08M20j88
$$ -145 -122 -266 13 -298 358 -476 -590 271 63 256 -4 -299 392 -117 -50 -135 15 409 1 421 233
3019B33N7k99k46K9q2O18j75J06J14l52J41l21k89R16m05N81o45j76M19p5K22
$$ 233 290 -9 -255 -226 -308 310 135 241 355 3 144 -177 -466 450 45 626 -19 -195 224 149 371
3040C71m85K02m39L12L87n67K86O64n11j63j47J6K96m76O40k36r8m05J98K66M8
$$ 371 -114 88 -351 -39 348 -219 67 731 220 57 -90 -74 222 -254 386 150 52 -353 -155 111 159
3061A59l56L25o40Q40l40m67L5M54o7J21k26L3J68j59K55K21j96l25N28m94K30
$$ 159 -197 128 -512 328 -12 -479 -444 10 -57 64 -162 -129 39 -120 135 356 160 -165 363 -131 99
3082I9N4Q2q43Q03l81P83k33J37l56k78K33K52j9k56M96j31l29k29M27r3j29k60
$$ 99 153 235 -608 195 -186 597 364 501 145 -133 100 352 333 77 573 442 113 -116 311 218 89 -171
3104a71M73k64L00l17K7K71n21k74Q21L3m9m24rJ0L11m54M48l62K21k2K0j80P9
$$ -171 302 38 338 21 48 319 -202 -476 345 378 329 -95 -104 -94 217 -237 211 -151 70 48 68 -112 -33
3127c3K76N30p61r5M1j93J83J80j35o5m5q1R7m5j41k51J77P01n25J90o2Pk89p6
$$ -33 243 773 12 -83 -42 -235 -52 128 -7 -72 -117 -198 -101 -146 -287 -538 -361 340 -185 5 -57 -50 -339 -415
3151d15R4Q79j179P77k17k7L79n38M48q13Q32mn40L10M02n6j299J117j35k01J127
$$ -415 -321 558 -621 156 -61 -88 291 -247 201 -612 220 216 -324 -14 388 332 -967 150 15 -186 941
3172I41j015K73K53p14L87K04j33j94k33J77j84k85N06K13m93L32l90M01K65J74
$$ 941 -74 199 452 -262 125 329 196 2 -231 -54 -238 -523 -17 196 -297 35 -355 46 311 485
3192D85j21j40k80J61K23K33Q3j27l49Kk66N80n72L20L22l48J5k95N19m16M80
$$ 485 364 224 -56 105 328 561 644 517 168 170 -96 484 -88 232 554 206 221 -74 445 29 509
3213E09j95o47N46p19k23J153K9p61N44p4M1l84j45j12J97j61R7N70p1j18n77
$$ 509 314 -333 213 -506 -729 424 453 -308 236 162 203 -181 -326 -438 -241 -402 -305 265 194 76 -501
3234e01O15K56k66r1j36n12J077m02K86m88J97l95O32m3l49R6M8P19n57o1n01
$$ -501 114 370 104 13 -123 -635 442 40 326 -162 35 -360 272 229 -120 -24 24 743 186 125 -376
3255c76l16J007M29n28o6l58Q18q14J83j19L93k42L80p16Q7M94l92K02K68m52
$$ -376 -692 315 744 216 150 -208 610 -204 -21 -140 253 11 391 -325 -238 256 -136 66 334 -118
3275a18N75n62L92m3k10k89J43J60m16o8N07p5k54J13K37l17m30N58J18j33j10
$$ -118 457 -105 287 244 34 -255 -112 48 -368 -436 71 -4 -258 -145 92 -225 -655 -97 21 -112 -222
3296b22K45o32J136p67K83K98N5O6n31K03L13K7l77k31P5M06n58K0L62m62K28
$$ -222 23 -609 527 -240 43 341 396 462 -69 134 447 474 97 -134 -59 347 -211 -191 171 -291 -63
3317f3K17n64O27m09k4M46k97l04n4N51j00K77J02m82J26N60n34l69J71K08R4
$$ -63 154 -410 217 -192 -216 230 -67 -371 -425 126 26 303 405 -77 49 609 75 -294 -123 85 179
3338A79m0q5J052j295K16M38k90J00j53K45m94o0M00j82mM2l73O44k08O1M18r37
$$ 179 139 54 1106 -189 27 465 175 275 122 367 -127 -187 213 31 27 69 -304 340 132 193 611 -326
3360c26M36q6J40J27o19N21l17K81K53l24R2K29J20q06J45k44N88J9r9M7j23O4
$$ -326 110 24 164 291 -328 193 -124 157 410 86 178 407 527 -279 -134 -378 210 229 130 177 54 118
3382A18N6j05l54l44J01M17J93K81o25M74L31q83k3O2O0j40J51k1P55k50l40o9
$$ 118 174 69 -285 -629 -528 -111 82 363 -262 212 543 -340 -363 -301 -241 -381 -230 -251 504 254 -86 -155
3404a55M41n63N72l12N64k87L6r95Q96j35k85O16n22m1J95K05n0K31l68P27n53
$$ -155 286 -277 295 -17 547 260 296 -699 197 62 -223 393 -129 -170 25 230 180 411 43 770 217
3425B17m76m9O51r91Q20q78L97M17l97m1L17j57M01o05K75j55N4k23j00Q74n20
$$ 217 -259 -308 343 -648 172 -706 -309 108 -289 -330 -13 -170 231 -374 -99 -254 -200 -423 -523 351 -169
3446a69N6j22L13l39j37J87K18J54m49m64P89o22O61O3l51K11MK06n3M9m99M12
$$ -169 -113 -235 78 -261 -398 -211 7 161 -288 -752 37 -585 76 139 -212 -1 3 209 156 205 -294 118
3468A18j56o25L54N03q9J12o24P13m4m31N55J98n41j30j93L07O08k85Q3n40J38
$$ 118 -38 -663 -309 194 105 217 -407 306 262 -169 386 584 43 -87 -280 27 635 350 433 -107 31
3489C1m6L28p9lMr27N48M8N42r33M35l87J71j83K23J76k48L96l06P21k96n66J71
$$ 31 -15 313 234 231 235 -692 -144 -96 446 -487 -52 -439 -268 -451 -228 -52 -300 96 -210 511 215 -351 -180
3512a80L46j79J72o43N00k71L40L7K65o51K19K59m39J76L77k82k75m16N12J08
$$ -180 166 -13 159 -484 16 -255 85 122 387 -264 -45 214 -225 -49 328 46 -229 -645 -133 -25
3532b5N02j61n34J77O3P56p57r3j77L97m21J16J06n95L64M48o4l33L47l10L88
$$ -25 477 316 -218 -41 22 778 21 -72 -249 148 -273 -157 -51 -646 -282 166 102 -231 116 -194 194
3553A94K90j69k28Pj83M88k66J39l6l11l0L55l21m1J49L53q52M71L09k66q1L65
$$ 194 484 315 87 94 -89 399 133 272 236 -75 -105 250 -71 -112 37 390 -462 9 318 52 -29 336
3575C36o05N30K49m92k55J12k4j78O34k96P3l93J12N96n76J35j87j20L09K2R5
$$ 336 -269 261 510 18 -237 -125 -149 -327 307 11 84 -309 -197 399 -177 -42 -229 -349 -40 -18 77
3596G7K20l98K1o8k67P13j199O30O99l17o7J07j31Q3j83K60l21J42q4J5L98j99
$$ 77 297 -101 -80 -148 -415 298 -901 -271 428 111 44 151 20 103 -80 180 -141 1 -83 -68 330 131
3618A31j55j59L5M73k00l41M00L2l51q8O5K15k69k85L98K45k51MJ55Q9k01j37
$$ 131 -24 -183 -148 325 125 -216 184 216 -135 -223 -158 57 -212 -497 -99 146 -105 -101 54 143 -58 -195
3640a95N09l28O42l44k78l11J9J28l7L22k30N19o65r0M77j81N06m33M31p52o2
$$ -195 314 -14 628 284 6 -305 -286 -158 -195 127 -103 416 -249 -339 138 -43 463 30 461 -291 -353
3661c53P0L87M73n66k07L04o98J31M52k71O15o38J63K15j85J23J65j39j72J28
$$ -353 -283 104 577 11 -196 108 -590 -459 -7 -278 337 -301 -138 77 -108 15 180 41 -131 -3
3681ck30M60n45L90j30j79K22k58j33K92l37L61j7k87N31J30J6N2k17o00M15l03
$$ -3 -233 227 -318 72 -58 -237 -15 -273 -406 -114 -451 -90 -107 -394 137 267 283 335 118 -482 -67 -370
3703c70L40J16L53o44K24m8j2M72Rm8m89Q4K62m48L63l92M91m50O3j68L28l88
$$ -370 -30 86 439 -205 19 -29 -41 431 440 392 -97 -13 249 -199 164 -228 263 -187 -124 -292 36 -352
3725c52K97K6L47j1k42n81Q1L14M43o9M47n15n77K38K94j1O14o48n88M20k40R1
$$ -352 -55 -29 318 307 65 -516 -435 -121 322 253 700 185 -392 -154 140 129 743 95 -493 -73 -313 -222
3747b22L80J84p49L61J88K13j224P66J41j70k33J78l63P75l68k36N06L1j25M30
$$ -222 158 342 -407 -46 142 355 -869 -103 38 -132 -365 -187 -550 225 -143 -379 127 158 33 463
3767D63j79k13J79jJ98M38k44l21m15k87O34m32N34m8Q8j90k82J65j26O81j037
$$ 463 284 71 250 249 447 885 641 320 -95 -382 252 -180 354 306 394 204 -78 87 -39 642 -395
3788c95K89j56P28l60l43K29L6l61N28m53k67K69L99J72L3k83p21M07M99r1M5
$$ -395 -106 -262 466 106 -237 -8 28 -333 195 -258 -525 -256 143 315 348 65 -656 -249 250 159 204
3809B04L60o17j61M37p4M8j19J73o69R18o87L90m76L73l03n01R23j27J68j0j27
$$ 204 564 -53 -214 223 149 197 78 251 -418 500 -187 203 -273 100 -203 -704 219 92 260 250 123
3830A23j02p1M67o14J35j34M17j16n80N18k29N08o05J61n64P70jJ96k95P8J93
$$ 123 21 -50 417 -197 -62 -196 221 105 -475 43 -186 322 -283 -122 -686 84 83 279 -16 62 255
3851B55j21L25p62N16K45k00m79M72j9o55Q21o01N07p3J40m94P7J43o3o3J57R3
$$ 255 134 459 -303 213 458 258 -221 251 232 -423 398 -203 304 231 371 -123 -46 97 34 -29 128 221
3873B21o15P14l65l74R5O85O1l51R9m6k24J30j57l3J73M2K44O7j47L58m51o23
$$ 221 -394 320 -45 -419 -324 361 422 71 170 124 -100 30 -127 -160 13 55 299 366 219 577 126 -497
3895d97N49K30j70P7k27m74R06k47j37l16O03m06l1j48J78l51J43l01K17M11m2
$$ -497 52 282 112 189 -38 -512 394 147 10 -306 297 -109 -140 -288 -110 -461 -318 -619 -402 9 -33
3916c3K82l31K63L77o94k9k0M15m26R18p10k48L34l60L9K27o6J29j50L09oj65
$$ -33 249 -82 181 558 -136 -165 -185 230 -196 722 12 -236 98 -262 -223 4 -62 67 -83 226 220 55
3938E5L57j24n90J020j66l83J20m69K88m97K93N29m95K77m84J56j09mK67j91j47
$$ 55 412 288 -302 718 552 169 289 -180 108 -389 -96 433 -62 215 -269 -113 -222 -226 41 -150 -297
3959b97j12K35N58k92j66p4k28M81J26k85k05k55N78L87j197J036k59o5L41m68
$$ -297 -409 -174 384 92 -74 -148 -376 105 231 -54 -259 -514 64 451 -746 290 31 -34 307 -161
3979a61J74J03l65N00k39J95m41n7K88j4r8l26p4P98n63K95j09PN22j78Q4j14
$$ -161 13 116 -249 251 12 207 -234 -291 -3 -17 -115 -441 -515 283 -280 15 -94 -87 435 257 341 227
4001B27NJ70Q6R4m77l56N46k67L05o38oO97l31m25N96m30K86J86m27M04j31n09
$$ 227 232 402 488 582 105 -251 295 28 333 -305 -311 386 55 -370 226 -204 82 268 -159 245 114 -395
4023c95O0P27j43J53m05k29O94l83N4L7m85O13m86M17n47L61p3o40N41J37K7j76
$$ -395 -335 392 249 402 -3 -232 462 79 133 170 -315 298 -188 229 -318 43 -30 -670 -129 8 35 -141
4045a41J57k36l31R16q7o19J070j160M47l24L84K39j76k59Lk5L01q0k43j8L12
$$ -141 16 -220 -551 365 278 -341 729 -431 16 -308 76 315 139 -120 -117 -142 159 79 -164 -182 130
4066A30l2n33L59R1J70J82L13n09J18p02L59m4q1k6l10N69J65o59K10j61N34M13
$$ 130 98 -435 -76 15 185 367 680 171 289 -413 -54 -98 -179 -205 -515 54 219 -440 -230 -391 143 556
4088E56q83L53J93K19j595P78%J61M46K45l28kJ37j109P05n36M73J49R5j93N7
$$ 556 -327 26 219 438 -1157 -379 -379 -218 228 473 145 143 280 -829 -124 -660 -187 -38 57 -136 -79
4109g9L44k62j61j1l23K17N71n82K30k30J78j8O7j67M40l09K06Oo50O25l3l95
$$ -79 265 3 -158 -169 -492 -275 296 -286 -56 -286 -108 -126 -59 -226 214 -95 111 117 -533 92 59 -336
4131c36j3M40K95j10k00Pj54m44M79K83o34O99m40J20P6J68o41J80j13J34R14
$$ -336 -349 91 386 276 76 83 -71 -515 -36 247 -387 312 -128 -8 68 236 -405 -225 -338 -204 710
4152G10j25p69Pm2L50k05o8K71q18R74p0l74K51M53m26j13K21m3R1k67J57m27
$$ 710 585 -184 -177 -219 131 -74 -142 129 -689 285 215 -159 92 545 119 6 227 184 275 8 165 -262
4174b62K37L51n24L04j98L29k04J15K46l72k67R4p40R01N3K12n52O75o01k31M29
$$ -262 -25 326 -198 106 -92 237 33 148 394 22 -245 -151 -891 10 63 275 -277 398 -203 -434 -5
4195ej62Q00o38O65l95m90L12k19P6M1o5K1M0K5k07l09J114o85K39J24n64L69
$$ -5 -167 633 -5 660 265 -225 87 -132 -56 -15 -80 -59 -19 6 -201 -510 604 -81 158 282 -282 87
4217H7l95J46K24j95j81P01l20p6j88J36K6N92j91l61j33P69K69p73M94k70m54
$$ 87 -308 -162 62 -133 -314 387 67 -9 -197 -61 -35 557 366 5 -128 641 910 137 631 361 -93
4238i3R8j58K26n10L84K40J18m68M52k95P03p36k68N33l23N35L0l93n48R87k56
$$ -93 5 -153 73 -437 -53 187 305 -163 289 -6 697 -39 -307 226 -97 438 468 75 -473 514 258
4259B58k51k16J06k89O66k63l66M98l95P80r35J014p29l13N80oj10j70L7L04n64
$$ 258 7 -209 -103 -392 274 11 -355 143 -252 528 -407 607 -122 -435 145 139 29 -141 -104 200 -364
4280c64K04J32l69L1P7K9L33P9j01K72o69j25L7P64l55m68J222k50p73J72m7O18
$$ -364 -160 -28 -397 -366 -289 -260 73 152 51 323 -346 -471 -434 330 -25 -493 729 479 -294 -122 -169 449
4302D49k60l11J71L50k20l57M02l53P3p2N63l46l28k09K66J24l25L57K02k55N8
$$ 449 189 -122 49 399 179 -178 224 -129 -56 -128 435 89 -239 -448 -182 -58 -383 -26 176 -79 -21
4323b1J03n11O19j79K24j09q8k1J28m13M35m61rQ16l14l19K38J32J6m11j3k67
$$ -21 82 -429 190 11 235 126 38 17 145 -268 167 -294 -303 513 199 -120 118 250 266 -145 -158 -425
4345d25J84N7k3N15o14P54p04k98M48L24j19k65K57l47J016n16n78K2M37M2k77
$$ -425 -241 -184 -207 308 -306 448 -256 -554 -106 218 99 -166 91 -256 760 244 -334 -312 125 167 -110
4366a10j10j7k22M33p3L46l84P2K13k8n63M28L23q2k83l3kRJ47J88J01m06Q4k77
$$ -110 -220 -237 -459 -26 -99 247 -137 -65 148 120 -443 -15 308 226 -57 -90 -92 -83 64 252 353 -53 31 -246
4390b46q4N43M0p2l8m14j02M87o5n9j88r2m4R04k66K1j49J97M46q46L48Mm37M1
$$ -246 -330 213 253 181 143 -271 -373 114 49 -10 -198 -290 -334 570 304 325 176 373 819 -27 321 325 -112 -71
4414g1n30M22N35k81l01L75P3k54K44k12q3P41o41Q6L3Nm38M06J87Pr45N27m02
$$ -71 -601 -179 356 75 -226 149 222 -32 212 0 -83 658 17 103 136 141 -297 109 296 303 -642 -115 -517
4437e17P95l08P4K05n92O74p6j75M56k76L34m60R3p59R29m61J05K99k73M0j05
$$ -517 278 -30 44 249 -343 331 255 80 536 260 594 134 227 -532 397 -64 41 340 67 107 2
4458BJ28k89M14j94j93l28O01l17j93J23J93O55p11j67J046m16m78L37k21L27
$$ 2 130 -159 255 61 -132 -460 141 -176 -369 -246 -53 602 -109 -276 770 354 -124 213 -8 319
4478C19j96k42L15j93L3o21J010o87J91R5n1M44m77L04l53J65k16O50n06m3j06
$$ 319 123 -119 196 3 36 -585 425 -262 -71 24 -27 417 -60 244 -109 56 -160 490 -16 -59 -165
4499a65r5K52k4P7K96m71N90m64J4j13J62j93O9K02q34K95Q8L96KJ8K64l67l55
$$ -165 -260 -8 -32 45 341 -130 460 -4 10 -103 59 -134 -65 137 -697 -402 -314 82 84 102 366 -1 -356
4522c56L69k14K87l10j44K13O38n42m4J42M36n99J9K03j52N7K6R8k03l02N95K78
$$ -356 13 -201 86 -224 -368 -155 483 -59 -103 39 475 -124 -105 98 -54 3 29 127 -76 -378 217 495
4544D95j45p22O42l3q38R7M46N87p92K57K79l74M2J09M25n95M12l64PL29n27k19
$$ 495 350 -372 270 237 -601 -504 -58 529 -263 -6 273 -101 -59 50 475 -120 292 -72 -65 264 -263 -482
4566d82K35M53Ll24J37k56L73k96j80N28Q4L88p72J88j37q7K85m23L10M62l16
$$ -482 -247 206 209 -115 22 -234 139 -157 -337 191 275 663 -109 79 -58 -145 140 -283 27 489 173
4587A73j90K85p08K5L96P2p7k74K43p8k14L98Kj30p3P6j27L33j28K67k02J25n87
$$ 173 -17 268 -440 -415 -19 53 -24 -298 -55 -133 -347 51 53 -77 -150 -74 -201 132 4 271 69 194 -393
4610c93K96n4M66l35M11k39q4K45m04N75o83J47P6j81r0L92K93o18r9L62K92k71
$$ -393 -97 -151 315 -20 391 152 68 313 -91 484 -199 -52 24 -157 -247 145 438 -180 -279 83 375 104
4632A04p8J86l81L66J8j85o45N94P43j037N52R0l54q3j7M06m94q6k48P08M10n77
$$ 104 26 212 -169 197 215 30 -615 -21 722 -315 237 327 -27 -110 -127 279 -215 -301 -549 159 569 -8
4654hK46m01L30l9J16l97L17m95P9R4l26L54K44o41J62J94L75L5n3J61q05P09
$$ -8 238 -163 167 128 244 -153 164 -331 -252 -158 -484 -130 114 -527 -365 -171 204 239 186 347 -458 251
4676B51j04l25k60L19L24O12q50K8J91nJ05p05K75L8n46P00j40L39j90j39L5K63
$$ 251 147 -178 -438 -119 205 817 -33 -5 186 181 286 -419 -144 -106 -652 48 -92 247 57 -82 -47 216
4698B16n65L79n05N00L44m44j08n9K71Q4k59l0J96k51L71j91k63J84n1J79j67
$$ 216 -349 30 -475 25 369 -75 -183 -242 29 113 -146 -176 20 -231 140 -51 -314 -130 -181 -2 -169
4719a69J08N04o01l3n65J190p66K2K15M27j03K57Jj54p31N08j20j71l39O59k11
$$ -169 -61 443 -158 -191 -756 434 -332 -310 -95 332 229 486 487 333 -398 110 -10 -181 -520 139 -72
4740g2M10J51m30J7l80N79L59q00L63k1M06p54J35l65J30L89J84j31k83J65rJ27
$$ -72 338 489 59 76 -304 275 634 -166 197 176 582 -172 -37 -402 -272 117 301 170 -113 52 43 170
4762A70q13O79J62j05m34J17J14O26j025O60R4l21Q6r9J60J06o55J31M77k69j83
$$ 170 -643 36 198 93 -341 -224 -110 516 -509 151 245 -76 10 -89 71 177 -478 -347 130 -139 -322
4783c22M14l13K0M49J95l96k45L37M9n9m73k24N00k12N75m21K68k03J0L04n54
$$ -322 92 -221 -201 248 443 47 -198 139 188 129 -344 -568 -68 -280 295 -126 142 -61 -51 253 -301
4804c01L96l00M3q7P36m34l24M23N38r34L88o67N31k18j74N8L67om09J22J66m46
$$ -301 95 -205 -162 -249 487 53 -271 152 690 -244 144 -523 8 -210 -384 -326 41 35 -374 -252 -86 -532
4826e32L91N28p02O98m67J81K78m21O82p38j82P34m84j04l27P71m29p6J97K80
$$ -532 -141 387 -315 383 -84 97 375 -46 636 -102 -284 450 -34 -138 -465 306 -123 -199 -2 278
4846B78k19p72M57L2L38L39k45N97k85j068K66L81l91O59m83J72j33m6L97n02
$$ 278 59 -713 -256 -224 114 453 208 805 520 -548 -282 99 -292 367 -116 56 -77 -123 274 -228
4866b28M65j03Q1n27Q20n84L09l05m73N45n19%J65K58l01M48j51r8L48K58k83
$$ -228 237 134 215 -312 508 -76 233 -72 -545 0 -519 -519 -354 -96 -397 51 -100 -198 150 408 125
4887A25J28j021J087m00L84n96P39n5o35N12j08j30L91k73k86j98K07k00P0M72
$$ 125 253 -768 319 -81 303 -293 446 391 -244 268 160 30 421 148 -138 -336 -129 -329 -259 213
4907B13l92L87n2m43j3K63j99J31m03O05N6n1J92j30k51K57m69L54L12o41M03
$$ 213 -179 208 156 -287 -300 -37 -236 -105 -508 97 153 102 294 164 -87 170 -299 55 367 -274 129
4928A29j63j05M7q7K58m32k64J110k73m61N03J70j142Q43J33R4l16j95L3pn3r6
$$ 129 -34 -139 -92 -179 79 -353 -617 493 220 -241 262 432 -710 133 266 360 44 -151 -118 -125 -178 -274
4950b74J54K89k39j17oj36J76k0M08J67o76K32J81J7l0oj7rl08R2J86j53l11Q18
$$ -274 -120 169 -70 -187 -193 -329 -153 -173 235 402 -274 -42 139 156 126 120 103 94 -214 -122 64 -89 -400 418
4974D18n12O86lj73p16M40J3K29l01L03k34j37J20n27N80j02O76j007j85O92j033
$$ 418 -94 592 589 416 -300 140 153 382 81 384 150 13 133 -394 186 84 760 -247 -432 260 -773
4995g73P52j77M55k36q16P34o6M55R9K2l86n44P20j67k71Q8J42Q3l39L4J49l5
$$ -773 -21 -198 257 21 -795 -61 -127 328 427 449 63 -481 239 72 -199 -111 31 114 -225 -191 -42 -77
5017g7J95l71K77m4j12K93r2p6M1N95o90L43n20P57q09L28L41k81K76l78K25k4
$$ -77 118 -253 24 -20 -132 161 69 -7 34 629 -61 282 -238 519 -290 38 379 98 374 -4 221 197
5039A97m9m91K90K32k30N4L76o17q8p21J387k86k90l61O76k3R3K77k79k4j77m80
$$ 197 148 -343 -53 179 -51 3 379 -238 -326 -1047 340 54 -236 -597 79 56 149 426 147 123 -54 -534
5061e34q4N38m6M68k40M60p62q4N77l21l49O17Q0m86l3J76K53j99l90N11J83k18
$$ -534 -618 -80 -126 342 102 562 -200 -284 293 -28 -377 240 320 -166 -199 -23 230 31 -359 152 335 117
5083A17k1k40j01K35j76r1j24P74m17L67J3K65m55J69q05O33l93j27M27J63k36
$$ 117 96 -144 -245 -10 -186 -277 -401 373 -44 323 336 601 146 315 -490 143 -250 -377 50 213 -23
5104b3l92L70j58N55m02L41j43j61R1l72O97j5N0k21k26M53l46Kj87P5N56o47
$$ -23 -415 -45 -203 352 -50 291 148 -13 78 -294 403 388 438 217 -9 444 98 100 -87 -12 544 -103
5126a03o9j52Q99k22j82K91m72J28J96k53m51M82J46k53j44q8L35K93n66M79k24
$$ -103 -172 -324 575 353 171 462 -10 118 314 61 -390 92 238 -15 -159 -247 88 381 -185 294 70
5147G0J17n9m30M41o18M78Q99q39K90j9K15m20l43L74m60J75l44J47M68p3k98
$$ 70 187 128 -302 139 -479 -1 898 59 349 330 545 125 -218 156 -304 -129 -473 -326 142 69 -229
5168b29K57l5r4L33k1j13j05q2m5O6M81l59K95q4m0K53q97J85j68R3K81o6m44
$$ -229 28 -7 -101 232 211 98 -7 -89 -134 -68 413 54 349 265 225 478 -419 -234 -402 -309 -28 -94 -538
5191e38M52N45p16L76J42R3j112P22m83K72O23j76n0j55P7P11p12L79l48p15P52
$$ -538 -86 459 -257 119 261 354 -758 -36 -519 -247 376 200 150 -5 72 783 71 450 102 -613 139
5212A39n44N66j23n01P59k71p5m70J059p50N45n9j55q5r1j81k16O57m0J37k45
$$ 139 -405 161 38 -463 296 25 -50 -520 539 -211 334 275 120 35 -56 -237 -453 204 164 301 56
5233E6J68k18J16k62OO24J38r67N81m27k20M07J0j26j35k72L08L59p6l33j23L9
$$ 56 224 6 122 -140 -134 490 628 -339 242 -185 -405 2 12 -114 -249 -521 -213 146 70 -263 -386 -347
5255c47j08O73n24j65j93J86O94r9k7m40M91o13M53m54K04L98K45l91R2l30M04
$$ -347 -455 218 -306 -471 -664 -478 216 117 90 -350 141 -472 -19 -473 -269 129 374 -17 75 -255 149
5276A49r07N76O03o43L50k84K84m68L33k04N33p22Q40r43N99o2K3l44l54N81k15
$$ 149 -758 -182 421 -222 128 -156 128 -340 -7 -211 322 -400 440 -503 96 34 57 -287 -641 -60 -275
5297b75Q6l78K81p4P17k09J7j9q89J260m38n29Q10n16L84j45J69n0o18K79N40
$$ -275 -189 -567 -286 -360 357 148 165 146 -743 517 79 -450 360 -156 228 83 252 202 -416 -137 403
5318D03o2n57l68N09k18N85n04JJ47j6q8L44K2n23N34K2m55O46J65j169J93Q2
$$ 403 341 -216 -584 -75 -293 292 -212 -211 -64 -80 -168 176 198 -325 209 231 -224 422 587 -582 -389 -307
5340c07Q2m60Q62k45n10N27N8j19J97J82k83k98K22J49L62m74m5M08K97o87M19
$$ -307 -225 -685 177 -68 -578 -51 7 -112 85 267 -16 -314 -92 57 419 -55 -100 308 605 -82 337
5361C37l94J76M7k69j01mJ54j26o4L1L00r6j95J49m46M97j8j52MN00j6n00K2L89
$$ 337 -57 119 166 -103 -204 -208 -54 -180 -244 -213 87 -9 -204 -55 -501 -4 -22 -174 -170 330 314 -186 -164 225
5385B25j71q5j7k64k5p7L85l37j27O19k74L10l28J7K79n47M37M26q62K2N22l00
$$ 225 54 -31 -48 -312 -337 -414 -29 -366 -493 126 -148 162 -166 -149 130 -417 20 446 -416 -394 128 -172
5407a72k40J004p47J10L15l49J17m7J24Ok23K37rj34r6j45P01l01m00o6N05m15
$$ -172 -412 592 -155 -45 270 -79 38 -9 115 121 -102 135 126 -8 -104 -249 452 151 -249 -315 190 -225
5429b25O34k71o7o92L42K46j29N24j66K36k64k63j5J64K50Q6p96K75J45k70K90
$$ -225 409 138 71 -621 -279 -33 -162 362 196 432 168 -95 -110 54 304 390 -406 -131 14 -256 34
5450C4m38O01q0k8J91R1l90j11k22N5M46O3k01q9L36j92P55n62k07J49N8n48K61
$$ 34 -404 197 117 89 280 371 -19 -130 -352 -297 149 212 11 -78 258 66 821 259 52 201 259 -289 -28
5473b8n62P14m62M8N35j01J42l16o9L30J90n84K02j51QM06p7k68l43O24o90O99
$$ -28 -590 124 -338 -290 245 144 286 -30 -99 231 421 -163 39 -112 -104 302 225 -43 -386 238 -452 247
5495B47k63j93O15j08k2m67k0m17J136k26R5p89J65Q9m6P1K65r1K59m50o1O23
$$ 247 -16 -209 406 298 276 -191 -211 -628 508 282 377 -412 -247 -158 -204 -133 132 41 300 -150 -211 412
5517D12P8p77KR00p55L72j73K40l89k14K09o1N20j015O53p16K55P11n40K31J9
$$ 412 490 -287 -285 615 -140 232 59 299 -90 -304 -95 -156 364 -651 2 -714 -459 252 -288 -57 -38
5538c8N6k35O78r31Q62l87j18Q7o88N02K99l81O25J39Q5o27J47k0k01j30KK57
$$ -38 18 -217 461 -470 392 5 -113 -26 -714 -212 87 -294 331 470 555 -72 75 55 -146 -276 -274 -17
5560a7k31M63p5K84n71p9L50l57k20J64P40o85J29R5M14n91M39n5k19P0n92N58
$$ -17 -248 215 140 424 -147 -226 124 -233 -453 -289 451 -234 -105 -10 404 -187 252 197 -22 48 -544 14
5582A4K51J73n96O92k24j67O82j212L64k63J1k41J003k35k51L08p77N03j16J1
$$ 14 265 438 -158 534 310 143 825 -387 -23 -286 -275 -516 487 252 1 309 -468 35 -81 -70
5602g0M01q34Q13o05o1j80L26k5M88K66o43N00j29j71M05n76l48O79j49m21m7
$$ -70 331 -503 310 -295 -356 -536 -210 -235 253 519 -124 376 247 76 481 -95 -443 236 87 -334 -381
5623c81L25O3P2J98k61Q5j72j52k86L49L74o17N67k02K17k89R7o23J215m24l33
$$ -381 -56 7 79 277 16 101 -71 -223 -509 -160 214 -403 164 -38 179 -110 -13 -636 579 155 -178
5644a78R9N49j149J014m37K25k91K14J15k56K23m45L72J1J43J35o61J35M07p87
$$ -178 -79 470 -679 335 -102 123 -168 46 161 -95 128 -317 55 66 209 344 -317 -182 225 -562
5664e62L3Q71l27j32K28m3l95O46j00j87q2P4J57k40k6k80P09j83n05k92J63M90
$$ -562 -529 342 15 -117 111 68 -327 319 219 32 -50 24 181 -59 -85 -365 344 161 -344 -636 -473 17
5686A7r45O61N82k48n31N30P6j29m22J74M35l14R01p59k75O18l83N00q22J52K29
$$ 17 -928 -267 315 67 -464 66 142 13 -409 -235 200 -114 787 28 -247 371 -12 488 -334 -182 47
5707D7j98L50K24o51K56O37j169K50O18p79k56M64M1J05k65R9J21j09M22oq0j25
$$ 47 -151 199 423 -228 28 665 -504 -254 364 -415 -671 -207 -166 -61 -326 -227 -106 -215 207 201 121 -4
5729dJ85k12l1Q5l65j4K6M93m5p94O91m30K19J88M22o00O19p83j28O57k80N02
$$ -4 181 -31 -62 23 -342 -356 -330 163 118 -676 15 -415 -196 -8 414 -186 433 -350 -478 179 -101 401
5751D01p21M67j19n9N27n90J67o1M50q17J22M75j82M94j116P92l67o8j36L26L23
$$ 401 -320 147 28 -31 496 -94 73 12 462 -355 -233 242 60 554 -562 230 -137 -205 -341 -15 308
5772C08J5j28l09J3J27j39L00m71qM62l44k91L78k31J66K29p5O6P2j00p64J205
$$ 308 323 195 -114 -101 26 -113 187 -284 -292 170 -174 -465 -87 -318 -152 77 2 68 140 40 -724 481
5794D81m79J71k72O90j062K57K89k17L69j8p11L44K65q8l59L9N01n36N62j00k40
$$ 481 2 173 -99 591 -471 -214 75 -142 227 209 -502 -158 107 19 -340 -301 200 -336 226 126 -114
5815a14P25k01q05Q71n28l56L46o39l0M16J70o6M18K79m31k86N0p4r3K55l45M79
$$ -114 611 410 -395 476 -52 -408 -62 -701 -731 -315 -145 -211 207 486 55 -231 -181 -255 -348 -93 -438 41
5837D1%k47J92M84m22l36K82j82K54m92P4nL01L86n63K94k9j00K53m61J02K89
$$ 41 41 -206 -14 470 48 -288 -6 -188 66 -426 -352 -357 -56 330 -233 61 32 -68 185 -276 -174 115
5859A15k61L2O6N7k3l7l96N76o14P25Ll37K60n19M41l47l89N89L27l36k62J004
$$ 115 -146 -114 -48 9 -14 -51 -447 129 -485 240 243 -94 166 -353 88 -259 -648 -59 268 -68 -330 674
5881F74l94L5l84n15N73j27L1j4K97mK77p53O00J08r00j07J182m52J45l86K07
$$ 674 280 315 -69 -584 -11 -138 -107 -121 176 172 449 -304 296 404 -496 -603 579 127 272 -114 93
5902I3O77l43o55K48J73k75Pk76K50n40L87R08p33N20o08j4M44j57K14n97J27
$$ 93 770 427 -228 20 193 -82 -75 -351 -101 -641 -254 654 -79 441 -167 -181 263 106 320 -277 -150
$$ [...]
8191A40
##END NTUPLES=NMR FID
##END=
