##TITLE=1H_SL-65-SPh(new)
 CDCl3, 8 sc, 
 23.3.2020
##JCAMPDX= 6.0         $$ Bruker NMR JCAMP-DX V2.0
##DATA TYPE= NMR FID
##DATA CLASS= NTUPLES
##ORIGIN= UXNMR, Bruker Analytische Messtechnik GmbH
##OWNER= root
$$ XWIN-NMR		Version 3.5
$$ Mon Mar 23 14:56:22 2020 Russian Standard Time (UT+4h)  she@DPX200
##.OBSERVE FREQUENCY= 200.1315
##.OBSERVE NUCLEUS= ^1H
##.DELAY= (6, 6)
##.ACQUISITION MODE= SIMULTANEOUS
##.ACQUISITION SCHEME= undefined
##.AVERAGES= 8
##.DIGITISER RES= 18
##SPECTROMETER/DATA SYSTEM= spect
##.PULSE SEQUENCE= zg30
##.SOLVENT NAME= CDCl3
##.SHIFT REFERENCE= (INTERNAL, CDCl3, 0, 15.7039)
##AUDIT TRAIL= $$ (NUMBER, WHEN, WHO, WHERE, WHAT)
$$ ##TITLE= Audit trail, XWIN-NMR		Version 3.5
$$ ##JCAMPDX= 5.01
$$ ##ORIGIN= Bruker BioSpin GmbH
$$ ##OWNER= she
$$ F:/spectra/data/she/nmr/H-F/1/audita.txt
$$ ##AUDIT TRAIL=  $$ (NUMBER, WHEN, WHO, WHERE, WHAT)
(   1,<2020-03-23 14:55:30.04 +0400>,<she>,<DPX200>,
      <created by zg, POWCHK disabled, PULCHK disabled
       configuration hash MD5:
       00 E9 B6 7A A2 85 ED C7 34 08 36 98 17 FE 4E 26
       data hash MD5: 16K
       B4 E4 45 A6 B5 36 76 BF A1 00 ED D4 65 91 F1 42>)
$$ ##END=
$$ 
$$ hash MD5
$$ 29 71 55 4B A5 D2 A6 97 E7 65 FD F8 16 BA B8 65
##$RELAX= 
##$RELAX= 
##$RELAX= 
##$RELAX= 
##$RELAX= 
##$RELAX= 
$$ Bruker specific parameters
$$ --------------------------
##$DU= <F:/spectra>
##$EXPNO= 1
##$NAME= <H-F>
##$PROCNO= 1
##$TYPE= <nmr>
##$USER= <she>
##$AMP= (0..31)
100 100 100 100 100 100 100 100 100 100 100 100 100 100 100 100 100 100 
100 100 100 100 100 100 100 100 100 100 100 100 100 100 
##$AQSEQ= 0
##$AQ_mod= 1
##$AUNM= <au_zg>
##$AUTOPOS= <>
##$BF1= 200.13
##$BF2= 200.13
##$BF3= 200.13
##$BF4= 200.13
##$BF5= 200.13
##$BF6= 200.13
##$BF7= 200.13
##$BF8= 200.13
##$BYTORDA= 1
##$CFDGTYP= 0
##$CFRGTYP= 5
##$CHEMSTR= <none>
##$CNST= (0..31)
1 1 145 1 1 1 1 1 1 1 1 1 1 1 1 1 1 1 1 1 1 1 1 1 1 1 1 1 1 1 1 1 
##$CPDPRG= <>
##$CPDPRG1= <>
##$CPDPRG2= <>
##$CPDPRG3= <>
##$CPDPRG4= <mlev>
##$CPDPRG5= <mlev>
##$CPDPRG6= <mlev>
##$CPDPRG7= <mlev>
##$CPDPRG8= <mlev>
##$CPDPRGB= <>
##$CPDPRGT= <>
##$D= (0..31)
0 1.2 0 0 0 0 0 0 0 0.06 0 0.03 0 0 0 0 0.0002 0 0 0 0 0 0 0 0 0 0 0 0 
0 0 0 
##$DATE= 1584960929
##$DBL= (0..7)
120 120 120 120 120 120 120 120 
##$DBP= (0..7)
150 150 150 150 150 150 150 150 
##$DBP07= 0
##$DBPNAM0= <>
##$DBPNAM1= <>
##$DBPNAM2= <>
##$DBPNAM3= <>
##$DBPNAM4= <>
##$DBPNAM5= <>
##$DBPNAM6= <>
##$DBPNAM7= <>
##$DBPOAL= (0..7)
0.5 0.5 0.5 0.5 0.5 0.5 0.5 0.5 
##$DBPOFFS= (0..7)
0 0 0 0 0 0 0 0 
##$DE= 6
##$DECBNUC= <off>
##$DECIM= 24
##$DECNUC= <off>
##$DECSTAT= 4
##$DIGMOD= 1
##$DIGTYP= 9
##$DL= (0..7)
0 120 120 120 120 120 120 120 
##$DP= (0..7)
150 150 150 150 150 150 150 150 
##$DP07= 0
##$DPNAME0= <>
##$DPNAME1= <>
##$DPNAME2= <>
##$DPNAME3= <>
##$DPNAME4= <>
##$DPNAME5= <>
##$DPNAME6= <>
##$DPNAME7= <>
##$DPOAL= (0..7)
0.5 0.5 0.5 0.5 0.5 0.5 0.5 0.5 
##$DPOFFS= (0..7)
0 0 0 0 0 0 0 0 
##$DQDMODE= 0
##$DR= 18
##$DS= 0
##$DSLIST= <SSSSSSSSSSSSSSS>
$$ [...]
##$SUBNAM2= <"">
##$SUBNAM3= <"">
##$SUBNAM4= <"">
##$SUBNAM5= <"">
##$SUBNAM6= <"">
##$SUBNAM7= <"">
##$SUBNAM8= <"">
##$SUBNAM9= <"">
##$SW= 24.9337058887773
##$SWIBOX= (0..15)
0 0 2 0 0 0 0 0 0 0 0 0 0 0 0 0 
##$SW_h= 4990.01996007984
##$TD= 16384
##$TD0= 1
##$TE= 0
##$TE2= 300
##$TE3= 300
##$TEG= 300
##$TL= (0..7)
0 120 120 120 120 120 120 120 
##$TP= (0..7)
150 150 150 150 150 150 150 150 
##$TP07= 0
##$TPNAME0= <>
##$TPNAME1= <>
##$TPNAME2= <>
##$TPNAME3= <>
##$TPNAME4= <>
##$TPNAME5= <>
##$TPNAME6= <>
##$TPNAME7= <>
##$TPOAL= (0..7)
0.5 0.5 0.5 0.5 0.5 0.5 0.5 0.5 
##$TPOFFS= (0..7)
0 0 0 0 0 0 0 0 
##$TUNHIN= 0
##$TUNHOUT= 0
##$TUNXOUT= 0
##$USERA1= <user>
##$USERA2= <user>
##$USERA3= <user>
##$USERA4= <user>
##$USERA5= <user>
##$V9= 5
##$VALIST= <valist>
##$VCLIST= <CCCCCCCCCCCCCCC>
##$VD= 0
##$VDLIST= <DDDDDDDDDDDDDDD>
##$VPLIST= <PPPPPPPPPPPPPPP>
##$VTLIST= <TTTTTTTTTTTTTTT>
##$WBST= 1024
##$WBSW= 4
##$XGAIN= (0..3)
0 0 0 0 
##$XL= 0
##$YL= 0
##$YMAX_a= 147022
##$YMIN_a= -53272
##$ZGOPTNS= <>
##$ZL1= 120
##$ZL2= 120
##$ZL3= 120
##$ZL4= 120
##$ABSF1= 10
##$ABSF2= 0
##$ABSG= 5
##$ABSL= 3
##$ALPHA= 0
##$AQORDER= 0
##$ASSFAC= 0
##$ASSFACI= 0
##$ASSFACX= 0
##$ASSWID= 0
##$AUNMP= <proc_1d>
##$AZFE= 0.1
##$AZFW= 0.1
##$BCFW= 1
##$BC_mod= 2
##$BYTORDP= 1
##$COROFFS= 0
##$CY= 11.3945322036743
##$DATMOD= 1
##$DC= 2
##$DFILT= <>
##$DTYPP= 0
##$F1P= 16.9975609425685
##$F2P= -3.02152046262296
##$FCOR= 0.5
##$FTSIZE= 0
##$FT_mod= 4
##$GAMMA= 1
##$GB= 0.15
##$INTBC= 1
##$INTSCL= 1
##$ISEN= 128
##$LB= 0.24
##$LEV0= 0
##$LPBIN= 0
##$MAXI= 10000
##$MC2= 0
##$MEAN= 0
##$ME_mod= 0
##$MI= 1.114404
##$NCOEF= 0
##$NC_proc= 0
##$NLEV= 6
##$NOISF1= 3.799351
##$NOISF2= 2.8
##$NSP= 1
##$NTH_PI= 0
##$NZP= 0
##$OFFSET= 15.70392
##$PC= 1
##$PHC0= -9788.792
##$PHC1= 16.00082
##$PH_mod= 1
##$PKNL= yes
##$PPARMOD= 0
##$PSCAL= 0
##$PSIGN= 0
##$REVERSE= no
##$SF= 200.130013532006
##$SI= 16384
##$SIGF1= 3
##$SIGF2= 2
##$SINO= 400
##$SIOLD= 16384
##$SREGLST= <1H.CDCl3>
##$SSB= 0
##$STSI= 0
##$STSR= 0
##$SW_p= 3612.71676300578
##$SYMM= 0
##$S_DEV= 0
##$TDeff= 0
##$TDoff= 0
##$TI= <>
##$TILT= no
##$TM1= 0
##$TM2= 0
##$TOPLEV= 0
##$USERP1= <user>
##$USERP2= <user>
##$USERP3= <user>
##$USERP4= <user>
##$USERP5= <user>
##$WDW= 1
##$XDIM= 8192
##$YMAX_p= 0
##$YMIN_p= 0
$$ End of Bruker specific parameters
$$ ---------------------------------
##NTUPLES= NMR FID
##VAR_NAME=  TIME,          FID/REAL,        FID/IMAG
##SYMBOL=    X,             R,               I
##VAR_TYPE=  INDEPENDENT,   DEPENDENT,       DEPENDENT
##VAR_FORM=  AFFN,          ASDF,            ASDF
##VAR_DIM=   8192,          8192,            8192
##UNITS=     SECONDS,       ARBITRARY UNITS, ARBITRARY UNITS
##FACTOR=    0.0002004,     1,               1
##FIRST=     0,             0,               0
##LAST=      1.6414764,     0,               0
##MIN=       0,             -53272,          0
##MAX=       1.6414764,     147022,          0
$$ Real data points
##PAGE= N=1
##DATA TABLE= (X++(R..R)), XYDATA
0@%%%%%%%%%%qJ6j6J6j6K3l1L2m0M8n6O4p2Q8j02J14j30J49j67J88k13K40k71
33a44L04l39L79m22M68n20N77o39P08p86Q69r60J066j182J313j466J642j843K082
52A107k374K731l188L795m641N921q103J2826m3484N1438O2231p9056n2475K2632
66c0640M7949k0113l8841m033L1702J0810m562J770J4130Q69r294r993M70N221
80d555J0565M372n439j0286M073J0650P92j1756q45J8238K0617J290j7792k1389
94a465r833Q763J8112O954q853k182J9835J9992j1895l1460j2609J3882J2287
107B1528l860k341P809M785k918L702Q550o947k0922o188J7041J3993o659j2573
121A5000l841K193N147J3098J0809j0316k2188m266J4454N052j3060n186J2590
$$ plain form
0 0 0 0 0 0 0 0 0 0 0 0 -8 8 -8 8 -8 15 -16 16 -24 24 -32 32 -40 48 -54 60 -70 79 -88 100 -113 127 -144
33 -144 160 -179 200 -222 246 -274 303 -336 372 -414 455 -505 561 -621 692 -774 868 -975 1107
52 1107 -1267 1464 -1724 2071 -2570 3351 -4752 8074 -35410 16028 78259 -797 -53272 -30640
66 -30640 17309 -2804 -41645 -45678 -13976 -3166 -7728 -5958 8172 9041 -253 -10246 -9776 -4555
80 -4555 6010 10382 4943 -5343 -1270 9380 10172 -1584 -2429 15809 36426 37716 19924 -1465
94 -1465 -11298 -2535 15577 22531 13678 11496 31331 51323 39428 7968 -4641 9241 21528
107 21528 17668 15327 23136 27921 25003 28705 37255 30308 9386 3198 20239 34232 27573 15000
121 15000 11159 13352 18499 31597 42406 32090 9902 5636 20090 25142 12082 6896 19486
134A9486O470j0334l346J5234Q297j8267j9967O018J6606o70j2271J227J3164
147B1647Q47j4380o770J0506J1257k558r258m650j470k267j99N904O613j06l557
162A1559Q08M035j860j1196j0708L891J4426P232p529p958O440J0867l860j5342
176H05o436P349O602j321K682Q999m5j5248j0951P915J1171j481o062M736R179
191A7894k943j1431m076M624J572k247K346O671J485m004j232R46l529p755j446
206c125Q292R277J705l934m814m409l097K035N242J941l201r84N171M433l899
221A0633j0142n755K495N839M602K518R01j154k211k539l302l698l345Q55N876
236A573Q625L157n013p618j621L037Q9m738j927M073K869j267j164L227J111o032
$$ plain form
134 19486 25956 15622 12276 27510 35807 17540 -2427 3591 20197 19527 7256 8483 21647
147 21647 22494 8114 1344 11850 23107 20549 11291 6641 5171 2904 2705 8609 15222 15116 11559
162 11559 12367 16402 14542 3346 -7362 -3471 10955 18187 10658 2700 9140 20007 16147 805
176 805 -5631 1718 8320 6999 9681 18680 18635 3387 -7564 351 11522 10041 3979 8715 17894
191 17894 14951 3520 -556 4068 5640 3393 5739 12410 13895 9891 8659 9605 6076 -1679 -3125
206 -3125 5167 14444 16149 12215 7401 2992 -105 1930 7172 9113 5912 4928 10099 14532 10633
221 10633 491 -5264 -2769 3070 7672 10190 11091 9937 7726 5187 1885 -1813 -5158 -4303 1573
236 1573 10198 13355 8342 724 -897 2140 2229 -2509 -4436 -363 2506 1239 75 3302 4413 -1619
252a619n923M068Q140J71q305l622L417J271m228k992M476O365J995j913j963
267f62k684m451l853k62J560J529L628M440L125j758m416k983k661k760j931K146
283a1993L666J890R58K661J635k314n298l205J202K428k37k250j171J820K696
298g512J816N98L07n95j762j659o58O28k536l484J183O231M999j55k011J117P37
315b756l045o268k443L760L343j124j002L316N523K163j359m056l262j970o75
330i855Q30K19J263K214L512K151R77J372r85m860p436k676N601P654M47m343
346c915k81O601N540l616p699l895K961K610k65l59K208K022k249k524K707N401
362E247J453m562l418O96P32j906l387P51M259M634K357J281K02k228n182n594
$$ plain form
252 -1619 -7542 -3474 4666 4837 -3468 -7090 -3673 -2402 -6630 -9622 -5146 1219 3214 1301 -662
267 -662 -3346 -7797 -11650 -11912 -10352 -8823 -5195 -755 2370 612 -3804 -6787 -9448 -12208 -14139 -11993
283 -11993 -8327 -6437 -5479 -2818 -1183 -3497 -8795 -12000 -10798 -8370 -8607 -10857 -12028 -10208 -7512
298 -7512 -5696 -5098 -4791 -5386 -7148 -8807 -9465 -8837 -11373 -14857 -13674 -7443 -2444 -2599 -4610 -3493 -2756
315 -2756 -5801 -12069 -14512 -10752 -7409 -8533 -9535 -6219 -696 1467 108 -3948 -7210 -9180 -9855
330 -9855 -9025 -8806 -7543 -5329 -1817 334 1311 2683 1698 -3162 -10598 -13274 -7673 -19 428 -3915
346 -3915 -4196 2405 7945 4329 -3370 -7265 -4304 -1694 -1959 -2318 -110 1912 -337 -2861 -154 5247
362 5247 6700 2138 -1280 -584 148 -1758 -5145 -4394 -135 4499 6856 8137 8339 6111 929 -4665
378d665k543J022M076N434M491J837o44l934l614j996l02j198j538J674O423N231
394I754q96n722m130Q22J943O45O46J380K93k467l214O19J493N15l36J281L313
411E939L278l80m918o552l133J452M497L485K218J867J117j722m111k811j214
426i88o44k5K300M446L313J75j466k529l855k668J693N103K782j851k581K66J204
443D675n9j107p59O05J048J863J529l23k406k343j100N17J683K804K703M44k684
460G090k547l1J448o74j614K6K596K353J28j827j526K44R94m35j430j86K594K014
478I217j830k894j43K942J109k974k165K025L972k58m150j503K684J692j893k441
494C390R53J902j85l354n85M201L473j476n562k819J309K417r26j346J132K844
$$ plain form
378 -4665 -7208 -6186 -2110 3324 7815 9652 9008 5074 1460 -536 -838 -2036 -3574 -1900 4523 9754
394 9754 8858 3136 -994 -172 1771 2416 3062 4442 4735 2268 -946 -327 1166 1681 1345 2626 5939
411 5939 9217 8837 3919 -2633 -5766 -4314 183 3668 5886 7753 8870 7148 3037 226 -988
426 -988 -1632 -1657 643 5089 8402 8577 7111 4582 727 -1941 -248 4855 7637 5786 3205 3471 4675
443 4675 4616 3509 2750 3355 4403 6266 7795 7472 5066 2723 1623 2140 3823 6627 9330 9774 7090
460 7090 4543 4512 5960 5286 3672 3698 6294 8647 8775 6948 5422 5666 6660 6225 4795 4609 7203 9217
478 9217 7387 4493 4350 7292 8401 5427 3262 5287 9259 9001 4851 3348 6032 7724 5831 3390
494 3390 4343 6245 6060 2706 2121 6322 9795 8319 2757 -62 1247 3664 2738 1392 2524 5368
510E368M46j902j590M78j76k766k929j62L589L358R30k155k249j634o36n7L53
527a734J100R7l23j037j231o74j95M2J403J219k34J33n10j207l672k783k13K819
545g000K876J090J642Q06k50l142n426l824m7M126M537J575l67n30L8o24l514
562h034j920L90J929m13m47K421L281p88m383k699K494L728L62r21K34L32k417
579f851l419j207K565M635L718J520j836k640j974j412j144m64J132K098K666
594b613J535K347K016j652n570m449J04L114K719J765J048R26m20r40q26m27k71
611a594J338J352q23j742p13J291J860O36M71J056k48r73j71Q25j100l045j321
628b901J550L625J894J293J480j487l586k854J300J569j409j375J749L011R93
$$ plain form
510 5368 5814 3912 2322 2800 2624 -142 -3071 -3233 356 3714 4644 2489 240 -1394 -2030 -2087 -1734
527 -1734 -634 -537 -860 -1897 -3128 -3802 -3997 -3955 -2552 -1333 -1567 -1434 -1944 -3151 -6823 -9606 -9819 -7000
545 -7000 -4124 -3034 -1392 -586 -836 -3978 -9404 -13228 -13275 -9149 -4612 -3037 -3404 -3934 -3896 -4520 -8034
562 -8034 -9954 -9564 -7635 -8048 -8495 -6074 -2793 -3581 -7964 -10663 -8169 -4441 -4079 -5000 -4766 -4434 -6851
579 -6851 -10270 -11477 -8912 -4277 -559 961 -875 -3515 -5489 -6901 -8045 -8509 -7377 -5279 -2613
594 -2613 -1078 1269 3285 1633 -3937 -8386 -8282 -5168 -2449 -684 364 1290 870 -70 -896 -1323 -1594
611 -1594 -256 1096 273 -1469 -2182 -891 969 1605 2076 3132 2884 1911 1740 2565 1465 -1580 -2901
628 -2901 -1351 2274 4168 5461 6941 5454 1868 -986 314 1883 474 -901 848 3859 4852
643D852q99M31J60m42k460j668N0K79J024J327J000m61n87P68J334j184j972k53
661A299q6j897p66J918M262P37k191k241N8K11n5K2L23M43j171o93n13K89K757
680B706J850j100k963q65K368J027k845k468J640K569n69j885K110M142k63l842
696A612k921K24L21j184J101L864L283o60m189j942J31J530M59p79j820R02L111
713C043J559j695k803k00O99m78J29K219J912j248l325L55J963q67k951l04M100
730B108L584j082l393j420O78l26j276M51J171J140N36R74Q24k092l497k587Q97
747c310M001L576m47l328k230J535J386j107l239J14K777J835m5K12J08k325l485
764c972l47L251J800k259j095K474L752q50m597l801J4K387K370J816M39k108
$$ plain form
643 4852 3953 4384 4544 4102 1642 -26 24 303 1327 2654 3654 3193 2606 3374 4708 3524 1552 1299
661 1299 1213 -684 -1450 468 4730 5467 3276 1035 1093 1304 1249 1271 1594 2037 866 173 -340 -51 2706
680 2706 4556 3456 493 -372 1996 3023 178 -2290 -650 1919 1350 -535 1575 5717 5454 1612
696 1612 -1309 -1085 -764 -1948 -847 3017 6300 5640 1451 -491 -360 1170 1629 850 -970 -68 3043
713 3043 4602 2907 104 -96 603 125 254 2473 4385 3137 -188 167 2130 1263 -1688 -1992 2108
730 2108 5692 4610 1217 -203 475 149 -1127 -676 495 1635 2171 3145 3969 1877 -1620 -4207 -3310
747 -3310 691 4267 3820 492 -1738 -203 1183 76 -3163 -3049 -272 1563 1518 1730 1838 -487 -3972
764 -3972 -4319 -1068 732 -1527 -2622 -148 3604 2754 -1843 -5644 -5630 -3243 -873 943 1382 -726
780g26k512j88J317Q60l31j113m55J389J064M35k011k134n6J628K001l09j196
797b337K77J245l18j436j760r91j78K112L121J510j803k440m22J022o28j467p86
814e279J707J366N94J72N5j035k028j1K249J450j856k654q38K386K284M17j628
831b649n74L20L59l63j81l22l45j320N3K600K261o66l327p93K485K442j753l354
849e127o70K555J898j571j057J385J266r88j653J563K587j243m193j796J952L309
865a783P79j294M97J939N58k793l252J53J629P25k68R50K454O77j879k311L43
882b876J265r52j486K61L106K453k072k569j015K432J405r70j297J240J676Q9
898F90k208j683O1N96P54J799J989J048j411k933j579n08R24R81M33J397J603
$$ plain form
780 -726 -3238 -3426 -2109 -1249 -1580 -2693 -3148 -1759 -695 -260 -2271 -4405 -4461 -2833 -832 -1141 -2337
797 -2337 -2060 -815 -1133 -2569 -4329 -5320 -5498 -3386 -265 1245 -558 -2998 -3420 -2398 -3026 -4493 -5279
814 -5279 -3572 -2206 -1612 -1440 -1385 -2420 -4448 -4459 -2210 -760 -2616 -5270 -6108 -3722 -1438 -1021 -2649
831 -2649 -3223 -2903 -2544 -2907 -3088 -3410 -3755 -5075 -5022 -2422 -161 -827 -4154 -4947 -2462 -20 -1773 -5127
849 -5127 -5797 -3242 -1344 -2915 -3972 -2587 -1321 -2309 -3962 -2399 188 -1055 -5248 -7044 -5092 -1783
865 -1783 -1004 -2298 -1801 138 696 -2097 -5349 -5196 -3567 -2842 -3110 -2160 294 971 -908 -3219 -2876
882 -2876 -1611 -2563 -4049 -3788 -682 1771 -301 -2870 -3885 -1453 -48 -1018 -2315 -1075 601 690
898 690 -1518 -3201 -3140 -2544 -1790 9 1998 3046 1635 -1298 -2877 -3385 -2461 -1480 -1047 350 1953
915A953K03k56q52j195k239r34J488K794K070j116j734J63J158j46j661j542J420
932d26K698N16j262j360j8J81R5r90J462K148J029r21k102n14k54J59j71L01J118
951A689J971Q06l42k167j048k91Q97M59l42O08P31J182k33j115j199N48K33J61
969B548O9J96J243J16p35r39j85L63J177M05j3o13m06L62J96l0o84j9J224P00
989D975L3r53o96R65O98q05j009J00J274O96o09j015n8J100O34r32p87Q08M45
1008D864l43j181j39J257N29o03n17M29M67j222j050J63J162J335m94j196n59
1025B902L14l5k45J10l3K0n57j55J339R24j402k739j616J439K856J331j744j473
1043A236m38J34L18r81k85K77L74Q3J06j6J71j183j344o47K80J362J054j13j181
$$ plain form
915 1953 2156 1900 1048 -147 -2386 -3320 -1832 962 3032 1916 182 345 1503 1357 -304 -1846 -426
932 -426 2272 2788 1526 166 148 329 424 -566 896 3044 4073 3152 1050 536 282 441 270 571 1689
951 1689 3660 4466 4124 1957 909 618 1515 1974 1632 2240 2971 4153 3920 2805 1606 2154 2387 2548
969 2548 2617 2813 4056 4172 3437 2498 2313 2676 3853 4258 4245 3632 3226 3588 3784 3754 3070 3051 4275 4975
989 4975 5008 4055 3359 4324 5022 4217 3208 3308 4582 5278 4669 3654 3596 4696 5330 4398 3611 4419 4864
1008 4864 4521 3340 3201 4458 4987 4384 3867 4296 4763 3541 2491 2654 3816 5151 4657 3461 2902
1025 2902 3216 3181 2936 3046 3013 3033 2476 2321 3660 4584 3182 443 -1173 266 3122 4453 2709 1236
1043 1236 798 932 1250 269 -16 261 635 718 824 808 979 -204 -1548 -2195 -1915 -553 501 388 -793
1062g93m12k73n48p94k56R96R64M58k44p87j042j056n22M09P92R12L53K66o60
1081b237q00r79k99K37L72l03o8P82K077Q2j767k289j262J034J869Q25M46j64
1099b444m55r63j632L28J773J307j362j228M11J936O98r92k181j006P97J906P52
1116b355Q72k41p00j744p51P79J278L71p17k3R84R27n28q28p66l01J12L07J108
1135b216J277l33j443l63J247Q87j028j351K6J252J811p15j173o24N98M33l85
1152b100j94J204J153j236j669o70J619K010j59j935r62J182J577k11p33j02j97
1169a423o20m71M96J904P44j197j909n21J674J878M31k107j842K85J442J110l9
1186a65r8j12k78o41J19P24K57q22n63J168L55J82l52L81M8q45j033O82J713O35
$$ plain form
1062 -793 -1205 -1478 -2026 -2820 -3076 -2080 -1116 -658 -902 -1689 -2731 -3787 -4309 -3900 -3108 -2196 -1843 -1577 -2237
1081 -2237 -3037 -4016 -4315 -4078 -3706 -4009 -4077 -3295 -1218 -1136 -2903 -5192 -6454 -5420 -3551 -2726 -2280 -2444
1099 -2444 -2899 -3862 -5494 -5166 -3393 -2086 -3448 -4676 -4265 -2329 -1631 -2623 -4804 -5810 -5013 -3107 -2355
1116 -2355 -1483 -1724 -2424 -4168 -4919 -4140 -2862 -2491 -3208 -3231 -2247 -1320 -1848 -2676 -3442 -3743 -3631 -3324 -2216
1135 -2216 -939 -1272 -2715 -3078 -1831 -944 -1972 -3323 -3297 -2045 -234 -949 -2122 -2746 -2148 -1715 -2100
1152 -2100 -2294 -1090 63 -1173 -2842 -3512 -1893 117 -42 -1977 -2939 -1757 -180 -391 -1124 -1226 -1423
1169 -1423 -2043 -2514 -2018 -114 630 -567 -2476 -2997 -1323 555 986 -1121 -2963 -2678 -1236 -126 -165
1186 -165 -263 -375 -653 -1294 -1175 -451 -194 -1016 -1579 -411 -56 126 -226 155 203 -642 -1675 -993 720 1355
1206A355r53o24K99Q19n22r46l7J135R27O15m44o97J96r12k47k26J741J732J20
1225C331k135j524J592K048j65k291j039J620J780O99l3o52r43j330k54J394J399
1242C497L87k54m51Pm14L43j21k63m25N90J074N15J3n58n49p15k64R0J123P14
1262D339L8o0K69j198r84R5J134R18q25q17R39J524o34j805r30J77J075N75P5
1281C905j12p77O78K32r09j360o39J807J268n86j206Q00O53j137j733n5J817J216
1299C862j163j287l94P49N97n98m33p36L60J019L58j099j93P22n1j217j061J149
1317E84J166l76q38J52L50o85q98O72P27l77r90N26R44j49j292r87J329J097o18
1336C37j172m05N67Q07k49o08n84L15N58Q7o53J01Q4N55n34p39M86J042n58j751
$$ plain form
1206 1355 402 -222 77 896 374 -572 -609 526 1453 2068 1624 927 1123 211 -36 -262 1479 3211 3331
1225 3331 1196 -328 1264 3312 3147 856 -183 1437 3217 3916 3883 3231 2288 958 704 2098 3497
1242 3497 3884 3630 3179 3186 2772 3115 2994 2731 2306 2896 3970 4485 4498 3940 3391 2676 2412 2502 3625 4339
1262 4339 4377 4317 4586 3388 2404 2499 3633 4551 3726 2909 3848 5372 4738 2933 2003 2180 3255 3830 3905
1281 3905 3793 3016 3694 3926 3017 1657 1018 2825 4093 3507 2301 3101 3754 2617 884 829 2646 3862
1299 3862 2699 1412 1018 1767 2364 1766 1333 597 957 1976 2334 1235 1042 1764 1713 496 -565 584
1317 584 1750 1374 536 688 1038 353 -545 127 854 477 -513 13 957 808 -484 -1471 -142 955 337
1336 337 -835 -1240 -673 134 -115 -723 -1307 -992 -434 -347 -1000 -899 -815 -260 -794 -1533 -1047 -5 -563 -2314
1356b314k17J287J068m99j090n2N30k63K30N77n37r89l87J055J213l87q76q48
1374b499M06J09J46mq2K45R31j69j080q30M73R02j76r40J61J487P38j837r73M00
1394b592J002j48p92L04P12K08q04l16jo4K52q0k59K58O65Q21J0j063j674k88
1414c849R36J290N71K46j105j334L30J018L20j256q52Q41J347N38q62o27R2n80
1432b936m66R44R63L38r64p54K99O82N72n08j032j426Q11K515R96j084k192l85
1450c627R48R02q2N5J56J61m00O6k76k24k1L59O45m53P9L32K23k83m89m23Q06
1471a546J91n3K52O15l69k35n3N38j80k46K59L08m4p8J308O66j603j674M49K069
1491E74J548m92j671q82J026O54P42K53r89n50L6J241O86L45o50o75n94Q07J855
$$ plain form
1356 -2314 -2531 -1244 -176 -675 -1765 -1817 -1287 -1550 -1320 -743 -1280 -2269 -2656 -1601 -388 -775 -1651 -2499
1374 -2499 -2093 -1984 -1838 -1842 -1924 -1679 -748 -917 -1997 -2827 -2354 -1452 -1628 -2568 -2407 -920 -182 -2019 -2992 -2592
1394 -2592 -1590 -1738 -2530 -2226 -1514 -1306 -2110 -2426 -2427 -2491 -2239 -2319 -2578 -2320 -1655 -834 -824 -1887 -3561 -3849
1414 -3849 -2913 -1623 -1052 -806 -1911 -3245 -2915 -1897 -1577 -2833 -3685 -2844 -1497 -959 -1821 -2448 -2356 -2936
1432 -2936 -3402 -2458 -1495 -1157 -2121 -2875 -2576 -1894 -1322 -1830 -2862 -4288 -3477 -962 34 -1050 -3242 -3627
1450 -3627 -2679 -1777 -1859 -1804 -1648 -1487 -1887 -1821 -2097 -2321 -2342 -1983 -1338 -1791 -1712 -1380 -1157 -1440 -1929 -2352 -1546
1471 -1546 -1355 -1408 -1156 -541 -910 -1145 -1198 -660 -840 -1086 -827 -519 -563 -641 667 1333 -270 -1944 -1495 574
1491 574 2122 1630 -41 -923 103 757 1499 1752 763 213 249 1490 2176 2521 1871 1196 602 1409 3264
1510C264J27j595j117J081J798K86j173p51N37N49m31m1J484l3j371j069J190
1527B735K010k9j648j187R85J074L92q31n06M02J015k9j454o14Q36J464o67j024
1545B924Q9J065J51j280l99P55N18n66p78Q78J107r01j561n08R65R93J63o95o83
1564B237n47O96P33K19j299r32Q2O89L56K73j33q51j021l85J322P00n37j156O3
1583E09J221j64q83m82p32K16M03J050K49r78q04j18N76j77R0k33l07n61N68R21
1603C64j1p85j030K77M58K91p5J14L12o04q45J92K16K49k05K99K43m6q20P6L69
1624i61K76m94j16mL21L07M21p7j112l48M35M67r4K25L00j26o35l54O90P35m62
1645f06j320J2J078P90n11r32K42L52J57l51m42M94K62L14m21m21j1J13k70j87
$$ plain form
1510 3264 3391 1796 679 1760 3558 3844 2671 1920 2457 3006 2575 2534 4018 3985 2614 1545 2735
1527 2735 4745 4716 3068 1881 2866 3940 4332 3501 2995 3397 4412 4383 2929 2315 3151 4615 3948 2924
1545 2924 3013 4078 4229 2949 2550 3305 3823 3257 2479 3357 4464 3563 2002 1494 2459 3452 3615 2920 2237
1564 2237 1690 2386 3119 3338 2039 1107 1189 1878 2234 2507 2374 1523 502 117 1439 2139 1602 446 509
1583 509 1730 1566 683 201 -531 -315 88 1138 1387 409 -395 -513 63 -114 -24 -257 -564 -1125 -557 364
1603 364 353 -432 -1462 -1185 -727 -436 -511 -397 -85 -689 -1534 -1342 -1126 -877 -1082 -783 -540 -586 -1406 -1330 -961
1624 -961 -685 -1179 -1295 -1299 -978 -671 -250 -327 -1439 -1787 -1352 -885 -979 -754 -454 -580 -1215 -1569 -879 -144 -606
1645 -606 -1926 -1914 -836 -46 -557 -1489 -1247 -895 -738 -1089 -1531 -1037 -775 -461 -882 -1303 -1314 -1201 -1471 -1658
1665a658K33O30P4p38p63M58Q95k2j039m7J73K18j18q1O89l80j84l30j17K57K93
1686a557n7j98l33LK78j00j23J42K6K2o52J85L88K65q9j18m90M97l12j33J32K84
1708a940L08l38j20o5O1K76Ql30M27n68O09l18P80l63m33o16M68N23M28L67n99
1729a435O2J53j00j09O9L82M50J30n89j46O25L3K15m16N4L93L47n47l37R75N30
1750G39j90j108n4Q74J038j54j035N7L14R51l88o43M7P86L37l51N9J4L02j29m59
1771A007J12N92l1M6l59L85K92K02p70n74N34O21L50j19j57k60o54M12N39M10
1791B578m41l89J10N0O71j84n96r3R7Q8Q2J73J0P4l76pn97L87M01k84o0p3O84
1814B305q5r97J51M21N04r45l97J79N59N19o19m85R1L80N0k18m14K82K00k16m39
$$ plain form
1665 -1658 -1425 -795 -721 -1459 -2222 -1764 -869 -891 -1930 -1977 -1804 -1586 -1704 -1785 -1096 -1476 -1660 -1990 -2107 -1850 -1557
1686 -1557 -1614 -1812 -2145 -2142 -1864 -1964 -2087 -1945 -1919 -1897 -2549 -2364 -1976 -1711 -1800 -1918 -2408 -1911 -2223 -2356 -2224 -1940
1708 -1940 -1632 -1970 -2090 -2155 -2094 -1818 -1810 -2140 -1713 -2281 -1672 -1990 -1210 -1573 -2006 -2622 -2154 -1631 -1203 -836 -1435
1729 -1435 -1373 -1220 -1320 -1429 -1360 -978 -528 -398 -987 -1133 -508 -475 -260 -676 -622 -229 118 -429 -766 209 739
1750 739 549 -559 -613 261 1299 1145 110 167 481 1432 1044 401 448 1234 1571 1220 1279 1293 1595 1466 1007
1771 1007 1119 1711 1680 1726 1367 1752 2044 2246 1476 902 1436 2057 2407 2288 2131 1871 1217 1629 2168 2578
1791 2578 2137 1748 1858 1908 2579 2395 1799 1706 1803 1891 1973 2146 2156 2230 1854 1847 1250 1637 2038 1754 1694 1621 2305
1814 2305 2220 1223 1374 1795 2299 1354 957 1136 1695 2214 1595 1110 1201 1581 1631 1413 999 1281 1481 1265 826
1835H26K54K27n9j87l74K43L45K80o04k02K74j06K40o54J43p8M60L97m84Q3m11
1856F13o3K66k30Q4K29o4m34m0M6P87k21p08m7N82j3J42m38n7K15j05l60J74Q2
1879D40L90k15n77L37J34j6k10l91M94M35n50k93N32K26Q1n95n47J73L82j21m82
1900c73K47O03K45n37k89N9M24k73m53J1L03L03k6o71J47K62k0j20j0K02n0k30
1922b46j43m79O41q2m20K23K19O8K5l49k13K53p5l44j95J2M14j08l58M9p0K33
1944i45q5n13j77M07L6K5l05K6K68k76k21K2oN53p65m07N75J64J58o85j64Q69
1966a446o7p5j86J1k96O3o9O6RJ65K07M4l97M7l6o6j57k93N18J63l83k15L68P21
1990a304m69k30Q3J18M90k29j97j5M31j84l00N58N6%n9r5j87N61m66J84qJ10P41
$$ plain form
1835 826 1080 1307 1248 1061 687 930 1275 1555 951 749 1023 917 1157 503 646 568 1028 1425 941 1024 613
1856 613 550 816 586 670 899 835 401 361 407 1194 973 265 218 800 787 929 491 434 649 544 184 358 440
1879 440 830 615 38 375 509 493 283 -108 386 821 271 -22 510 736 817 222 -325 -152 230 109 -373
1900 -373 -126 477 722 185 -104 -45 379 106 -347 -336 -33 270 244 -427 -280 -18 -38 -158 -168 34 -16 -246
1922 -246 -389 -868 -227 -309 -729 -506 -287 -219 -194 -543 -756 -503 -578 -922 -1117 -1105 -691 -799 -1157 -1108 -1178 -945
1944 -945 -1030 -1543 -1720 -1313 -1277 -1252 -1557 -1531 -1263 -1539 -1760 -1738 -1744 -1191 -1956 -2363 -1788 -1624 -1466 -2151 -2315 -1446
1966 -1446 -1513 -1588 -1774 -1763 -2059 -1996 -2065 -1999 -1990 -1825 -1618 -1574 -1971 -1924 -1960 -2026 -2183 -2476 -1958 -1795 -2178 -2393 -2025 -1304
1990 -1304 -1773 -2003 -1920 -1802 -1312 -1541 -1738 -1753 -1322 -1506 -1806 -1248 -1192 -1192 -1251 -1346 -1533 -972 -1438 -1254 -1262 -1152 -411
2013d11ol27M7m4O68k95m96J22O16P1m07p0R75N14p76k23N1O70q6l04l07M75N7
2036E14N35j83J43P4K03k90j36J89P7J72j04n34P52O62J34j011j0O38Q0m08m49
2057A048N35J32j95j88M29M99k61l36j62K04J94j91j10j08o2K16K73J80n98ON50
2078B055m12k19j26N80q5l72o50O24M22L6q09l1K68l6m04j93O05J80m67j60k87
2099E19J40K29K57k74j08j70J63l9n3k6M7J15o92j80P36K2k20n35k6J004l25n56
2121B8l60P03M61l56m6l43k78j42L71O12k7r5o66j93lK31O93R3n30n72l9R99M
2144E45k22m20K80j92l31K22P34j41p01lO31K28p00l51L50M10K4J6n3j34J58K2
2166C72j70m59l3M72N49o95n85N46M61l97k45K44N67k81r75k58R02Q95j131l47
$$ plain form
2013 -411 -417 -744 -697 -741 -73 -368 -864 -742 -126 -55 -462 -532 443 957 181 -42 9 679 593 289 -18 457 514
2036 514 1049 866 1009 1083 1286 996 860 1049 1126 1298 1194 660 1412 2074 2208 1197 1187 1825 1905 1497 1048
2057 1048 1583 1715 1520 1332 1761 2260 1999 1663 1501 1705 1899 1708 1598 1490 1428 1644 1917 2097 1499 1505 2055
2078 2055 1643 1424 1298 1878 1793 1421 771 1395 1817 1853 1044 1013 1281 1245 841 648 1253 1433 966 806 519
2099 519 659 888 1145 871 763 593 756 717 664 638 685 800 108 -72 664 686 466 -69 -95 909 584 28
2121 28 -332 371 832 476 430 87 -191 -333 38 650 623 528 -138 -331 -334 -103 590 683 153 -419 -458 541 545
2144 545 323 -97 183 -9 -340 -118 616 475 -226 -229 402 630 -70 -421 -71 339 363 379 326 192 350 372
2166 372 202 -257 -290 182 731 36 -549 -3 458 61 -184 60 627 346 -629 -887 15 910 -221 -568
2186e68k52J156l99L23l70l81j72J04N87m89n86l15P21P31o21J12n4p90j30K68
2206a125Q20Qj252n98R97K79J45L8k08r4o51m43P15M50m37n50j51P65M8Q6j1l55
2228a524j35j6L25j51n67r4M70M56j96k74L48j16k19j9J30k00j90RM68N36q25
2249a784P5J54Q29o94m55J3M30J68k42R2M21Nl53l3J75K87J93o14l22j6L86J018
2271b67K34j021l82R12R12l26j119j87M71K13J15J69M29n44j63L1P56M24o99o59
2291g01j11N22K46M78OJ67m08R6P5n1N0k92m8K74m26O84K95k52m70M82O83l03
2313I96m76q03M44Q99m17n46J45M47L61j19K3o61K68L64j49n09j16M64L19k56
2333F78k4M4K8Ko50LO21M65r18j50KJ021K99m02l46M2l44L17j94L37o79j75L83
$$ plain form
2186 -568 -820 336 -63 260 -110 -491 -663 -559 28 -461 -1047 -1362 -641 90 -531 -419 -473 -1263 -1393 -1125
2206 -1125 -305 -297 -1549 -2147 -1150 -871 -726 -688 -896 -990 -1641 -2084 -1369 -919 -1356 -1906 -2057 -1292 -1244 -1158 -1169 -1524
2228 -1524 -1659 -1675 -1350 -1501 -2068 -2162 -1692 -1236 -1432 -1706 -1358 -1474 -1693 -1712 -1582 -1782 -1972 -1963 -1495 -959 -1784
2249 -1784 -1709 -1555 -726 -1420 -1875 -1862 -1432 -1264 -1506 -1414 -993 -988 -1341 -1374 -1199 -912 -719 -1333 -1655 -1671 -1285 -267
2271 -267 -33 -1054 -1436 -524 388 62 -1057 -1244 -773 -560 -445 -276 153 -391 -554 -523 233 657 -42 -701
2291 -701 -812 -290 -44 434 440 607 199 295 370 319 369 77 29 303 -123 561 856 604 134 616 1299 996
2313 996 520 -283 161 1060 643 97 242 689 1050 931 954 293 561 925 776 267 151 615 934 678
2333 678 654 698 726 728 78 81 702 1167 249 99 101 1122 1421 1019 673 715 371 688 494 831 152 -23 360
2356C60Q0Q53n07k37l76mK37P03o52k52J73K41M90p96J45K61L11o43j53P4P20
2377A028l69j36j72K40L96p8k81j76L2N31j37m89K25j08L45q2j18O1L97j22l25
2398F62K44R3L31m63j01K54n2j2O9l31N44j88L0k38K44J71j83j14k09J98K59k39
2420I69k39J63J19Q6o6j75r7M18j43n37l03P06J09k18o43L98J56P9k78l74M80
2441F10K1k27l23M1N25m07p2m6J08K78kl82m98J15M22j32m35K18J51N8j38j42
2463b57N6j6k57o56P0O85K13k04m79K1J88Q5J94m83j93M7K67o5j01nM6l22j05
2486a271L10J55l42q8o95L72O0L07o2Pj37K90J08j7l59r2j68l68J23M85L57p6
2508a101j07k55J35J46j32J95m19J00j75L02mK97n0j39j09N9J95J63m66K7Q0K70
$$ plain form
2356 360 440 1293 786 549 173 169 406 1109 457 205 378 619 1109 313 458 719 1030 387 234 308 1028
2377 1028 659 523 351 591 987 909 628 452 484 1015 878 389 614 506 851 769 651 712 1109 987 662
2398 662 906 999 1330 867 766 1020 968 956 1025 694 1238 1050 1080 842 1086 1257 1074 960 751 949 1208 969
2420 969 730 893 1012 1098 1032 857 760 1178 1035 498 195 901 1010 792 149 547 703 782 504 130 610
2441 610 631 404 81 122 647 240 168 122 230 508 506 124 -374 -259 163 31 -404 -186 -35 23 -115 -257
2463 -257 -201 -217 -474 -1130 -1060 -375 -162 -366 -845 -824 -636 -551 -357 -840 -1033 -986 -719 -784 -885 -890 -844 -1166 -1271
2486 -1271 -961 -806 -1148 -1236 -1931 -1559 -1499 -1192 -1254 -1247 -1384 -1094 -986 -1003 -1362 -1454 -1622 -1990 -1867 -1382 -1025 -1101
2508 -1101 -1208 -1463 -1328 -1182 -1314 -1119 -1538 -1438 -1613 -1311 -1315 -1018 -1068 -1207 -1316 -1257 -1062 -899 -1365 -1338 -1258 -988
2530i88j50L35L10L8j72j63j95K93L51jo41r6N10M46nk41%k00K93m04K38N9j2
2553c95k29n5M84Q73k22l53l69L77k10L68j71J30k40N3K45J76K95J69p27l02L06
2574B03N24J20l36n49L37K84L64l52J59j6J31n03J24q9M71l1l62j44M56L66k60
2595H97q0J12k72Prj09M44K78m56m1j2L73J55j29l71m3j6R8K9J22M4k73K46k78
2619G16J50L21j10k95m06M84J64J67k78k71L61L51l15m02Q8l48N34m23K93J37
2639I18qJ18k53R3L63k60k44k09N0p1L51q4M8j37J14k82%K07L68j21j84l44K5
2662D58L04O4L1r4j71K44J98l93J59P2L44n33m00J18M36K20m74j47j37N68j02
2683G65j93l44L34oj9M9L9K24l20j06j80M04p0K44l42O5q0k00n7K34M1mk79j22
$$ plain form
2530 -988 -1138 -803 -493 -455 -627 -790 -985 -692 -341 -342 -983 -1079 -569 -123 -128 -369 -369 -569 -276 -680 -442 -383 -395
2553 -395 -624 -679 -195 678 456 103 -266 111 -99 269 98 228 -12 41 286 462 757 926 199 -103 203
2574 203 727 847 511 -38 299 583 947 595 754 738 869 366 490 401 872 841 479 335 791 1157 897
2595 897 817 929 657 664 655 546 990 1268 812 771 759 1132 1287 1158 787 744 728 826 855 977 1021 748 994 716
2619 716 866 1187 1077 782 376 860 1024 1191 913 642 1003 1354 1039 637 725 377 911 488 781 918
2639 918 910 1028 775 868 1231 971 727 518 568 497 848 764 812 675 789 507 507 714 1082 961 777 433 458
2662 458 762 826 857 763 592 836 1034 641 800 872 1216 683 283 401 837 1057 583 436 299 867 765
2683 765 572 228 562 556 537 586 625 849 529 423 243 647 577 821 479 544 464 264 207 441 482 478 199 77
2707G7j22M55k08j2l67L81J32Qn82k87M16L66J52o75mK79k25j27m58N02L45l33
2729b87m92N19K5L45j25l40j84k61k0j3J66R7j63J46k38P8K20j69K44k77j28j58
2751a015L81p35J15P85m5l45j20K89k44j40k55J48M22q1j03n7lR5J79l05K4k76
2773a286M58j74j83lL33L5mM1P4J2K25p10l00P65lp14J45O82j83n7j36K65K11
2796e07m19J71j90O3MK96o2k53R6M39R1j82n25J69N11j62m83JN43L10j96j71N38
2819H2l70Np22O55o0R8l4p8J23J70J4J97K16o97K13K98p2m60K60L79J29m02K1
2842c5Q9j14K32j96J18o3o7n58R37M7J64j45j07K0j2k13j31J55m8k1M82mk83M9
2866B96J77j22J31P8K86m79m44K69L03P67m21o17K45M62k85m22K77L3r7J5K51
$$ plain form
2707 77 -45 410 202 190 -177 204 336 344 -238 -525 -109 257 409 -266 -270 9 -216 -343 -801 -299 46 -287
2729 -287 -779 -260 -235 110 -15 -355 -539 -800 -820 -833 -667 -570 -733 -587 -825 -747 -527 -696 -452 -729 -857 -1015
2751 -1015 -634 -1369 -1254 -469 -514 -859 -979 -690 -934 -1074 -1329 -1181 -759 -840 -943 -1000 -1003 -908 -729 -1034 -1010 -1286
2773 -1286 -828 -1002 -1185 -1188 -855 -820 -824 -783 -709 -697 -472 -1182 -1482 -717 -720 -1434 -1289 -607 -790 -847 -983 -718 -507
2796 -507 -926 -755 -945 -882 -878 -582 -644 -897 -801 -362 -271 -453 -978 -809 -298 -460 -943 -942 -399 -89 -285 -456 82
2819 82 -288 -283 -1005 -350 -410 -312 -346 -424 -301 -131 -117 80 296 -401 -188 110 38 -422 -162 217 346 -56 -35
2842 -35 54 -60 172 -24 94 31 -36 -594 343 390 554 409 302 322 310 97 -34 121 73 52 534 530 247 296
2866 296 473 351 482 560 846 367 -77 192 495 1262 841 224 469 931 646 224 501 534 437 452 703
2887G03j1N1j14J87OR3k57J59k42O3L21m24N65j70l00M37j01q0p3j42Q0k62J36
2910F25j26L64k9j21M7Q8k37q8q0K26K60j64r0JJ42J44j20L10m04j38l76L35L20
2933H89J97k93k23M9J53j5K71n25Jk24N82j1k23k79R5j1J29J29P0k55j51j86L14
2956D83J48l3n7k66j52L75J54j26m28r5J77K23k68j28J71j9L03k94j33J23k00
2977d2PK13j28L42k85m25L10k48K33J14l87k9K03p4M9l33j5P1N6L8l79j99L35
3000e73J87k68J07J06l76R1m8J79L40m26m42j66L82L71k28q5j84K66l8m4q7R8
3022h38j60j99L09j03j20L29l30k85L46J44J05q30J73K48P6N8n6J43j62N2q3J41
3044a042j97J09j84j34K37M07n3k93k2K58K75k90j29k82R3L61P3j19lJ56J44J25
$$ plain form
2887 703 692 743 629 816 822 915 658 817 575 638 959 535 1100 930 630 1067 966 886 813 671 751 489 625
2910 625 499 863 834 713 760 848 611 523 443 669 929 765 675 676 818 962 842 1152 748 610 234 569 889
2933 889 1086 793 570 619 772 757 1028 503 504 280 862 851 628 349 444 433 562 691 761 506 355 169 483
2956 483 631 598 541 275 123 498 652 526 98 3 180 403 135 7 178 159 462 168 35 158 -42
2977 -42 -35 178 50 392 107 -318 -8 -256 -23 91 -296 -325 -122 -196 -147 -480 -495 -424 -368 -330 -709 -908 -573
3000 -573 -386 -654 -547 -441 -817 -726 -774 -595 -255 -681 -1123 -1289 -907 -536 -764 -849 -1033 -767 -805 -849 -936 -838
3022 -838 -998 -1197 -888 -991 -1111 -782 -1112 -1397 -1051 -907 -802 -1632 -1459 -1211 -1135 -1077 -1133 -990 -1152 -1100 -1183 -1042
3044 -1042 -1239 -1130 -1314 -1448 -1211 -804 -857 -1150 -1172 -914 -639 -929 -1058 -1340 -1247 -886 -813 -932 -935 -779 -635 -510
3066e10k67q1K28L2l50m7K81L86m73J01K04K14k7l34LJ98J00k56J88R2p1L14L04
3089B29o69M26j03l46K72k1J77j47J79j37O4N1O9k60K84l90L35j97k9M17l23M3
3111g6N5L42k75k9J03k7k39M7J89rJk35P7K64j3N7j04L30k76j51J54k17M08J2
3135C88l26N2L02j26j35K22K82k02m06K93k14J05L03j35k0J3K7j32l6q0J97jr8
3158B73K1k09M44J87n11r7L44K41j01K0k44r4L33o1L6J58K0k58l49L87M95n96
3180D39K49k49J22J07M32j92l85L81n4Ql29J00J74l38L32J45J0k70K54k37L0k50
3202D79N48l24l52M47L0j90L0k1M85j96j95j47k36L75l5J63j63J31K51k19j4k92
3224E55K14m6q1k49J83J12m26J38n4J20K21j33j36j89L10Ko8Q3m59K82p7N6k87
$$ plain form
3066 -510 -777 -858 -630 -598 -948 -995 -714 -328 -801 -700 -496 -282 -309 -643 -640 -442 -342 -598 -410 -318 -389 -75 229
3089 229 -440 -14 -117 -463 -191 -212 -35 -182 -3 -140 -76 -25 44 -216 68 -322 13 -184 -213 204 -119 -76
3111 -76 -21 321 46 17 120 93 -146 -99 90 81 82 -153 -76 188 175 232 128 458 182 31 185 -32 376 388
3135 388 62 114 416 290 155 377 659 457 51 344 130 235 538 403 383 396 423 291 255 175 372 371 273
3158 273 294 85 529 716 205 108 452 693 592 612 368 274 607 546 582 740 760 502 153 540 1035 439
3180 439 688 439 561 668 1100 908 523 904 850 858 529 629 803 465 797 942 952 682 936 699 729 479
3202 479 1027 703 351 798 828 638 668 647 1132 936 741 594 358 733 698 861 698 829 1080 861 847 555
3224 555 769 723 642 393 576 688 262 400 346 466 687 554 418 229 539 541 473 556 97 379 302 358 71
3247G1M53o8p1n18J68L51p7o1k96k11J11Q8J10Q1m27K91m02J27K53j86J07k35
3269c41j40K64q8J81j75j01j60L65l40K35k04J09j42QM8n1J15k92O2J66K06n1
3291c26o81J46N27l09J8k22J14o2J1L5K49l14L22k88K33k10J52K2J20j74k9J29
3313e37j91j42K01p4N34o60j10L38K56NN8l36K66k66M1J47j48J30K05k33j18L46
3335b88r7N7k1j47j20K95m6%j89N4K65J34k65o7N0K74k79k57M34J22k16n2K16
3358a43R0j77k7O2j47R2L27k62j18K91l11J65n67K54K48K71j05p7k92M09L55o14
3380b76q5K33k10k88J89K72l7k5m36J22K75K14l35qJ74J48j6N1J35m61M73m50
3402c41L39j03j89L07J52k77r1L73k53K93k07O0K5q4k11M12M1J48n43QJ45K81
$$ plain form
3247 71 524 456 385 -133 35 386 309 248 -48 -259 -148 -60 50 131 -296 -5 -407 -280 -27 -213 -106 -341
3269 -341 -481 -217 -305 -124 -299 -400 -560 -195 -535 -300 -504 -395 -537 -529 -481 -532 -417 -709 -647 -481 -275 -326
3291 -326 -1007 -861 -334 -643 -625 -847 -733 -795 -784 -749 -500 -814 -492 -780 -547 -757 -605 -583 -463 -637 -666 -537
3313 -537 -728 -870 -669 -743 -209 -869 -979 -641 -385 -380 -322 -658 -392 -658 -617 -470 -618 -488 -283 -516 -634 -288
3335 -288 -385 -328 -349 -496 -616 -321 -367 -367 -556 -502 -237 -103 -368 -435 -385 -111 -390 -647 -213 -91 -307 -359 -143
3358 -143 -53 -230 -257 -195 -342 -250 77 -185 -303 -12 -323 -158 -725 -471 -223 48 -57 -134 -426 -17 338 -276
3380 -276 -361 -128 -338 -626 -437 -165 -202 -227 -663 -541 -266 -52 -387 -395 -221 -73 -89 -38 97 -364 109 -341
3402 -341 -2 -105 -294 13 165 -112 -203 170 -83 210 3 63 88 4 -207 205 246 394 -149 -141 4 285
3424B85J47l92N91k61q5M61m86J44J40j70K51j55M4j60l6K77j59L01j52J06n86
3445A05L80J49L9Jk41L20k20nm3K31J30K94n52J19J49m30K02K50m05n2K66K13
3467I00j41p6j93J80n2K56k19J84r9k73L88K59m03l1J79k10R6k04K42j05J51l65
3489D64J00k6J43q7j91K02K32k29j69J4N7k1Q5l2j30l53j25N43j49l71q2O34k16
3512B93o6qO8J28k87j48kr4J78J18j78j04O8j73L62j55m05M71k4p0j84o3q7J75
3536a87j08j75N84p3k15m48J83K35j46l13J11M24k49r4k64N80k20L09J32k81m09
3557f24OK51L19M2m45K24l32N4K84L31m72k16K2M14o5l61L28M0j48M07o63L95
3579b09n4L81p00K28J14lM0j62K19l7J90n1j76j30J82K4J59j73L91l55J51k14
$$ plain form
3424 285 432 40 631 370 285 746 260 404 544 374 625 470 514 354 318 595 436 737 585 691 105
3445 105 485 634 673 674 433 753 533 528 485 716 846 1140 588 707 856 426 628 878 473 421 687 900
3467 900 759 683 490 670 618 874 655 839 740 467 855 1114 711 680 859 649 745 541 783 678 829 464
3489 464 564 538 681 594 403 605 837 608 439 453 510 489 574 542 412 59 -66 477 328 -43 -125 509 293
3512 293 227 219 287 415 128 -20 -22 -116 62 180 2 -102 -34 -207 155 0 -405 66 42 -28 -212 -275 -362 -187
3536 -187 -295 -470 114 41 -174 -622 -439 -204 -350 -663 -552 -128 -377 -471 -735 -155 -375 -66 66 -215 -624
3557 -624 -618 -367 -48 -6 -451 -227 -559 -505 -221 110 -362 -578 -556 -142 -207 -568 -240 -200 -348 59 -604 -209
3579 -209 -263 118 -582 -354 -240 -243 -203 -365 -146 -183 7 -44 -220 -350 -168 -144 15 -158 233 -122 29 -185
3601a85p8J22J44J15l19k13M62J25j88k30R6J32k33J67k9j34J75J02J0j84m00
3622e43M70K49k64j42K50J76j50n6L13k97k98J1L82j4M5l56j72J07K14k39K48
3643f6j77n9P9PP5Q3P9m13J21l9J26J31j27n28N05k56K76K37l36l47K16P7Q4J42
3667a10j23M09o12K95n7N4K01k36j32L48m23K33J28m25M90k85J06j66J93pO7J21
3689F9k80M06j7Mq5J00j63L26o1J88n0L9n47R9J74L33j66J23j33j81L69n2p0N7
3713D82q8k69O3O17O6o57K29m9j35K31K75m66J18j18q6L77k14j71L30k81K33J57
3735F44l3j92J74l47K02O3R7k3p7J88j51j67L33j55j90J30j08Q4l19O3J05J70
3757D91k02j47K08n6K51l84K53j41k03K18Kj13K23k91J40l01K63kJ7l08M0K57
$$ plain form
3601 -185 -263 -141 3 118 -201 -414 48 173 -15 -245 -149 -17 -250 -83 -112 -246 -71 31 41 -143 -543
3622 -543 -73 176 -88 -230 20 196 46 -10 303 6 -292 -281 101 87 132 -224 -396 -289 -75 -314 -66
3643 -66 -243 -302 -223 -216 -141 -58 21 -392 -271 -310 -184 -53 -180 -708 -203 -459 -183 54 -282 -629 -413 -336 -252 -110
3667 -110 -233 176 -436 -141 -198 -144 57 -179 -311 37 -386 -153 -25 -450 40 -245 -139 -305 -112 -119 -52 69
3689 69 -211 195 178 182 97 197 34 360 299 487 437 476 -71 28 202 535 369 492 359 178 547 495 425 482
3713 482 394 125 188 805 871 214 443 394 259 490 765 299 417 299 213 590 376 205 535 254 487 644
3735 644 611 419 593 246 448 511 608 585 508 696 545 378 711 556 366 496 388 472 153 216 321 491
3757 491 289 142 350 294 545 161 414 273 70 288 290 177 400 109 249 -52 211 209 226 -82 -42 215
3779B15j70K63j90J42j37j84N3K24O9l6m14K88k63L08k02j9k01j20M01j2j30R7
3801a8j72J10k40O1J75o6p6m6J60p2O9k99L66k75K91k40J22m02M9L63k61L52l30
3824c79L73k43lK3l9J00Q5k20q8K69Q9j47R3l41K32K7j36J42K3L5m49J67o2J21
3848c28K93q5j57P4OnM3k25J85J80l38J5J91pj63J55m03J71J61O0k80L95j11J41
3872c2k59j55L65o2l9k10j20L81k31j44j09L40J98J00m61N9N2j79M14m33J49j28
3894e04J11J69j06K50J6k05j52j52J50K1J19l07K05J52j99R8R5k76J1P1l8LJ05
3917c63Q9J08j36k60K52K30p2k66J71ML9j16N3Q2Jj36M28J7m92K03j64L5J62o0
3941a91P9l49M15L7J56j19k5j77L83l90P6j50M11j27r1L4K25J69n64L72l61K91
$$ plain form
3779 215 45 308 118 260 123 -61 -8 216 285 249 -165 123 -140 168 -34 -53 -254 -374 27 15 -115 -18
3801 -18 -190 -80 -320 -259 -84 -150 -226 -272 -112 -184 -115 -414 -48 -323 -32 -272 -150 -552 -503 -140 -401 -49 -379
3824 -379 -6 -249 -252 -229 -268 -168 -83 -303 -391 -122 -33 -180 -87 -428 -196 -169 -305 -163 -140 -105 -554 -387 -449 -328
3848 -328 -35 -120 -277 -203 -197 -202 -159 -384 -199 -19 -357 -342 -151 -158 -321 -166 -569 -398 -237 -177 -457 -62 -173 -32
3872 -32 -291 -446 -81 -143 -182 -392 -512 -131 -362 -506 -615 -275 -77 23 -438 -379 -327 -506 -92 -525 -376 -504
3894 -504 -393 -224 -330 -80 -64 -269 -421 -573 -423 -402 -283 -590 -385 -233 -432 -334 -239 -515 -504 -433 -471 -468 -363
3917 -363 -274 -166 -302 -562 -310 -80 -152 -418 -247 -243 -204 -320 -267 -185 -184 -320 108 125 -367 -164 -328 -293 -131 -191
3941 -191 -112 -461 -46 -9 147 28 3 -174 209 -181 -105 -255 156 29 -62 -28 197 366 -198 174 -187 104
3963A04J58o1L20l86K64qm5k5j57K76k26J15J6l02O53J6l38r1K05k05J47l17L34
3986D47j2j22j43M1M36l84L09k3o0l65J59J50J31J98k74Po5K62j68j68j40K30
4008D46j99M93k05j16QK3n7m3N1q7oo6k01M59l0p8Q8m86M01m4J41l22J97k59q5
4033B3L39k28k28N16k17J43l1k49J63k66M7k01K74J02j27j69N11k00l87Q2J76
4054G3K66j14j68j71K06N2k31M9J54j26M85m98Q2r0J4P0l12L42J0j98lK5L5k75
4078c23K97J42k29M4n8O4m88N71j10r2P8j66j85K74J73k02J04mK23p67N31J25
4100Br2Q8l4o5K34r2O9k90O8L04j61k47m4k33K22M44k26m2q9l3J92l16K81L9j54
4125a75j12J15j96J51J84j31j71J27j0J89k61n4O27l77k27n7j29J14K27k91K07
$$ plain form
3963 104 262 201 521 135 399 391 346 321 164 440 214 329 345 43 696 712 374 283 488 283 430 113 447
3986 447 435 313 170 211 647 263 572 549 489 124 283 433 564 762 488 495 430 692 524 356 216 446
4008 446 247 740 535 419 427 450 393 350 401 314 308 242 41 500 470 392 480 -6 395 351 492 170 367 108 23
4033 23 362 134 -94 422 205 348 317 68 231 -35 12 -189 85 187 60 -109 402 202 -185 -103 73
4054 73 339 225 57 -114 92 144 -87 -38 116 -10 475 -23 59 -31 -17 53 -259 83 93 -105 -108 -83 -48 -323
4078 -323 -26 116 -113 -69 -127 -63 -551 20 -90 -182 -104 -270 -455 -181 -8 -210 -106 -110 113 -654 -123 2
4100 2 -90 -2 -36 -101 133 41 110 -180 -112 192 31 -216 -260 -493 -271 173 -53 -95 -184 -217 -25 -341 -60 -21 -175
4125 -175 -287 -172 -368 -217 -33 -164 -335 -208 -218 -29 -290 -344 283 -94 -321 -378 -507 -393 -166 -457 -250
4146b50oK82k83j14K22J4j95j64K08j40J71oo1k41Q6L53m9j90l38N43l61K21n3
4169c51M2M0q6l8n72Q08m03K62j69J71O1j01p7R5O9j27j51L60k96L45j25j19J04
4192b58J43J0r9J27j4j85j02L92m37J51J02J21l30J50j81nO12j30j95L04k31j16
4214a71k0R8J68j08l9J02k77M38k95J45m9N5Q4N5j68J3J22j2J33N1q3L9P5j58
4238A98j50K4K79l12r3M16q9j75K88k16k0j36M92l60n1K91k9j94L35j68J3Q0j
4261D22j66L3J92j9n1j29J02M1j23J97j89M4j8K8K2o8j59N8J01k18O05n78P6M6
4285B49k01L00L4l72M14Q8l2j19J07k88K50K15j97l52R9o0J26J63k3j5j45j32
4307A09P0L49j00J24l58l8m3K5N00o41J54M01m29Pp9J50k90J31Q3K33j13M7j49
$$ plain form
4146 -250 -256 26 -257 -371 -149 -135 -330 -494 -286 -426 -255 -261 -322 -563 -477 -124 -173 -363 -701 -158 -519 -298 -351
4169 -351 -309 -269 -355 -393 -965 -157 -560 -298 -467 -296 -235 -336 -413 -318 -249 -376 -527 -167 -463 -118 -243 -362 -258
4192 -258 -115 -105 -204 -77 -91 -276 -378 14 -423 -272 -170 -49 -379 -229 -410 -415 197 67 -128 176 -55 -171
4214 -171 -191 -93 75 -33 -72 30 -247 191 -104 41 -8 47 131 186 18 31 153 141 274 325 242 281 356 198
4238 198 48 72 351 39 -54 362 273 98 386 170 150 14 506 146 95 386 357 163 498 330 343 423 422
4261 422 256 289 481 462 411 282 384 425 302 499 310 354 336 364 386 318 159 217 318 100 705 127 203 249
4285 249 48 348 382 10 424 512 480 361 468 180 430 645 448 96 195 135 261 424 401 386 241 109
4307 109 179 528 428 552 194 156 113 138 638 -3 151 552 123 130 51 201 -89 42 125 358 245 292 143
4330A43K8N9J38k21P2J77m0r3j48J67J4r4k79J97J07j82L09p1k35K02k8j93j9
4353A0p6j90L39j31J60k05R1m7j21P9L64j96m67N82l10K63Pq6l40L66M8k86J16
4376c0m56M05j07K55p1k20l79O31jJ9o3n7k14j68J04M0N0J07r9lM7J11K2k60n1
4401c88N03o9m70j9Pn7M21k52o0J9k4k7K65j93J05M8l98j02L52K64k69k64L60
4424b48l2j33J5j29L71l26n8j99L40j7j38M17N8j55NP4m28M5L71k34l7K47l66
4447e57K11k57M48l12L52k36J77q8J38mm5l39K44K08k60J9J35l65N81k36N7j07
4469b36J47j68N5J00k34K92o8O8rK84n37K83m5K64j15J7l13R1J81M2K25p8J79
4492D25o18L10J18j14J44k17m4K35l83K72J44Q6j34m5j77J10L2O6k04L28k45j3
$$ plain form
4330 143 171 230 368 147 219 396 356 263 115 282 296 202 -77 120 227 45 354 283 48 250 222 29 10
4353 10 -66 -256 83 -48 112 -93 -2 -49 -170 -91 273 77 -390 192 -118 145 152 66 -274 92 140 -146 -30
4376 -30 -486 -81 -188 67 -4 -224 -603 28 27 46 -17 -74 -288 -456 -352 -312 -262 -155 -254 -257 -210 -99 -77 -337 -388
4401 -388 115 46 -424 -443 -436 -493 -72 -324 -384 -365 -389 -416 -151 -344 -239 -191 -589 -691 -339 -75 -344 -608 -248
4424 -248 -280 -413 -398 -527 -156 -482 -540 -739 -399 -416 -554 -137 -79 -234 -229 -155 -583 -538 -167 -401 -438 -191 -557
4447 -557 -346 -603 -155 -467 -115 -351 -174 -262 -124 -128 -173 -512 -268 -60 -320 -301 -166 -531 50 -186 -129 -236
4469 -236 -89 -257 -202 -102 -336 -44 -112 -44 -53 231 -306 -23 -68 196 81 98 -215 -124 57 99 324 246 425
4492 425 -193 117 235 121 265 48 4 239 -144 128 272 358 224 179 2 112 144 210 6 334 89 76
4514G6L24q4M1k61M9O3l4M32j86l44L00j98K93n5k41k99L97J89k49j12J05p7K0
4537A49j45L04L8K06m38K2K20k17R2r5J17J20j24n2O3K05j27j69j68K17O0Ok0
4560B64J6k7j01n5J19PLO1j01k30L71K9m8q8j6K2j47J36o8J09J13n25M70l25N51
4585E40k19k13K34l13K79m42J34L30k85K09l12J46K52k93J83k04r9K59J01j47
4605A40K24j9k27k86L66j41PK49j74j57M0J43j6K3k84J5K73J27l35J22O2j3K27
4628C66k37k25R9L88k70q5k54L52k4J55m76KK83l4k54J41K21m53J88L36k50k5
4650e6q5L03k31J38O9m22J93k19J59R5r6j74mJ53J91j10j49Q4l85L08J38m30K52
4673b78k05M0K16j55L51m05O2K06M1j69J88J33k85J1n3k65O9j24L68N8j75Q9L9
$$ plain form
4514 76 400 316 357 96 145 208 174 606 420 76 376 178 471 416 175 -124 273 462 213 101 206 129 149
4537 149 4 308 346 552 114 136 356 139 231 136 253 373 249 197 260 465 338 169 1 218 278 284 264
4560 264 280 253 152 97 216 223 226 287 186 -44 327 356 308 220 204 226 79 215 147 256 369 -156 314 -11 540
4585 540 321 108 342 29 308 -134 0 330 45 254 -58 88 340 47 230 26 -73 186 287 140
4605 140 364 345 118 -168 198 57 64 313 139 -18 22 165 149 172 -112 -97 176 303 -32 90 152 139 366
4628 366 129 -96 3 391 121 36 -218 134 110 265 -211 -209 74 40 -214 -73 148 -305 -117 219 -31 -56
4650 -56 -141 162 -69 69 138 -284 -91 -310 -151 -56 -152 -326 -330 -177 14 -96 -245 -161 -546 -238 -100 -530 -278
4673 -278 -483 -443 -227 -382 -31 -436 -374 -168 -127 -296 -108 25 -260 -249 -302 -567 -498 -622 -254 -196 -371 -282 -243
4696b43l19j15N05k12J0K17l98L86j92Qk8k61J40J29L93k43J58K5j83l08P9M19
4718c3j26j80O4j94K63k06J55K82k76p2J94p1l1J23n9r7K0R6R3K3k96N7J02J49
4742b0om2j26KK57J8n9j85L5J93L0j06J33k64J00M23l79K3j62J50j51K75m6j09
4766a6K34j54j89J91k68K60j7l24M93R2k04N1O3j44J43j26J53j13J8J83m33K58
4788A51K13j73j58k13N39l50J84j83P1l2Q2L9M5j76J95k45l5J71K1L20k99q5L2
4811A14j46L50k20p4K14P0j71K85K7k36p3J40j14J2k88L51k2L1N2J0o7k26K73
4834B92k76J02r6J41J46J77m27K82K6j39J10J02j47j97N8K62k60l0j05Q6R3M3
4856B43j05L8J86k92j14K8J82R6k8j91K37K30l81Q3j5l32N16j42j32o3L09k99
$$ plain form
4696 -243 -562 -677 -172 -384 -374 -157 -555 -169 -361 -353 -381 -642 -502 -373 20 -223 -65 -40 -223 -531 -452 -33
4718 -33 -159 -339 -275 -469 -206 -412 -257 25 -251 -323 -129 -200 -231 -108 -167 -264 -244 -148 -55 -32 -328 -271 -169 -20
4742 -20 -26 -68 -194 -192 65 83 24 -161 -126 67 97 -9 124 -140 -40 383 4 27 -135 15 -136 139 93 -16
4766 -16 218 64 -125 66 -202 58 41 -283 210 302 98 149 212 68 211 85 238 125 143 326 -107 151
4788 151 364 191 33 -180 359 9 193 10 81 49 131 170 215 39 234 -11 -46 125 146 466 167 82 114
4811 114 -32 318 98 24 238 308 137 422 449 213 140 280 166 178 -110 241 219 250 302 312 245 19 292
4834 292 16 118 22 163 309 486 59 341 367 228 338 440 293 96 154 416 156 126 21 107 200 243
4856 243 138 176 362 70 -44 -16 166 262 234 43 280 510 129 212 197 -135 381 239 107 44 353 54
4878E4L51J70l43q2o0K86l43oM06j50m19L68m4j1j6M4J7J55k38j57q1J83O0k23
4902g9J86lK24l94J06k04P1K90j13o2n2K20k0k07K69j05r6J21j22j12J53l72J14
4925a87k0J2K78p9j43jL07m71J63l33J35L79l04K94l25O4r8K23M7m1p9k6k08j7
4949d30J93P1l1R1j77m4M9k60L27j27J20k64o2J28L08m7j31o4j96K42P2J24k20
4972c28K11P3j86J78m0p6j74M8k53J76M61m42R9j00J57m4L25l66J59R3j3J34j10
4995a8J0j22k8J05r7P0J12Q4j79j76K66j73j27r9K29M3J3j10J07K8j35j74J83
5018a88J24RP7K19m63J78K95j62j79J0K31M6j70J78k88K46l46R9j4L46j36R2j20
5041H4N8J8j59J27J1R8k26K32k44R5J91k80M8j13P2J68L3l93L8K32Q9l6j83J20
$$ plain form
4878 54 405 575 232 150 90 376 33 27 433 283 -136 232 188 177 161 205 222 377 139 -18 -99 84 144 -79
4902 -79 107 104 328 -66 40 -164 -93 197 84 22 -30 190 170 -37 232 127 31 152 30 -82 71 -301 -187
4925 -187 -207 -195 83 4 -139 -140 167 -304 -141 -474 -339 40 -264 30 -295 -231 -329 -106 -59 -100 -179 -205 -413 -430
4949 -430 -237 -166 -197 -106 -283 -327 -278 -538 -211 -338 -218 -482 -544 -416 -108 -155 -286 -350 -546 -304 -232 -108 -328
4972 -328 -117 -44 -230 -52 -92 -168 -342 -294 -547 -371 90 -352 -253 -353 -196 -240 85 -281 -122 -29 -42 92 -18
4995 -18 -8 -130 -158 -53 -150 -80 32 116 -63 -239 27 -146 -273 -372 -143 -100 -87 -197 -90 -62 -197 -371 -188
5018 -188 -64 -55 22 241 -222 -44 251 89 -90 -80 151 197 27 205 -83 163 -183 -84 -98 248 112 204 84
5041 84 142 160 1 128 139 237 11 243 -1 94 285 5 53 -60 12 180 213 -180 -142 90 179 143 -40 80
5065H0j41J78R6r1J13J93l24k36J94O0Nk89K80l76M26l03M69j82j29P8j60J03
5087D4qK79j74j00J69J26k61J96l65P5J49K17r4m92L64J01j00q1PK07m13K89o7
5110F8K31k27J59O3j25j0K56o4m3k89J16N7k57L03Q5k82p2R7K1K54j60J08k17
5133G2J77K32n34L13k0j34r0r4L83j28j93J14L30l2n0j36J82k75Mj97L02o8l68
5156b10M80j79O3r9L0L1j03R7J45j25j23K26J62k20j48N1M3N6J39l81K31Qj03
5179G1J00M2j88M5j9k12J47j20J02K5j04J55j61N7j6K26l4k45O7j04J7K09k74
5202b14O8J25k94K01l35M91p5k79P9l1R9k89K14k16N55k88M5n9J76j23j02J16
5224a36j10J50j91j7n4N1Q9m9J89l99K19J51k56l9l7J87J4K4j03j49J39k83K40
$$ plain form
5065 80 -61 117 213 122 235 428 104 -132 62 122 127 -162 118 -258 168 -135 334 152 23 101 -59 44
5087 44 36 315 141 41 210 336 75 271 -94 -19 130 347 253 -239 125 226 126 45 52 259 -154 135 68
5110 68 299 72 231 294 169 159 415 351 308 19 135 192 -65 238 323 41 -31 66 87 341 181 289 72
5133 72 249 481 -53 260 240 106 16 -78 305 177 -16 98 428 396 346 210 392 117 121 -76 226 158 -210
5156 -210 270 91 154 55 85 116 13 110 255 130 7 233 395 175 27 78 121 177 316 -65 166 174 71
5179 71 171 213 25 70 51 -161 -14 -134 -32 -7 -111 44 -117 -60 -76 150 116 -129 -62 -166 -149 60 -214
5202 -214 -146 -21 -315 -114 -449 42 -33 -312 -233 -264 -165 -454 -240 -456 99 -189 -144 -203 -27 -150 -252 -136
5224 -136 -246 -96 -287 -304 -358 -307 -218 -267 -78 -477 -258 -107 -363 -402 -439 -252 -238 -214 -317 -466 -327 -610 -370
5247c70%K46n2r6N5%O3K24k31q0j03J71J2j59N0K65Mo8K1l30K70P1J54j15l51
5272c49K76m9J38j06j26K37k61L06k42K67n8q9j40K17K5Q6l10R3Q4j9j88K16j68
5295a60QJ78k44Q1r2K17J19R8k49o7l11K89o1L73l64J05J06j1l12j0j06J38M0
5318b35J56j85L75l02K65p7J92m19K02j72L45j43M5J23j62l8k7j46R4L25J2k66
5340c8R3n9J36k30j34L85n34P17m22J09N7o0N2l4Q9r6k12L32o6J15r4k71J59j33
5364a39K94j48J92k18L23j27Rq5k47O40m20j90J50J02r2k34K26R2m0J50J79k30
5386A87K08j07k27N8Q5n8r2j53K13j07K24k43N56k79l6j07J51K41m36Q2oM65l61
5409B58j11L4o5M12m65M58j89j02k22K39j15L64k19k07L04m53K17L92o00J39o5
$$ plain form
5247 -370 -370 -124 -176 -272 -217 -217 -154 70 -161 -241 -344 -173 -161 -320 -270 -5 -1 -69 -48 -378 -108 -37 117 2 -349
5272 -349 -73 -122 16 -90 -216 21 -240 66 -176 91 33 -56 -196 21 46 132 -178 -85 -1 -20 -208 8 -160
5295 -160 -152 26 -218 -137 -229 -12 107 205 -44 -111 -422 -133 -194 179 -185 -80 26 15 -297 -307 -413 -275 -235
5318 -235 -79 -264 111 -191 74 -3 189 -230 -28 -200 145 2 47 170 8 -30 -57 -203 -109 216 228 -38
5340 -38 55 -4 132 -98 -232 153 -381 336 -86 23 80 20 72 38 127 31 -181 151 85 200 106 -165 -6 -139
5364 -139 155 7 199 -19 304 177 186 101 -146 494 74 -116 34 136 44 -190 36 128 88 238 417 187
5386 187 395 288 61 119 204 146 54 -99 114 7 231 -12 544 265 229 122 273 514 78 160 154 619 258
5409 258 147 181 116 528 63 521 332 230 8 247 132 496 277 70 374 -79 138 530 -70 69 4
5430DM05j27L3k91K03l25L54j47r1L5J08j52M08m08J12J78k98j89L47j15o6J22
5452A00j30J9J25j01M4n8o4J50m47K81J38j46n8J89j61L05j21k18J11J6jR2j74
5475a09J77P7k70K88k86m3j19J50q7K21k49K76n5J64lk40j46MK73j09k42K90j10
5498a48j94M06k79L7m0P1r7J15r9J05K7k7K72n46K91J17j99K06k68L02j78l3R9
5521f0r1P0K00l00k72L43O7K4r8N6K54l13j15K47k43K84j34j94K02L75j4l01j71
5544a84J40j02L71k33P9j93K30l4k14K1k14L64J20j39k23K28j06j8R1r7L98l61
5566g6k58N32j26r4j23J82j06r7m3j17L95l2q3k44L09j2l1j4k19M02k55L26j76
5589D0j52K15m16L13JP4j56R4j09Ok09J47J98l46J84J96l62K20N3j11J9J89J31
$$ plain form
5430 4 409 282 315 24 227 -98 256 109 18 53 161 9 417 9 121 299 1 -188 159 44 -22 100
5452 100 -30 -11 114 13 57 -1 -65 85 -362 -81 57 -89 -147 42 -119 186 65 -153 -42 -26 -27 65 -109
5475 -109 68 145 -125 163 -123 -166 -285 -135 -222 -1 -250 26 -29 135 132 -108 -254 -250 23 -86 -328 -38 -148
5498 -148 -342 64 -215 -178 -218 -147 -244 -129 -228 -123 -96 -123 149 -397 -106 11 -188 18 -250 52 -126 -159 -60
5521 -60 -151 -81 119 -181 -453 -110 -43 -19 -117 -61 193 -120 -235 12 -231 53 -81 -275 -73 302 288 -13 -184
5544 -184 -44 -146 225 -8 71 -122 108 74 -140 -119 -333 31 151 12 -211 17 -89 -107 -16 -113 285 -76
5566 -76 -334 198 72 -22 -145 37 -69 -166 -209 -326 69 37 -46 -290 19 7 -24 -38 -257 145 -110 216 40
5589 40 -112 103 -313 0 1 75 -81 13 -96 -90 -299 -152 46 -300 -116 80 -282 -62 -9 -120 -101 88 219
5612B19j10k82M77l23OL79k40o7n4P1j80L02l4j13k37K06J61m77J53K01N5J60
5634B73j79r9RO6K7J25Q8j2n7j48J14k61L52l26J44J20L6j62j31N7o8K72l3j47
5658F0K57j00J55q3J26k33j13M88n11K54k44L06j89j7M78k66j31m35M07q6J98
5679C21O2j57j58R4N6r9n8J17K10k26o7Q1J04j37m28N20j12l7j87J41j24Q0J05
5702A01Q7J43k86M0K8J54l64J56J54j30J00l46O30k01j61K01l72P4K33l4j92k92
5724b77J56J62k12N5Q7J02l53J27J6L3J65j61K34m03M98k06j12n4J37j93Q6Mm1
5747a50J91l37KK36L4rr6j47K98j99M0n3J96k78J94j38R5K17l29K05L0k8l4P4
5771A4j63K28o14K15J03j37Q0j6L43P9k33P5r8nJ62l80K14J81k56O5K37l58K76
$$ plain form
5612 219 109 -173 304 -19 -13 366 126 59 5 76 -104 198 164 51 -186 20 181 -296 -143 58 113 273
5634 273 94 -5 4 70 97 222 310 298 241 93 207 -54 298 -28 116 236 272 110 -21 36 -32 240 207 60
5658 60 317 217 372 289 415 182 69 557 46 300 56 362 173 156 634 368 237 -198 209 123 321
5679 321 383 226 68 162 218 119 61 178 388 162 95 176 280 143 -285 235 123 86 -101 40 -84 -4 101
5702 101 188 331 45 85 113 267 -97 59 213 83 183 -163 467 266 105 306 -66 8 241 207 15 -277
5724 -277 -121 41 -171 -116 -29 73 -280 -153 -137 -104 61 -100 134 -269 229 23 -89 -143 -6 -199 -113 -109 -150
5747 -150 41 -296 -294 -58 -24 -33 -129 -276 22 -177 -137 -190 6 -272 -78 -216 -121 96 -233 -28 2 -26 -60 14
5771 14 -149 79 -535 -320 -217 -354 -274 -290 53 132 -101 -26 -124 -129 33 -347 -133 48 -208 -143 94 -264 12
5794A2j03k09K55J73k35MJ8J12j00q7k05N99m22J57P7m10L98o5j72J89K56k54
5816a2k57K93o4l8K24o03L00J38Q3l74K40J06J1k16j76K67j6r4J40k14n5L88m4
5839B7k31K24k01l00M63j45m9J27l26M08j40Mn7R6N4k75M23m45L20O6l44Q5J99
5862a7p2K86m61K12p4L6N4n3K18P7j14j83J49M0l3j09N5k1J37q6jj31J63L00l38
5887C4j6k0J76o54N01J04Ll85J29L8M1Kl3O6J25n4K60P8k70K9q1K95l23j8N12
5912E39m57J53n8o8mj15K01j20J27P8m2j46N2L2o7J16k63L67j75M4J18j27J22
5935C07l52L24o9J69j33j02L07j66k0l7j45J73r0j5J32k79r6J03J3J37j41J05
5957A25J68m63M19o7O7r9m58L38k17L87m9j67M2l6k20L20M61j06q14L09K62M5
$$ plain form
5794 12 -91 -300 -45 128 -107 -103 -85 27 -73 -160 -365 234 -188 -31 46 -364 34 -31 -203 -14 242 -12
5816 -12 -269 24 -40 -78 146 -457 -157 -19 64 -310 -70 36 47 -169 -345 -78 -94 -188 -48 -262 -317 71 27
5839 27 -204 20 -181 -481 -18 -163 -212 -85 -411 -3 -143 -139 -196 -100 -46 -321 102 -343 -23 43 -301 -216 -17
5862 -17 -89 197 -264 -52 -126 -90 -36 -89 129 206 92 -91 58 98 65 -44 11 -10 127 41 40 -91 72 372 34
5887 34 18 -2 174 -480 21 125 128 -257 -128 -90 -49 -47 -80 -14 111 57 317 395 125 154 73 368 45 27 539
5912 539 82 235 177 109 105 -10 191 71 198 276 234 88 140 172 105 221 -42 325 150 194 312 185 307
5935 307 -45 279 210 379 246 144 451 285 265 228 83 256 166 151 283 4 -92 11 24 161 20 125
5957 125 293 -170 249 182 249 150 -308 30 -187 200 151 -16 26 -10 -230 90 551 445 -369 -60 202 247
5979B47k69J42j73J39q9K21j93l47J75J6J03l31L54j8j64J95q2K18l14p8J88k3
6001h3R7n3k9J60j42J80m1l24K47N0q6k52N03q2k34Q7J53l82j0J72r3M33j95k14
6025a38M5k49M84%k94j02j38N30j90J8L14k77m4k13L93k0j99Q4l18K29q9j04M32
6048A54q3k05m3j27K34K74l76J52j70K52j65j05j92K14P2O5j77k12M98p0O2l4
6070A8l26K65J09J7k80L06n22J78L00k46J17j7r8J66j27K13n13K63l4K52j43k1
6092a23n4J06M3j07J37j56q6M7J81j69J77k02O8J26Q7k24k88L40k50L34k23K82
6114D6j52j30M47l39m9L25l86J02q0k7J47N5p1q2k7L3O5K30M7j15j08m50M03j15
6138b31K84K6l20R4J91j16n6K04k33l3J56L7m5J99j68M75n41K64k67J87k6J00
$$ plain form
5979 247 -22 120 -53 86 -3 218 25 -322 -147 -131 -28 -359 -5 -23 -187 8 -74 144 -170 -248 -60 -83
6001 -83 14 -39 -68 92 -50 130 89 -235 12 62 -24 -276 227 145 -89 -2 151 -231 -241 -69 -162 271 76 -138
6025 -138 -93 -342 142 142 -152 -254 -392 138 -52 -34 280 3 -41 -254 139 119 -80 4 -314 -85 -174 -278 154
6048 154 71 -134 -177 -304 -70 204 -172 -20 -190 62 -103 -208 -400 -186 -114 -49 -226 -438 60 -10 52 18
6070 18 -308 -43 66 83 -197 109 -413 -235 65 -181 -64 -81 -179 -13 -140 73 -440 -177 -211 41 -102 -123
6092 -123 -177 -71 -28 -135 2 -154 -240 -193 -12 -181 -4 -206 -138 -12 75 -149 -437 -97 -347 -13 -236 46
6114 46 -106 -236 211 -128 -177 148 -238 -136 -216 -243 -96 -41 -112 -194 -221 -188 -123 107 154 39 -69 -519 -116 -231
6138 -231 53 79 -241 -147 44 -72 -128 76 -157 -190 -34 3 -42 157 -11 464 -77 187 -80 107 81 181
6160A81m05K39J78m8r3j32L66l33J30J8k28J66K37l09K67k7k42lL32m00L30j53
6182G1J8k9J91k59K18r4J58l05R2J64l8p5M29m78P6Q0j89M3N6N5j7L4n5J4j84
6207b4K11J20k60K90k41k9L12j18J34j35mj99J31j25Jj32K08J5jj25J48o0Jl25
6231b07K69rJ0j28M0J48R3o7j01M5L6K2j6r3P0L3r9n2j71K95l01M4L16k32k5n6
6257a36P7J09J50k73L75l69j40N0J6K81l85M14l55K87l8J28j87j32L63l00J48
6278H3j24Q5K59l60N5Oj07J73K12m41q5P0j14N08R4l21L18j08n5n07L81p2K1j5
6302d4N4j74k26M70p5j4o7M3l25N23j3j48M2j38R6k19K67l14L57l60K28r5L80
6325B48j53j01j22Q4R3N7k91m5L6o4K55K43m42R0J23k72K98R9j40K5P5P2m5p4
$$ plain form
6160 181 -224 15 193 145 52 -80 286 -47 83 101 -127 39 276 -33 234 207 -35 -38 294 -106 224 71
6182 71 89 60 251 -8 210 116 274 -31 61 225 187 112 541 63 139 219 30 73 129 184 167 201 146 160 -24
6207 -24 187 307 47 337 96 67 379 261 395 260 256 57 188 63 64 -68 140 155 154 29 177 117 118 -207
6231 -207 62 53 63 -65 -25 123 216 149 48 93 129 151 135 42 112 145 46 -6 -177 118 -183 -139 177 -55 -80 -136
6257 -136 -59 50 200 -73 302 -67 -207 -157 -141 140 -245 169 -186 101 63 191 4 -128 235 -65 83
6278 83 -41 44 303 -57 -2 4 -103 70 282 -159 -244 -174 -288 220 314 -7 311 203 148 -359 22 -50 -29 -44
6302 -44 10 -164 -390 80 5 -9 -76 -33 -358 165 152 4 46 -92 4 -215 52 -262 95 -265 -37 -132 248
6325 248 95 -6 -128 -44 49 106 -185 -230 -194 -258 -3 240 -202 -112 11 -261 37 136 -4 21 96 168 123 49
6349D9j79K36j16j94j48K53Q0j91K82l00j1L87q0m29K33JK3o4q5J91k45M4K21
6372d2K1l44Q5J80k0l30M15Or8J4K42j52kl86N64L7m32LK37j6m7k6j78L41n0k65
6398b43K48j53m2oK74l32L9K56k10J30j06J65j70K14k40L17j31j2J79nk69q5K35
6421E3J0mj47j2J11O4O2j83K48j80k12K79j2j86J32J6q8N2q6K00j65M8J32j1j94
6446g3K13j83K73l6K22l15k20O01n29J47L3P5k37L36j45J4l14K3K39J4l91K53
6468@j01M35q6l24K13k54J03j66L77m06L97k85M77k50k24K66k08K64k93jL40l76
6490a02K73m02J73P1J60k8k65N62k15l76J47Q7pj49M68n35K45Pj13n9j14L27M3
6513A98j40K7o7j78K39m9L9l31L29j23K57k05k3J58J81r9k70K21j55J24M4r1k60
$$ plain form
6349 49 -130 106 -10 -204 -352 -99 -19 -210 72 -228 -239 148 68 -361 -128 -127 -104 -168 -253 -62 -307 -263 -42
6372 -42 -21 -365 -280 -100 -120 -450 -35 -29 -127 -113 129 -23 -25 -411 153 190 -242 -239 -2 -18 -65 -91 -269 72 22 -243
6398 -243 5 -148 -190 -196 78 -254 -215 41 -169 -39 -145 20 -150 64 -176 141 10 -2 177 172 -97 -182 53
6421 53 63 59 -88 -100 11 75 137 -46 202 22 -190 89 77 -109 23 39 -49 3 -83 117 -48 0 132 121 -73
6446 -73 140 -43 230 194 416 101 -119 482 -47 100 133 208 -29 307 162 176 -138 -115 124 138 -253 0
6468 0 -101 334 248 -76 137 -117 -14 -180 197 -209 188 -97 380 130 -94 172 -36 228 -65 -66 274 -102
6490 -102 171 -231 -58 13 173 145 -120 442 227 -149 -2 85 78 -71 397 -138 107 114 1 -58 -172 155 198
6513 198 58 85 18 -160 79 30 69 -262 67 -56 201 -4 -27 131 312 213 -57 164 9 133 177 86 -174
6536a74Q2j5j6J79K04l29j29K52K86j71k5l0j86J55L6j11k8P7L76m39N8L2J65
6559B49j78P9k37n6L54l78J60p1J16j33J67j18K13j36m5K72j62j83K22k60J89
6580F4l41K63m6j39J72Q7k81O8K58q7N1k0p2j47K75N6j63J30j1J00l54Q3J22O6
6604A34l39J90j30J35L6K8r4O1k88N74n37L88o9jp9l76J85J73m0k17R0K15mj97
6628a62J83j87M52l6k40N1j18K19m6k53k8M6Jj68n1J17L01l14J43o1K23j91L0
6651h9l45J54R0K64oL5k88L06k92L39m38J97n2j49N09q3j99l70L58j4M3j05m9
6674a84L11k22R0K02k46R1k08n3nJ31N2N3k09J44P4k05N98n99M56k24j38J29J8
6697E6l06L65j81m1J8K44k27rP7J68k15oJ96k49p7K06m7j88L47n8J31P1j95k26
$$ plain form
6536 -174 -92 -107 -123 56 260 -69 -198 54 340 169 144 114 -72 83 119 8 -20 57 433 -6 52 84 249
6559 249 71 150 -87 -143 211 -167 -7 -78 38 -95 72 -46 167 31 -14 258 96 -87 135 -125 64
6580 64 -277 -14 -60 -199 -27 60 -221 -153 105 18 69 49 -23 -170 105 161 -2 128 117 217 -137 -54 68 134
6604 134 -205 -15 -145 -10 26 54 -40 21 -267 307 -230 158 89 88 9 -367 -182 -9 -49 -266 -176 39 35 -162
6628 -162 21 -166 286 250 10 61 -57 162 116 -137 -165 -119 -118 -286 -337 -220 81 -233 -90 -151 72 -119 -89
6651 -89 -434 -280 -190 74 68 103 -185 121 -171 168 -270 -73 -125 -274 235 152 -47 -417 -59 -73 -30 -135 -184
6674 -184 127 -95 -5 197 -49 42 -166 -219 -224 -93 -41 12 -197 -53 21 -184 414 -185 271 47 -91 38 56
6697 56 -250 115 -66 -107 -89 155 -72 -81 -4 164 -51 -57 139 -110 -187 19 -28 -216 131 73 204 275 80 -146
6721a46K16J53l16J21J20j37J53qk35k7P7j5R2k83R7R6l0M8n8J78o9l6L62j08
6745B45j74j65M05k65M8m2k02J87J42q1P4O7k97p3L75k33L6j15K84j80R8l25O81
6768D90l43k43m6j20O2Q6j61K95j65J09R0j84K38j12o6K32N8k2m57O1K92l54M16
6791A56k01q8R5%L12k61k8j50O47m89j09K84k6j75J75j64M1J98j60l30K94J44
6813A65K9L9n9j12J72j75m02K96K03K19k97K76n44M85k74q0p8J16k66K69k17L34
6835I9j69K39J55n30M4M09j97k40K48J23l34K40J57m83K78Q4n8K16l43R6m3k7
6857c6j5j00J85kJ72%j04j27Q0M9r5J47O9l36N0K7K85l25m5J68J05k50K73n5j95
6882g5J4O3L4j31l5p7L09l15J32j4j29l8K70k4M3m06K55M7j00K72m47L24l1J99
$$ plain form
6721 -146 70 223 -93 28 148 11 164 156 -79 -106 -29 -44 48 -235 -138 -42 -72 -24 -82 96 27 -9 353 245
6745 245 71 -94 311 46 94 52 -150 37 179 98 172 239 -58 -131 244 11 47 -68 216 36 134 -191 490
6768 490 147 -96 -142 -262 -200 -114 -275 20 -145 -36 54 -130 108 -4 -70 162 220 198 -259 -198 94 -260 156
6791 156 -45 -133 -38 -38 274 13 -15 -165 482 -7 -116 168 142 -33 142 -22 19 217 57 -273 21 165
6813 165 194 233 174 62 234 59 -343 -47 156 375 78 354 -190 295 21 -59 -137 -21 -287 -18 -235 99
6835 99 -70 169 324 -206 -162 247 50 -190 58 181 -153 87 244 -239 39 123 65 281 -62 34 -9 -36
6857 -36 -51 -151 34 32 204 204 100 -27 53 102 7 154 223 -113 -63 -36 249 -76 -121 47 152 -98 175 120 -75
6882 -75 -61 2 36 -95 -130 -207 102 -213 -81 -95 -224 -262 8 -16 27 -379 -124 -77 -177 95 -352 -28 -59 140
6906A40r6j73J87j35j27K71k62kq3K33j36o5K57K6o8k95K81n0rj09L98l96O0P4
6930g9K68k18J5j62J58k73K3K46j92L4K00O3r8k57M60k57N6J24k07N4j24J62l33
6953c37M98O1j67j6r8J60l92M17m76K81J07k43K68l38l7N38j22k56K24k26K12
6974E8J37l92N3L70k17m2J65j39k7J85n6j19k7M4j40L67q3k63N4k05K20p3K17
6997H7O8k67K10m6j34P0K19P6l65j7K59j12K67m13L03o6o7qj17L5k2l4M2m56N20
7022C2lO5j12J36J69l25N8J32M1l31L25k12K54l60Q3K38m47P3J24J27N5J9k55
7045a14L58j62R3j67j5J06PJ91k66Q4J60j72j3P9j3p1j92R3j60N78l58qJ92k17
7069A3K60k56K17k25j41N35n44L43R6k70K2r2j06L62m17N53n47K43o4J38M4j02
$$ plain form
6906 140 44 -129 58 -77 -204 67 -195 -197 -280 -47 -183 -248 9 35 -33 -328 -47 -97 -106 -215 183 -213 -153 -79
6930 -79 189 -29 -14 -176 -18 -291 -268 -22 -214 -180 20 83 -15 -272 188 -69 -13 111 -96 -42 -166 -4 -337
6953 -337 161 222 55 39 -59 101 -291 126 -350 -69 38 -205 63 -275 -312 226 104 -152 72 -154 58
6974 58 195 -197 -144 226 9 -33 132 -7 -34 151 95 -24 -51 -7 -147 220 137 -126 -72 -277 -57 -130 87
6997 87 155 -112 98 52 -82 -12 207 283 -82 -99 160 48 315 -98 205 139 72 64 -53 -18 -40 -74 -32 -488 32
7022 32 29 94 -18 118 287 -38 20 152 193 -138 187 -25 229 -131 -48 190 -257 -184 -60 67 122 141 -114
7045 -114 244 82 175 8 -7 99 106 297 31 115 275 103 90 169 156 85 -107 -14 -174 404 46 38 230 13
7069 13 273 17 234 9 -132 403 -141 202 298 28 50 -42 -148 214 -203 350 -197 46 -18 120 164 62
7091F2k76J45K01j37J57n1m13L66n1r7J22l0J23J05J64l86J70n4j9l5l6J70R5
7114B95k7j13j79K73l67N2J16N5J50m4l26Q8o2j06M2O8j9l2K2r4J2j0K66J46j58
7139D8K06k82N9J14l85K52k25rK00o7p2K92j25j14L4Q5m6J14P7k29k03k3L86j76
7163h9j1L31j86j18j73K39m5K0j06Lk31J30J94K43l81K67m21K4K91j45O7k63J81
7186a79Q6k27L11l28K45l7P9l49L89k88J29Q8r7K15l09J21K38j15j49K21j04J99
7208A39l9o8rK70m71o3K22O6k50J28j58R2j55N28m6k84q8P8J62k34K83l13J56
7231e4K53N8j85Q7k82J87L8QO3m25L07p6K58l95M22n3p0j52j45J74L0ll05n3K18
7256i5l3M10j70j97J91L7m16J93J73K21k78K31k45MJ3J74k66J25q6N3j10j19L31
$$ plain form
7091 62 -214 -69 132 -5 152 101 -312 54 3 -94 28 -2 121 226 390 4 174 120 101 66 30 200 295
7114 295 268 155 -24 249 -118 -66 50 105 255 211 -115 -27 -89 -195 -153 -85 -104 -136 -114 -208 -196 -206 60 206 48
7139 48 254 -28 31 145 -240 12 -213 -222 -22 -89 -161 131 6 -108 -74 11 -35 79 156 -73 -276 -299 87 -89
7163 -89 -100 231 45 -73 -246 -7 -52 -32 -138 -135 -366 -236 -42 201 -180 87 -334 -310 -19 -164 -97 -360 -179
7186 -179 -93 -320 -9 -337 -92 -129 -50 -399 -10 -298 -169 -81 -178 37 -272 -151 87 -28 -177 44 -60 139
7208 139 100 32 23 293 -178 -241 -19 47 -203 -75 -233 -141 -296 232 186 -98 -186 -108 54 -180 103 -210 -54
7231 -54 199 257 72 159 -123 64 102 110 173 -252 55 -21 237 -158 264 211 141 -11 -156 18 48 45 -260 -313 -95
7256 -95 -128 282 112 -85 106 143 -273 -80 93 314 36 267 22 26 39 213 -53 72 -14 39 -71 -190 141
7279A41m81M51j92L13l07K85j0Q1k50l8K7o2J66l10J48om8K68l19K84n00K40O08
7302D89l05j98l0J8O5J85j76M2J60j52j07P1J43k08J51j12J81k18j65J35L04k14
7324E9J07k84K25j33J34j31J39Jj45M0n1Rj36K26Q4j10J34O0k47Q0J52j75R3K1
7348A52ml83L42l35K81j53M61m40Q6J36L3p7P3j29O7l73L42K8k02R1J5k8l1Q2
7372C4N9l45L29K89l93N24l42j65r0R3r5L83l33J9K12Mj98N5J09m0l8o6R9l09
7396b05L04j91L38n0j35l21K84l1R2k7J6j69j93N00m10N3J96j28JJ08P8k18J1
7419i7jm6J2K50j32J7nj99M0J59MJ29j37O8j96R7k51qJ21O3K13J8j68j54J55N4
7445Fj24J46j21k7r2J34K74j45o4j89J17J4j95M78l33L26k75K16j17k05L32n40
$$ plain form
7279 141 -340 111 -81 232 -75 210 200 281 31 -7 20 -42 124 -186 -38 -44 -92 176 -143 141 -359 -119 489
7302 489 184 -14 -44 -26 39 224 48 90 250 98 -9 62 205 -3 148 36 217 -1 -166 -31 273 59
7324 59 166 -118 107 -26 108 -23 116 117 -28 12 -39 -30 -166 60 144 34 168 228 -19 61 213 38 131 152
7348 152 148 -235 107 -228 53 -100 361 -79 7 143 176 99 172 43 110 -263 79 107 -95 -4 11 -17 -48 34
7372 34 93 -252 77 366 -27 497 155 -10 -100 -7 -102 281 -52 -33 179 183 -15 40 149 109 71 5 104 -205
7396 -205 99 -92 246 196 61 -260 24 -7 85 58 74 -95 -288 212 -198 -145 51 -77 -76 32 110 -108 -97
7419 -97 -98 -144 -132 118 -14 3 -2 -201 -161 -2 2 131 -6 62 -134 -37 -288 -296 -175 -112 101 119 -49 -203 -48 6
7445 6 -118 28 -93 -120 -212 -78 196 51 -13 -202 -85 -71 -266 212 -121 205 -70 146 29 -176 156 -384
7467c84L26k8j12R5n8M06l49r4L25j78O8p2J80k45k42K60J91K7j14j16M8k78L50
7490FO2j64orJ9J64j39n5K9k08o1K77K47m70K90N6rJ18j54J27k61J41n4J61k39
7515a32j74N7L35J58j77p3M3k28K09np3K35j74K38m4j12j47o3j96KK29J81K58
7538C47l48RJ50k66J19l9q8k0M64m12J89J61l76J93k48J16J79m21M0K72R7m7n17
7561d46K83K0J10m6K32n31N68j71K27l31qn5P2K49l92L06O8N3k74L14k8k09N1
7584F2k7J92l44j07K50l07N74j16j46J17j24j56J10j57K09K2q4k43N35k13r5l0
7606g8P7O1j82r8L21K10n2j51k55M42n5j27K77n79J21N11m37j32J78j1J54k8O6
7629B33L4j46l53L40J61k88O1RJ22j88PL32m92K52k65M56j89r6R9k82L47j38J69
$$ plain form
7467 -384 -58 -86 -198 -103 -161 245 -104 -198 127 -51 17 -55 125 -120 -362 -102 89 116 2 -114 -66 -344 6
7490 6 68 -96 -102 -111 -92 72 -67 -122 -93 -301 -362 -85 162 -308 -18 38 29 147 -7 120 -141 0 -54 107 -132
7515 -132 -306 -249 86 244 67 -6 37 -191 18 13 -60 175 1 239 195 83 -64 -127 -323 -321 -92 89 347
7538 347 -1 8 158 -108 11 -28 -116 -136 328 -84 105 266 -110 83 -165 -49 130 -291 -251 21 118 71 -446
7561 -446 -163 -143 -33 -79 153 -378 190 19 246 -85 -93 -148 -76 173 -219 87 155 208 -66 248 220 11 62
7584 62 35 227 -117 -224 26 -281 293 177 31 148 24 -132 -22 -179 30 52 -32 -275 260 47 -48 -78
7606 -78 -1 60 -122 -220 101 311 259 108 -147 295 240 113 390 -189 -68 443 6 -126 52 41 195 167 233
7629 233 267 121 -232 108 269 -19 42 51 173 -15 -8 324 -168 84 -181 275 86 -10 89 -193 154 16 185
7652A85l02K47N6k88q2p5N23k27K98n17K01m8J39R9n53O2j44O43j47j24N4j71
7674a71K50m2j49L14k66O4k07K82rJ64m4m3n09N7K98L02j57J04j23n1p3P8J10
7697A79j22m1j5rK03k07J87r0j96J72j79M01j30j29rO9r7j89J32K76j6j89N3J8
7721G2j69K43k27L44k05j29L14k80o0q0J06L41j01k26J14J7k21J20j19K26j35
7742e5n6j1J25l8K5KJ72J2m18L29Q4l25M8R3n11N12j47m3K44L0k7RJ09m82K28
7767i1r6J49KK09k9m10J67K8j0K65j43K57l74R8o4Q2j61L9N6J21k29K50J10j34
7791I2l25J61rk38K76L3p1J76j91l4K16j71J95l77K18l9J34P2j97R4j38M02n21
7814b42K30J06k44L75k11j25K90j27l02K27k20P5J61l13K19N3K16o5k91R1M3L6
$$ plain form
7652 185 -117 130 186 -102 -184 -259 264 37 335 -182 19 -29 110 209 -344 -282 -426 217 70 -54 0 -171
7674 -171 79 37 -112 202 -64 0 -207 75 66 230 186 143 -366 -309 -11 291 134 238 115 64 -9 69 179
7697 179 57 16 1 -8 195 -12 175 85 -111 61 -118 283 153 24 15 84 -13 -202 -70 206 190 1 54 72
7721 72 -97 146 -81 263 58 -71 243 -37 -97 -177 -71 270 169 -57 57 74 -147 -27 -146 80 -55
7742 -55 -111 -122 3 -35 -10 -8 164 176 -242 87 171 -154 -106 -13 -524 -12 -159 -202 42 72 45 54 163 -319 -91
7767 -91 -187 -38 -36 173 144 -266 -99 -71 -81 184 41 298 -76 22 -42 40 -121 -82 -26 95 -134 116 226 92
7791 92 -233 -72 -81 -319 -43 -10 -81 95 -96 -130 86 -85 110 -267 -49 -88 46 118 -79 15 -123 279 -242
7814 -242 -12 94 -150 225 14 -111 179 52 -250 -23 -243 -168 -7 -320 -101 -48 168 103 -188 -97 -54 -18
7836a8k31K19K18m17M01k35P9M8r2J55l19K09J47J05r8n8J6O5j85j61K72l0J07
7859A97J4pk32P1J01J49j69j77M36j34j09M6k89J43j01J32k30J83K26J80l07m4
7881G9L50l11J07k09Qj51J29r3J02L24m33J30M7j24J0p7K8m7K58k76J57N1K0n1
7905B8J79j86M2mJJ51r4k29M1N6K47l70K13J10j21J51j58Qk30J62J7K11m4j51
7929C0k73J19K16j7Jl7R6k07J15j86K70J25k26J34j1J61l75J24m9J4M42l83k03
7952a20K88l07K56k23p5J03q9J18J11j72J32oj23OQ4j1J27O9l88J24J24j1j86
7975a69L18k81nQ6J04k86P7J58j75l2L24k07K67k6m13L21K11j88j50O2L0j77O9
7998h2J19o9J18j46L8k75J25J64J5K4m0K30pm4j22j66K95k63O6L5K8n3K24k49
$$ plain form
7836 -18 -249 -30 188 -229 172 -63 16 64 -28 127 -192 17 164 269 171 113 129 194 9 -152 120 90 197
7859 197 211 204 -28 43 144 293 124 -53 383 249 140 186 -103 40 -61 71 -159 24 250 430 123 79
7881 79 429 118 225 16 24 -127 2 -91 11 335 -98 32 79 -45 -35 -112 -84 -131 127 -149 8 59 79 28
7905 28 207 21 63 59 60 211 117 -112 -71 -15 232 -138 75 185 64 215 57 65 -165 -3 14 225 181 30
7929 30 -243 -124 92 75 76 39 135 -72 43 -143 127 252 26 160 149 310 -65 59 10 24 466 83 -120
7952 -120 168 -139 117 -106 -181 -78 -167 -49 62 -110 22 16 -107 -101 -17 -28 99 168 -220 -96 28 17 -169
7975 -169 149 -132 -137 -51 53 -233 -156 2 -173 -205 119 -88 179 153 -260 61 272 84 -66 -4 26 -151 -82
7998 -82 37 -32 86 -60 -22 -297 -172 -8 7 31 -9 221 214 170 48 -118 177 -86 -20 15 43 -10 214 -35
8022c5J1J1l4q1j65J88j11M2J13m6k38J70J5J28p6J69j55l63N62r4k81M24j90
8045c6J3R9m6K05k81j77L46k82K51l39J10P5J93n06K34l8nK18k01L08k94J40M4
8068C1J28l16P7K5Q0P0k52J62j32k20M18%j40j83J64L0k07J69L93o51N14j01m0
8091A9M9l12J65J69k61K12k1p4N6j04O2L04m56M69m91M52k47l2N7J28j90O1M4
8114E9R4k01K49j17j76J61n8L7K4J9q0K5J01n4L2m6m9J79l29L7j29J16r6L84k00
8139a8j88J86J63lJ87J20k89n75N48M3j20J61lj21L2J47j45J61p4j13n4o7J69
8162A47M3l23J82K26k20j83K59m30L28q8J57j54n5J36j20q3K65M0j44L87m74R6
8184hJ26P1k73J26Qj36J57
$$ plain form
8022 -35 -24 -13 -47 -128 -293 -105 -216 -174 -61 -107 -345 -175 -160 -32 -108 61 -94 -457 105 11 -270 154 -36
8045 -36 -23 76 30 235 -46 -223 123 -159 92 -247 -137 -62 131 -375 -141 -179 -184 34 -167 141 -153 -13 31
8068 31 159 -157 -80 -55 25 95 -157 5 -127 -347 71 71 -69 -252 -88 -58 -265 -96 297 -354 160 59 19
8091 19 68 -244 -79 90 -171 41 20 -54 2 -102 -40 264 -192 277 -214 238 -9 -41 16 144 -46 15 59
8114 59 153 -48 201 84 -92 69 11 48 72 91 11 36 137 83 115 69 20 199 -130 -93 -222 -106 -202 182 -18
8139 -18 -206 -20 143 140 327 447 158 -417 131 174 54 215 212 91 123 270 125 286 212 99 45 -22 147
8162 147 190 -133 49 275 55 -128 131 -299 29 -59 98 -56 -111 25 -95 -178 87 127 -17 370 -104 -8
8184 -8 118 189 -84 42 50 -86 71
8191G1
$$ Imaginary data points
##PAGE= N=2
##DATA TABLE= (X++(I..I)), XYDATA
0@%%%%%%%%Lj1J6j6J6k1K9l2M0m8N6o8P6q8J04j20J39j61J84k09K37k68L02l41
32a81L82m26M79n35N94o62P36q14R01r98J105j223J356j505J670j858K075k327
50a231K620k970L398l932M624n560O902q999J2778k1738Q1064Q0066j22231m9101
64b4310L3538N7367k6419l7272N983M2754Q256j2720o588R100n015j2798q714
77B3162O386P807P487j286r148q932N541J0205l06j1405Q17J5382R690j3118k4384
92A7898j5777M075J8040J8269J626j2689n002J2474P212k1163l0467k529K4252
105A6219J5087o111o213N214K738o418k855K428q215j6698M35J9998J0877j2425
119A4061j4946O65Q349O105N725K82j5122j9879J855J8882N600j3132m780J3249
$$ plain form
0 0 0 0 0 0 0 0 0 0 3 -8 8 -8 8 -13 16 -16 24 -24 32 -36 40 -48 56 -64 75 -86 98 -111 126 -142 160 -181
32 -181 201 -225 254 -281 313 -349 387 -427 474 -524 581 -642 714 -791 879 -979 1096 -1231
50 -1231 1389 -1581 1817 -2115 2509 -3051 3851 -5148 7630 -14108 66956 147022 24791 -24310
64 -24310 9228 66595 40176 2904 8887 51641 59897 47177 40589 49689 44674 31876 23162
77 23162 29548 37355 44842 43556 34408 25476 31017 41222 40916 29511 30328 45710 55400 42282 17898
92 17898 2121 6196 24236 42505 44131 31442 26440 38914 46126 24963 -5504 -8033 16219
105 16219 31306 25195 18982 24196 26934 20516 17661 20089 11874 -4824 -4389 15609 26486 14061
119 14061 -885 -220 8129 14234 19959 20241 5119 -14760 -12905 5977 11577 -1555 -6335 6914
133F914N979j1578n315J1404L687j8942j5411J2727J9296k303j3272J090J1840
146F116j091j4535l516J2714R079p185j1562k614L549K407K570N385M194k990
160B521n679p76J819k846q859l457J0051J4638L086j1449q049O225P911o129j4480
175a5473j524J3349Q640l038j508L793l526j3584n639J2188J2962l402q071K623
189b210O721n469j1505j217Q546M307k342J296M700j324n797k903Q73j608m152
204a2084K380R941O274l620q708n192j279R92M538N117O77m453j831L523J737
219a988o185q285j069P688P584K653j504k960l132l506k210j269l30J241M124
234i148O334M485j917q652p549J261M681J516l517l32M558L562k439k620K004
$$ plain form
133 6914 12893 1315 -4000 7404 11091 -7851 -23262 -10535 8761 6458 -6814 -5724 6116
146 6116 5025 -9510 -13026 -312 8767 1582 -9980 -12594 -9045 -6638 -4068 1317 5511 2521
160 2521 -3158 -3934 -2115 -4961 -13820 -17277 -7226 7412 10498 -951 -9000 -2775 5136 -993 -15473
175 -15473 -16997 -3648 4992 1954 446 4239 713 -12871 -18510 -6322 6640 3238 -4833 -2210
189 -2210 4511 -958 -12463 -13680 -5134 -827 -3169 -1873 2827 1503 -4294 -7197 -6324 -7932 -12084
204 -12084 -9704 237 6511 2891 -5817 -11009 -12288 -11296 -6758 -1641 -964 -5417 -7248 -3725 -1988
219 -1988 -8173 -16458 -17527 -9839 -2255 398 -1106 -4066 -7198 -10704 -12914 -14183 -14513 -13272 -9148
234 -9148 -2814 1671 -246 -8898 -16447 -15186 -10505 -8989 -12506 -12838 -8280 -4718 -7157 -9777 -7773
249g773M35m864l534N831P034k137q611k382N328L356l046r88N300N267j426n187
265g397l745j565j384o23L577M707L069K025J883o44n220n323j864N97P85J902
281i220L973M285J189n66k61k97l577m717r34M195L723k97j223OL001K637M11
298B328q46j438j354j181r92M66J161l14l76K923O142L091l371m506p41Q38k786
315i56m099J252O396M058j112j179K480L767j194n009m579j364J061J696K332
330C550K172J271K015J601l27j576j867k675m448l669K437Q553O384j554o015
345E852l98N028K231o301p997k53N664L630m61p60J508Q54k599k159K436M150
361A0425j380n767l256J560K365j039j190K531N035K981j411k681k714l875m289
$$ plain form
249 -7773 -7338 -12202 -15736 -9905 -2871 -5008 -13619 -16001 -10673 -7317 -10363 -11351 -6051 -784 -2210 -7397
265 -7397 -11142 -12707 -14091 -14714 -11137 -6430 -3361 -1336 547 -97 -5317 -10640 -12504 -11907 -11122 -9220
281 -9220 -5247 -962 227 -339 -600 -897 -4474 -9191 -10125 -5930 -2207 -2504 -3727 -3721 -720 1917 2328
298 2328 1482 44 -1310 -2491 -3483 -3017 -1856 -2170 -2546 377 6519 9610 6239 1733 992 1830 -956
315 -956 -5055 -3803 2593 6651 5539 4360 6840 10607 9413 4404 -175 -1539 -478 1218 3550
330 3550 5722 6993 9008 10609 10282 8706 6839 4164 -284 -3953 -1516 7037 13421 11867 5852
345 5852 5454 10482 12713 6412 -1585 -1838 3826 7456 6995 6235 7743 8597 5998 3839 6275 10425
361 10425 9045 3278 22 1582 3947 2908 1718 4249 9284 12265 10854 8173 5459 1584 -2705
376b705j873K140N139N165L910O20k582m312m826l034M95J908J057P70K988M716
392I576J278m522p244k181L420L037Q03n58O22j002k672j468J691K813J035n21
408D107J85K056K05k978n775l793J071N800N699K295n79j477j883l124m256q10
424c257J455J851K127K992K884J9k352l742l021j922M96M012M291J320l628l345
440A80P60J952l00j530k02J004R32J042j92j601k661j867J060K345J720K045N38
457E225k273l368k442J470J500j98j275P56K539R96j399l034r73K36J349qj227
474b126J62J496P13j962k991J93L210P17l553j382K537K919j566m660j173L605
490c861J667k413k080R66K183j006k391L10L611J698m023n328r15L409L167o45
$$ plain form
376 -2705 -4578 -2438 2701 7866 11776 12396 9814 5502 676 -2358 -1863 45 1102 1872 4860 9576
392 9576 10854 6332 -912 -3093 327 3364 4167 3609 4231 3229 557 -911 780 3593 4628 4107
408 4107 4292 6348 6553 3575 -2200 -5993 -4922 878 6577 8872 8293 6816 4933 1809 -2447 -3257
424 -3257 -1802 49 2176 5168 8052 8071 5719 1977 -1044 -2966 -2470 1542 5833 7153 3525 180
440 180 940 2892 2592 1062 860 1864 2796 3838 3646 2045 -616 -2483 -1423 922 2642 4687 5225
457 5225 2952 -416 -2858 -1388 112 -86 -1361 -605 1934 2930 1531 -1503 -2476 -2240 -891 -899 -2126
474 -2126 -1964 -468 245 -1717 -4708 -4515 -1305 -588 -4141 -5523 -2986 -67 -1633 -6293 -7466 -3861
490 -3861 -2194 -4607 -6687 -5721 -3538 -4544 -6935 -6625 -3014 -1316 -5339 -10667 -11582 -8173 -5006 -5651
506e651j498J055J698l61k903j301N02J77j699j315K031M474K186j638l618k357
522a0218k88R70J203J093O37j39p53q95k20J78P11J102J281K44l71j021r29j393
540h808j759k08K901L749K792J90p65j325j913l185k992K1M496N612L774q57k600
557h77j837n12j016j584l81K681K525N75q7J899J502j993m225o30M017L703p14
574C046k433m01O24j831j264J278M637M048R95k056l849l165j256P79J307J435
590A894J910K795J495j4k83j217l667m768j246L360N414K187J0p14q78j100j808
607C370l49K31L36O78O47r47j482J53K098J280k23o16m0q69j710k26L04o44j620
626C71j12L142L222O49j129j783k273l386j063K460K414j049p17J725K353k08
$$ plain form
506 -5651 -7149 -6094 -4396 -4757 -7660 -8961 -8459 -8282 -9981 -11296 -9265 -4791 -2605 -4243 -7861 -10218
522 -10218 -10506 -9536 -8333 -7240 -6603 -6742 -7495 -8390 -8610 -8432 -7721 -6619 -5338 -5094 -5465 -6486 -7415 -8808
540 -8808 -10567 -10775 -7874 -4125 -1333 -1143 -1908 -3233 -5146 -8331 -11323 -11302 -6806 -1194 2580 1723 -877
557 -877 -2714 -3226 -4242 -5826 -6207 -3526 -1001 -426 -513 1386 2888 895 -3330 -3960 57 3760 3046
574 3046 613 212 836 -995 -2259 -981 3656 7704 8699 6643 2794 -371 -1627 -848 459 1894
590 1894 3804 6599 8094 8080 7797 6580 2913 -1855 -3101 259 5673 7860 7870 7156 6278 5178 3370
607 3370 3021 3252 3588 4266 4913 3966 2484 2637 4735 6015 5792 5176 5136 4267 2557 2331 2635 1991 371
626 371 259 3401 6623 7272 6143 4360 2087 -1299 -2362 98 2512 1463 746 2471 4824 4616
642D616k194j072J97j252k276Q4R79J405J054J351j49j358q79K05M23j338j902
659b106j5R41o88P58K283K939p68m016j999Q81J010P0j44M91k03m76l70L76R74
678f2J848O17k117l395j01K807J056k603j590K471K820r30j518J095K486k061
694H23m260j825K391J445K59J058L088J039l105m447q88J750K160L88j119q36
710b079J163K291J25k491k830N67J678M97L0J551P25k358k917O25K366m9k662
727c768O24M204J762k757m406o39J807M26k53O10J557L22q1j74q74j923k640l57
745f560K977M121J982k866l949j454J907K377j376k612Q20L949J504j369j760
760b309j028j621j595J491L631J318j745j656K147K358k341n122j402K634L884
$$ plain form
642 4616 2422 1350 1547 295 -1981 -1897 -918 487 1541 2892 2743 1385 506 711 1134 -204 -2106
659 -2106 -2121 -1180 -1868 -1110 1173 4112 3344 -672 -2671 -1790 -780 -710 -854 -363 -566 -1042 -1412 -1036 -62
678 -62 1786 2403 286 -3109 -3210 -403 653 -1950 -3540 -1069 1751 821 -697 398 2884 823
694 823 -3437 -5262 -2871 -1426 -1167 -109 2979 4018 913 -3534 -4422 -2672 -512 -124 -1243 -2079
710 -2079 -916 1375 1500 -991 -3821 -3254 -1576 -1079 -1049 502 1227 -1131 -4048 -3423 -1057 -1106 -3768
727 -3768 -3144 1060 2822 65 -4341 -4980 -3173 -2747 -3000 -2390 -833 -511 -592 -766 -1640 -3563 -6203 -6560
745 -6560 -3583 538 2520 -346 -4295 -5749 -3842 -1465 -2841 -5453 -4633 -684 820 -549 -2309
760 -2309 -3337 -4958 -6553 -5062 -1431 -113 -1858 -3514 -1367 991 -1350 -6472 -7874 -5240 -1356
775a356J948m1j431k215j822K49K579R02o75j072L27J023N74k69j899r19O64K897
793e36J251j206j710O46O5l90j216p55N67J513K209K295p30k941k496L68J685
810a381k36n36L66J585J593l86q39m65j105q72M94J986Q40j649k008M39L293J630
828B749r87k162q78R52K07j05m03R6k0j4R58K035P57j277l295n77L442J469k114
847H33l084P34L360J495j873j464J413J364j337j037J152J235j430l217m02L681
863A423L240P1k198j48J071p79k852j565J413K793J067p39O17J572l72k937k142
880d65J223J632m8j352J059K698J057k637l146M46L020J363j564j421J252J639
896D756j124k492q71J439J704J107M76O65n73k346k629o84J849J549J319N42L38
$$ plain form
775 -1356 592 551 -880 -3095 -4917 -4668 -2089 -1187 -1862 -2934 -2607 -1584 -1010 -1279 -3178 -4097 -3433 -536
793 -536 715 -491 -2201 -1555 -1490 -1880 -3096 -3851 -3284 -1771 438 2733 2003 -938 -3434 -3066 -1381
810 -1381 -1617 -2153 -1787 -202 1391 1005 166 -299 -1404 -2276 -1782 204 1044 -605 -2613 -2174 1119 2749
828 2749 1762 -400 -1278 -326 -119 -224 -627 -531 -551 -565 393 2428 3185 1908 -1387 -1964 1478 2947 833
847 833 -2251 -1517 1843 3338 1465 1 1414 2778 1441 404 1556 2791 1361 -1856 -2258 1423
863 1423 4663 4734 2536 2388 3459 2680 -172 -1737 -324 2469 3536 2797 3414 4986 4614 1677 -465
880 -465 758 2390 2342 990 2049 4747 5804 3167 21 467 3487 4850 3286 1865 3117 4756
896 4756 3632 1140 269 1708 3412 4519 4995 5660 5087 2741 112 -572 1277 2826 4145 4687 5025
913E025M96q67j542j179q14q30N45K483K484N41k183k051lJ112J03j637m71J827
931C039K145j17k278j291P51L97J46Q6J299Q59n0j906j852l76R77O72L79M57J066
950D403P36l06j747k184m31R01J543L02l80J77O68O17j269j751m81J164O79M9
968B690k97K33K13j9j333q97O02Q79N91j48l15r75k98k2P05n72k29O1P43L17p75
989A154r86m6M40K72o18q91N16R54M70j366j042M83O43M16j174r45N70N57m67
1008a060r30M01J001l50q47o23J91L34j079r20O28J747L76j235j060m80L95K57
1026c254n2l33K31K13o12k51N99M60j484j971j30K404K697j60k605j838Q3J341
1044d662l79l7J37O04M73j30k27O4n92r55n39J75J597J142M22j022j083l00N31
$$ plain form
913 5025 5521 4654 3112 1933 1119 289 834 3317 5801 6342 4159 2108 2105 3217 3320 1683 1212 3039
931 3039 5184 5067 2789 1498 2249 2646 2792 2878 4177 5036 4986 3080 1228 852 1829 2501 2880 3337 4403
950 4403 5139 4833 3086 902 471 1372 2915 3217 2837 3014 3682 4299 3030 1279 798 1962 2641 2690
968 2690 2393 2626 2839 2820 1487 590 1192 2071 2662 2514 2199 1224 926 904 1609 1037 808 869 1612 1929 1154
989 1154 168 122 562 834 216 -675 -159 795 1265 -101 -1143 -660 -17 399 -775 -1720 -1150 -593 -1060
1008 -1060 -1990 -1589 -588 -938 -1785 -2408 -2217 -1883 -2962 -3882 -3254 -1507 -1131 -2366 -3426 -3906 -3511 -3254
1026 -3254 -3306 -3639 -3408 -3195 -3807 -4058 -3459 -2999 -4483 -6454 -6584 -4180 -1483 -1643 -4248 -6086 -6003 -4662
1044 -4662 -5041 -5078 -4941 -4337 -3864 -3994 -4221 -4157 -4749 -5704 -6243 -6068 -4471 -3329 -2907 -3929 -5012 -5312 -4781
1063d781j08j63N80R76Q81n04l46j147p87M2P25J251J030N82j26p63l83j179k18
1082d438M81J005Q05J4PN36R72l55j865j603O6K476K006K40o96o37l00q26n29
1101b641J421J788N2r98j535J376J309N66j706j572K71J792J427R75m21j126j521
1118e43j023N57J373J864r6j035n03J287J89r11j027q7J97Q45O52J119K01j114
1136A945j408j21J340N01p65j267P57J799L76j082j620K14J003O29l02l41R48
1153B606Jj256j083l6K625J054j198j838o85J593J196qj211o33K44r1p7J049R38
1172C190M95j654j696K29K292J243m94k438j393J385K314L38n80q56N1l13q9K64
1190B288O70j51n07k23R66L63Jp96J56j82k88k33O13J656j70j279o27N42P41o06
$$ plain form
1063 -4781 -4889 -5052 -4472 -3496 -2615 -3119 -3465 -4612 -5399 -5357 -4632 -3381 -2351 -1769 -1895 -2658 -3041 -4220 -4438
1082 -4438 -3957 -2952 -2147 -2133 -2126 -1590 -618 -973 -2838 -4441 -4375 -1899 107 347 -349 -986 -1286 -2112 -2641
1101 -2641 -1220 568 620 -378 -1913 -537 772 1338 -368 -1940 -1669 123 1550 2525 2104 978 -543
1118 -543 -1566 -1009 364 2228 2132 1097 594 1881 2070 1159 132 45 242 1087 1739 2858 3059 1945
1136 1945 537 416 1756 2257 1492 225 982 2781 3157 2075 455 669 1672 2301 1999 1658 2606
1153 2606 2607 1351 268 232 2857 3911 2713 875 190 1783 2979 2971 1760 1127 1371 1280 1203 2252 3190
1172 3190 3685 2031 335 564 2856 4099 3605 1167 -226 1159 3473 3811 3231 2375 2426 2113 2024 2288
1190 2288 2958 2807 2300 2077 3043 3406 3407 2611 2767 2585 2297 2064 2677 4333 4163 2884 2257 2799 3540 2934
1210B934p63Q0J541P37l39j076o29J74j86j83N82J530Q33j165k331p73J758J981
1228D705j302k471p7K028J949k56j655r54m58m91K85J496J303n99j244n30j79
1245A550Q6On5m38j77O22P82R9q52j312l21L18K65K85P16R9n80p55jj017r18O77
1267i21J435M28j246j005J016P56r82j452o19R64J192L38m28p82o24N39on68j011
1286b976K7J936P85j362j069M13N69j051j318J167J925J43j463j539M73J069N03
1303a768j084o67K17R22Q16l89j077k97P02L8j387K43J100Q54m71j269K82P38
1321b497m72p75O74J149o11j048Q25R01o95j288j68J422R08o05j547K84J223M45
1339a875p9j030l36O71N23j72k51l90J036K63q60o61R51R81r65j477P64J301P46
$$ plain form
1210 2934 2171 2251 3792 4529 4190 3114 2485 2659 2473 2290 2872 4402 5235 4070 1739 966 2724 4705
1228 4705 3403 932 855 2883 4832 4576 2921 1967 1509 1018 1303 2799 4102 3503 2259 1729 1550
1245 1550 1636 1642 1587 1149 972 1594 2376 2475 1623 311 -10 308 573 858 1574 1673 1093 338 337 -680 -1598 -921
1267 -921 514 942 -304 -1309 -293 463 -519 -1971 -2590 -1626 -434 -96 -524 -1306 -1930 -1391 -1397 -1965 -2976
1286 -2976 -2949 -1013 -228 -1590 -2659 -2246 -1677 -2728 -4046 -2879 -954 -811 -2274 -3813 -3340 -2271 -1768
1303 -1768 -2852 -3519 -3302 -2380 -1564 -1953 -3030 -3327 -2625 -2587 -3974 -3731 -2631 -1777 -2248 -3517 -3235 -2497
1321 -2497 -2969 -3744 -3070 -1921 -2532 -3580 -2755 -1854 -2549 -3837 -4005 -2583 -1675 -2280 -3827 -3543 -2320 -1875
1339 -1875 -1954 -2984 -3320 -2649 -2126 -2298 -2549 -2939 -1903 -1640 -2500 -3161 -2210 -1229 -2194 -3671 -2907 -1606 -860
1358h60p86r89L44L74R8J54L41k55r75J10J369R38q95j399k63J055M18l37K53
1377a305P4L37K04k31j349M5N83J217K05j441P51R59J73j751q59J003J363k24
1395b46j117Q46L66J27o79m07J07O02l5q8O9K72O47K20n08j423m96L08J825Q40
1415A230J2o39r17j151P97J546l08j108l90J347J206k61j179n62K05J1K61O37
1433G37J030l03r69l77N13P05Ll84q00k31J236K006Q1j876k109L46J981N64m6
1452B107k95J46p3j77K53k31m53L53Q97K86l38l45N06R3k66r70M89Q42L20k83
1472B861j14N39o01Q1j19J88j15j04M90J37L52m83P38J27j467j115Q98K377P09
1491E379j715j537J74R62Q24N0m82r48j30J87R72L55l81j113n01K93O76J240m89
$$ plain form
1358 -860 -1646 -2635 -2291 -1917 -1819 -1665 -1324 -1579 -2554 -2444 -1075 -137 -1032 -2431 -2694 -1639 -1221 -1558 -1305
1377 -1305 -1231 -894 -690 -921 -2270 -2225 -1642 -425 -220 -1661 -910 49 222 -1529 -2388 -1385 -22 -246
1395 -246 -1363 -517 -151 -24 -703 -1110 -1003 -401 -436 -524 -455 -183 464 684 176 -1247 -1743 -1435 390 1230
1415 1230 1242 603 -314 -1465 -668 878 570 -538 -928 419 1625 1364 185 -377 -172 -161 100 737
1433 737 1767 1464 495 118 631 1336 1339 955 155 -76 1160 3166 3247 1371 -738 -392 1589 2153 2107
1452 2107 1812 1958 1885 1708 1961 1730 1277 1630 2527 2813 2475 2130 2636 2729 2463 1493 1982 2824 3144 2861
1472 2861 2747 3286 2685 2766 2647 2835 2720 2616 3106 3243 3595 3112 3850 3977 2510 1395 2293 4670 5379
1491 5379 3664 2127 2301 3263 4087 4137 3655 2707 2577 2764 3736 4091 3710 2597 2096 2389 3065 4305 3816
1510C816j700q02J342J937q21j907n46J133K41l90k34J098p18j100q66J337J737
1527C557j109j898p35J093J071k82o08j116O56M73l04j246l06J234P91q76j534
1544a139J41Q48j0j078o59J400K94r56k76N65M27j000j082q4J291R46o35q27q36
1563b670k6Q13O03m98j333k79N20R14J45k56n19p35o57N65J671J40m87j134J48
1582c075M78N94p37r68L40N12O19Q06m32r97m60L11N51M91m43j62p2q1O76P12
1602a337j92j229l88M91J115K22l75J42j59k08o46J24Q40J43M4J78n9K96o49k71
1622a918N01K00l50O1L53J7Q57l28l37j072J82P79M83j03k90k9J94o72o0N61N91
1643c80n24j258P24J381K56j165o87M49M90J71k64m96N69M86m82n84l86K31O74
$$ plain form
1510 3816 2116 1314 2656 4593 3772 1865 1319 2452 2693 2303 2069 3167 2449 1349 483 1820 3557
1527 3557 2448 550 -185 908 1979 1697 1089 -27 629 1102 798 -448 -754 480 1271 395 -1139
1544 -1139 -998 -150 -160 -1238 -1897 -497 -203 -1159 -1435 -870 -443 -1443 -2525 -2609 -1318 -372 -1007 -1834 -2670
1563 -2670 -2696 -1883 -1280 -1778 -3111 -3390 -2870 -1956 -1811 -2067 -2586 -3321 -3978 -3413 -1742 -1602 -2089 -3223 -3075
1582 -3075 -2597 -2003 -2740 -3708 -3368 -2856 -2237 -1431 -1863 -2860 -3320 -3009 -2458 -1967 -2410 -2572 -2644 -2725 -2049 -1337
1602 -1337 -1529 -2758 -3146 -2655 -1540 -1318 -1693 -1551 -1710 -1918 -2564 -2440 -1600 -1457 -1413 -1235 -1294 -998 -1647 -1918
1622 -1918 -1417 -1217 -1567 -1506 -1153 -1136 -279 -607 -944 -2016 -1834 -1055 -572 -675 -965 -994 -800 -1472 -1532 -971 -380
1643 -380 -904 -2162 -1438 -57 199 -966 -1653 -1204 -714 -543 -807 -1303 -734 -248 -730 -1314 -1700 -1469 -795
1662g95O6k4r9K59J88o89o10P81J152n32p65m24P96L05k09LJ95m27j85MP5N92
1684c43L96j14m98J78K68l26K62L10n6k19J24o2O1M96J12r8p02M27L49K01m15
1705C51L39K22K14k88l32J12M82K85kj30j12J02M62j64j56K64j58o86N06M08R53
1726B672m62k03l45L90k38J66k03M61M50j95m85J2J78O74n62n65K73Q11Q2q50
1746B061j6M71N89o21n18j3J404L58o10j231j29O48L42n01n44O03L84K10n43l15
1766B029j9O0K0p67N91L64R7o02k91L78J12j72r64o6N99M62l5n09l53j71j88R3
1788F68L10L68k50n74k41L98M68p61l81J7M84J57k19j73L2K12m92n53J32M75K06
1809B83k44l24K73O8L10j283L19L86M34o29k68j16O18J4o43j60K39M61p69K10
$$ plain form
1662 -795 -729 -753 -852 -593 -405 -1094 -1704 -923 229 -303 -1068 -1492 -696 -391 -600 -597 -402 -829 -1014 -1010 -935 -343
1684 -343 53 -61 -559 -381 -113 -439 -177 133 77 -142 -18 -80 -19 477 589 491 -211 216 565 766 351
1705 351 690 912 1126 838 506 618 1100 1385 1383 1253 1141 1243 1705 1541 1385 1649 1491 805 1311 1719 2672
1726 2672 2210 2007 1662 2052 1814 1980 1777 2238 2688 2493 2008 2020 2198 2872 2310 1745 2018 2829 2911 2061
1746 2061 2045 2516 3105 2484 1966 1953 3357 3715 3105 1874 1745 2393 2735 2234 1690 2293 2677 2887 2344 2029
1766 2029 2010 2070 2090 1323 1914 2278 2375 1773 1482 1860 1972 1800 836 770 1369 1831 1796 1287 934 763 575 668
1788 668 978 1346 1096 522 281 679 1147 386 5 22 506 663 444 271 303 515 23 -530 -398 77 283
1809 283 39 -285 -12 56 366 -917 -598 -212 222 -407 -675 -791 -173 -159 -802 -962 -723 -262 -1031 -821
1829h21KJ35j08q8j96J93J84J34l03m08J45Q12l89m52j29K56P64m34l28N8J03
1850h70R9J57m30j46K46j95P8m5m1J62m3n0j59L50L63j87l70l85M30M85o44N8
1872a137K74J46j46k03m7J75K91r8m69L16mq1k74o9N12k2k77k70K04J74K35o06
1894a376l16J29N84j61n83L04M02J30l20k84N12r7l43o6k55L76K72j98k59K58
1914a291MJ2j8k44qN29j86m98J38J61L36m64k70M76M61m67q7Q0k48J80k08k35
1936a847N38L55k32k24O6J42K50k93l14J42N63j14j6l81L3M17J80l91J33J1L40
1957f42l32k65K44L08Ok09O3O84J99n10j75j99M71l89L01m2N75J5L56k71k23J20
1979H5J56l97L28n0M56J07k21l1N21J01J6o25r1O13K58p6k12L24Q2M3r8K75M58
$$ plain form
1829 -821 -819 -684 -792 -880 -1076 -883 -699 -565 -868 -1276 -1131 -319 -708 -1160 -1289 -1033 -269 -703 -1031 -973 -870
1850 -870 -771 -614 -1044 -1190 -944 -1139 -1061 -1106 -1147 -985 -1028 -1078 -1237 -887 -524 -711 -1081 -1466 -1036 -551 -1195 -1137
1872 -1137 -863 -717 -863 -1066 -1113 -938 -647 -745 -1214 -898 -902 -983 -1257 -1326 -814 -836 -1113 -1383 -1179 -1005 -770 -1376
1894 -1376 -1692 -1563 -979 -1140 -1723 -1419 -1017 -887 -1207 -1491 -979 -1076 -1419 -1485 -1740 -1364 -1092 -1290 -1549 -1291
1914 -1291 -1287 -1275 -1293 -1537 -1545 -1016 -1202 -1700 -1562 -1401 -1065 -1529 -1799 -1323 -862 -1329 -1416 -1336 -1584 -1404 -1612 -1847
1936 -1847 -1309 -954 -1186 -1410 -1344 -1202 -952 -1245 -1559 -1417 -854 -968 -984 -1365 -1332 -915 -735 -1126 -993 -982 -642
1957 -642 -974 -1239 -995 -687 -681 -890 -827 -143 56 -454 -629 -828 -357 -746 -445 -487 88 103 459 188 -35 85
1979 85 241 -156 172 122 578 685 464 433 954 1055 1071 446 355 968 1226 1150 938 1262 1344 1387 1289 1564 2022
2002B022k16n27L63j07J43j03K45l76P14J17p4j80m41K81N01Jl68j12K93o6q6
2023B024O4M39R6p00j64l3P06l83m51l3M83M03l63r3l43K80j1o7p57J60O31m6
2045A842l20P3k57O11m36p00j21P67J2k84q12M30Q52j012j28J36N40l43n49l27
2065b6N61j07k41k06N41n08K80J45l31m30k50L50J19l54j81M79K8l84m77J002
2085A0J45m94q34L21L68k34m04rM11J39j98l20r1K33K15k32M03m93n83N51L97
2106f99k30o1J58Jk25j60P33J53n44m81j88J114j73p16q2R27RJq74N17l13j66
2128a299L33P02k3m40o97L06J36L37J51J76o13m45O38O41l32p27K65J13J6m9M07
2149d04M35m83p64K17M91N26j226p9N56M58J39n16j09L4J83j61l24J06J86K0j44
$$ plain form
2002 2022 1806 1279 1642 1535 1678 1575 1820 1444 2158 2275 2201 2021 1580 1861 2362 2363 1995 1883 2176 2110 2024
2023 2024 2088 2527 2623 1923 1759 1726 2432 2049 1598 1565 2048 2451 2088 1995 1652 1932 1921 1854 1097 1257 1888 1842
2045 1842 1522 1595 1338 1949 1513 813 692 1459 1471 1187 375 805 1657 645 517 653 1193 850 301 -26
2065 -26 535 428 187 -19 522 14 294 439 108 -322 -572 -222 -103 -457 -638 -159 -131 -515 -992 10
2085 10 155 -339 -1173 -852 -484 -718 -1122 -1131 -720 -581 -779 -1099 -1190 -957 -742 -974 -571 -1064 -1647 -1096 -699
2106 -699 -929 -990 -832 -831 -1056 -1216 -483 -330 -874 -1355 -1543 -429 -602 -1318 -1400 -473 -464 -463 -1337 -820 -1133 -1299
2128 -1299 -966 -264 -287 -727 -1424 -1118 -982 -645 -494 -318 -931 -1376 -738 -97 -429 -1156 -891 -778 -762 -811 -404
2149 -404 31 -452 -1216 -999 -508 18 -1208 -1287 -731 -273 -134 -650 -759 -725 -542 -703 -1027 -921 -735 -715 -859
2170h59o0m83N65K56j68m96K66L20k04r73J65J346K09p19p25P5Q22j06l12k17
2190a298j12R3J13N06n64l72l1Q68L91m85r8l99kk26N04P81k38p60n43R26O84
2211b62l73J43m79k30l04K66P02L62n19m03L15J91O03k87l33m1m0L49K53J05n90
2232e72J22N86M51k42n55q9M53j50k54O70m57M20j84P88J54n73j82K66N05n95
2252E62o89K08R22J14l51O1O20l29O5k91K91r6k89L7j45K95O72M85m15j201L07
2273H33Q44O41m52j126j88N90N81J06j73Nl98l37L26N87K89p89n23J56M97J36
2293A605J64l76p6k21J15K36k81R8k67J80l55M43M79k66k25m80J72P64n28p67
2313D14k92O79N92n09l24K45L46j28K87m37q41P44m5M8o66J6N78N06k34l86K41
$$ plain form
2170 -859 -919 -1402 -837 -581 -749 -1245 -979 -659 -863 -1836 -1671 -325 -116 -835 -1560 -1485 -663 -769 -1081 -1298
2190 -1298 -1410 -1317 -1204 -698 -1262 -1634 -1665 -797 -406 -891 -989 -1388 -1390 -1616 -1112 -331 -569 -1329 -1872 -946 -262
2211 -262 -635 -492 -971 -1201 -1505 -1239 -537 -175 -694 -1097 -782 -591 12 -275 -608 -649 -689 -340 -87 18 -572
2232 -572 -450 136 587 345 -210 -299 154 4 -250 420 -37 383 199 987 1141 568 386 652 1157 562
2252 562 -127 81 1003 1117 766 827 1447 1118 1183 892 1183 1087 798 835 690 985 1657 2142 1727 526 833
2273 833 1677 2318 1866 740 552 1142 1723 1829 1656 1661 1263 926 1252 1839 2128 1339 816 972 1469 1605
2293 1605 1769 1393 1317 1096 1211 1447 1166 1264 997 1177 822 1265 1744 1478 1253 773 945 1709 1181 414
2313 414 122 801 1393 884 560 805 1151 1023 1310 873 32 776 731 779 113 129 707 1213 979 593 834
2334H34k42pk96j76P74K5p17k83L87N30M6m39n73K69p7n9M03j95K1k01P2P35Q9
2357I20m87m16j77K25O79o9o19k03L18O22J5m59O4j4P5m33k21L01O04q9p82J50
2379DL59M66l58l30K7P7K40k91k39q2O58p9k93j46K8L07m11J12l13N68Q5k85l23
2402b19J47l5J02k62l1K04kn4l11Q7K42m4l35L22O8j9n66p3K84M07j19n74j5J77
2426f19J82q8n78N7J42L26j24n13O6K40j00j94qrJ9K59n15k8M50j39j2k30J81
2449a235L6J4j04l94K24K27Qj61J16j01J26j26m9K26m73M10k67RN87j43O8k99
2471a301J99K65p1p2l61j79K23L87k53O78j42m08r0P8M41j99l27J62j05K58L95
2492d22N46n68K23k84J89J81j92K99m07m3P1K93K24K21j76k70J19K24l0k11K6
$$ plain form
2334 834 592 585 289 113 887 912 195 -88 299 829 875 436 -137 132 55 -4 399 204 225 24 96 831 920
2357 920 433 17 -160 65 744 675 56 -147 171 793 808 349 413 399 474 41 -180 121 725 636 -146 4
2379 4 363 829 471 141 168 245 485 194 -45 -127 531 452 159 13 41 348 -63 49 -264 304 389 104 -219
2402 -219 -72 -107 -5 -267 -298 -94 -96 -150 -461 -374 -132 -176 -511 -189 -121 -140 -706 -779 -495 -88 -207 -781 -796 -619
2426 -619 -437 -525 -1103 -1046 -904 -578 -702 -1215 -1149 -909 -1009 -1203 -1211 -1220 -1201 -942 -1457 -1485 -1035 -1174 -1186 -1416 -1235
2449 -1235 -1199 -1185 -1289 -1683 -1459 -1232 -1224 -1385 -1269 -1370 -1244 -1370 -1419 -1193 -1666 -1256 -1523 -1514 -927 -1070 -1002 -1301
2471 -1301 -1102 -837 -908 -980 -1341 -1520 -1297 -910 -1163 -485 -627 -1035 -1125 -1047 -606 -805 -1132 -970 -1075 -817 -422
2492 -422 124 -444 -221 -505 -316 -135 -327 -28 -435 -478 -407 -114 110 331 155 -115 4 228 198 -13 13
2513A3j72K30L70L7J23M20p0k49k21M20j72q5l5l09N08J54k0M71k05o8k94k92
2535E54J95K64K54l76k15J72N60K87n1n04N3m27k7M35L6J0K5k55L4M63K07L00
2557A994j189o6K38L27Lj07kl72L54J74J33J58n17m46k85O22J68m8j92n58M74
2578H63L34j12q5l04L14k24l87j76P27K32m64k8k51L48N61p59l4l8L4j19l42O00
2600F90j67J65k53J73k84N89p5n97j56oJ15L90k23j41q2J68k63J25K41l94k2l07
2622c14j21Q65K02k74l83r5K94J58j92k49J80j97j60j8M40j07J92k41l12K5R2
2643b15L20o8l09l44M34N36m14j75P1l20K77j32J97p9J80l46l70M20o9Q04n44
2664a46m18l5J92P6qK34k62l85nJ05O22l36Q1j55m62K34J17M75o02M7J12j1l51
$$ plain form
2513 13 -159 71 441 478 601 1021 951 702 481 901 729 644 609 300 808 962 942 1413 1208 1140 846 554
2535 554 749 1013 1267 891 676 848 1408 1695 1644 1140 1193 766 739 1174 1210 1220 1245 990 1024 1487 1694 1994
2557 1994 805 739 977 1304 1307 1200 1198 826 1180 1354 1487 1645 1128 682 397 1019 1187 1139 947 389 863
2578 863 1197 1085 1000 696 1010 786 399 223 950 1182 718 690 439 787 1348 589 555 517 551 432 90 690
2600 690 523 688 435 608 324 913 838 241 85 79 194 584 361 220 138 306 43 168 409 15 -7 -314
2622 -314 -435 430 632 358 -25 -120 174 332 140 -109 71 -126 -286 -304 136 29 221 -20 -332 -307 -215
2643 -215 105 37 -272 -616 -182 354 -60 -235 -164 -484 -207 -339 -142 -221 -41 -387 -757 -337 -406 398 -146
2664 -146 -564 -599 -407 -331 -339 -105 -367 -752 -757 -652 -30 -366 -285 -440 -902 -668 -551 -76 -678 -631 -519 -530 -881
2687h81L24J13r0m43RK42K26m11o0j01O92l78j89qj30J40J91j52m14M78K25j06
2709g23n50k96N72K81l20rr0kM51l02j54l8K05N4l55K24K84K33k98o35M15L60
2731f93K46n35j15m94L34j12O58j52M9j62J91l66K69J1L51m27j90L01M3n4R4K47
2753e06M23j38n80J03K47O4m52M57o1M26n21L87k36K11P9j28O7j32m1K67Q2J86
2775B04k70K51P7k50q3L05K70l89j64k66Q44p1l78K05L81j7j16j35K28l7l53q9
2797A47j39L97L11m4j5j11J47L97j24m43j04j12J47J55l49K63K29L21k95k97J92
2818F73M0j19k58K85K78J4k84L4J54J46Q5j34m60P3M5L13Q2l28K91J30k37k69
2840E54j23N15k19J7QJ9O5k88oK44N70m26l73J69j29K79Q8n68lPN56j07m19M71
$$ plain form
2687 -881 -557 -444 -534 -977 -968 -726 -500 -911 -971 -1072 -380 -758 -947 -955 -1085 -945 -754 -906 -1320 -842 -617 -723
2709 -723 -1273 -1569 -997 -716 -1036 -1045 -1135 -1137 -686 -988 -1142 -1180 -975 -921 -1276 -1052 -768 -535 -833 -1468 -1053 -693
2731 -693 -447 -982 -1097 -1591 -1257 -1369 -711 -863 -814 -976 -785 -1151 -882 -871 -520 -947 -1137 -836 -793 -847 -753 -506
2753 -506 -83 -221 -801 -698 -451 -387 -839 -382 -443 -17 -538 -151 -387 -176 -97 -225 -158 -290 -331 -64 18 204
2775 204 -66 185 262 12 -71 234 504 115 -49 -315 529 458 80 285 666 649 533 398 626 589 236 147
2797 147 8 405 716 672 657 546 693 1090 966 523 419 307 454 609 260 523 752 1073 778 481 673
2818 673 713 594 336 621 899 913 629 663 817 963 1048 914 454 527 572 885 967 639 930 1060 823 554
2840 554 431 946 727 744 752 771 836 548 542 786 1356 930 557 726 597 876 964 396 393 400 956 849 430 901
2864I01l54n9J87k06J30j11O0j70j02P12L77o42l49l63P83k16k06j16L85l07n5
2885B79K0J35K98k69k47k6j58M43l29J87l14M55j2m8j90k59J02M40o26n4K51l8
2907D0K19j49J69K82l10j47j66N8k99k72M49K91j44l84J9l2K72j98Q0k85L46m05
2929e66qM02l9m6j19k9j39L52j69K69n51k94J21M65J59n24l0np9L84j24O2m6m15
2953i69l0L18J89M5l10j36j5J74N00p68k27R0L19M77p23j37J62n1J96j03j06K16
2975h89p5k00J75J4K10n9m99o4N58J8m67J43o5L36j29K49j91m62J73O35m95k0
2997a104j29J56J58l1K16k86J67l27M04Q4Ok38k01P6M07L64m51k25M05%R9o00
$$ plain form
2864 901 547 488 675 469 599 488 548 378 276 988 1365 723 374 11 794 578 372 256 641 334 279
2885 279 299 434 732 463 216 190 32 475 146 333 19 474 462 414 224 -35 67 507 -119 -173 78 40
2907 40 259 110 279 561 251 104 -62 -4 -303 -575 -126 165 21 -363 -344 -376 -104 -302 -222 -507 -161 -566
2929 -566 -574 -172 -211 -257 -376 -405 -544 -192 -361 -92 -643 -937 -816 -351 -192 -716 -746 -751 -830 -446 -570 -508 -554 -969
2953 -969 -999 -681 -492 -447 -757 -893 -908 -734 -234 -1002 -1229 -1139 -820 -343 -1066 -1203 -1041 -1092 -896 -999 -1105 -889
2975 -889 -964 -1164 -989 -975 -765 -824 -1323 -1387 -829 -811 -1278 -1135 -1200 -864 -993 -744 -935 -1397 -1224 -589 -1084 -1104
2997 -1104 -1233 -1077 -919 -950 -734 -1020 -853 -1180 -776 -692 -686 -924 -1125 -1049 -642 -278 -729 -954 -549 -549 -450 -1050
$$ [...]
8191a81
##END NTUPLES=NMR FID
##END=
