##TITLE=1H_SL 67-Dan(f5)
 CDCl3, 32 sc, 
 31.05.2021
##JCAMPDX= 6.0         $$ Bruker NMR JCAMP-DX V2.0
##DATA TYPE= NMR FID
##DATA CLASS= NTUPLES
##ORIGIN= UXNMR, Bruker Analytische Messtechnik GmbH
##OWNER= root
$$ XWIN-NMR		Version 3.5
$$ Mon May 31 10:51:34 2021 Russian Standard Time (UT+4h)  she@DPX200
##.OBSERVE FREQUENCY= 200.131506
##.OBSERVE NUCLEUS= ^1H
##.DELAY= (6, 6)
##.ACQUISITION MODE= SIMULTANEOUS
##.ACQUISITION SCHEME= undefined
##.AVERAGES= 32
##.DIGITISER RES= 18
##SPECTROMETER/DATA SYSTEM= spect
##.PULSE SEQUENCE= zg30
##.SOLVENT NAME= CDCl3
##.SHIFT REFERENCE= (INTERNAL, CDCl3, 0, 15.7039)
##AUDIT TRAIL= $$ (NUMBER, WHEN, WHO, WHERE, WHAT)
$$ ##TITLE= Audit trail, XWIN-NMR		Version 3.5
$$ ##JCAMPDX= 5.01
$$ ##ORIGIN= Bruker BioSpin GmbH
$$ ##OWNER= she
$$ F:/spectra/data/she/nmr/H-F/1/audita.txt
$$ ##AUDIT TRAIL=  $$ (NUMBER, WHEN, WHO, WHERE, WHAT)
(   1,<2021-05-31 10:50:24.71 +0400>,<she>,<DPX200>,
      <continue with go, POWCHK disabled, PULCHK disabled
       configuration hash MD5:
       00 E9 B6 7A A2 85 ED C7 34 08 36 98 17 FE 4E 26
       data hash MD5: 16K
       2B CF 42 62 D1 3E EB A2 01 D4 FB 94 78 BF DD 06>)
$$ ##END=
$$ 
$$ hash MD5
$$ D9 BD 0D 96 2B B6 2F E8 8D 98 CE 0B C4 BB 97 63
##$RELAX= 
##$RELAX= 
##$RELAX= 
##$RELAX= 
##$RELAX= 
##$RELAX= 
$$ Bruker specific parameters
$$ --------------------------
##$DU= <F:/spectra>
##$EXPNO= 1
##$NAME= <H-F>
##$PROCNO= 1
##$TYPE= <nmr>
##$USER= <she>
##$AMP= (0..31)
100 100 100 100 100 100 100 100 100 100 100 100 100 100 100 100 100 100 
100 100 100 100 100 100 100 100 100 100 100 100 100 100 
##$AQSEQ= 0
##$AQ_mod= 1
##$AUNM= <au_zg>
##$AUTOPOS= <>
##$BF1= 200.13
##$BF2= 200.13
##$BF3= 200.13
##$BF4= 200.13
##$BF5= 200.13
##$BF6= 200.13
##$BF7= 200.13
##$BF8= 200.13
##$BYTORDA= 1
##$CFDGTYP= 0
##$CFRGTYP= 5
##$CHEMSTR= <none>
##$CNST= (0..31)
1 1 145 1 1 1 1 1 1 1 1 1 1 1 1 1 1 1 1 1 1 1 1 1 1 1 1 1 1 1 1 1 
##$CPDPRG= <>
##$CPDPRG1= <>
##$CPDPRG2= <>
##$CPDPRG3= <>
##$CPDPRG4= <mlev>
##$CPDPRG5= <mlev>
##$CPDPRG6= <mlev>
##$CPDPRG7= <mlev>
##$CPDPRG8= <mlev>
##$CPDPRGB= <>
##$CPDPRGT= <>
##$D= (0..31)
0 1.2 0 0 0 0 0 0 0 0.06 0 0.03 0 0 0 0 0.0002 0 0 0 0 0 0 0 0 0 0 0 0 
0 0 0 
##$DATE= 1622443717
##$DBL= (0..7)
120 120 120 120 120 120 120 120 
##$DBP= (0..7)
150 150 150 150 150 150 150 150 
##$DBP07= 0
##$DBPNAM0= <>
##$DBPNAM1= <>
##$DBPNAM2= <>
##$DBPNAM3= <>
##$DBPNAM4= <>
##$DBPNAM5= <>
##$DBPNAM6= <>
##$DBPNAM7= <>
##$DBPOAL= (0..7)
0.5 0.5 0.5 0.5 0.5 0.5 0.5 0.5 
##$DBPOFFS= (0..7)
0 0 0 0 0 0 0 0 
##$DE= 6
##$DECBNUC= <off>
##$DECIM= 32
##$DECNUC= <off>
##$DECSTAT= 4
##$DIGMOD= 1
##$DIGTYP= 9
##$DL= (0..7)
0 120 120 120 120 120 120 120 
##$DP= (0..7)
150 150 150 150 150 150 150 150 
##$DP07= 0
##$DPNAME0= <>
##$DPNAME1= <>
##$DPNAME2= <>
##$DPNAME3= <>
##$DPNAME4= <>
##$DPNAME5= <>
##$DPNAME6= <>
##$DPNAME7= <>
##$DPOAL= (0..7)
0.5 0.5 0.5 0.5 0.5 0.5 0.5 0.5 
##$DPOFFS= (0..7)
0 0 0 0 0 0 0 0 
##$DQDMODE= 0
##$DR= 18
##$DS= 0
$$ [...]
##$SUBNAM2= <"">
##$SUBNAM3= <"">
##$SUBNAM4= <"">
##$SUBNAM5= <"">
##$SUBNAM6= <"">
##$SUBNAM7= <"">
##$SUBNAM8= <"">
##$SUBNAM9= <"">
##$SW= 16.9725357007746
##$SWIBOX= (0..15)
0 0 2 0 0 0 0 0 0 0 0 0 0 0 0 0 
##$SW_h= 3396.73913043478
##$TD= 16384
##$TD0= 1
##$TE= 0
##$TE2= 300
##$TE3= 300
##$TEG= 300
##$TL= (0..7)
0 120 120 120 120 120 120 120 
##$TP= (0..7)
150 150 150 150 150 150 150 150 
##$TP07= 0
##$TPNAME0= <>
##$TPNAME1= <>
##$TPNAME2= <>
##$TPNAME3= <>
##$TPNAME4= <>
##$TPNAME5= <>
##$TPNAME6= <>
##$TPNAME7= <>
##$TPOAL= (0..7)
0.5 0.5 0.5 0.5 0.5 0.5 0.5 0.5 
##$TPOFFS= (0..7)
0 0 0 0 0 0 0 0 
##$TUNHIN= 0
##$TUNHOUT= 0
##$TUNXOUT= 0
##$USERA1= <user>
##$USERA2= <user>
##$USERA3= <user>
##$USERA4= <user>
##$USERA5= <user>
##$V9= 5
##$VALIST= <valist>
##$VCLIST= <CCCCCCCCCCCCCCC>
##$VD= 0
##$VDLIST= <DDDDDDDDDDDDDDD>
##$VPLIST= <PPPPPPPPPPPPPPP>
##$VTLIST= <TTTTTTTTTTTTTTT>
##$WBST= 1024
##$WBSW= 4
##$XGAIN= (0..3)
0 0 0 0 
##$XL= 0
##$YL= 0
##$YMAX_a= 207728
##$YMIN_a= -208133
##$ZGOPTNS= <>
##$ZL1= 120
##$ZL2= 120
##$ZL3= 120
##$ZL4= 120
##$ABSF1= 10
##$ABSF2= 0
##$ABSG= 5
##$ABSL= 3
##$ALPHA= 0
##$AQORDER= 0
##$ASSFAC= 0
##$ASSFACI= 0
##$ASSFACX= 0
##$ASSWID= 0
##$AUNMP= <proc_1d>
##$AZFE= 0.1
##$AZFW= 0.1
##$BCFW= 1
##$BC_mod= 2
##$BYTORDP= 1
##$COROFFS= 0
##$CY= 11.3945322036743
##$DATMOD= 1
##$DC= 2
##$DFILT= <>
##$DTYPP= 0
##$F1P= 15.9154993809931
##$F2P= -4.1035820241983
##$FCOR= 0.5
##$FTSIZE= 0
##$FT_mod= 4
##$GAMMA= 1
##$GB= 0.15
##$INTBC= 1
##$INTSCL= 1
##$ISEN= 128
##$LB= 0.24
##$LEV0= 0
##$LPBIN= 0
##$MAXI= 10000
##$MC2= 0
##$MEAN= 0
##$ME_mod= 0
##$MI= 1.114404
##$NCOEF= 0
##$NC_proc= 0
##$NLEV= 6
##$NOISF1= 3.799351
##$NOISF2= 2.8
##$NSP= 1
##$NTH_PI= 0
##$NZP= 0
##$OFFSET= 15.70392
##$PC= 1
##$PHC0= -11121.27
##$PHC1= 13.60099
##$PH_mod= 1
##$PKNL= yes
##$PPARMOD= 0
##$PSCAL= 0
##$PSIGN= 0
##$REVERSE= no
##$SF= 200.130013532006
##$SI= 16384
##$SIGF1= 3
##$SIGF2= 2
##$SINO= 400
##$SIOLD= 16384
##$SREGLST= <1H.CDCl3>
##$SSB= 0
##$STSI= 0
##$STSR= 0
##$SW_p= 3612.71676300578
##$SYMM= 0
##$S_DEV= 0
##$TDeff= 0
##$TDoff= 0
##$TI= <>
##$TILT= no
##$TM1= 0
##$TM2= 0
##$TOPLEV= 0
##$USERP1= <user>
##$USERP2= <user>
##$USERP3= <user>
##$USERP4= <user>
##$USERP5= <user>
##$WDW= 1
##$XDIM= 8192
##$YMAX_p= 0
##$YMIN_p= 0
$$ End of Bruker specific parameters
$$ ---------------------------------
##NTUPLES= NMR FID
##VAR_NAME=  TIME,          FID/REAL,        FID/IMAG
##SYMBOL=    X,             R,               I
##VAR_TYPE=  INDEPENDENT,   DEPENDENT,       DEPENDENT
##VAR_FORM=  AFFN,          ASDF,            ASDF
##VAR_DIM=   8192,          8192,            8192
##UNITS=     SECONDS,       ARBITRARY UNITS, ARBITRARY UNITS
##FACTOR=    0.0002944,     1,               1
##FIRST=     0,             0,               0
##LAST=      2.4114304,     0,               0
##MIN=       0,             -208133,         0
##MAX=       2.4114304,     207728,          0
$$ Real data points
##PAGE= N=1
##DATA TABLE= (X++(R..R)), XYDATA
$$ [...]
2325e18O41n29P1Q56Q77j486k20k00p32N19R97p38L63P49o60m25l4J037l51k06
2345A1o0P11n02N3J40R8J26k47M2K22M97m54l14N25k15k65p7L89l1n20L52L11
2367G92l59p7j57j27N48n14K77m05o6Q64j560J215k22m18l03J147n27j66j92Q37
2387E87p07k84P69m42l72M91l66j50L97J35l24K88l99n44O15K8M6m65J36N37J43
2408A19o42O21n13K3l29O42j0N4K33l04j1P64j102J79O40k39j57j46O50m10k33
2429a71J002n1r04P40O2n13K18L49p66M25R32j551O08J17R8j170O95L7o4o07J70
2450c44L98n39N14J50j42n6R54q23j94K40k85l23L67J01k92j74L35m71L9Q7P4
2471c84m40O07K91o49K40L14n82L88j28PM65m0n27J48j30N71o60K14L49l72n5
$$ plain form
2325 -518 123 -406 -335 521 1398 -88 -308 -508 -1240 -721 276 -462 -99 650 -10 -435 -469 568 217 11
2345 11 -49 662 160 213 353 451 577 330 372 594 1091 637 323 848 633 368 291 680 649 129 481 792
2367 792 433 356 199 72 620 106 383 -22 -88 776 -784 431 209 -209 -512 635 108 -58 -250 587
2387 587 -120 -404 365 -77 -449 42 -324 -474 -77 58 -266 22 -377 -921 -306 -278 -232 -697 -561 -24 119
2408 119 -523 98 -415 -392 -721 -79 -89 -35 198 -106 -117 647 -455 -276 364 125 -32 -178 472 62 -171
2429 -171 831 780 -124 616 678 165 383 732 -34 391 1323 -228 380 497 595 -575 120 157 93 -514 -344
2450 -344 54 -485 29 179 37 -19 935 112 -82 158 -127 -450 -83 18 -274 -448 -113 -584 -545 -458 -384
2471 -384 -824 -217 74 -575 -335 -21 -603 -215 -343 -336 129 89 -438 -290 -420 151 -509 -295 54 -318 -373
2492c73M10k38J82K13o9J43o61R28k31J18j79O8j64j34K3j1O9j91P55N9l82K83
2514F18m36L8J06L17l52J23o9n90M54k5K26m79Q05n97m2j07j66Q1j9O10p60j82
2536d46L85R0j91l6Q6N73m17N15q41m06O19o9k82L64k49m93K70L13K24q26O94
2557a23m76j0L02L63k15m91O44m91P19o59K09K14o09O05p81J372j040O41pM19
2577E86l07M59r62K47l0m99K01L52M59l08K37p0l13M78j99o60J301n88l55N57
2597E86K13j71q4k12L34J95p14r1N16r84J387r11k10N78q39J46J21O4J008l62
2617E70j2n30O60r6j583j58L61J966k775P24n83K93N07R08o78J28K43J65r10M97
2637c03J030n83j60L36M13r22l3O45p66k88J737o53j99L77k36J79m04K5P9n4k53
$$ plain form
2492 -373 37 -201 -19 194 125 268 -393 535 304 422 243 311 147 13 36 25 94 -97 658 717 335 618
2514 618 182 220 326 643 291 414 345 -245 209 184 410 -69 736 139 97 -10 -176 -95 -114 496 -264 -446
2536 -446 -61 29 -162 -198 -112 461 44 559 -282 -688 -69 -138 -420 -56 -305 -798 -528 -215 9 -817 -123
2557 -123 -599 -609 -307 56 -159 -650 -6 -497 222 -437 -228 -14 -623 -18 -799 573 -467 174 167 586
2577 586 279 738 -224 23 -7 -506 -305 47 506 198 435 365 52 530 331 -329 972 384 29 586
2597 586 799 628 544 332 666 861 147 56 572 -412 975 64 -146 432 -407 -261 -140 -76 932 570
2617 570 558 28 688 592 -991 -1149 -788 1178 -1597 -873 -1456 -1163 -656 252 -426 -298 -55 110 -800 -303
2637 -303 727 144 -16 320 733 -189 -222 423 -343 -631 1106 453 254 631 395 574 170 195 274 220 -33
2658c3J64KK32j09o02J208n10O95j155K8N03K0k75r70J152o4j5l52j98N08L72
2679F01q83K4Q51m02l89O6nQ05j034N21m74L13Q75j696m63J448j19J7j220P55
2699d09M5J95k52J031p72J0n63L43K98j453O57P64l68O12o21Q62r10P13p41J99
2719c60M72L44j25l34J90o20l9K46M0k17P38p68R46j334O51L70Q00j468N23j50
2739i5K83N1n09R4O78NM9p74n49J562k02n82K56k16J50N57p75m56L25R85k34j656
2761a053R94L31N82q55r39J705l33n78Qj65Q0j31j41M1K67q13N32O11j027j14
2781i98J109o98Q47n19L44k24n5M4r9l31J86N08p09J71O73J53n55l00J10J025
2801F82o33K77l28m56J176L67j506Q81K82o96l02R57N4m04M41n70O27o74L35k06
$$ plain form
2658 -33 131 133 365 256 -346 862 352 1047 -108 -80 423 443 168 -802 350 286 271 -81 -279 229 601
2679 601 -282 -258 593 191 -198 -132 -137 668 -366 155 -319 -6 869 -827 -1290 158 39 56 -1164 -409
2699 -409 -364 -169 -421 610 -162 -152 -715 -372 -74 -1527 -870 -106 -474 138 -483 379 -531 182 -559 -360
2719 -360 112 456 331 -3 187 -433 -472 -226 -186 -403 335 -433 513 -821 -170 200 1000 -468 55 -95
2739 -95 188 239 -270 -176 502 507 556 -218 -767 795 593 11 267 51 201 758 -17 -473 -148 837 603 -1053
2761 -1053 -59 272 854 -1 -940 765 432 -146 -138 -303 -223 -354 -495 -454 -187 -1000 -468 143 -884 -998
2781 -998 111 -587 260 -259 85 -139 -194 -150 -249 -580 -394 114 -595 -424 249 402 -153 -453 -343 682
2801 682 49 326 -2 -458 718 1085 -421 460 742 46 -256 701 755 351 792 222 849 175 510 304
2821C04N01m52k26P01p56l83R56n61j70K60j14k88Q68m0o18k28P43P7r11R31p10
2842a16m35l53q2J480m45L58l00n13o74J244p98O11k34l13R60k33n56N63j78l51
2862c65R54j428R21k30k52N33K69Pn97p6J102q47l28K30N15k98L25r74N70J38
2882A69l36J08L46K41K66k67k95L20k7J11j236P94n51O60L67l19k13N15j13o3
2902D77m12k08M19J03n38K92K42M48r26o2O0m0n9L21N41j079R70l66p06M46p6
2923a53j12j16O71j1p65O92m90j27M11l97K12k53K97k62M69k5L35Ro95O61J12
2944D63j230J222k6k74m06m17O51J38j78m41P28K27R6r4j096Q33r38O96M08n23
2964a61M21j49O48n10J201q28p20R9N79j228Q88J14k83K41l66J67m74k23P12J39
$$ plain form
2821 304 805 353 127 828 72 -311 645 84 -86 174 60 -228 640 600 -18 -246 497 574 -337 594 -116
2842 -116 -551 -904 -986 494 49 407 107 -406 -1080 164 -634 -23 -257 -570 390 157 -399 164 -14 -365
2862 -365 589 -839 82 -148 -400 133 402 409 -188 -264 838 -9 -337 -107 408 110 435 -539 31 169
2882 169 -167 -59 287 528 794 527 232 552 525 636 -600 194 -357 303 670 351 138 653 540 477
2902 477 65 -143 276 379 -159 133 375 823 -103 -165 -105 -145 -204 117 658 -421 549 183 -523 -77 -153
2923 -153 -265 -381 290 279 -486 206 -284 -411 0 -397 -185 -438 -141 -403 66 41 376 385 -310 351 463
2944 463 -767 455 429 155 -251 -668 -17 121 -57 -498 230 457 553 459 -637 196 -742 -46 362 -161
2964 -161 260 111 759 249 1450 622 -98 1 580 -648 240 354 71 312 -54 113 -361 -584 128 267
2984B67l20n81J189n20kk94k83N27M98n35M36j182J21o9N52O45l30L35j809J408
3004E3n73L71K3l11j13R53r25O76r8J30o03O14ro46l62P60n30N41J467j268o26
3025d76P02m00J15P86p09m72k25J280k41l36L30l0j29N24o42o6j79N83l37m0K94
3046C32K3J7m19L89m19L01k95p78O66L15n63R8P94k29k29n5l5L46p7M25k23m4
3068C40p62K47J0M46n51l04M46n65K04O57n5J06K28p5n13q33J041k54M42k07p68
3089g20M81L09k09%k29q3j8kN22k48l92Q42n7k34J97J48k63j08J77P2k32o5M75
3112C63m04O48P89j502K63M71jk56j66j71L69Q15j481k33M17M33j258R01J48l84
3132b39J29P96m47j072J034p40N26l3n49M52J04N19n12k93J13O56o12J61K46p29
$$ plain form
2984 267 -53 -634 555 35 33 -261 -544 -17 481 -54 382 -800 -679 -748 -196 449 119 454 -1355 53
3004 53 -520 -149 -126 -437 -550 403 -522 154 56 186 -417 197 188 -458 -820 -60 -590 -49 1418 150 -476
3025 -476 226 -174 -59 727 18 -454 -679 601 360 24 354 324 195 719 77 11 -168 415 78 38 332
3046 332 355 372 -47 342 -77 224 -71 -849 -183 132 -431 -333 461 232 3 -52 -87 259 182 607 384 340
3068 340 -422 -175 -165 281 -270 -574 -128 -693 -489 168 113 219 447 372 -141 -974 67 -187 255 48 -720
3089 -720 -239 70 -139 -139 -368 -451 -469 -471 51 -197 -589 253 196 -38 159 307 44 -64 113 185 -47 -112 363
3112 363 -41 607 1396 -106 157 628 627 371 205 34 403 1218 -263 -496 -79 354 -904 -3 145 -239
3132 -239 -110 686 239 -833 201 -539 -13 -46 -595 -143 -39 480 -32 -325 -212 444 -168 -7 239 -490
3152d90M43M18m18l54M26K40m51j45O0Q87j556N33Q97n25r4J38J81r14P02n26
3172e48Q45m63L18m34N21k43p2L2O48o74j67M14J09J55m31K13r6j89J002j256
3192c16o3M70L82n14M22k98J66K54n33J84n01P15N1l1m92K11l39K8J89N89p82
3213b08l04P50l10M6J84n33j95N13k00j31J0J30jK66o31J20J23L53n94L90P7m6
3235a91K68m87q0M86n50L54q7N62m61M87j82J30o22K95k23L64m57L05N98j91k97
3256B1m03M53K63j51J11J87l87J62L10p1n12m52P58ql66l3P25m28j3J20k15N43
3278F14n36k75L31j22l1J23lN6j24k26K1k01O75n97k87L56K94m30L27K12l98J87
3300c4l20J24kO23K7m09K01n11J16M6l84M25p2J1M98o53K78Q8j37n97N48l34P23
$$ plain form
3152 -490 -47 371 -47 -401 25 265 -186 -331 -271 616 -940 -407 490 -35 -129 9 190 -724 -22 -548
3172 -548 297 -166 152 -282 239 -4 -76 -44 604 -70 -237 177 286 441 10 223 127 -62 940 -316
3192 -316 -379 91 473 -41 381 83 249 503 -30 154 -347 368 419 388 -104 107 -232 -204 -15 574 -208
3213 -208 -512 238 -72 -26 158 -375 -570 -57 -257 -388 -378 -248 -249 17 -614 -494 -371 -18 -612 -222 -145 -191
3235 -191 77 -410 -490 -4 -554 -200 -287 275 -186 301 119 249 -373 -78 -301 63 -394 -89 509 318 21
3256 21 -382 71 334 183 294 481 94 256 566 495 -17 -469 289 281 -85 -118 607 179 166 286 71 614
3278 614 78 -197 134 12 -19 104 101 157 33 -193 -172 -373 302 -295 -582 -226 68 -362 -35 177 -221 -34
3300 -34 -354 -230 -232 391 418 9 210 -301 -185 -139 -523 -98 -170 -159 339 -314 -36 52 -85 -682 -134 -468 255
3323B55l70L59J03q18Q45p78J235k38k67m79j19N02K81k44k51J57j51L54L75m56
3343B95n72R43k63J48m52o17R15n20K14L77l07N55j505Q86L75r3k37K95l83QM61
3364E23l07M10q05O4J219n15k24k01p56J018p61P40k49m18L24M18j338J107r21
3383f72J96K46k01j65N70o37M53J79o45P91O02q05j50K06Q4L78n90qP9M65o19
3404b43Q9O40p08M82Oj26J9K54j98J34j59k14p1K19J1l36J69j45K93K53l12K09
3426B66q38R32k7p83P61k37r8J55o2J5N6m97N51q3k08J58o4O23r43M22J36j43
3448I2M36o26l08P1M52L2m42L31k53l01N37m41N5M41o33P44l84R5J47j36K10L99
3470E18q25K88m31K19m3j02J040p12l21L32J00J9r5P5q4J15J8l0K14m47O68k49
$$ plain form
3323 255 -115 244 347 -471 374 -404 831 593 326 -153 -272 230 511 267 16 173 22 376 751 295
3343 295 -277 666 403 551 99 -518 397 -123 91 468 161 716 -789 97 472 379 142 437 54 62 523
3364 523 216 626 -179 -115 1104 589 365 164 -592 426 -335 405 156 -262 62 480 -858 249 -672
3383 -672 -476 -230 -431 -596 -26 -663 -210 -31 -676 115 717 -88 -238 -32 52 430 -160 -168 -89 376 -243
3404 -243 -154 486 -222 260 266 140 159 413 215 349 190 -24 -95 124 135 -201 -32 -177 116 369 57 266
3426 266 -572 360 333 -450 311 74 -24 131 69 84 140 -357 194 111 -97 61 -3 620 -323 99 235 92
3448 92 528 -98 -406 -335 117 149 -293 38 -215 -516 21 -420 -365 76 -557 187 -197 -102 45 -91 119 518
3470 518 -307 -19 -450 -231 -274 -376 664 -48 -369 -37 63 82 -13 62 -22 93 111 81 295 -152 516 267
3492B67j79n7j16O19l72l2K22K35l55l48K60K33j85j65O09m15m81J63K27J19k77
3513b8M51k26k74l47J83M15k43K27j74K69j62l68N11K63n43J93l94j75J66K30
3533b6J69n58L35Q78r28k59J47M03m20L25O0k2j90O25j183O78L76o35J00O80r74
3554d19M58k42RM92Mn25J07N90l75j55M49n01K08l88L66j25K45m11M66J21q6r2
3576A96p35P50m55K95n40K93L05J7l22P32o50R3k72L53J21j85Ll83K01J85K83
3597B85K23q91N03L63Po09J05j70L59q02N4R26k15m72j74Q2M65J28m82n8K64n68
3619f77O99j04J05m43M49j54l28K03L5J31k86m4J016k52N98n82n64j43J171M54
3639A284j016p14n69J326m99N56J35q5o8k16k22K55J79Q9m11o79J449p72P04l15
$$ plain form
3492 267 88 31 -85 534 162 130 352 587 232 -116 144 377 192 27 636 221 -260 -97 130 249 -28
3513 -28 423 197 -77 -424 -241 174 -69 158 -16 253 91 -277 234 497 -46 147 -247 -422 -256 -26
3533 -26 143 -415 -80 798 -130 -389 -242 161 -259 66 126 104 -86 539 -644 34 410 -225 -125 555 -419
3554 -419 39 -203 -194 298 302 -223 -116 474 99 -56 393 -108 100 -288 78 -47 198 -213 253 374 288 196
3576 196 -539 211 -244 51 -489 -196 109 126 -196 536 -114 -21 -293 60 181 -4 -1 -384 -183 2 285
3597 285 508 -383 120 483 490 -119 -14 -184 175 -627 -573 353 138 -334 -508 -426 39 167 -315 -373 -109 -677
3619 -677 22 -82 23 -420 29 -125 -453 -250 -215 -84 -370 -414 602 350 948 366 -198 -341 830 1284
3639 1284 268 -446 -1015 311 -188 368 503 418 350 134 -88 167 346 435 24 -655 794 22 726 411
3659D11N54n50k97R9n27K08P7K29l07J59ll99L17kk39K27M5J03l03P44o56K21
3681A11l33n74K94N55j16q6K65j69m84Q9K15l29R89P33k463J455k19q22R87K14
3701C12q01Q03P1R5K3LP2o86N53p04R96n42J73P4l41M08p57O50m00MP8k89P78
3724E73l81k93J87j28l08M32r1j64R97p32R6l16L5k16K33l23O70l29l8K08j51
3745c9L52k58j06q6K17K45j29q2K60l99k29Q24j026O15M5j27k65P0l33M08k60
3766c03P51p06K15P85p69k1k6J48n09L54J12Ol26J77O5L46j33m16L18o31Q15J47
3788C99p51M62j09K65k40o6L37J72r1n52P70m44M45k21k09k16N86l18m66L55k61
3809a53P8N52o16J50J21p7J21l07q8K79J41m28O10p44O0K12k5l60N58m85m0N50
$$ plain form
3659 411 965 415 118 217 -310 -102 -25 204 -103 56 53 -346 -29 -31 -270 -43 2 105 -198 546 -110 111
3681 111 -222 -796 -502 53 -63 -149 116 -53 -537 -448 -233 -562 427 1160 -1303 152 -67 -889 98 312
3701 312 -489 314 385 480 503 506 578 -108 445 -259 737 195 368 442 101 509 -248 402 2 6 84 -205 573
3724 573 192 -101 86 -42 -350 82 -9 -173 824 92 188 -128 -93 -309 -76 -399 271 -58 -96 112 -39
3745 -39 313 55 -51 -137 80 325 196 114 374 -25 -254 570 -456 159 204 77 -188 -118 -451 -43 -303
3766 -303 448 -258 -43 742 -27 -48 -74 74 -435 -81 31 37 -289 -112 -47 299 166 -250 68 -563 252 399
3788 399 -352 110 1 266 26 -40 297 469 378 -174 596 152 597 376 167 -49 537 219 -247 108 -153
3809 -153 -75 477 -139 11 132 55 176 -131 -219 60 201 -227 383 -361 -301 -89 -114 -474 84 -401 -441 109
3831A09r9L68o16K40p4l28M18m11L12m2Kj62J86l25L70K29JL1n77K00J14m58J98
3854c14K51l30M00K0J39o36N44l32K31J06l81K94J84q4n9J54k05Q0k06O07p33
3875b70L6Q9L06j85o6N00l01J13j95Q7n16O88o04K74L30m46K51m29P83q22L59
3896a8K10m2l36O0o35K36K96N70q9n22N44m34l82L32L84p34l01K47L34j84O29
3917A65o34N33J51n9k89m8j9K33j05j90k0q7K40J09o23J019q1J77m27K26P1n0
3939B92j60K7j9n41M70j32P70l86j46L60k58Q0n2l2l06N03n18J36L16J91n09M22
3961E08P04r98j04P41q16l80Q26j94j28L23J18l28n09L13k48rp50N24J317j165
3981b55L12l49o90O76J59R15r92l98P40L13k50k39k26L17k8M48p60J069o77m1
$$ plain form
3831 109 10 378 -238 2 -72 -400 18 -393 -81 -123 -121 -283 -97 -422 -52 177 178 209 -368 -168 -54 -512 -314
3854 -314 -63 -393 7 27 166 -470 74 -258 -27 79 -302 -8 176 92 33 187 -18 62 -144 463 -270
3875 -270 -234 -145 161 -24 -90 410 109 222 27 114 -402 286 -318 -44 286 -160 91 -338 445 -377 -18
3896 -18 192 150 -186 -126 -761 -525 -229 341 252 -270 274 -160 -542 -210 174 -560 -861 -614 -280 -464 165
3917 165 -469 64 215 156 -133 -181 -200 33 -72 -262 -282 -369 -129 -20 -643 376 295 472 45 271 342 292
3939 292 132 159 140 -401 69 -63 707 321 175 535 277 357 305 273 -33 470 -48 88 404 595 86 508
3961 508 1212 214 110 851 35 -345 481 287 159 482 600 272 -237 76 -172 -181 -931 -407 910 -255
3981 -255 57 -292 -982 -306 -147 768 -224 -622 118 431 181 -58 -284 33 5 453 -307 762 85 44
4001D4N27o88O45K69j656P38M6L77n09K88k59j036J736l25K98j022M26o01P67
4020F5l35L42n70L58N66k31l01Q06m03M16l77m80L70J05o9l8q58J347p10o6M52
4041C89k16R04n68o06N75n58m22P25k00N96o11J43p65J276q68N11J98p08K12n94
4061e87N68m94L19J18k51J08J05j53K96J78o69M00n37P64L48j138K66P62l79j75
4081a51J73l12L55l45J372j448O52q69J108m85n02J295o29N16k58l07O3l06q6
4100a64R35l70m80O27k78L80k32J7r76P78L59p43m50Q46j87K95q3o0K77n90J08
4121Il07M19m00J18L05j45m87K58K72k57K43Qm7p64Q79k47L7K40n4L19l66O81
4143G14j334M50K99k74L75q09M88P6K18l12N6j83N80p90M38l38k94O02O98m72
$$ plain form
4001 44 571 -117 528 797 -859 -121 -75 302 -207 81 -178 -1214 522 197 495 -527 -101 -702 65
4020 65 -270 72 -498 -140 426 195 -106 700 297 713 336 -144 226 331 262 224 -634 713 3 -63 389
4041 389 173 1077 509 -97 478 -80 -502 223 23 619 8 151 -614 662 -206 305 503 -205 7 -587
4061 -587 -19 -513 -194 -76 -327 -219 -114 -267 29 207 -462 -62 -599 165 513 -625 -359 403 24 -151
4081 -151 22 -290 65 -280 1092 -356 296 -573 535 50 -452 843 214 730 472 165 228 -78 -164
4100 -164 771 401 -79 548 270 650 418 435 -541 237 596 -147 -597 249 62 357 274 214 491 -99 9
4121 9 -298 121 -279 -161 144 -1 -488 -230 42 -215 28 36 -11 -775 104 -143 -106 134 80 399 33 714
4143 714 -620 -170 129 -145 230 -579 -91 -15 203 -109 -53 -236 344 -446 -8 -346 -640 -38 660 188
4163A88k17L11q1k17L19K6q10L46M64o03M41K15j17n1J15l17M1p5j84N7P65o68
4185e2K68j88J88m23q7O58j79m64R7q7J07J47K2K3m6k7K5n9p4N38m91j09P29r15
4209c99l41O13J98l37K25o1j66k32J39J19J5J92K7j24Q26r25J32P5n8jO00o29
4231a12J54l4O61m26q70M04M52m61M35r3rJ29p33M38N14k59p33R65L9k14L1p20
4253d42P95l81L59r36N84n30O84p79N99L55N24j125N84j203Q28m25j12O84n28
4272d65L15m41Q79o23q7R29m25p41P49r79N99J304j091o0Q0m24J006n20m12K0
4292c87P09l49M23j72m66O04l87j63N9j2o2J71J0l9j69MK18k57L51k80j26K12
4314a08L19p03N13l91O58j56m62J254k06p07O0K13M33j100L76k63K50l24R9J41
$$ plain form
4163 188 -29 282 201 -16 303 329 -481 -135 329 -274 167 382 265 214 329 12 53 -22 -206 -149 616 -52
4185 -52 216 28 216 -207 -294 364 185 -279 -182 -269 -162 -15 7 30 -16 -43 -18 -77 -151 387 -104 -213 516 -399
4209 -399 -740 -127 71 -266 -41 -102 -268 -500 -361 -242 -227 -35 -8 -132 694 -231 -99 -24 -82 -83 517 -112
4231 -112 42 8 669 243 -627 -223 229 -232 203 110 101 230 -503 -65 449 190 -543 422 461 247 278 -442
4253 -442 353 -28 331 -605 -21 -551 133 -646 -47 308 832 -293 291 -912 -84 -509 -621 63 -465
4272 -465 -150 -591 288 -335 -422 507 82 -659 90 -889 -290 1014 -77 -137 -57 -481 525 5 -407 -387
4292 -387 322 -27 396 224 -242 362 -25 -188 -129 -141 -203 -32 -22 -61 -230 -226 -8 -265 86 -194 -320 -108
4314 -108 211 -492 21 -370 288 132 -330 924 718 11 71 284 717 -383 -7 -270 -20 -344 -245 -104
4334a04P8K8M69K1l56k01j94K89k5K79l13L03r3Lm16O34k75L25k80K4J84r75N21
4357g4L1J96Q4k14p6J51q0o29R30m63M93j22k75M14o04M00j20K48k08J02o02K01
4379b17M83n80l90J094j58j90l65N07Jl86J85L5o58j86J092j15o21K83L64o60
4399d82J050p07L87L45p50N61l50M25r80L60N13j96L79q10N13k15L66j38J53l01
4419A23J34N06p95K22j44k65K55p19K6M04P34q56N00m97L61p3K1M70n29M2L37
4440B57m34J6O07o80K97O93j288O60m7j45N53J27j58j187J113j075M32J74M1r3
4460a37j15J05K38j77k36K04N8l9m18K02R18r44N38j54L6m6p0M75l75n60P36p9
4482A60K54m56k80K72J69P89p55m68L55K57j77N3PR9j4l67J4n01K49P36L74p91
$$ plain form
4334 -104 -26 2 471 492 136 -65 -259 30 5 284 -29 274 181 184 -232 402 127 452 172 196 380 -595 -74
4357 -74 -43 153 237 23 -53 98 18 -611 319 -144 349 227 -48 366 -238 162 42 290 82 184 -418 -217
4379 -217 266 -314 -704 390 232 42 -323 184 185 -201 -16 19 -639 -825 267 152 -469 -186 178 -482
4399 -482 568 -139 248 593 -157 404 54 479 -501 -141 372 176 555 -255 258 43 409 271 424 123
4419 123 257 763 -32 190 46 -219 36 -683 -657 -253 481 -375 125 -372 -11 -84 -63 407 -122 -80 257
4440 257 -177 -161 446 -234 63 756 -532 128 81 -64 489 616 458 -729 384 -691 -259 -85 -44 -137
4460 -137 -252 -147 91 -86 -322 -118 -60 -99 -517 -315 603 -341 197 43 79 33 -37 438 63 -497 239 160
4482 160 414 -42 -322 -50 119 908 153 -315 40 297 120 173 180 279 265 -102 -88 -589 -340 396 770 -21
4504b1J09k41J63j62nM1l0j21M24k52o7J31k67M93k60O5k02O46j011N85m03j29
4526e14qO43k05o6J85j30q0j13R2L68p9l62L69l79P7K4Qk7R25n45Q4l55j06l2
4550b26r2L33J3l16K17J96O1j29R2l75N54k44n63O53j67r4J02o64P79m92M89j95
4572f8j20q0K51M20l38k38o6N19l30k87M38P9l48J67J5N33l20l56k88L83k44j36
4594d14L99p77J575j374P03p87O63j4p90J573j036J69n32J608j027N91q75R30
4612E85n02l81K82k54Q14K48j082q5j30J408j195M33r11O74N60r20N34k12Pn47
4632f74J405l40o15o51O22l04J475j260O94o92L58j07P79j171L09M21j197J666
4650G18j133M48j173J493k00k63k82N98j057J328m85k45L32m59m81L87J058j11
$$ plain form
4504 -21 88 -153 10 -152 -157 -116 -146 -267 157 -95 -162 -31 -298 195 -65 0 -202 444 -567 18 -385 -514
4526 -514 -522 121 -84 -150 35 -95 -175 -288 -196 172 93 -269 100 -279 -202 -178 -170 -197 728 183 267 -88 -194 -226
4550 -226 -318 15 28 -288 -71 125 186 57 149 -226 328 84 -479 174 7 -87 15 -649 130 -362 127 -68
4572 -68 -188 -268 -17 403 65 -173 -239 280 -50 -337 101 180 -168 -1 14 547 227 -129 -417 -34 -278 -414
4594 -414 -15 -792 783 -591 112 -675 -12 -26 -816 757 -279 -110 -642 966 -61 530 -345 585
4612 585 83 -298 -16 -270 544 792 -290 -375 -505 903 -292 141 -770 -96 464 -456 78 -134 -127 -674
4632 -674 731 391 -224 -875 -253 -557 918 -342 352 -340 18 -89 690 -481 -172 249 -948 718
4650 718 -415 33 -1140 353 153 -110 -392 206 -851 477 -8 -253 79 -380 -861 -474 584 473
4668D73o90pK14N02n12o1M81m31R46l51n59P4L28k2l64O4K09j369N36J69M17m47
4690d00L49j66M99j441J836q5j304J61M83o36K89O7k09K99J8l50O99j41k70J220
4710I18p40o78J321j41q75L07n80O15j36O87m62k27q6p12Q73p62N12N88Nj4m7
4731C66l34J29L12n78j4L43q61N64j39j74N68l32K65l37O24j082R36j11m3k57
4751a55K25o38N28M1m38K87O8m76O72r2L16J15l48J74n95N42o26N47n73M68O91
4772G33n41j76N62j30n03No2N6K32J4l0o29M69O4P0J78o15M84n40N01K17k16J55
4795B98n48M32k23L05j60O4p4J80l97O67o9n77J16J78m22K98L10P3k71l83P32
4816E29n25j98j4M9k6K5J4K04K68k73j7l17M58j97q6P6m00L80L0P8J14p31K78
$$ plain form
4668 473 -217 -224 -10 492 -20 -81 400 -31 915 564 5 79 407 385 21 85 294 -1075 -539 -370 47 -400
4690 -400 -51 -217 282 -1159 677 592 -712 -551 -68 -704 -415 -348 -557 -258 -240 -590 109 -32 -302 918
4710 918 178 -500 821 680 -195 112 -468 147 11 698 236 9 -77 -789 84 -678 -166 422 427 413 366
4731 366 32 161 473 -105 -119 224 -637 -73 -212 -386 182 -150 115 -222 402 -680 256 145 102 -155
4751 -155 70 -568 -40 1 -437 -150 -82 -558 114 22 338 453 105 279 -316 226 -400 147 -426 42 733
4772 733 192 16 578 448 -55 -50 -112 -56 176 190 160 -469 0 64 134 312 -303 181 -359 142 359 143 298
4795 298 -250 182 -41 264 104 168 94 274 -123 544 475 -102 14 192 -230 68 378 451 180 -203 529
4816 529 4 -194 -208 -159 -185 -160 -146 58 326 53 36 -281 177 -20 -106 -30 -430 -50 -20 58 172 -559 -281
4839b81K49l28L18M58k52k67K48k67J06j90r9K58K51j13j76k90K25K36q0K11P
4860B24k84K03J19j21n11Q95m77o10R02m22Q35r70m6P26m69K9L71N53P3j362L12
4881c0o4q5P60n55L13j279P92R56K20l36q26k71J252j155m99J297q03Q65n67M
4901a1K9n08K6M51LM34l30n08M22L86M2r51O87N77q84p45J446l43l76L3m94N38
4923g6n48R80n3l28Qk97Q21j023J124m13o16L36j52m57K2J016q55J025n96M50
4943C68l91K91j273J609o05N91o88N22k12m46Q04K12j408M37L86k68L27L01n19
4962C8k44M44k80L32P1o70J46J62M72r09o2L88Q28j189K10K09n15N93m1K46j213
4983i84J306m27N30j195J372p53M48J06p03P93m13J16J44K66j319K14L43m8J09
$$ plain form
4839 -281 -32 -360 -42 416 164 -103 145 -122 -16 -206 -305 -47 204 91 -85 -375 -150 86 6 217 224
4860 224 -60 143 262 141 -370 525 48 -562 340 -82 753 -217 -263 463 -6 23 394 947 1020 -342 -30
4881 -30 -94 -179 581 26 339 -940 -148 808 1028 692 -134 -405 847 -308 -807 490 -313 552 -15 -11
4901 -11 18 -490 -464 -13 -10 424 94 -414 8 394 436 -515 172 749 -135 -880 566 223 -153 -120 -614 -76
4923 -76 -624 356 303 -25 -17 -314 507 -516 608 195 -421 -85 -237 -694 -672 344 -511 514 -82 368
4943 368 -23 268 -1005 604 -1 590 -98 424 212 -234 570 782 -626 -189 197 -71 256 557 38
4962 38 -206 238 -42 290 361 -309 -163 -1 471 -438 -500 -112 716 -473 -263 -54 -569 24 -17 229 -984
4983 -984 322 -105 425 -770 602 -151 297 403 -300 493 80 196 340 606 -713 -499 -156 -204 -95
5002i5R92q63K3L77L40m39O95j780J233o14j67M10J16L6l37k16L53K62j55r49
5022g78P19j00M57J29n43N37q52J672r19j92o40o04J349p3J40j76p40O19R87o30
5042C62N8N9p48k84J503q83n4q35J409k51j18n12M69K64R7l16P18j417R67k34
5062B54k57P79q52J2L40l18L91r25L34p2K40J36q68P03k02M74P6m12L85J006q93
5083C31p47O44o26R14m28j46J90qK28M12j010J4P18m28J12N0l35J84k30P21k97
5104B63k94O54p33L29J0j93m33K05K93r1N82j45j22K93n64mK40m53j54J73k08
5125c52R5k64M20L9J96l25L70J11k10m80L88k99O35n82k95K73N39P05j48p58r20
5146h62M90k27L72R9r72R37L1M00K9k61M7J80K50n28j66K02q7J24l02L23j17N1
$$ plain form
5002 -95 897 34 57 434 774 335 1030 -750 483 -131 -298 112 228 264 -73 -289 64 326 171 -778
5022 -778 -59 -159 298 427 -116 421 -431 1241 322 130 -510 -1114 235 162 302 126 -614 5 992 362
5042 362 420 479 -269 -553 950 67 13 -822 587 336 218 -294 175 439 536 220 938 -479 488 254
5062 254 -3 776 -76 -64 276 -42 349 -576 -242 -314 -74 62 -806 -103 -305 169 245 -167 218 1224 331
5083 331 -416 228 -398 516 88 -58 132 124 352 764 -246 -232 486 58 170 220 -115 69 -161 560 263
5104 263 -31 623 -110 219 229 36 -397 -192 101 10 592 447 325 618 54 50 290 -163 -317 -144 -352
5125 -352 -257 -521 -101 -62 134 -191 179 290 80 -400 -12 -311 324 -258 -553 -280 259 964 816 58 -862
5146 -862 -372 -599 -227 -128 -1100 -163 -132 268 297 36 83 263 513 -15 -181 21 -66 58 -244 79 -38 13
5168A3o4N8pK85l9K22m1p33k3K45J34n7r0K32q0m75O31k95M39q53M03K44j76l34
5192c61N84m33M69l13R4k17l32L92N7k06N09m98L69l25J39j75K21o1J47K5j82
5213i7M74p13K60j12M1K55L2k74L56k46K55o83O92J6j89J47o08R07p06L74n34
5234c53N22N8k1O6m38j41K09j19k77O04J39m71M9K16O99n25O75o5l37o64J98l24
5256c00P55m18j56K74j07k32m68N04K40M2o18Q49n07J54k20L43n46L03L88k43
5276C7l21L27K0J27K52q22K53L24K6o10N54j06k97J40o60M68K45q06J740p40m35
5297b84R2K90k70N7j12J146j510l4Q93k5J93j70K15l25J43m49L2O7j0O1j63n9
5319b22k03N37l99M80k88L91j30O1m0O1R5m08N16p30J05K05j42N52p49k4J77K1
$$ plain form
5168 13 -51 7 0 285 246 468 427 -306 -329 -84 50 -7 -97 135 55 -420 211 -84 355 -498 -95 149 -27 -361
5192 -361 223 -210 259 -54 40 -177 -509 -117 -60 -266 243 -255 114 -211 -72 -247 -26 -87 60 85 -97
5213 -97 377 -336 -76 -188 -147 108 140 -134 222 -24 231 -452 240 256 67 214 -394 513 -193 181 -353
5234 -353 169 227 206 272 -166 -307 -98 -217 -494 110 249 -222 -173 43 742 217 892 827 490 -174 24 -300
5256 -300 455 37 -119 155 48 -184 -652 -148 92 134 -484 365 -142 12 -208 135 -411 -108 280 37
5276 37 -284 43 63 190 442 -380 -127 197 223 -387 167 61 -236 -96 -756 -288 -43 -849 891 151 -284
5297 -284 -192 98 -172 -115 -227 919 -591 -625 268 243 436 266 481 156 299 -150 -118 -51 -61 0 -163 -222
5319 -222 -425 112 -287 193 -95 296 166 227 187 248 343 -65 451 -279 -174 31 -111 441 -308 -332 -155 -134
5341a34O79r40L89M82n8j37n63L19k03j59L57m02J78J17k69J38J34p7j24L81J35
5362B43k79l13k28M73k37K38M18k33R1o52K61J31K78j17K98l12j86K71L0O1o65
5383d29N81m29O22n4k89K87M4m08J08O95j007M66J01l74KL35j38Qj36J71Pl74
5405b11N22m69K80l0k09P8J13R4k74K8L84j97r0l9p4j45P58o09Q4k75M51l81J81
5428c0J6m91N23j12m9q8N65p91P1N1M14M0J44k11M42p05j82M14j67J08K63J82
5450D07l35j35L14r4n46J81o2j36L58o0J7Jq2pK9j67L93M7n8j63j24N74m47L91
5474B96o08K43K34K03q03L15M25j58k00q8o1O26l53j47j82j25P24j41n90M10L3
5495E3k69O17m52j24K23K12J63n24n63Q87J06J39n92k37L27n04N10n93J026j837
$$ plain form
5341 -134 545 -395 -6 476 418 281 -282 37 -166 -325 32 -370 -192 -75 -344 -206 -72 -149 -273 108 243
5362 243 -36 -349 -577 -104 -341 -103 315 82 173 -479 -218 -87 191 74 372 60 -126 145 175 236 -429
5383 -429 152 -277 345 291 2 289 333 -75 33 728 -279 187 288 -86 -84 251 113 121 -15 156 163 -211
5405 -211 311 -158 122 92 -117 -39 74 168 -106 -78 306 109 19 -20 -94 -239 519 -90 -6 -281 170 -211 -30
5428 -30 -14 -505 18 -94 -143 -231 334 -457 -386 -335 79 119 263 52 494 -211 -393 21 -146 -38 225 407
5450 407 72 -63 251 157 -389 -208 -270 -406 -48 -108 -91 -90 -172 -179 -150 -317 76 123 65 -98 -222 352 -95 296
5474 296 -312 -69 165 368 -435 -120 305 147 -53 -141 -202 424 71 -76 -258 -383 341 200 -390 20 53
5495 53 -216 401 -51 -175 48 260 423 -101 -664 223 329 468 -124 -361 -34 -538 -28 -621 405 -1432
5515a432J943r59O77k35k4M14j493J143M30l38l40N18o07J02m45Q40j86O5K07
5534B80l36l26J42p3M50K91k21Q4n53O24m35k44R55p22L65j68n64M51k27M90n32
5555b69R7M69K27n5n01K84o49l0J38j98N39k02L11l17j65M3O62m27k82N15k13
5576b3j21M96o08J6o7K26k41R36r52Q2J31J13L58K04k37k96O9J95mm05p2o1N37
5599B76n43L47m51M38j98j09k05N08n4j99L82k58M9K60n48M17k77L30m77K83M94
5620D65p63J30M23l23K39R1l79Q38m65J10o58L48j88o3J70qL07n38L30L72l15
5641A23JM8l57j68K91N52p62k41M15Q26l78j142N56j53J025k52l33M03o64n1k77
5662e38L35J46M02k03k83L1J30J43m65p5J95L35p9R0k16J25O7QJ24n29JR0L82
$$ plain form
5515 -1432 511 -448 229 -6 -30 384 -1109 34 464 126 -214 304 -303 -201 -646 194 8 73 280
5534 280 -56 -382 -240 -313 137 428 207 291 -262 362 -73 -317 638 -84 281 113 -451 0 -227 263 -269
5555 -269 -172 297 524 469 -32 252 -397 -427 -289 -487 52 -150 161 -156 -321 -278 384 -43 -325 190 -23
5576 -23 -144 352 -256 -240 -307 -81 -322 614 -338 -256 -125 -12 346 550 313 17 86 281 277 -128 -200 -261 276
5599 276 -267 80 -371 67 -131 -240 -445 63 9 -190 192 -66 -17 243 -305 112 -165 165 -312 -29 465
5620 465 -298 -168 255 -68 171 262 -117 721 256 366 -292 56 -132 -195 -25 -33 274 -264 66 438 123
5641 123 124 172 -185 -353 -62 490 -272 -513 -98 728 350 -792 -236 -389 636 384 51 454 -210 -261 -538
5662 -538 -203 -57 345 142 -141 -110 20 163 -302 -377 -182 153 74 164 -52 73 140 148 272 -257 -256 -166 216
5685B16j57P09p35K4j05N28n34J01J58o2k62M8L19j80j39L57l17L8K30J98k61
5706A74J69l01M10n75n0j32L71K54l92Ll89P77n07N75m13l71N09l53L48L52n52
5727i3m87N64l46M35L5p1j97L13o1r40Q49K25n91L23L0l64J31l83K89M75o04J79
5749b89j03L77n0o31J200r77N11n33P11K90p92K2M23J10o1k93l28K61j05M83J91
5770D17k23m47L04j6O7L84n21j8N03k99k83N70l27N5o1l27M88j40R6O10j013J25
5792e6o6J64Q9j07M1k5k85M42O9l24L01n74j52L23M24k6l19k5PJ10j00K11J07
5815B29k08k64m3N44n64N82k87L4j71K12pJ73n94K80J07J72o0n7rj22N46M2l70
5838A65j30J95j21r5L0J06j61K28j8M6k63j13L5J81J90k61o4J57J69M50n00m30
$$ plain form
5685 216 59 768 33 57 -48 480 -54 47 205 143 -119 -71 248 68 -71 286 -31 7 237 435 174
5706 174 343 42 452 -123 -173 -305 66 320 -72 -69 -458 319 -188 387 -26 -397 112 -241 107 459 -93
5727 -93 -580 -16 -362 73 108 37 -160 153 92 -848 1 226 -365 -42 -12 -376 -245 -628 -339 136 -468 -289
5749 -289 -392 -15 -65 -696 504 -473 38 -495 216 506 -286 -264 159 269 208 -85 -413 -152 -257 226 417
5770 417 194 -253 51 35 102 486 -35 -53 450 151 -132 438 111 166 105 -222 266 126 222 832 -181 -56
5792 -56 -122 42 131 24 65 40 -245 197 266 -58 243 -331 -483 -160 264 238 -81 -106 -99 11 -89 122 229
5815 229 21 -243 -286 258 -306 276 -11 23 -148 64 57 230 -364 -84 23 195 135 78 69 -53 493 535 165
5838 165 35 230 109 14 44 150 -11 217 199 245 -18 -131 -96 85 275 14 -50 107 276 726 226 -204
5860b04N26p49M46j72j43j25L23j2M51m70J69J33j14J98o25J46L3M94k86j41K72
5881A50j4j15q7K45J58q61P96m15K3J10L52n61o3k80N11K9J56m3j14m9Mn8q2N87
5905C79m94K16j18l8m14N92M12j32m89P4j46k51L22K80L17r60M01L17m88o5L75
5926I0L43o79M73J69m11R4j137R02Q04o61J023j400P00j121K58J545q82J52o54
5945c92Q4J230r89J107j123r51N89L94J11J75J07J56m26j079J802o65k2k20n70
5964f82O61k7O0r37N95K75J03j021J797j090k74R40l420L318N0P54k71j253K02
5983b20Q26n65P19j575J495J10o41P76n28l89n59J4R73J80o14q04P86O75p09k
6003e2O35o9n94J144j472J006J61k03k85m94Q54j5M02r55M94m48O11j369M2N99
$$ plain form
5860 -204 322 -427 19 -153 -296 -421 -98 -110 341 -129 40 173 59 257 -368 -222 -189 305 19 -122 150
5881 150 136 21 -66 179 337 -524 272 -143 -120 -10 342 -219 -282 -562 -51 -22 134 91 -23 -72 -68 -126 -208 379
5905 379 -115 101 -17 -55 -469 123 535 403 -86 -12 -158 -409 -87 193 510 -450 -49 268 -220 -285 90
5926 90 433 -246 227 396 -15 79 -1058 -156 648 -13 1010 -390 310 -811 -553 992 110 262 -392
5945 -392 -308 922 -67 1040 -83 -1034 -445 -51 60 235 342 498 72 -1007 795 130 108 -112 -682
5964 -682 -21 -48 12 -925 -330 -55 48 -973 824 -266 -540 400 -3020 298 348 1102 831 -422 -220
5983 -220 606 41 760 -815 680 790 149 925 397 8 -551 -537 436 616 2 -802 -16 659 -50 -52
6003 -52 583 514 -80 1064 -408 598 759 556 271 -223 631 616 1018 63 557 109 720 -649 -607 -8
6023hM06k2j8n55M34p3n4J01l70N9q6K01k0J21q0p7oK00j50k72Q9K94q6O5J0k23
6049a20J88l52L13p1Q6R2P1l46L26n90K60J81j71M26O8j248J358j4j080M45M58
6070B80j98M24J84q91O20p03m4J432j125R59r59n52J284P9j096n22J480o66P9
6089F5M72o39N8K00o25l96L88M76P8l73J34k64J12L14n30k0N26j74p0N71q0p10
6111d87M22QK61K02o57r6K18M8J63p5l66J023j239O03l81j49K8M79m41J69K32
6132c5R4k37rK20m65n1J234j48l56m40o42J014O32j075q6L48l77Q55o15n18Q84
6153B27j122J954n39l07J95J73k75l74q57R25L71o82N15n34N57l95R91o10q28
6172f15M8M27k42J155l19j052J02J178o81j90m21J020p7j33l37l4O37n86j79M9
$$ plain form
6023 -8 398 376 358 -197 237 164 110 211 -159 -100 -186 15 -5 116 36 -41 -47 153 3 -269 -180 114 28 93 103 -120
6049 -120 68 -284 29 -42 44 136 207 -139 187 -403 -143 38 -133 293 361 -887 471 457 -623 -178 280
6070 280 82 506 690 -201 419 -284 -328 1104 -21 938 -21 -573 711 790 -306 -828 652 -14 65
6089 65 537 -102 -44 156 -469 -865 -477 -1 77 -296 -162 -426 -314 0 -530 -550 -24 -198 -268 303 223 -487
6111 -487 -65 -57 204 406 -251 -347 -129 -81 82 7 -359 664 -575 28 -353 -502 -474 5 -436 -267 -35
6132 -35 59 -178 -187 33 -432 -483 751 603 247 -193 -835 179 811 -264 -350 -2 -379 476 -139 -657 227
6153 227 -895 1059 520 213 408 581 306 -68 -925 0 371 -311 204 -330 227 -168 823 213 -615
6172 -615 -567 -140 -382 773 454 -598 -496 682 1 -189 -610 410 333 200 -137 -171 466 -120 -299 -250
6192b50P28j1j64o7l9j60J78l32Q0M8J66l96L48l33L09n04L80J03o1l19L84k3
6214F5j7l53N04J55l69J04k47K32l27j83N73m59P90j86k56J29p3l20J93M8J33
6235A36m56J107r53O0O6J09j23Q6l6L69M5j23n70K14j45m11L54J93L42j84J77
6256B57p28P19l98J40K48o7m45N50k56j42O10l33j20l8M7l69O09q66O44J0J7N
6278I4K23m96K31k53l29R93l18ok79K13J16l45J65l84O80l77OJ29J6J9p0K9K84
6301C41J26l97J34M2P7q7M5n20K36L57n34M4K44j64K90j96m4K54n44k06Q79j142
6323g65N26L42n97L23M4J5o60P38l86M02K9N02l21k15m63M44K18k05l4R1K68m
6345B92N31r37M55j51O0l15J46k90O67p90M32J59L26r66L09m93k75O11J268j280
$$ plain form
6192 -250 478 467 303 236 197 37 215 -117 -37 11 177 -219 129 -204 105 -399 -19 84 23 -296 88 65
6214 65 48 -305 199 354 -15 89 -158 74 -253 -436 137 -322 468 282 26 155 82 -238 -45 3 136
6235 136 -320 787 -166 -106 -40 69 -54 32 -4 365 410 287 -283 -69 -214 -625 -271 -78 264 80 257
6256 257 -471 248 -150 -10 238 171 -274 276 20 -122 488 155 35 -3 44 -325 284 -582 62 72 89 94
6278 94 317 -179 52 -201 -530 463 145 139 -140 73 189 -156 9 -375 305 -72 -66 63 79 98 28 57 341
6301 341 467 70 204 246 323 236 281 -239 -3 354 -180 -136 108 -56 234 38 -6 248 -296 -502 377 -765
6323 -765 -239 103 -494 -171 -127 -112 -772 -34 -420 -18 11 513 192 -23 -486 -42 176 -29 -63 28 296 292
6345 292 823 -114 341 190 250 -65 81 -209 458 -332 100 259 585 -381 -72 -565 -840 -229 1039 -241
6365b41M12j22P14p41j69p4O47l32o9K90j79K42l71N24Lj19n16M56J64j88j55
6386A76o91M7N40J71K97l70o12P54k96K3n69O78M49j551J599l80j03L27n21L03
6406B71n89P47J06j159Q12Q0l79j77R67m24L24K0l37n20l39Q07RL53n78J0j29
6427a25n0o2M59o5M92n22J28l22l3L30l37O16o40L05l4j13k33m4l33N01L23K42
6449D83k38M2k53L59p92J33P87n83m3R0O7o92k34P98k91P48m44L53O2l24m05K78
6471i9k76M74k35q43J076m78M72M58p17L21m13K01l97L0l12M55K3j32J161k24
6491E45p50n1O01m35o52P44qk7L36m82M47p71P64r86L44N11rq3r5n33L61n24R19
6514A66J46l55J28L9k51K48oL93k64j24j52k52M45j68K18m59J54K05l89N22k99
$$ plain form
6365 -241 171 49 763 22 -147 -221 426 94 25 315 136 378 7 531 534 415 -101 355 519 331 176
6386 176 -515 -468 72 243 540 170 -442 312 16 39 -530 148 597 -954 645 265 162 489 -32 271
6406 271 -318 429 535 -624 188 268 -111 -288 679 255 579 599 262 -258 -597 210 219 572 -6 4 -125
6427 -125 -175 -237 222 157 649 127 255 -67 -100 230 -107 509 -131 174 140 27 -206 -250 -583 -82 241 483
6449 483 245 287 34 393 -399 -266 521 -62 -105 -15 52 -640 -874 -76 -367 381 -63 290 352 28 -377 -99
6471 -99 -375 99 -136 -979 97 -381 91 549 -168 153 -260 -59 -456 -426 -738 -283 -260 -392 769 545
6491 545 -205 -256 345 -90 -742 2 -6 -33 303 -179 268 -503 261 -725 -381 130 121 38 -57 -590 -229 -753 166
6514 166 312 -43 85 124 -127 121 115 508 244 120 -32 -284 161 -7 211 -248 -94 111 -278 244 -55
6535e5L41o82N38j35K86K01n16j60n7q0L87M9JK36M8n61M0P8J42M48p58J89j8
6558c8P26l98k80K27r0o33J45K08Q41m01m21n5J0N13m61k91K17P3j33J117r11
6579c5J16l4J67k18J11n70N59M28o81L54m05K88R2n71M08M80l10j68l5L62p41
6600d03N55k92J37Q2l16K39Qnl06j28P04M62j10m15m61J24n08Q28L14l42k25K10
6622A52k33O06j078l79J337o39j10L35m07M5O97m35O80n10O8k96Q15j232P59K9
6642B04j2j49k92M53N78k18m69n2N57N88j465J057l62j059J283l42r07O33k11
6661a85m20J490n59q18k80R56M89r59M23q1J25j99L68q6J00K03j931J140l14O75
6681A37N22l70l85K42q3n43J59N4J359q58r90M29L02n42O32M46j67n78N44m21
$$ plain form
6535 -55 286 -396 142 7 293 494 -22 -182 -239 -319 68 117 118 354 402 -159 -119 -41 101 549 -209 -20 -38
6558 -38 688 290 10 237 147 -486 -341 -133 708 307 -114 -169 -159 354 -107 -398 -181 -108 -241 876 -35
6579 -35 81 47 214 -4 107 -463 96 524 -157 197 -208 80 172 -399 9 489 179 11 -24 338 -403
6600 -403 152 -140 -3 79 -237 2 10 5 -301 -429 275 737 627 212 -249 -125 -633 195 509 167 -58 152
6622 152 -81 525 -553 -932 405 -234 -344 -9 -416 -371 326 -109 571 61 129 -167 648 -584 175 204
6642 204 192 43 -249 204 782 564 95 43 600 1188 -277 780 418 -641 642 300 -607 26 -185
6661 -185 -605 885 326 -492 -772 184 673 -286 137 56 181 -18 350 264 364 567 -1364 -224 -538 137
6681 137 659 289 -96 146 63 -480 -321 -267 1092 234 -756 -327 -25 -567 65 511 344 -234 310 -111
6701a11O97j75n03J90n16K86J095j593J100j127M03O03j161Q09l21L53J18O15
6719G62k98j02K83m73n18J013j00j093R48J59m23p4k74l62Q03l31K0n4J54N50
6739E90j259J236m15m28O73o33P34m29j62Q3J44q48O41K74r4J84m20K25L06q24
6759d22J028n26J6q4j17J06J88p0k57J15Q2J9k78J49L49q77N16J8l8K40m24l2
6781b99k27R07Qj70k94k51j6J61J83l90P11m37J18m49K69J79m21N10O4l64l48
6802e56O12M12p63N31K58l72J18M06o73L10k12o5l77J05k14K61J78K62L65l44
6822B42m23O3ll0K6M52R7q33N20J6m5j47r8K57j13j87J33J28k47J18j09J24L38
6845B79L1k34j06J65j72K02l26K27k48M12k06l59O74l37K42k6n72O09j31q0j53
$$ plain form
6701 -111 586 411 -92 98 -418 -132 963 -630 470 -657 -254 349 -812 -3 -324 29 147 762
6719 762 464 362 645 172 -346 667 567 -526 422 581 158 84 -190 -552 251 -80 -60 -114 40 590
6739 590 -669 567 152 -276 397 -236 498 69 -93 -10 134 -714 -73 201 107 291 -129 96 402 -422
6759 -422 606 80 96 12 -105 1 189 119 -138 -23 59 78 -200 -51 298 -579 -63 -45 -83 157 -267 -299
6781 -299 -526 381 389 219 -75 -326 -342 -181 2 -388 323 -114 4 -445 -176 3 -418 92 156 -208 -556
6802 -556 56 468 -295 236 494 122 240 646 -27 283 71 6 -371 -266 -480 -219 -41 221 586 242
6822 242 -181 -118 -121 -151 -125 327 424 -409 111 127 82 -65 -163 94 -19 -206 -73 55 -192 -74 -183 -59 279
6845 279 310 76 -30 135 -37 165 -161 66 -182 230 24 -335 339 2 244 218 -354 255 124 44 -109
6866a09k26N22nM81p19l02J72p5K82j54j40l7L91O0j78J50J67K38l90l9l27J15
6888a23ppM94m17k14J9M96k33k98L5M58l25O6M05l21j63O4J30K12P2m52l47N91
6911A35J27q02J14K4O03L06j89l03k98K87K34K4p47Q07p0l12k24L68J77m48K79
6932I2m84N56l48L47k22N01o22L35l62J14L48l63j64N16k35o6J65J96j30k27J62
6953A09k52q1o9L25L83o09J51J38j68O03q35Q35p08M10P5m97J10M04n0l34l9K05
6975A06j20m82K67K28nJ40k6l60K85L60n82K91J4j30R1m50O40j28k68L28j61l6
6997Bk77R2P5k55M91L41j89k06L00n33M4k5j37M05j50J49q6l36R2R5m25M51L7
7020d5P6j03J58J76k05K46m35Q06j147M66q3J23P4Kk35M01p05N56j44k6J50k75
$$ plain form
6866 -109 -335 187 182 663 -56 -358 -186 -261 21 -133 -273 -310 81 141 -37 113 280 518 128 89 -238 -123
6888 -123 -130 -137 357 -60 -274 -255 241 8 -290 -255 203 -122 -56 349 28 -135 -71 59 271 343 -109 -456 135
6911 135 262 -540 -426 -402 201 507 318 15 -283 4 238 262 -485 322 252 -60 -284 84 261 -187 92
6932 92 -392 164 -184 163 -59 442 -180 155 -207 -93 255 -108 -272 244 9 -57 108 304 174 -53 109
6953 109 -143 -224 -293 32 415 -194 -43 95 -73 530 -305 530 -178 232 307 -190 -80 324 274 -60 -99 106
6975 106 -14 -496 -229 -1 -6 134 108 -252 33 393 -189 102 116 -14 77 -373 267 139 -129 199 38 2
6997 2 -275 -183 -108 -363 128 469 280 74 374 -159 -115 -140 -277 128 -22 127 41 -295 -203 -108 -533 -82 -45
7020 -45 31 -72 86 262 57 303 -132 674 -473 -7 -90 33 107 109 -126 275 -430 126 -18 -44 106 -169
7042a69P31n43k74j50M70LM76l41m56N51l50j4J45n64O61J5k99O17o26N32j028
7063f13O04N04k15k98m92O94l6k04N80k37p9J29l05k4J02m93j32K23J16l59N77
7084D2K84R1L67o73k15r8K55k05n83Q91l25LR8K74n35O63k36l44O25q74l64O50
7106b09L49k62o8m80P47J54m25l03M94J44p4M25m43p91J261j057J4M03l96J198
7126F81l2j066O27n27m72J210q52n2M1N52j73N47j197P80J45R6k26m58n1N50k14
7147i1O30k32l71K41k67o50P51j03j68L53j11k15j53K96j07K88m03N39m30j5Q42
7168F24q51L31k62r8j59M94J16j38j54L71n34P40r50N39j57J23J61Q6m97m2j58
7189d15L42q4M8m01N22K00n06M99j39M26j60n14M9L48K1P3m66N88q0n83K14Lm63
$$ plain form
7042 -169 562 19 -255 -405 65 68 544 203 -253 298 -52 -66 79 -485 176 191 -108 509 -117 415 -613
7063 -613 -9 495 280 -18 -510 184 148 -56 524 287 208 337 32 8 110 -383 -515 -292 -176 -535 42
7084 42 326 417 784 111 -104 -202 53 -152 -735 156 -169 -166 -68 206 -329 334 98 -246 379 -495 -859 -209
7106 -209 140 -122 -190 -670 77 231 -194 -497 -3 141 67 492 49 -742 519 -538 -524 -121 -517 681
7126 681 649 -417 210 -317 -789 421 -431 -483 -442 110 -63 484 -713 67 212 308 82 -376 -427 123 -91
7147 -91 539 307 -64 177 -90 -740 11 -92 -260 93 -18 -233 -386 -90 -197 91 -312 227 -203 -218 624
7168 624 -227 104 -158 -256 -415 79 195 57 -97 274 -260 480 -470 69 -88 35 196 282 -215 -257 -415
7189 -415 -73 -157 -109 -510 12 212 -294 205 66 492 332 -182 -133 215 236 309 -157 431 351 -232 -18 -15 -478
7212d78n1L74j93P95n79l9K11J79n19N18k64j00j77Q7L51n2K68l60K96L36p90
7233a87Q8J12j83O0M94p14N10m0k84L20k34K9k17m96P78K26m11N60rn58j87J24
7255b19J74l48L43K03L11m22L09l83J33p1l50n9n4K91j10j02M11n66K05N12J04
7276C12Rp36N41k81K98k95L19j4J82K92l82k34J8k41l8O32O7n46l1j54K21K83
7298B22l46K12j83l23nP05J77j50l17K20j49j33j0M19n44O9O69j241j54Q99L13
7319C50o27L00k73K23m6K34k00M18l61n3R1J91k06K68m57P1J28m29P44p83J62
7340b55K55p9L59J5r37M42j55K07K86n91J11J59J51L81J0n10K87J45n30L3R97
7361G81o29r7p29Q11j53K00L4J8l56K10q57M24K96j98Q5N83k84O61m56M68j458
$$ plain form
7212 -478 -529 -155 -348 447 -132 -171 40 219 -300 218 -46 -146 -323 -236 115 63 331 -29 267 603 -187
7233 -187 -99 13 -170 -110 384 -330 180 140 -144 176 -58 -29 -246 -742 36 262 -149 411 402 -156 -343 -219
7255 -219 -45 -393 -50 153 464 42 351 -32 101 30 -320 -379 -433 -142 -252 -354 57 -509 -304 208 312
7276 312 321 -415 126 -155 143 -152 167 153 335 627 245 11 29 -212 -250 382 449 -97 -128 -282 -61 222
7298 222 -124 88 -95 -418 -423 282 459 309 -8 212 63 -70 -80 339 -205 -136 533 -708 -862 37 350
7319 350 -277 23 -250 -27 -73 161 -39 379 18 -35 56 247 41 309 -148 -77 51 -378 366 -417 -255
7340 -255 0 -79 280 295 -642 -200 -355 -148 138 -453 -342 -183 -32 349 359 -151 136 281 -249 -216 781
7361 781 152 55 -674 137 -16 184 218 236 -120 90 -767 -343 -47 -245 -160 423 139 800 344 812 -646
7382f46M37M69m97j32M05j23P5p46N39J49j13k71K48L19n33J095k0n25q9J59m20
7403b20K08J07o22R36n08O98j06N6o22l47K44K10M02L3n28M2n96O93P8o4K34j48
7425A80m84L27L37J60n16j90N65k27J97o9l92M87j80r6l21M06l8P1R6L40n28j18
7447Gm2j27J95p8L77k88j38k49O14l68N11l65L4J19n46O06l49j2L62l9m45J07
7469a14j69L43r1L14k21L9j16p7k91M38L09m33l65N14j71L13n2n43J92p0N92l29
7491A2l01J65L80k56K84n04k2K49J43m12N92k31J34N2l81P59m90L5m26J85j21
7512a54l7k23L32N14m17P4K37m58J8P7Q7M49k20k90PK4K09O9m58J69O0k56j27
7535c14M29J06L3j61k19K80k88N5J53l32M4M81l26k71K12L17m10O08J64p86J44
$$ plain form
7382 -646 -209 260 -237 -369 36 -87 -12 -758 -219 -70 -183 -454 -206 113 -420 675 655 130 41 200 -220
7403 -220 -12 95 -527 409 -99 599 493 549 -73 -420 -176 34 436 469 -59 -17 -613 80 158 94 328 180
7425 180 -304 23 360 520 4 -186 379 152 349 280 -112 375 195 99 -222 184 146 217 313 653 125 7
7447 7 -35 -162 33 -45 332 44 -94 -343 271 -97 414 49 83 202 -344 262 -87 -99 263 224 -221 -114
7469 -114 -283 60 -31 283 62 101 -15 -92 -383 55 364 -69 -434 80 -91 222 170 -373 -181 -251 341 12
7491 12 -289 -124 256 0 284 -220 -242 7 150 -262 330 99 233 285 -96 663 173 208 -218 -33 -154
7512 -154 -191 -414 -82 432 15 89 326 -132 -114 -37 50 499 279 -11 -4 20 229 298 -160 9 69 -187 -314
7535 -314 115 221 254 93 -126 154 -134 -79 74 -258 -214 267 -59 -330 -118 199 -211 397 561 -225 -81
7556h1n3K12M02q84Q41r59O84K05m12L64o10Q18l52m51k42M63j68K79K95p82M32
7577Am3L41l19L90k4k03j58J84j62k7K73k95n71P86k89m1j31P77Ko31P65n09o58
7600e42Q57r79N63J72l71P84l62LJ46j55l69N12k51K02O4m22K58J6j78P2o34L28
7622b86n4M18l42M61j94m04O69m56P10j51m07K0j06q1O01l63J9Qk29K43L51m76
7644d9J03m14M83n9l67K16K7k72K10J86rl76K61K31m37J83L4K94J23q20J30J58
7666a64L48k64K43k48K73k75l7J26J94l24K35l12K09K30l35o2O5N51j64j30k39
7687h0j4J76j11K9L37m83L10o08K63Q3j99J43M4L55k4j65L58n55K24L1Po13Q94
7710D02r7j52j0j02o8K5m3m7l32L70r2j73Q41n32L20k17J13j05o6L3m8L42l27
$$ plain form
7556 -81 -134 78 480 -404 437 -522 162 367 -45 319 -291 527 175 -276 -518 -55 -223 56 351 -431 1
7577 1 -42 299 -20 370 346 143 -15 169 7 -20 253 -42 -613 173 -116 -157 -288 489 491 -140 625 116 -542
7600 -542 315 -664 -101 71 -300 484 122 125 271 116 -253 259 8 210 274 -148 110 126 -52 20 -614 -286
7622 -286 -340 78 -264 197 3 -401 268 -188 522 371 -36 -16 -122 -203 398 35 54 62 -167 76 427 -49
7644 -49 54 -360 123 64 -303 -87 -60 -332 -122 64 55 -321 -60 171 -266 -83 -49 245 368 -452 -322 -164
7666 -164 184 -80 163 -85 188 -87 -124 2 196 -128 107 -205 4 234 -101 -163 -98 453 289 159 -80
7687 -80 -94 82 -29 0 337 -146 164 -444 -181 -98 -297 -154 -110 245 221 56 414 -141 83 114 121 -492 402
7710 402 305 153 143 41 -27 -2 -45 -92 -424 -54 -146 -319 522 -10 310 93 206 101 35 68 20 362 35
7733C5j98J00k39O74r4m84M65rm59N24o49K49m30M74k09P7N0n7L94p6l2k4k62
7756a80K46L04m42j23L15l67k27O07kK29r5J50o04K14Mk54J87N46k85m22L54J02
7778B57k69J14k01M86l41K54l14n35Q11k04J39J23P3q42P97O6n29k88M24J15o29
7799d93P04K2J67j53m36M02q44Q50n66R3J40RK52m55K88P5J91K08l86l66r0O01
7821B13l77M60j78l39J2rJ18J28l3m89M14M37m00J07M9j79M58m66j74J70j27j24
7843c29J92K82N3l94j17M81n02L38l0J44O6l95K99ll84L98J79J3l11L46j16k50
7865d0j52K24m4K03J70j93j99K93m58N95p55K74K85m96P21p69L61K43J12q20L41
7886a04L59P9Kn40P36p20P00o26j52M99o59O42m34P46j85p11k91M79M77k20K05
$$ plain form
7733 35 -163 -63 -302 372 278 -206 259 250 -209 315 -334 -85 -515 -41 -250 -173 -123 -180 214 138 106 82 -180
7756 -180 66 370 -72 -195 120 -247 -474 133 131 360 265 415 -189 25 29 -225 -38 508 223 -199 155 257
7778 257 -12 102 -99 387 46 300 -14 -549 262 58 197 320 393 -449 348 414 -115 -403 21 136 -493
7799 -493 211 233 400 247 -189 213 -631 219 -347 -254 -114 -105 147 -308 -20 55 246 454 68 -298 -388 213
7821 213 -164 296 118 -221 -209 -218 -100 28 -5 -494 -80 357 -43 64 113 -66 392 -74 -248 -78 -205 -329
7843 -329 -137 145 198 -196 -313 168 -334 4 -26 118 184 -211 88 85 -299 99 278 291 -20 326 210 -40
7865 -40 -192 32 -12 191 361 168 -31 262 -196 399 -356 -82 203 -293 428 -341 20 263 375 -445 -104
7886 -104 255 334 336 -204 532 -188 512 -114 -266 233 -426 216 -218 528 343 -368 -659 -180 297 77 282
7907B82n22k1K05k58M95O3r5l12Q24o95M49k76r0l55M71j68j43lK83M6j44l61
7929c25N91oj87K69n41j7L4M90j11R7l94j42J64O29n83m2N23n56L92k40p2OJ11
7952I0l61M41q5K89k85q1k02J62j2O17q85j28P51j06n77J96P3J31o8M28q91O65
7974A62j54l74R48m13j256J438k05K99j65L34J6r91P18j416M77m8P83L1n80o0
7994d56Q24r2m24M2N06k82M8r5j68O0N3m14M69l67P94m25L22O2m08l30K79K89
8016B87jl10j28J36j02J87j13K36J03k35j13j61L18m08M77n88L57k21K61l2k14
8037b64j02k77Q28m97K12j95K22K74l33K87n0n09J024m93j76k6n0K71p92L26J98
8058a22j89N38l98K33Q6k80k69N16p85R77n73K96k13M6m74K35L13m6J22k42J40
$$ plain form
7907 282 -240 -261 -56 -314 181 244 149 -163 661 -34 415 139 49 -306 165 -3 -146 -149 134 180 36 -325
7929 -325 266 260 73 342 -199 -216 -182 308 197 294 -100 -242 -78 551 -32 -74 449 -107 285 45 -27 -21 90
7952 90 -271 170 85 374 89 8 -194 -32 -44 573 -312 -440 311 205 -372 -176 -103 28 -40 388 -503 162
7974 162 8 -366 582 169 -1087 351 146 445 280 614 630 -361 357 -1059 -582 -630 153 184 -396 -456
7994 -456 368 276 -148 -106 400 118 166 71 -97 -37 16 -398 71 -296 498 73 395 457 49 -281 -2 287
8016 287 286 -24 -152 -16 -118 69 -44 192 295 60 -53 -214 104 -304 173 -415 -58 -279 -18 -50 -264
8037 -264 -366 -643 185 -312 -100 -295 -73 201 -132 155 105 -404 620 127 -49 -75 -125 146 -646 -320 -122
8058 -122 -311 227 -171 62 148 -132 -401 115 -670 307 -266 30 -183 -137 -611 -376 -63 -109 13 -229 -89
8079h9L14L2o89N12J62J40o69N87n41J89J6l9M69k35l93J95O79r55m54O88L64
8100B83K9l25L85n07J61K13k60K09n07M07M37n47l93K79k44N23J32j57l0r0K90
8121B88j47L85r47J25N6L0L89l93q9O45j73k84K19k4o8k78N36J63q84M78j3j26
8143a12K85l31l79L44L92K51m85N1k75P85p22M75n31Q21q0q52N54o96J89O16o80
8164c80Q90k55J78J00j35J2q77L00J5L00n11J356j225Q71k83m18O16r06N04o50
8184d98N58p8P1Q19j110J85M71
$$ plain form
8079 -89 225 257 -432 80 242 382 -287 300 -241 -52 -36 -75 394 159 -234 -39 640 -315 -769 -81 283
8100 283 312 -13 372 -135 26 239 -21 188 -319 88 525 -22 -415 -136 -380 143 275 118 88 -2 288
8121 288 141 526 -421 -296 -240 -210 179 -214 -303 342 169 -115 104 80 12 -266 270 433 -451 27 14 -112
8143 -112 173 -158 -537 -193 199 450 -35 16 -259 526 -196 279 -252 569 489 -363 191 -505 -316 300 -380
8164 -380 510 255 433 533 398 410 -467 -167 -152 148 -363 993 -232 639 356 -62 554 -352 152 -498
8184 -498 60 -18 53 872 -238 -53 418
8191D18
$$ Imaginary data points
##PAGE= N=2
##DATA TABLE= (X++(I..I)), XYDATA
0@%%%%%%%%%%%%%%%%l2O4o4O4o4Q9j21J28j51J83k00K32k85L20l55M16m79N42
34B87o10O91p83Q79r82J098j225J364j515J677j858K059k271K503k763L044l354
51a759L695m069M484m947N470o056O721p486Q375r426J0688j2232J4180j6724
65i086K0206k5300L3580n0171J54367k84644J01007K66344l33738J84870M4925
76A02360j79578J32764n673r1739Q8987r7987L5986Q4243q9969L616K6858n8956
88d9088N6800O796p2429K9425N8908n9086J807N3778q6740n527J30184p8691m6527
101f0390Q3812p0424J9754Q3283j06181K4106N0602q5871Q1096m311j08221J33533
113D0788p574j10565J07889l8033o5799J26480m0827o0710P1121k9558J589M0064
$$ plain form
0 0 0 0 0 0 0 0 0 0 0 0 0 0 0 0 0 0 -32 32 -32 32 -32 57 -64 64 -87 96 -104 128 -157 163 -192 224 -255 287
34 287 -323 368 -415 464 -518 580 -645 719 -796 881 -977 1082 -1189 1314 -1449 1595 -1759
51 -1759 1936 -2133 2351 -2596 2874 -3182 3539 -3947 4428 -4998 5690 -6542 7638 -9086
65 -9086 11120 -14180 19400 -30771 123596 -161048 -60041 206303 -127435 57435 102360
76 102360 -77218 55546 49873 -41866 47121 -50866 -14880 69363 -20606 -16990 9868 -49088
88 -49088 7712 14508 -57921 -28496 30412 -28674 -26867 26911 -59829 -65356 64828 -13863 -60390
101 -60390 23422 -47002 -27248 56035 -50146 -26040 24562 -61309 19787 15476 -92745 40788
113 40788 33214 -77351 30538 -7495 -73294 53186 12359 -48351 22770 -6788 -5199 34865
125C4865n1885J2863J2447j7809O8537k9198q2089P9162K3065p0363L8082J2476
137C0153m8637N1820J4345p3993J9969L3858k8182J7106j1207l0358M8378j855
149B1397l2854J1717l4612K3540N1919n9250P992L3960o2037K5431L7078n3336
161b9055J4839K7012k0767R604p161k1442J4720J4844p267q354k528M691J5737
174D873j2622k4726K0743J500o573L5824l0343l9862N5858O832l6470K4138k295
187c123j7222K4386k602q997J2428j2029J2315J3421l6797J5627K1961k7941L3502
200B4929n545n5038N1585J5842m4499K2453o427o668L3105j8902r953k898q141
213a0157L4663r282k2899K5345p473j0646J3490j1731n067J2905J1712q654j8149
$$ plain form
125 34865 -17020 -4157 8290 -9519 59018 29820 -52269 26893 49958 -20405 17677 30153
137 30153 -18484 33336 47681 -26312 -6343 27515 -667 16439 5232 -25126 23252 21397
149 21397 -11457 260 -34352 -10812 41107 -18143 -10151 23809 -38228 -12797 24281 -29055
161 -29055 -14216 12796 -7971 1633 -5528 -26970 -12250 2594 -4673 -13027 -15555 -10864 4873
174 4873 -7749 -32475 -11732 -10232 -16805 19019 -11324 -51186 4672 11504 -24966 -828 -3123
187 -3123 -20345 4041 1439 -7558 4870 -7159 5156 18577 -18220 -2593 19368 -8573 24929
200 24929 19384 -35654 15931 31773 -12726 9727 3300 -3368 29737 10835 882 -2016 -10157
213 -10157 24506 15224 -7675 17670 10197 -449 13041 1310 -3757 9148 20860 12206 -5943
226e943J2163J115j1183J6876q042j9301K3842N166j4760n47j1703m37J8900j542
240D604k248j3037j0036L4402j2960l7422M0356K919k6900K7354j4711j5866K5817
253B272p446K061l551j4227K6169p299q151J9035l0843P888L5468k8374n192J3511
267A321q372O473N360J085j2410o747K8230r038j9902K4517l547n633J3573j9857
281d947m667K0188N090l053j4067J404J7741j4423l49J3122j9991M368K3503j5197
295H722p376N324o690N702M312m570j007m401J0977J026k4355R217J4167j0684
309C64L233k011j0214N033R303J601k1593j248K4160j2372r01J2091k8164J0203
323a0515K0094k2496N467O771q530J0252p862k33J337q219K1111k812k2760J5476
$$ plain form
226 -5943 6220 7335 -3848 13028 4986 -14315 9527 14693 -67 -614 -12317 -12754 6146 4604
240 4604 2356 -10681 -20717 13685 725 -36697 3659 6578 -20322 7032 -7679 -23545 2272
253 2272 -5174 -3113 -6664 -20891 5278 -2021 -10172 8863 -21980 -14092 21376 -6998 -12190 1321
267 1321 -7051 -578 4782 5867 -6543 -13290 14940 5902 -14000 10517 6970 1337 14910 -4947
281 -4947 -9614 10574 15664 12611 -1456 -52 17689 3266 2917 16039 -3952 416 23919 8722
295 8722 1346 6670 -20 5682 9994 5424 4417 16 10993 12019 -12336 -3119 11048 364
309 364 3597 1586 -8628 -3595 5708 7309 -14284 -15532 8628 -3744 -4645 7446 -20718 -10515
323 -10515 9579 -12917 -7450 -679 -9209 1043 -6819 -7052 -5715 -13934 7177 4365 -18395 -2919
337b919L946n563Q970r630o730R897Q752P52j7200R84J7205n356l168L937o292
352b415J515Q952j6o452k140J1836J352j6053O985R249j1414J1574M935k1672
366c764P565P138q654J2490p143j2389J3682j705j54k617j5865J7516M945j6619
380e574J0681m409j1437J5932k179j1761L491P422J877j0003p22Q61l222J4616
394E573k591j7802O080Q105j153k859l290K223n202N155J3133j9358p472K4452
408D994o766j2659J2339n130m291J5254n079j2006O349Q498L216q847o812J2903
422A963Q38m131P874o504o590J0531J723l170P25k188n32L821K969q624k126J1509
438H088n769l619P066p573J716O311l946M1r721O595J8674j8974m021J1643j2667
$$ plain form
337 -2919 1027 -4536 4434 -5196 -11926 -2029 6723 7475 -9725 -8741 8464 3108 -60 3877 -2415
352 -2415 -900 8052 8036 1584 -556 11280 12632 -3421 3564 12813 1399 12973 17908 -3764
366 -3764 3801 10939 2285 14775 7632 -4757 8925 7220 7066 4449 -11416 6100 11045 -5574
380 -5574 5107 698 -10739 5193 3014 -8747 -5256 2166 4043 -5960 -6682 -5821 -9043 5573
394 5573 2982 -14820 -8740 -635 -1788 -4647 -7937 -5714 -10916 -5761 7372 -11986 -19458 4994
408 4994 -1772 -14431 -2092 -7222 -11513 3741 -1338 -13344 -6995 1503 4719 -4128 -10940 1963
422 1963 2801 -1330 6544 40 -6550 3981 5704 2534 3259 1071 539 4360 7329 -1295 -3421 8088
438 8088 2319 -1300 5766 -1807 -91 6220 2274 2315 -7406 -811 17863 -1111 -5132 6511 -6156
453f156J2067Q356k3263O393J0875n637J879o517P26L619n023J0061o829j4695
467a4144J9582J766j8406M965L580l75K344m00m306q785R875J3929j8095l504
481a1974J2637p141M872M573j2197M429M109j191M718j1115N192J0039j4747Q901
495A105K068j7851K1957M46k0689J6798l684p638J8017q865n165L922n223J6307
509A1505m481j3651J4976m962j373J3514j3461k672J2261r38k686n868N106L525
523A0795o678P344n624j0481J6643J280j2926P67j462N130K679p473J720m334
537b620k541J4631p258j3649J2671R9o814R898p506p301J3183j219p428J24M7
552e683P393k635o942O252o131k51J3301q877r624Q847K919k844J029m01n521
$$ plain form
453 -6156 5911 14267 -8996 -2603 8272 2635 4514 -2003 -1277 2342 -2681 7380 551 -14144
467 -14144 5438 7204 -11202 -6237 -2657 -3032 -688 -1088 -5394 -14179 -4304 9625 -8470 -11974
481 -11974 663 -6478 -1606 2967 -9230 -4801 -692 -1883 2835 -8280 -3088 6951 -7796 1105
495 1105 3173 -14678 7279 7725 -12964 3834 150 -7488 10529 1664 -3501 421 -4802 11505
509 11505 7024 -6627 8349 3387 2014 15528 2067 -605 11656 10718 8032 2164 7270 10795
523 10795 4117 11461 5837 -4644 11999 13279 353 1120 -342 4788 7467 -6 1714 -2620
537 -2620 -5161 9470 2212 -11437 1234 1333 -5481 4417 -3089 -10390 2793 1574 -5854 -5730 -5683
552 -5683 1710 -925 -7867 -1615 -7746 -7997 5304 -3573 -13197 -4350 -1431 -4275 -3246 -3647 -9168
567i168N508O722p245j319N332k669L066K235l479L1J510P122l301j1010R811
582C146O287p154L070r38o960P004P454o515q527O241N425n799K395j415n145
597a431M675L075k696n113l22Q853l954n998O661m129j290J1656q450j0800J0942
612A679L865p440L240k149n781O932K480m242k982l742P580K098r629L769J324
627b998m317Q496n243p921J0079J512m772J841j816j953N086L237k344p243L079
642e277R417m167l640K581j668O01N618l44p246J025P982j187p032N534P14m894
658a983Q378k629j0011R482L655m883J978m657Q97P149m094K580m030n528J3808
673A0112l142j0179J0244m889m084J2284q182n191O757j758J846l606l486P813
$$ plain form
567 -9168 -3660 3062 -4183 -5502 -170 -2839 227 2462 -1017 -986 524 7646 4345 -6665 3146
582 3146 9433 2279 5349 4411 -2549 4455 11909 5394 -3133 3108 8533 2734 5129 3714 -1431
597 -1431 3244 6319 3623 -1490 -1812 7041 3087 -2911 3750 -379 -1669 9987 1537 -9263 1679
612 1679 5544 -1896 1344 -805 -6586 346 2826 -1416 -4398 -8140 -560 1538 -8091 -4322 -2998
627 -2998 -7315 1181 -4062 -11983 -1904 -392 -5164 -3323 -5139 -7092 -2006 1231 -1113 -8356 -5277
642 -5277 4140 -27 -3667 -1086 -2754 -2153 3465 3121 -4125 -3100 4882 3695 -3337 2197 2911 -1983
658 -1983 6395 3766 -6245 3237 6892 2009 3987 -670 227 7376 3282 5862 1832 -3696 10112
673 10112 6970 -3209 7035 2146 -1938 10346 2164 -3027 3730 1972 3818 212 -3274 4539
687D539m703j02M291j1107L332R592p296j870m85N26K381k813M979n744o010J3715
703C225k910r328Q490l120k649P842n960r79K165m16N191o559l060R388n018J890
719a808N589j2693M117J1049q514r16L767l573L004L145j594k402k629P548J238
734E328p964L613L512m457M637j864k350J995K187K428q184J088Q285o583K207
749C878M017j1004L664N577l071J44m067L524K745p210N478j25p908P882J40o984
765c320L203J217j100p6j094j319j383L940J876o249ML652k647L734N97o903J195
782d673L924J288m518k351M955j56l526N855l541n241R617L97q205L482K155P27
798A89M86k891K083q88O18O212o931k810Q982l571r00M654m922J46M754K33k464
$$ plain form
687 4539 -164 -266 4025 -7082 -3750 5842 -1454 -3324 -3809 -3283 -902 -3715 1264 -4480 -10490 3225
703 3225 315 -9013 -523 -3643 -6292 1550 -4410 -5389 -3224 -3640 1551 -5008 -8068 1320 -3698 -1808
719 -1808 3781 -8912 -4795 6254 -2260 -3176 591 -2982 22 3167 1573 -829 -3458 4090 5328
734 5328 -2636 977 4489 32 4669 2805 455 2450 4637 7065 -1119 -31 8254 1671 3878
749 3878 7895 -3109 555 6132 3061 3205 -862 2662 5407 -1803 3675 3550 -4358 3524 3664 -3320
765 -3320 -117 1100 0 -76 -1170 -2489 -3872 68 1944 -4305 -4301 -649 -3296 438 1035 -5868 -4673
782 -4673 -749 539 -3979 -6330 -1375 -1531 -5057 798 -2743 -7984 1633 2030 -6175 -2693 -538 189
798 189 675 -2216 -133 -1021 -403 5809 -1122 -3932 5050 1479 579 5233 311 457 5211 5444 2980
815B980l285N936m00o055N396J1n328N990n2m835J340P94J803j491k228K328l837
832i33K704M453p006r97M943m375J271L062n226m07M681n70l223k154L199J016
848D38k560Q03m31l679M198L734q269l2M804k08l65j500p74o12J982M076m751
865c146l122O408j23k396K102k273R09J657O26l97m625M997L974p128J301L319
881B083l873L378J715m645O72L81L139l23l916L101j055r30M166k701l148L958
897B002O51j841J051j81j107J159K643k461l414L827L084n368L08K177m348L834
913B016K465n599j223K022J632m93l397J844j24l176O853l678n822P628p54m479
929d285L444k211J230J455k048K362m674R79O802n110j880L068k367K121J874
$$ plain form
815 2980 -305 5631 5231 -824 4572 4583 -745 5245 5193 358 1698 2492 4295 2804 576 2904 -933
832 -933 1771 6224 -782 -1779 3164 -1211 60 3122 -2104 -2511 2170 1600 -1623 -3777 -578 438
848 438 -2122 -1319 -1750 -5429 -1231 2503 -5766 -5798 -994 -1202 -1567 -3067 -3841 -4453 -2471 1605 -3146
865 -3146 -6268 140 17 -2379 -277 -2550 -1641 16 642 245 -4380 617 4591 -2537 -1236 2083
881 2083 -1790 1588 3303 -1342 -670 -289 2850 2527 -1389 1712 657 -273 3893 1192 -1956 2002
897 2002 2653 812 1863 1682 575 1734 4377 1916 -1498 2329 5413 45 353 2530 -1818 2016
913 2016 4481 -1118 -2341 -319 1313 820 -2577 -733 -857 -4033 2820 -858 -6680 948 194 -4285
929 -4285 -841 -3052 -1822 -367 -2415 -53 -4727 -3748 3054 -2056 -3936 -868 -3235 -1114 760
944G60l951r0O21K587l73l436K760L43k037M094j528m189N163J493k999l10J770
961F78J197Mo55J674l803J531N964m076k437M140k429J65L777l316k158K513J518
978D287j053k717J366J485k217K180j235m283K629M110l797j965J380P21L64k92
994I63N01l632P55M469k953k786J941M51j337J123o82j940j34L226p70m228J966
1011c067J903j924O63L28k617K293L848k361m455K896K637j522O57J1k034J414
1027a330L346j595j914J228K421j803J86J469k317P7L761j533l310K780J083m88
1043B061j411J129k049J111L140q20k872r85L123P00j324J704l188o35M758j795
1059B647l708K427J109j903J569j109q85j039K458P91n109J715L381l299J49P34
$$ plain form
944 760 -3191 -3281 -2660 -73 -446 -3882 -1122 -779 -2816 1278 -250 -4439 724 2217 -782 -1092 678
961 678 1875 1879 1224 2898 -905 626 6590 2514 77 4217 1788 1953 5730 2414 256 2769 4287
978 4287 3234 517 1883 3368 1151 3331 2096 -2187 442 4552 755 -1210 170 891 1255 963
994 963 1464 -2168 -1413 3056 103 -2683 -742 -291 -1628 -505 -1187 -3127 -3261 -35 -805 -5033 -3067
1011 -3067 -1164 -3088 -2425 -2097 -4714 -2421 1427 -934 -5389 -2493 144 -1378 -721 -710 -2744 -1330
1027 -1330 2016 421 -1493 -265 2156 353 539 2008 -309 -232 3529 1996 -1314 1466 2549 2061
1043 2061 650 1779 -270 841 3981 3161 289 -696 2427 3127 1803 3507 319 -316 4442 2647
1059 2647 -1061 1366 2475 572 2141 1032 147 -892 1566 2357 -2752 -1037 2344 -955 -806 -72
1075g2k802J401J541k80k322j165L475p61k223K472j260k016L604k34l665K054
1091b253J284l48m05p35P52R38j308L603m667l1M839k192j186K918l690J281L398
1108B198j647p05p63R98K586k871J468J101l818N149M1o471M261R92j133Q92j077
1125A201N35P3K1L294m859j341O242l056k001K409k808P48J430r19m11j712J359
1142B05K092l661K7K235k862J125K263n139K022K620j849Q2j926J086M50l82J988
1159C76k476k160M271j312j228J551j790j11J865o63N15j391J331J245k311L42
1175a946K102k031J410J178l086J237J498J873k780o94J861n28j84K750l127n32
1191i99L312J049k857L61O43K11q34Q78R0l243L394J802l928O09K602j714Q41
$$ plain form
1075 -72 -2874 -1473 68 -212 -2534 -3699 -224 -985 -3208 -736 -1996 -4012 -408 -642 -4307 -2253
1091 -2253 -969 -1317 -1722 -2457 -1705 -767 -2075 1528 -3139 -3170 1669 -523 -1709 1209 -2481 -1200 2198
1108 2198 551 -154 -917 81 2667 -204 1264 2365 -1453 3696 3737 -2734 1527 2519 1386 2278 1201
1125 1201 1736 1809 1830 5124 265 -1076 5166 2110 109 2518 -290 458 1888 969 558 -1154 205
1142 205 2297 -1364 -1337 898 -1964 -839 1424 -3715 -1693 927 -922 -840 -2766 -1680 -1230 -1612 376
1159 376 -2100 -4260 11 -1301 -2529 -978 -2768 -2879 -1014 -1677 -1162 -2553 -1222 23 -2288 -1946
1175 -1946 156 -1875 -465 713 -2373 -1136 362 2235 -545 -1239 622 94 -90 2660 -467 -999
1191 -999 2313 3362 505 866 1509 1720 886 1764 1854 -1389 2005 3807 -121 488 3090 1376 2217
1208B217q44j245P88l12K936l241k122M228j953j315M440m614r57K568J54n95
1224A33j206M12R07j806J076P84l679K446J166l352R78Q24j141K527m64j303j382
1241c080J336K222k487j196K873l76n85K481k873j019L101K46j658o18O30K284
1257A281j629R61J126l926L731J789l302J72J451r65R93Oq00M50m84K268k139
1274I83p60J520R93k348J696R0k145J987K5p72q07M54L24p63K45O05j621P45J252
1293A703k039j100K516j137q56N59R3j057K18J849j472j638J801N67j893J061
1309h25o06j350J952O31j395r81Q04K113j382k5M24j120L75K190j191j768K636
1326D82R91k147N69L6j408J361J160j206j070N08K514j175j437K460j468o25K929
$$ plain form
1208 2217 1373 128 916 604 3540 299 -1823 2405 452 -863 3577 -1037 -1994 574 728 133
1224 133 -1073 -661 246 -1560 -484 300 -3379 -933 233 -3119 -2141 -1317 -2458 69 -395 -1698 -3080
1241 -3080 -1744 478 -2009 -3205 -332 -708 -1293 1188 -1685 -2704 397 643 -1015 -1633 -1003 1281
1257 1281 -348 613 1739 -2187 1544 3333 31 203 1654 689 1682 1688 888 1338 854 3122 983
1274 983 223 1743 2736 388 2084 2174 29 2016 2041 1269 462 916 1240 477 722 1327 -294 451 1703
1293 1703 -336 -1436 1080 -57 -913 -354 -261 -1318 -1100 749 -723 -2361 -560 7 -1886 -825
1309 -825 -1431 -2781 -829 -198 -1593 -2574 -1770 343 -1039 -1064 -640 -1760 -1385 805 -386 -2154 482
1326 482 1473 -674 -105 -69 -1477 -116 1044 -162 -1232 -724 1790 615 -822 1638 170 -455 2474
1343B474k220o14J044P69o70J29k56L38o56K575j655j653J709j01n57J176n47
1360A285n77O45N89q30k048J826J711k370l26Q91j059l97K255j604p16k99J247
1377B23J0q20K92m04r41J918m62k293J563K17l40l05M61k00m63R21J73j872J80
1396b142K339j311j014J565j092O17J485j434p77K87J760J78j997J552L31j392
1412a045K532j48k187R77R20k95o73L26R93r14P31P35j871P75J714j483k23N29
1430A393m19J0Q01l06j169j53J730k09j585Q27K97j458J252m55p55j8J213o46
1448C50j431Q92J82l09K79k27j125j39K023q31j296O93k08k5L40K98j650L04J256
1467f24L98k392J280J038j243Q21M60r51l20J431K94j210M95M74j97M36Q55k213
$$ plain form
1343 2474 254 -360 684 1453 783 912 656 994 338 2913 1258 -395 1314 1213 656 1832 1285
1360 1285 708 1353 1942 1112 -936 890 2601 231 -95 796 -263 -660 1595 -9 -725 -1024 223
1377 223 233 -587 -295 -699 -1640 278 -184 -2477 -914 -697 -1037 -1342 -881 -1081 -1544 -623 -450 -2322 -2142
1396 -2142 197 -1114 -2128 -563 -1655 -1038 447 -987 -1764 -1477 283 461 -1536 16 347 -1045
1412 -1045 1487 1339 -848 129 1049 754 81 407 1400 486 1217 1952 81 856 2570 1087 864 1393
1430 1393 974 984 1785 1479 310 157 1887 1678 93 920 1217 -241 1011 556 -199 -217 996 350
1448 350 -1081 -189 -7 -316 -37 -264 -1389 -1528 495 -336 -1632 -939 -1147 -1172 -832 -534 -2184 -1880 -624
1467 -624 -226 -2618 -1338 -300 -1543 -722 -262 -1213 -1533 -102 192 -1018 -523 -49 -246 190 1045 -1168
1485a168N80J659o79p05K65K41M57j74N69m80p75J939M05k327O67J159n36L70
1503A467m30q03M50J357l13q00r30J367r9o83J155j649j02J615n67j136N84l95
1521H8L79l56M8Rj384J193P45k225J34K320j683k58J108j665O48L73L02r19p63
1540a906J415K39k154J720k19j439K113K8j436Q03o8L02l22m11Q54n57O13J333
1558I08j665j88K203j739M87O05j238L67J086J89j86r27J072K87q30J109q57n46
1576A37J076L65r80L8P49n0o45k75L72j36KJ744k071j153K028o69J03J05J32k48
1596F24r6k05j70j319J179M30j461N75j05q54J337Qn58j28L4R16j665J78J262
1615a8j382M46Q44j361J8P41k14k76K37N84q23k35J473n42j275J632l34l40N73
$$ plain form
1485 -1168 -588 1071 392 -313 -48 193 650 476 1045 565 -210 1729 2134 -193 474 1633 1097 1467
1503 1467 1037 234 684 2041 1728 928 -2 1365 1266 583 1738 89 -13 1602 1035 -101 483 88
1521 88 467 111 159 168 -1216 -23 722 -1503 -1369 951 -732 -990 118 -1547 -899 -526 -224 -1143 -1906
1540 -1906 -491 -252 -2406 -686 -905 -2344 -231 -203 -1639 -836 -904 -602 -924 -1335 -481 -1038 -425 908
1558 908 -757 -945 1258 -481 6 611 -627 -260 826 1015 829 -98 974 1261 431 1540 683 137
1576 137 1213 1578 598 636 1385 1335 690 415 787 651 653 2397 326 -827 1201 532 635 740 872 624
1596 624 528 323 153 -1166 13 443 -1018 -443 -548 -1402 -65 -57 -615 -743 -709 207 -1458 -1280 -18
1615 -18 -1400 -954 -110 -1471 -1453 -712 -926 -1202 -965 -381 -1204 -1439 34 -508 -1783 -151 -485 -825 -252
1634b52J92k56L18P10o92r26J726R40k095P59O48j311Q88N56p13k51P67O70n19
1653A159j236J624p36p89K075j142j555J997L01j142K26J86R5r19P61J89j286
1670a92M30J272j472j47Q68j374J91P06p24o44K72R76q94n94O69L14n63Q71o42
1689f77j131J136P80j417P3M13j17K38K55kj157J162O27j243j68J370r98n8R13
1708aj00j267J281O71q04j39L61K52k63k5O10n74P9J082l81p68R78l22K8J191
1728A889p04r36J90J121j22p30q90J050l2k26O11j002j06R15n84m46N62j44j11
1747C05K9l55l85q4J439o71j569J112O8m84N00n2q12k08J330J98j518J22J099
1766F4j119N61K81j144M36M38m82L9J33K01j25j6Q30p48q81J683l85q01J007l25
$$ plain form
1634 -252 -60 -316 2 712 20 -906 820 1760 -335 424 1072 -239 649 1205 492 241 1008 1678 1159
1653 1159 -77 1547 811 22 2097 955 -600 1397 1698 556 782 968 1063 144 905 1094 -192
1670 -192 238 1510 38 -109 759 -615 -424 282 -442 -1086 -814 162 -732 -1326 -657 -343 -906 -35 -677
1689 -677 -1808 -672 108 -1309 -1236 -823 -940 -702 -447 -449 -1606 -444 183 -1060 -1228 142 -856 -914 -1
1708 -1 -101 -1368 -87 584 -220 -359 2 254 -9 -34 576 2 81 1163 782 14 992 670 698 1889
1728 1889 1185 249 439 1560 1438 708 -182 868 836 610 1221 219 113 1028 444 -2 560 416 305
1747 305 334 -21 -406 -490 949 278 -1291 -179 -111 -595 -95 -147 -959 -1167 163 361 -1157 -1035 64
1766 64 -1055 -494 -213 -1357 -921 -483 -965 -926 -793 -592 -717 -733 97 -651 -1532 151 -234 -1035 -28 -353
1786c53j34M28L72l00p69J286J12j128P03Q40r09J44N18j000J086J89k46p86L10
1805C63O21j90k28M37l62m00J509q68o71N92q0K97o65L45N6o33O36j4r89j38J067
1826F85p86J27N83p44J92K06j5r21o85J304n5j012R71p11j34J103l50p05N50j43
1846e40N00j202K32Q77j229P54O79j272N53Q95j057L09p2l5K40J55O25r73m00
1865i61M46Q95o90Q13n39q5O86rk67m05O84M98o49K47N21r01L94L52j135RJ176
1886A080l85q2K19m99P3L82K67n68p30J093j30q71Q09k55m1k84Q00j238M3M24
1906A07p3k93r48J055j51l18J029q79k89Q00l73J91j186J073l22L15l24l56l70
1925a312J241o36o78J63N18j018J255k12J322j232Q23l13j080J750k42j10j10
$$ plain form
1786 -353 -487 -59 313 13 -756 530 642 -486 217 1057 148 292 810 -190 896 1085 839 53 363
1805 363 984 794 566 1003 641 241 1750 882 211 803 723 1020 355 700 756 123 759 745 -244 -382 685
1826 685 -101 26 609 -135 57 263 248 -673 -1358 -54 -109 -1121 -150 -861 -995 108 -242 -947 -397 -540
1846 -540 -40 -1242 -1010 -133 -1362 -608 71 -1201 -648 247 -810 -501 -573 -608 -368 -213 412 -561 -961
1865 -961 -515 380 -310 503 -36 -121 565 556 289 -116 568 1066 417 664 1185 284 678 1030 -105 -96 1080
1886 1080 695 613 832 333 406 788 1055 487 -243 850 720 -151 658 403 362 78 878 -360 -317 107
1906 107 34 -259 -1207 -152 -303 -621 408 -471 -760 40 -333 -142 -1328 -255 -577 -262 -586 -942 -1312
1925 -1312 -71 -707 -1385 -1222 -704 -1722 -467 -679 643 -589 234 -79 -1159 591 349 239 129
1942A29L81R0q14J217J41j540K29N8Q45l29M39m32q84J302P10j711O26P11q06
1961C62K62k23j09L59o43J877j875M54N3j35p1P98j21j364L69Q47j021k00J234
1980H53q64j44M06j053r50J064J274q18R29j458K52q44M16j52m58O22M37o64K19
1999i33K70k65p3N64K7n53j49J020J24j943J815J54L9p29O33m40k0N66j44j86
2019b23k69M83J380j205j30j16Q73K37j128m14P57r56p29K858o62k58k97p75P65
2038A91o11J086n12O91j7J29j042j01Q25j106K21Q75k92j68r14Q75k86l97J247
2057F94q72m45L62m9R3J085q72p30j32J384q55p17Q75k29n63P0Q80n39k85Q24
2077b1k97j28j70m4J43j1Qn40L63P82m95m22M42L70q6j58l9Q4J40O05m40o34N95
$$ plain form
1942 129 510 600 -214 1003 1144 -396 -167 -109 736 407 846 414 -470 832 1542 -169 457 1168 362
1961 362 624 401 292 651 8 1885 10 464 517 382 311 1109 988 -376 -7 840 -181 -381 853
1980 853 -11 -155 251 -802 -1752 -688 586 -232 697 -761 -509 -1353 -937 -1089 -1547 -925 -488 -1152 -933
1999 -933 -663 -928 -1001 -437 -410 -963 -1112 -92 32 -1911 -96 58 97 -632 1 -439 -459 107 -37 -223
2019 -223 -492 -9 1371 166 36 -80 793 1030 -98 -512 245 -711 -1440 1418 756 498 201 -574 191
2038 191 -420 666 154 845 828 957 -85 -186 639 -467 -246 629 337 169 -745 130 -156 -553 694
2057 694 -178 -623 -261 -310 -217 868 -4 -734 -866 518 -337 -1054 -179 -408 -971 -901 -21 -560 -845 -21
2077 -21 -318 -446 -616 -660 -517 -528 -520 -1060 -697 85 -410 -832 -390 -20 -106 -264 -303 -219 -79 526 86 -548 47
2100D7Q11r45K34Q57r51m3L43N07o70p9Q33j81k36N41k47o34P73o70J4K73k49
2121C28O88m13j85N82n54Mk11L13j52J12k52l22j26L27n66M89k09r02M71L12l53
2142f19m90Q93k95m16Q09k05n29o8J044n00n82Q04l79J86K11l92j84L6P17l73
2162c32j54J40r1N8J0J07m44J64P50k95K49N73r08N63Q1l5n08M44J36R0m56R93
2184A135p77O9M04k47m80j53J378p21j220Q13K60l49N39k66l79j6N81J27j28M27
2204I97j577K75k91J204n88m01O06k02K38K61n83Q04j656Q98j62p67J104J7j226
2223a049K128j489j184L37M64J63J9o01J339o90N00n72j035K171n44m24m10K86
2241e91j61n03Q42J198o84R3R68j072j055R21J23P3L95m69J72l47j2k43Q44r3
$$ plain form
2100 47 858 -87 147 1004 53 10 353 860 190 111 944 763 527 1068 821 187 960 290 304 577 328
2121 328 1016 603 418 1000 446 450 239 552 400 512 260 -62 -188 139 -427 62 -147 -1049 -578 -266 -619
2142 -619 -1109 -216 -511 -927 -118 -323 -852 -920 124 -376 -958 -154 -533 -347 -136 -528 -712 -676 41 -332
2162 -332 -486 -346 -437 -379 -369 -262 -706 -542 208 -87 162 735 -173 390 471 436 -72 372 508 598 142 1135
2184 1135 358 427 831 584 104 -49 1329 608 -612 201 461 112 651 385 6 -10 571 698 570 997
2204 997 -580 -305 -596 608 20 -381 225 23 261 522 -61 743 -913 -15 -177 -944 160 177 -1049
2223 -1049 1079 -410 -1594 -1257 -793 -630 -611 -1212 127 -563 -63 -635 -1670 501 -43 -467 -877 -591
2241 -591 -752 -1255 -413 785 101 194 1162 90 -965 -44 79 152 547 78 250 -97 -109 -352 492 399
2261C99M97j57k96L02r02N80j26N25r07L65J08O02j074M75j89O8K18Q95j139M43
2281F87J97n24J67q5N86m81k21L8n14L22O53j412L05J229j267P23l68n62K55o7
2301c39r7L28k58q8K36k30r7j12l29J334R7j77m07J82r3l87J11L62o09j86J774
2322A015p29q39P89j47K31p36R79r65M66N84P71j340Q73J59j087O63o81KL55l37
2342B6l37K61K79N46m62O32q63P21j178Q52n24m5J151j41p63m58N14n00J80O88
2362E79k75j9j35Rm42k52J134r57j00M76m93K83J89j72j89K44o27o3O62l04J29
2383c23l0O5l4n2l0K10m31J20L28k26m04M82K66m13N50K89l25m7M38J87o08l2
2405b0P15l69j61N61k00l53J39K78o36K65Q98r75MN04j66m6Q66l64p39K18L19
$$ plain form
2261 399 896 739 443 745 -157 423 297 822 -85 280 388 990 -84 391 202 270 488 1383 244 687
2281 687 884 360 527 442 1028 547 326 364 -150 172 825 -587 -282 947 -320 403 35 -527 -272 -339
2301 -339 -436 -108 -366 -454 -218 -448 -545 -657 -986 348 445 268 -139 43 -50 -437 -326 36 -573 -759 1015
2322 1015 286 -553 236 89 320 -416 563 -402 64 648 1419 79 952 1111 24 687 6 8 363 26
2342 26 -311 -50 229 775 313 945 82 803 -375 477 -47 -92 1059 918 155 -303 211 -289 -109 579
2362 579 304 285 150 159 -283 -535 599 -358 -458 18 -475 -192 -3 -175 -364 -120 -747 -810 -148 -452 -323
2383 -323 -353 -288 -322 -374 -404 -194 -625 -505 -177 -403 -807 -325 -59 -472 78 367 42 -5 433 620 12 -20
2405 -20 695 326 165 726 526 173 312 590 -46 219 1117 142 146 650 484 438 1304 940 201 419 738
2426G38n11mL52o36K94K70O11j424Q88l07m98K10J95o20J18J22l18M98O78m50
2446B06o90P08k99o30P91j84n1K7l38K23j40l24K66L35lj3k47J4m44Q89J64k26
2468C4j26L12l08m50N66J55K13l65n98L46L53k52J85M54j58j29N83l44R0p30N35
2489C66qm60N61K15k72J08m0j29L5j43M22l50j18Q43r52p4P38m01n75O37r5k60
2511D8k61R6M63p84L56L41n53k98O85n85N20k00K2m49m8K51L0K13K31j12j66n58
2533g58M63k6k27L32l29M20k74L85n46M45l13o13O61K83k08J28N83J65n10K7n78
2554d90Q01l42M33l2R3K86k17P9r22J199j403J116L81j052L10N59p36OR34P70
2574A773j802M54J130j160K27p23M76J52j022Q36j48L67l59j92o3k28O28p82J07
$$ plain form
2426 738 227 223 575 -61 233 503 1114 -310 578 271 -227 -17 178 -442 -324 -202 -520 -22 656 206
2446 206 -484 224 -75 -705 86 -98 -149 -122 -460 -237 -377 -701 -435 -100 -103 -116 -363 -349 -793 96 260 34
2468 34 -92 220 -88 -538 28 183 396 31 -567 -221 132 -120 65 519 361 232 815 471 561 -169 366
2489 366 358 -102 459 674 402 510 470 341 376 233 655 305 187 1030 78 4 742 341 -234 403 308 48
2511 48 -213 -117 346 -438 -82 259 -294 -592 93 -492 28 -172 -150 -599 -647 -396 -366 -153 78 -34 -200 -758
2533 -758 -295 -321 -548 -216 -545 -125 -399 -14 -560 -115 -428 -1041 -380 -97 -305 -177 406 571 61 88 -490
2554 -490 311 -31 402 370 463 749 532 611 -311 888 -515 601 982 -70 240 799 63 69 1003 1773
2574 1773 -29 425 1555 395 622 -101 375 527 -495 341 193 560 201 9 -54 -282 346 -436 -329
2593c29R92j585M58K04n00L72Q13o18J24j221J402l80j21Jj50J76J025r82l28
2612f47K03K33q53N19J169p90m15O78L13Q65j741J028K23m38n15%o5P46M76r91
2632bk91M47N38j160J377j165O71J45p3q31P45O66q56N54j090O05j46J220j50
2651A204n92n63L66k22J38J71m74l53L68j34L13K44O1L14j150N83r52N92J36j61
2671a11oo64j78JP52n83Q85J59o43J28n39Q50J27J3n77J19j9N9m94J108l57k2
2693Hj75k73N62J14m24K03l49j2J22k30Q56l01r15J138k04j173J628j175J811
2712A211j235J19L24o80K98q46R22P59m84n58K74j80J04l09k46J259j64j022J240
2731G86k61L55n8j858J908o1j139j19N97j652J106J145r17L63r86J05O70l94o90
$$ plain form
2593 -329 663 -922 -464 -260 -760 -388 425 -193 -69 -1290 112 -268 -389 -388 -538 -362 663 -319 -647
2612 -647 -444 -211 -1064 -545 624 -166 -581 97 410 1275 -466 562 785 347 -168 -168 -233 513 989 -2
2632 -2 -293 154 692 -468 909 -256 415 560 487 -344 401 1067 211 765 -325 280 134 1354 1204
2651 1204 612 49 415 193 331 502 28 -325 43 -91 222 466 527 841 -309 274 -678 -86 50 -111
2671 -111 -117 -781 -959 -958 -206 -789 96 255 -388 -260 -799 51 178 191 -386 -267 -286 -227 -721 387 30 8
2693 8 -167 -440 122 236 -188 15 -334 -346 -224 -454 402 101 -814 324 120 -1053 575 -600 1211
2712 1211 -24 95 419 -261 37 -809 113 872 388 -170 104 -76 28 -281 -527 732 568 -454 786
2731 786 525 880 822 -1036 872 811 -328 -447 150 -1502 -396 749 -168 195 -791 -686 -16 -410 -1100
2750a100J391q67O18j47K89o42O45mm32M4P53j333J17k40O91o62Q32j135Q66P42
2770D26m82L49n69M66O91j608j10J122l95N08o52P44K4M50j81l08J45M09o12L3
2790D50N06j73p94k24O58p18O18l32n13J42J117L85q89j85J01m60J012l64n14
2809a77J011O1j093P15j078R8Q03r35P95n43J30K12K92o23l90j36J119r38O16
2828f1k40J38n12J11j25J046p68j27M88o25J357m27q31P12L01r32J289j024K30
2847@K72k5r52O3Q11k16j39m3q8K52J49j56L68j97o6N34r2j98k10L8N9J87m51
2870a00N88k29r2q61J342k33m04r5O0K00L2j50K39m05L54k1j22j62M20l97J1K07
2892A82K50l13l52K35k4j84K73l20J63mn03O50R9mo72N88K72p65p8M23m23j24
$$ plain form
2750 -1100 291 -576 42 -105 184 -458 187 183 -249 -205 548 -785 -668 -908 -217 -879 -47 -1182 -316 426
2770 426 -56 293 -276 190 881 -727 -837 285 -110 398 -254 490 514 964 783 475 620 1029 417 450
2790 450 956 783 -11 -235 423 -295 323 -9 -522 -380 737 1122 233 48 149 -311 701 337 -177
2809 -177 834 895 -198 517 -561 -463 340 -595 200 -343 -213 -1 291 -332 -722 -858 261 -677 -61
2828 -61 -301 -163 -675 -564 -689 357 -411 -538 -50 -675 682 255 -576 136 437 -495 794 -230 0
2847 0 272 247 -705 -642 169 -47 -186 -229 -317 -65 84 -72 296 99 33 567 475 277 67 105 164 351 -100
2870 -100 488 259 167 -694 648 415 11 -84 -24 176 208 58 297 -108 246 225 103 -59 361 -36 -25 182
2892 182 432 119 -233 2 -22 -206 67 -253 -90 -94 -597 53 152 148 -524 64 336 -429 -507 -84 -507 -631
2914f31K86J23j88O56j29n84q9L99M27k20l96O42p92L27m52N94l96j14L65J12
2934f0p34Q75l5m18O69r0r98kP6O68J174l95r12J617j029j246R35o80M34l4Q15
2955F30Qk59J68rr56K62J091o96q3R2K53m66K35k45K47j02J90j06j103R19m54
2976c84n5J764j648K72K49n69O80p43M88l19l93r5J051o04P62K41j084J53r4R77
2996F49l95q90O44K78r78K65R81r33J176l42j351P23J032q78K8l4L63j230J192
3015C00m08j67O39n04L02l11J026q71r2L81j87M53r63J061r90P32k04n28J8O56
3035C43J63p3p89Q68j38O7l52j25m72P3N00N24j5m37k67m10L07M8q36N26K04q37
3057a128N29K06L61m53m08N98o41L94O39j74p00J67L56p4L90K57m91N74o31P05
$$ plain form
2914 -631 -345 -222 -410 246 117 -467 -556 -157 270 50 -346 296 -496 -169 -621 -27 -423 -537 -172 -60
2934 -60 -794 81 46 -372 297 207 -791 -793 -717 -49 1125 730 -182 1435 406 -840 95 -585 -151 -185 630
2955 630 638 379 547 538 -418 -156 935 239 156 248 501 35 270 25 272 170 360 254 -849 70 -384
2976 -384 -439 1325 -323 -51 198 -371 309 -434 54 -265 -658 -753 298 -306 456 697 -387 -234 -328 649
2996 649 254 -636 8 286 -692 -427 554 -379 797 455 -896 -173 859 -19 9 -25 338 -892 300
3015 300 -108 -275 364 -140 162 -149 877 6 -86 295 108 561 -402 659 -331 401 197 -331 -313 343
3035 343 506 433 -356 512 374 441 89 -36 -508 -435 65 589 574 137 -130 -540 -233 -185 -1021 -495 -291 -1128
3057 -1128 -599 -393 -32 -485 -893 -295 -936 -542 97 -77 -777 -610 -254 -328 62 319 -172 402 -229 476
3077D76j45j30p41J81P39j109J023q3J07o41J11j77L71M0l18Q6L55J46q1J68M59
3098H37j030J51j10P89k74J25j3r67O02N13m31L7J21k48K95p53M30M99r42L54
3118a5m48M66M1%k29M38k18n61R88m83J100p35J48l06k53m59j1j21J000n56j97
3139d11K54J32k5J45l87L15j49m12J65O13K75r35Q3M72m35J14O94o81j78P15M76
3160H40m22r38O4R30r55J062p10J55K55M4J79j78l09q5M98o33J15R2j19M34k93
3181B6J11k23J53M34n57p9J39R0K14M2q2k78j02K43o71R56r39J15K14J29j17N37
3203C55q02K19j31L35k1o5J90n33M65l94n76P83l6N79m34J35n15r6N11k16K16
3224c1MQ8J37m33j09N33q7n93M99J92n92L71nk95M61M88m35o0K36j57R4j29J92
$$ plain form
3077 476 331 201 -540 -359 380 -729 294 211 318 -323 -212 -389 -18 22 -296 -210 145 291 210 378 837
3098 837 -193 -42 -152 637 363 488 475 -492 110 623 192 229 350 102 397 -356 74 573 -369 -15
3118 -15 -463 3 44 44 -185 253 35 -526 462 -21 1079 344 492 186 -67 -526 -537 -658 342 -214 -411
3139 -411 -157 -25 -50 95 -292 23 -126 -538 -373 240 515 -420 -337 135 -300 -186 508 -173 -351 364 840
3160 840 418 -520 -456 474 -481 581 -129 26 281 325 504 326 17 -68 430 -203 -88 4 -115 319 26
3181 26 137 -86 67 501 -56 -135 4 94 308 350 268 -10 -112 131 -540 416 -523 -408 -194 -65 -182 355
3203 355 -447 -228 -359 -24 -45 -110 80 -453 12 -382 -958 -175 -211 368 -66 69 -446 -542 -31 -247 -31
3224 -31 -27 61 198 -235 -344 189 102 -491 8 200 -392 -21 -26 -321 140 628 193 133 369 212 306 177 369
3247C69m64J9K61J57n09L93j19J81P37l02q08j85P02k81K80l0l0k7k74j16l06
3268c52J52j75Q78o06J72k12r6J94m38P74p55O10m25L22l54J87R8k59L61k76N6
3289a44K95l36J20R4J33o29M66K45j75J37n47P10r78M60O06q93L39N73l69m03
3309b96N83r9K40j10l79L79k17M13o83L32k85L75m48N1J8L77l46N51m02L12j69
3330A97P63l34n94K59J14J73k58K9n35k0L57r5Q8M34l69j246J252m05K23k12j70
3351c49L3J34N50m63p12M59n9M04M84p98P14o10l83R28p5n36pN16j036R78Pj504
3373a325J462l85k48J507j472N03o72M12K54o70j66J691j042J086j263J456p5
3390A053mr42q2K85l59L17j78j87R9j52P29n12k2n05M69K41n89O22K24n99O61
$$ plain form
3247 369 -95 -76 185 342 -167 226 107 288 1025 723 -85 -270 432 151 431 401 371 344 70 -46 -352
3268 -352 -200 -375 503 -103 69 -143 -239 -45 -483 291 -464 146 -279 43 -311 -124 -26 -285 76 -200 -144
3289 -144 151 -185 -65 29 162 -467 -1 244 69 206 -341 369 -609 -149 457 -436 -97 476 107 -296
3309 -296 287 188 428 318 -61 318 101 514 -169 163 -122 253 -195 -144 -126 251 -95 456 54 366 197
3330 197 960 626 32 291 405 578 320 349 -186 -206 151 56 144 578 209 -1037 215 -190 33 -179 -349
3351 -349 -316 -182 368 -95 -807 -348 -407 -3 481 -317 397 -213 -596 332 257 -279 -286 230 -806 172 179 -1325
3373 -1325 137 -248 -496 1011 -461 42 -630 -218 36 -634 -800 891 -151 935 -328 1128 1053
3390 1053 1049 107 25 310 -49 268 90 -97 2 -150 579 67 45 -460 9 250 -339 283 507 -92 569
3411E69o46L05n9K86m09o0m7N8L0K30K8k98O1K8p9j07R8j45J68p4j43j07J25J15
3435g3j23J39r7M30l26k96N6k30L68j19k03N65L7j14n2n8n22L50o0j51M52n83
3457f10J018p92K59O11m15j62m49M65j34L04L31l86k0M60m05j23l03O00J07k31
3477A25j52L3j43O46k59Rn2k37K81o3O52n15p04K11K97k03Qp1p9j88L33l21L99
3500GN67n90J23n7k24J33J41l7r2j54L33j80l09L00j62K12j16R3K3J21m80J46
3522b02J85j53P2j87K57l38Q1O6J45p8k09K33J42K44l45M33j65J03M8j53k87R9
3544iP74j195O64O3Q9n49N0L32j87j71N27k24K32j44k94P2L05k62J64l06r2M34
3566B73j17J16m67J13J90J38p6m35M92O3p91M75J58o5J33l48M25J64p45j81M35
$$ plain form
3411 569 -77 228 169 455 46 -14 -61 -3 27 257 285 -13 48 76 -3 -110 -12 -157 11 -63 -206 -313 -188 -73
3435 -73 -196 -57 -154 276 -50 -346 -290 -520 -152 -271 -474 91 128 14 -38 -96 -618 -268 -328 -479 -27 -610
3457 -610 408 -384 -125 486 71 -91 -540 -75 -209 95 426 40 20 480 75 -48 -351 249 356 125
3477 125 -27 6 -137 509 250 259 207 -30 251 188 840 325 -379 -168 129 -74 -66 -137 -216 -404 -71 -392 7
3500 7 574 -16 107 50 -174 -41 100 63 -29 -183 150 -30 -339 -39 -201 11 -105 -12 11 132 -348 -202
3522 -202 -17 -170 -98 -285 -28 -366 -285 -219 -74 -152 -361 -128 14 258 -87 346 181 284 332 179 -108 -9
3544 -9 765 -430 234 297 386 -163 -113 219 32 -139 388 164 396 252 -42 30 335 73 237 -69 -161 273
3566 273 156 272 -195 -82 108 246 170 -265 227 290 -501 -26 132 67 200 -148 277 441 -304 -485 -50
3587e0J71L9m77N4K32m94R5j8l26L71P69n62L03k79l08p0M08L15m31m31J182l98
3609I5J45j75J36n17K3M46J9j12k70K80j2J31j94k56n35Q31P93j108J34M08k61
3630Aj92J60L64p37N66j94o3N45k07m29OK61K3J24n3l65l76J231n23J24n98q12
3652a144J350K3J95r91P85o98K56J61q28J164n0r09P97o12L12j85N28m50K28m70
3672e38N21n04L80k08j97M07p2J89k58m21Q18m51J04j91k59N67j43N60n74n5m8
3693c73j34P23q28k1J231p44J21N72m04n51Q88J46J99l21J84l2O2j175N53J04
3713B00q1O3n8j13L81k95K17j96K21r2n75J75k67L83k17L97l4l06O76o75k68m27
3735h91Q39P52p96q1L1k02O8Nk1M1K80M61r73N13K46l40Lj43K69l90L33j10K51
$$ plain form
3587 -50 121 160 -317 -263 -31 -525 -430 -448 -774 -403 366 -196 107 -172 -480 -550 -142 173 -258 -689 493 95
3609 95 240 65 201 -316 -293 153 172 60 -210 70 58 189 -5 -261 -796 35 828 -280 -146 262 1
3630 1 -191 -31 333 -404 162 -32 -95 450 243 -186 -180 81 104 228 175 -190 -566 665 142 266 -332 -1144
3652 -1144 206 229 424 -567 218 -480 -224 -63 -891 273 223 -686 111 -501 -189 -374 154 -296 -68 -538
3672 -538 -17 -521 -141 -349 -546 -139 -211 -22 -280 -701 117 -334 -230 -421 -680 -113 -256 304 -270 -325 -373
3693 -373 -507 216 -612 -633 598 -146 -25 547 143 -408 480 626 825 504 688 656 718 -457 96 200
3713 200 119 182 124 11 392 97 314 118 339 247 -328 -153 -420 -37 -254 143 109 -197 479 -196 -464 -891
3735 -891 -52 700 -96 -177 -146 -348 -280 -275 -296 -255 25 486 -487 26 272 -68 -65 -208 61 -329 4 -106 145
3758A45j57j05k92K97M54l43o5k00J80j84N91l70L24l95J85J99M1n2N6M7k7J09
3780D38n66J81J6L37n86K11L65k71j06K12k07m16p8N00L89o12L57o23O46n8J27
3801B56j28J63l79j76K5L15j06j67m53N49K7k34N13n49L97k10j44K4N85m14L00
3822A94j92l25J54J48k89M31m08L87n3N7n46L31Q4j19j49J26K48K39m43J6L38
3843B29Pj24l78N08j88j1j40P76r49N95j37o00M08K46k8m15K32j18P73j080L83
3864a1J67l99J62K57n12P30J8o0l24l22M88m59N58k51P3J6J37n0m80M77l66O36
3886D85n93j42M14O2o6j87l41J54j40O6L15R0j8K01l50N4l19L42l11l62M58J4
3908a74K70j62K18p4Q4K49k95P0o8J69k93k32N34l66J28n79O78N9j13r8K06Q6
$$ plain form
3758 145 -12 -117 -409 -112 342 -1 -66 -266 -86 -270 321 -49 275 -120 65 264 305 253 309 356 329 438
3780 438 -128 53 69 406 -180 31 396 125 19 231 24 -392 -470 30 419 -193 164 -459 187 129 256
3801 256 128 291 -88 -264 -239 76 -30 -197 -650 -101 -74 -308 205 -344 53 -157 -301 -277 308 -106 194
3822 194 2 -323 -169 -21 -310 121 -287 100 47 104 -442 -111 -27 -146 -295 -169 79 318 -125 -109 229
3843 229 236 112 -266 242 54 43 -97 679 -270 325 188 -412 -4 242 214 -201 31 -87 686 -394 -11
3864 -11 156 -243 -81 176 -336 394 412 352 28 -294 194 -265 293 42 115 131 268 218 -262 215 -151 485
3886 485 -108 -250 164 226 160 -27 -368 -214 -354 -288 27 117 99 300 -50 4 -315 27 -284 -646 -188 -174
3908 -174 96 -66 152 78 162 411 116 186 118 287 -6 -238 296 -70 58 -521 157 216 103 5 211 297
3930B97l19L35K12J96l07l51K71j3p76P43J87l11q38Q68m21O99m67o6l56J89J57
3951g1j81PM24M2m32O27M2o89j12M0O06j062Q16m39L95j47K65K49k6p45j23J361
3973H47n20K9n49lR3L2Kl72K57k16N21j78P70r88m3m04O52J89q3K10J07l16o40
3996f03J605n39r12M16N1O85j091J048p15N48q6j8K7j48L83q07LpJ64Q32j160
4017c24k72N09N07o05K93j32q2Q23j180P1P15l22L25j55o54l20J362r76N66r11
4037g62R04m78M91k17L29j65o44K69k68J014p02P49o43m28J50M06q94K20L47P40
4057D18l35O38p18o17J16M04M38j056J28M35L28l8m84O51J07L52o12P54r47J6
4077b2O49j507P19j95P90j09k20r0N35n66k62R0L91o73P05k08k82R45r69P0O06
$$ plain form
3930 297 -22 313 525 721 414 63 334 321 -455 288 475 164 -674 194 -227 472 5 -61 -417 -228 -71
3951 -71 -252 -245 179 221 -211 416 458 -231 -343 -303 303 -759 57 -382 13 -134 131 380 354 -391 -514 847
3973 847 327 356 -193 -196 -103 -71 -69 -441 -184 -400 121 -57 713 -275 -318 -722 -70 119 36 246 353 37 -603
3996 -603 1002 463 -449 -33 18 703 -388 660 -55 493 407 389 416 268 651 -156 -153 -160 4 836 -324
4017 -324 -596 -87 420 -185 108 -24 -106 717 -463 -392 323 1 326 171 -483 -803 559 -417 149 -762
4037 -762 142 -336 155 -62 267 102 -542 -273 -541 473 -229 520 -123 -551 -401 5 -889 -669 -322 418
4057 418 83 721 3 -614 -498 -94 344 -712 -584 -149 179 141 -343 308 415 767 155 909 -38 -22
4077 -22 627 -880 -161 -356 434 325 105 15 550 -16 -278 -188 203 -470 235 27 -255 690 -279 -209 397
4098C97l5j321Q08K2l78j33O34K19j99J06m56M69q20O68J7J01l20O1j83N77n56
4119c22K69M9k01K22j52q2J68m0j19J50l63M11L01m98L40J85m40O27p0m24p68
4140g57O63L2K22n81J68M9N90m64JK00J64l54J58K18K40o41P1m85O15J26p89N24
4162c0rOL35P8n96K77j69r1L14M0r5J13M6m48k08P91Q0l49j01o0qO18n74l43Q84
4187E01n13J07R9l37J65J56j24K52n08N77J26l42O6l71m01N81j0k42m7J27k3O03
4209D42m43k92O60n1k96k95l84N47J49j83J99k21l08L33M85m56P09l02l58L53
4229B88k66lJk0Q7j21J15L7r9o35O64J40k29J329j296o84J142r20n3J95o3N84
4251A93J27l76N03j62l53K33N44q33Q51j10j132K035j305k16J25r56J121o92N35
$$ plain form
4098 397 362 -959 -151 -129 -507 -640 -6 213 14 120 -336 133 -687 -19 -2 99 -221 -160 -343 234 -322
4119 -322 -53 -4 -205 17 -135 -217 -49 -89 -208 -58 -421 -10 291 -207 133 318 -122 505 435 11 -757
4140 -757 -94 -62 160 -421 -253 -204 386 -78 -77 123 287 -67 91 309 549 -92 -21 -506 109 235 -554 -30
4162 -30 -39 -33 302 380 -216 61 -108 -199 115 155 60 173 219 -229 -437 354 434 85 -16 -76 -84 534 -40 -383 501
4187 501 -12 95 194 -143 22 178 54 306 -202 375 501 159 225 -146 -547 34 24 -218 -265 -138 -161 442
4209 442 -1 -293 367 316 20 -275 -659 -112 37 -146 53 -168 -476 -143 342 -114 595 293 -65 288
4229 288 22 19 20 0 87 -34 81 118 19 -616 48 188 -41 1288 -8 -692 450 -470 -523 -328 -391 193
4251 193 320 -56 447 285 -68 165 709 -124 727 617 -515 1520 215 -1 124 -832 289 -403 132
4270A32k40p9M41k95j66m03J14J07L47M58o79L69L14j307J63Q07q7J56n57l60
4290g65K63O57o25O67j243J230R2K93l46M84k72l55l52R68p42J77p9n7m85O68
4310A78K86n35q7K20Q4J5n46Q23p58K92jK42J12n24k51j97R47O49j342K84M32
4331C23l08M02m53k90K82j35K91K71J58j011O04j28J58j86Q6l94m0Q02m76p4q4
4352b02K16l5K76k95J2o9J21k32L92m80J57L00m89Q21q06J70L81O2l18M28m43
4373c3J54p65J348o15l25L91k80k16O54o41P00q71O39l26K46Om39J292q72J54
4393B01p53L88j13N74j068R02L06n44j18j1J85N03n30q3j03L38j30L40m30L05
4413A59j86L71m07l0m7j20L78kO7j80k87M86k92m5j00l8j82J43l5P46n78J15p5
$$ plain form
4270 132 -108 -187 254 -41 -207 -610 -496 -389 -42 416 -263 106 420 -887 -724 83 -4 152 -405 -765
4290 -765 -502 155 -470 197 -1046 184 276 569 223 707 435 80 -272 696 -46 131 52 -5 -490 178
4310 178 464 -71 -158 62 146 161 -385 438 -320 -28 -29 213 325 -199 -450 -647 300 949 -393 -109 323
4331 323 15 417 -36 -326 -44 -179 112 383 541 -470 134 6 164 -22 64 -330 -370 432 -44 -118 -202
4352 -202 14 -21 255 -40 -28 -97 24 -208 184 -296 -139 161 -328 493 -313 -143 238 300 -18 410 -33
4373 -33 121 -644 704 89 -236 155 -125 -341 313 -328 372 -499 140 -186 60 66 -373 919 47 201
4393 201 -552 -164 -277 297 -771 131 437 -107 -225 -236 -51 452 -78 -161 -264 74 -56 284 -146 159
4413 159 -27 344 -63 -93 -140 -260 118 116 183 3 -284 202 -90 -135 -235 -273 -455 -312 -347 399 -179 -64 -139
4436a39M00n05N62l80L31n55K45Q18p73q10M02N95j23j32k62K16N44m47M30n93
4456a76l88N12k9J49j99K2j83L23O9n25J1L21k22P72l45K99o52K87o43L48M49
4477B00K7k10k49M01j40l12K94K74L27m38q77Q89k06J79j63m9M34o40M30k01R2
4498F2l13K05N37q26M39n29N52K85l51n31J03P07m41j71J89N3K34K04m02K0P4
4519A00L48m54l5K54k40k34N34l66L7k56J109o75j95J0M35o56M89j65pj32M69
4540C70n07M03l55M73l55Q6j48k06P40o29R0j00K42j30J8j21j23K53O88m16M30
4561G03r35k18M25L49l79K62o61J084o74j1L1L19J54Q6k29n93K57m33K52O7L87
4582B43k43M73m32m42L75j46J84N28K77j078N24l16Q6l55J12j08q9j46R38o53
$$ plain form
4436 -139 261 -244 318 -62 269 -286 -41 777 4 -806 -404 191 68 -64 -326 -110 434 -13 417 -176
4456 -176 -564 -52 -81 68 -131 -109 -292 31 100 -425 -414 -93 -315 457 112 411 -241 46 -597 -249 200
4477 200 227 17 -232 169 29 -283 11 285 612 174 -703 186 -20 159 -4 -53 381 -259 171 -30 62
4498 62 -251 -46 491 -335 104 -425 127 412 61 -470 -367 340 -101 -272 -83 -30 204 408 6 26 100
4519 100 448 -6 -41 213 -27 -261 273 -93 -56 -312 797 122 -73 -63 372 -284 205 40 33 -99 370
4540 370 -137 266 -89 384 29 115 -33 -239 501 -128 -38 -138 104 -26 -8 -129 -252 1 689 273 703
4561 703 -232 -450 -25 324 -55 207 -454 630 -44 -55 -24 295 449 535 306 -287 -30 -463 -211 -144 243
4582 243 0 473 41 -401 -26 -172 12 540 817 -261 263 -53 33 -322 -210 -318 -407 -553 385 -268
4602b68Q87o68J371j441Q23j95o04P88n00p23O06j12l56O70J82p06O97o90J51
4621h8k24j77o0J154l94N30m13l6rQ7J83r43N5Q68p01J005r42K30K77j28O87j008
4643d7L57l16m23J26M29k9m56l10O88m65K68N14j02r61P94L03r37J36N24k25m0
4664a72J23Q79r60K71k11M53Q9j230o8QJ046l56Q05K64r41K03R44p53j89M77p40
4685e8M42p53Q72o31N41q0J08j29n00L95J81K44r09P33o79N22O5q47Q32k99N28
4706E78o46p26J831p47L9o08J36l82J4J21J30q8J19N90q80R99p56j31P55m23k6
4727a01J44L23j42o55M97P5M28o81MJ10n66Q89l03l24J47k44N97n90L61j91k1
4748b43K41r9jJ77l75R4N20o91N95j94J76l1N32j168N14l4K13k58J2n66N01K6
$$ plain form
4602 -268 619 -49 1322 -119 704 509 -95 693 193 -530 76 -36 -392 278 460 -246 451 -239 -88
4621 -88 -312 -489 -549 605 211 741 328 292 283 370 553 -390 -335 533 -168 837 -105 125 402 274 961 -47
4643 -47 310 -6 -429 -303 126 97 -359 -669 19 -446 -178 336 234 -727 67 370 -567 -431 93 -132 -172
4664 -172 -49 830 -130 141 -70 383 472 -758 -826 -818 228 -128 677 941 0 203 1147 394 205 682 -58
4685 -58 384 -369 503 -128 413 333 441 312 -188 207 388 632 -277 456 -223 299 364 -483 349 50 578
4706 578 -68 -794 1037 290 329 -279 -143 -525 -511 -390 -260 -348 -229 361 -519 480 -276 -407 348 -75 -101
4727 -101 43 366 224 -431 66 141 569 -112 -108 2 -564 325 22 -302 -155 -399 198 -392 -31 -222 -243
4748 -243 -2 -101 -102 75 -300 -206 314 -377 218 24 200 169 701 -467 47 13 226 -32 -20 -586 -85 -59
4770e9l34L91l8P2R3P1J48l4r3j22L7K98o85K1Q07n45l05K11m5oq0P0m1J33j34
4795a69J34N6k07N03j49j68M04o04L9q02R48n00N31j79KN2k97O96n01J70N1Q9
4817I9j37n76L34J26k29Q50n77l61P53k33P8k4L58j53q0K24n96N52r65N68N50
4838E61n51L72j95m79L16P4oM34j2o16o8M4N0L0P25m80l94J11L13J33k84m81M69
4861F6L99q23J58J22L01N2n20k3M47J34j0l52O8J211j492l57L50J58N27n95k52
4882d31J345j365K60Q18j260P46k54K41N73q61R40j046L99j15m29L41L55m37m37
4901f17J004r46Q35m04K45N67p70O01m83l17N87l89K6L96k35N60j196N16K64K33
4921D77j098O43K19P4n46p3P32k9n64L20K94o05J51K81M93j31k00j81k46N43l91
$$ plain form
4770 -59 -393 -2 -40 32 125 196 344 310 217 95 132 430 -255 -234 573 28 -277 -66 -111 -117 -197 -127 -168 -35 -169
4795 -169 -35 21 -186 317 168 0 404 -200 -161 -963 -15 -515 16 -163 -161 -109 -406 290 -211 -41 10 99
4817 99 -38 -614 -280 -154 -383 467 -110 -471 282 49 127 103 461 308 228 452 -144 408 -557 11 561
4838 561 10 382 187 -292 24 98 92 526 514 -102 -170 -126 -76 -46 679 199 -195 -84 229 362 78 -403 66
4861 66 465 -358 -200 -78 223 275 -245 -268 179 313 303 -49 19 1230 -262 -619 -269 -111 416 -179 -431
4882 -431 914 -451 -191 627 -633 113 -141 100 673 -188 752 -294 105 -10 -439 -98 257 -180 -617
4901 -617 387 -559 276 -128 117 684 -86 515 32 -285 302 -87 -61 335 100 660 -536 -20 244 477
4921 477 -621 22 241 315 -231 -304 428 399 -165 155 449 -156 -5 276 769 638 438 257 11 554 163
4942A63j8o97l29R00p26M09o7N79p9o9r6K57q70J104p37J61P45m19m59O90l1p90
4964c79Q69r40Q35r08O2R40M53r47L80p47j65M67M21M62p32l0O2k70M42n48J127
4985H54j039n44M49L34J00o15Q31q20N22J112j753P67R5M51K75q44p2j52N7q1
5005g3P22q36l28K07O44l57K65K20o14K58j9J99l24j81M6J45k43m45K83k03O64
5026C0l47K08N62j013M45N79j82l77l43L64M7o35R25j240J430N5l39L49o08n6
5046a46L11j23L05p8j0O08p48L78o67m02M11J02p53o3R35m75P96J86k1k84k59
5067Cm96r8N18M62m66o86J706r99J43jJ79O99j139m00N55l74M80J57N7m32M75
5088C43m66L98J16p27N0K54r3K72k19m2k60L48m17L22k52j37j62N83K17J76m38
$$ plain form
4942 163 145 -552 -881 19 -707 -298 -365 214 135 66 -30 227 -643 461 -276 -115 630 211 -248 442 411 -379
4964 -379 490 -450 385 -523 -461 479 932 -15 365 -382 -547 -80 341 803 71 41 103 -167 275 -273 854
4985 854 -185 -729 -280 54 154 -461 370 -450 72 1184 -569 198 293 744 1019 175 103 -49 8 -73
5005 -73 649 -187 -515 -308 336 -21 244 464 -150 108 89 288 -36 -217 -171 -26 -269 -714 -431 -634 30
5026 30 -317 -109 453 -560 -115 464 282 -95 -438 -74 -27 -662 263 -977 453 508 169 518 -90 -146
5046 -146 165 42 347 269 259 867 119 497 -170 -572 -161 -59 -812 -875 60 -415 381 567 546 262 3
5067 3 -493 -591 -73 389 -77 -763 943 -56 87 86 265 964 -175 -575 -20 -394 86 243 300 -132 343
5088 343 -123 275 391 -336 -286 -32 -125 147 -72 -114 -374 -26 -443 -121 -373 -510 -672 -89 128 304 -134
5109a34R8J09k5l74n20K81O11J17N4j70M51m21J25p28K94O88r43L30J21J6J49
5130A29p26K65K36K19l66N44l92K96j1n21J75l77O78j88j32J00K87l66Q58p62
5150e4l28K13M24n68P32N2j49l30j31N30l07M04n95k47L15m3k61K97M61l32l78
5171b95K44J11n20O57j56j28m7k31K78k06L91j16L8q32O01j01L91l45N25K7l46
5192f0l31R22m44m2K88j17k01J41k31o5J22ML15m43j7PN07l86j29M2Mk28M03o5
5216dJ19j24Ol97P34m34J67n8j22N9K05p5l18L48k37o5L64k1P9n1l34j92M01k9
5240B1j73N26l15j18l06L31O8j12J01L55p62J64N27o20k95K30j0n93O60P92p89
5261c18M28o14M07J32n63K43M49m04m1J57K62k33L09j54k75J35J22k00K03q0p7
$$ plain form
5109 -134 -36 73 48 -326 -846 -565 46 163 217 47 498 77 202 -526 -232 456 -487 -157 -36 -20 129
5130 129 -597 -332 -96 123 -243 301 -91 205 194 -327 -152 -529 149 -39 -171 -71 216 -150 708 -54
5150 -54 -382 -169 255 -313 419 471 322 -8 -139 391 84 488 -107 -354 -39 -82 -343 -46 415 83 -295
5171 -295 -51 60 -460 197 41 -87 -134 -365 -87 -293 98 -18 20 -812 -211 -312 79 -266 259 286 -60
5192 -60 -391 531 87 45 333 216 15 156 -75 -140 -18 -14 301 -142 -159 -152 355 -31 -160 -118 -114 -342 61 -4
5216 -4 115 -9 -3 -400 334 -100 67 9 -113 -54 151 76 -242 106 -131 -196 168 147 226 175 -159 -351 50 21
5240 21 -152 374 59 -59 -365 -34 34 -78 23 378 -384 -220 307 -313 -608 -378 -388 -981 -321 471 -318
5261 -318 110 -504 -97 35 -528 -285 164 -240 -281 -124 138 -95 214 60 -215 -80 42 -158 45 -35 -112
5282a12J07J55L54k37m66J06Q33o74k0m23J015j172L72K36n87N74j010L41P03
5301I5O35m94k68R83j450N7K58M58q9m98O97k70k38m0j42N31l14K85m46j47m0
5322d37L39K17Q2nj18K21j24J46k50m87M53l1M8Qk06q9O62n30j19J82J28m67J84
5345a93j12L31j05N17o83R2j60K42o6r4N06l1K6l70K70l70K43J52j96P6j75O1
5367c9L14j41J69m07J95l7l9k5J00J30n84O90m70L96l01L76J32l1l27L26m1n03
5389a17J36l30L3L26L2l08J16J74J7M1J52k10Ol56K01J85j08K09m31M81l61j80
5411b92O75k53r5l01M81l64K79k19k80L41m58O52r8k76m1N04l9l95R0K19j4j27
5433a1j27K66k5J54p0k48k84K49K78L3j01L31l79M4m25N66k47j13J10p8L14k44
$$ plain form
5282 -112 -5 150 504 267 -199 -93 740 66 46 -377 638 -534 -162 74 -513 61 -949 -608 95
5301 95 730 236 -32 951 -499 -442 -184 274 185 -313 384 114 -124 -164 -306 225 -89 196 -250 -397 -437
5322 -437 -98 119 201 196 78 299 175 321 71 -416 37 6 54 62 -144 -233 429 -101 -220 -38 90 -377 -193
5345 -193 -305 26 -79 438 -245 -153 -313 -71 -137 -231 275 244 270 -100 170 -200 43 195 -1 75 -100 -39
5367 -39 275 134 303 -104 91 54 15 -10 90 220 -364 326 -144 252 -49 327 459 428 101 427 386 -117
5389 -117 19 -311 -278 48 80 -228 -112 62 79 120 272 62 68 -288 -87 98 -10 199 -232 249 -112 -292
5411 -292 383 130 35 -266 215 -149 130 -89 -369 -28 -486 166 68 -208 -249 255 216 -179 -89 130 116 -11
5433 -11 -138 128 103 257 187 -61 -345 -96 182 215 114 445 66 110 -315 251 4 -109 1 -77 237 -7
5455gk60O29m94L11j17l48L89m31N25n5k50N33K65o89o6m00K24M07j34p9K16o75
5477e06R56o12L9J21K02j97J39j94L07m65J76j90RK54m20J37N16Q9k30o59L07
5498b21N54l94R00p98L3J40m16k93R14o94M39O38o42p9N4o68K8P98k20L47l06
$$ plain form
5455 -7 -267 362 -132 179 62 -286 103 -328 197 142 -108 425 690 1 -65 -465 -241 166 32 -47 169 -506
5477 -506 450 -162 -123 -2 200 3 142 -52 255 -210 -34 -224 -215 39 -381 -244 272 361 131 -528 -221
5498 -221 333 -61 839 41 74 214 -202 -495 419 -275 164 802 160 81 135 -533 -505 293 73 420 114
$$ [...]
8191B03
##END NTUPLES=NMR FID
##END=
