##TITLE=1H_SL 59-Dau(baf2)-f4
 CDCl3, 8 sc, 
 31.05.2021
##JCAMPDX= 6.0         $$ Bruker NMR JCAMP-DX V2.0
##DATA TYPE= NMR FID
##DATA CLASS= NTUPLES
##ORIGIN= UXNMR, Bruker Analytische Messtechnik GmbH
##OWNER= root
$$ XWIN-NMR		Version 3.5
$$ Mon May 31 10:59:17 2021 Russian Standard Time (UT+4h)  she@DPX200
##.OBSERVE FREQUENCY= 200.131506
##.OBSERVE NUCLEUS= ^1H
##.DELAY= (6, 6)
##.ACQUISITION MODE= SIMULTANEOUS
##.ACQUISITION SCHEME= undefined
##.AVERAGES= 8
##.DIGITISER RES= 18
##SPECTROMETER/DATA SYSTEM= spect
##.PULSE SEQUENCE= zg30
##.SOLVENT NAME= CDCl3
##.SHIFT REFERENCE= (INTERNAL, CDCl3, 0, 15.7039)
##AUDIT TRAIL= $$ (NUMBER, WHEN, WHO, WHERE, WHAT)
$$ ##TITLE= Audit trail, XWIN-NMR		Version 3.5
$$ ##JCAMPDX= 5.01
$$ ##ORIGIN= Bruker BioSpin GmbH
$$ ##OWNER= she
$$ F:/spectra/data/she/nmr/H-F/1/audita.txt
$$ ##AUDIT TRAIL=  $$ (NUMBER, WHEN, WHO, WHERE, WHAT)
(   1,<2021-05-31 10:57:09.95 +0400>,<she>,<DPX200>,
      <created by zg, POWCHK disabled, PULCHK disabled
       configuration hash MD5:
       00 E9 B6 7A A2 85 ED C7 34 08 36 98 17 FE 4E 26
       data hash MD5: 16K
       1F 82 2D 2D 07 48 EB D8 11 7C 88 85 B2 79 2A D3>)
$$ ##END=
$$ 
$$ hash MD5
$$ 23 E2 A6 01 15 87 DB FD 8A BA CA E5 26 3D F3 73
##$RELAX= 
##$RELAX= 
##$RELAX= 
##$RELAX= 
##$RELAX= 
##$RELAX= 
$$ Bruker specific parameters
$$ --------------------------
##$DU= <F:/spectra>
##$EXPNO= 1
##$NAME= <H-F>
##$PROCNO= 1
##$TYPE= <nmr>
##$USER= <she>
##$AMP= (0..31)
100 100 100 100 100 100 100 100 100 100 100 100 100 100 100 100 100 100 
100 100 100 100 100 100 100 100 100 100 100 100 100 100 
##$AQSEQ= 0
##$AQ_mod= 1
##$AUNM= <au_zg>
##$AUTOPOS= <>
##$BF1= 200.13
##$BF2= 200.13
##$BF3= 200.13
##$BF4= 200.13
##$BF5= 200.13
##$BF6= 200.13
##$BF7= 200.13
##$BF8= 200.13
##$BYTORDA= 1
##$CFDGTYP= 0
##$CFRGTYP= 5
##$CHEMSTR= <none>
##$CNST= (0..31)
1 1 145 1 1 1 1 1 1 1 1 1 1 1 1 1 1 1 1 1 1 1 1 1 1 1 1 1 1 1 1 1 
##$CPDPRG= <>
##$CPDPRG1= <>
##$CPDPRG2= <>
##$CPDPRG3= <>
##$CPDPRG4= <mlev>
##$CPDPRG5= <mlev>
##$CPDPRG6= <mlev>
##$CPDPRG7= <mlev>
##$CPDPRG8= <mlev>
##$CPDPRGB= <>
##$CPDPRGT= <>
##$D= (0..31)
0 1.2 0 0 0 0 0 0 0 0.06 0 0.03 0 0 0 0 0.0002 0 0 0 0 0 0 0 0 0 0 0 0 
0 0 0 
##$DATE= 1622444229
##$DBL= (0..7)
120 120 120 120 120 120 120 120 
##$DBP= (0..7)
150 150 150 150 150 150 150 150 
##$DBP07= 0
##$DBPNAM0= <>
##$DBPNAM1= <>
##$DBPNAM2= <>
##$DBPNAM3= <>
##$DBPNAM4= <>
##$DBPNAM5= <>
##$DBPNAM6= <>
##$DBPNAM7= <>
##$DBPOAL= (0..7)
0.5 0.5 0.5 0.5 0.5 0.5 0.5 0.5 
##$DBPOFFS= (0..7)
0 0 0 0 0 0 0 0 
##$DE= 6
##$DECBNUC= <off>
##$DECIM= 32
##$DECNUC= <off>
##$DECSTAT= 4
##$DIGMOD= 1
##$DIGTYP= 9
##$DL= (0..7)
0 120 120 120 120 120 120 120 
##$DP= (0..7)
150 150 150 150 150 150 150 150 
##$DP07= 0
##$DPNAME0= <>
##$DPNAME1= <>
##$DPNAME2= <>
##$DPNAME3= <>
##$DPNAME4= <>
##$DPNAME5= <>
##$DPNAME6= <>
##$DPNAME7= <>
##$DPOAL= (0..7)
0.5 0.5 0.5 0.5 0.5 0.5 0.5 0.5 
##$DPOFFS= (0..7)
0 0 0 0 0 0 0 0 
##$DQDMODE= 0
##$DR= 18
##$DS= 0
$$ [...]
##$SUBNAM2= <"">
##$SUBNAM3= <"">
##$SUBNAM4= <"">
##$SUBNAM5= <"">
##$SUBNAM6= <"">
##$SUBNAM7= <"">
##$SUBNAM8= <"">
##$SUBNAM9= <"">
##$SW= 16.9725357007746
##$SWIBOX= (0..15)
0 0 2 0 0 0 0 0 0 0 0 0 0 0 0 0 
##$SW_h= 3396.73913043478
##$TD= 16384
##$TD0= 1
##$TE= 0
##$TE2= 300
##$TE3= 300
##$TEG= 300
##$TL= (0..7)
0 120 120 120 120 120 120 120 
##$TP= (0..7)
150 150 150 150 150 150 150 150 
##$TP07= 0
##$TPNAME0= <>
##$TPNAME1= <>
##$TPNAME2= <>
##$TPNAME3= <>
##$TPNAME4= <>
##$TPNAME5= <>
##$TPNAME6= <>
##$TPNAME7= <>
##$TPOAL= (0..7)
0.5 0.5 0.5 0.5 0.5 0.5 0.5 0.5 
##$TPOFFS= (0..7)
0 0 0 0 0 0 0 0 
##$TUNHIN= 0
##$TUNHOUT= 0
##$TUNXOUT= 0
##$USERA1= <user>
##$USERA2= <user>
##$USERA3= <user>
##$USERA4= <user>
##$USERA5= <user>
##$V9= 5
##$VALIST= <valist>
##$VCLIST= <CCCCCCCCCCCCCCC>
##$VD= 0
##$VDLIST= <DDDDDDDDDDDDDDD>
##$VPLIST= <PPPPPPPPPPPPPPP>
##$VTLIST= <TTTTTTTTTTTTTTT>
##$WBST= 1024
##$WBSW= 4
##$XGAIN= (0..3)
0 0 0 0 
##$XL= 0
##$YL= 0
##$YMAX_a= 103038
##$YMIN_a= -117953
##$ZGOPTNS= <>
##$ZL1= 120
##$ZL2= 120
##$ZL3= 120
##$ZL4= 120
##$ABSF1= 10
##$ABSF2= 0
##$ABSG= 5
##$ABSL= 3
##$ALPHA= 0
##$AQORDER= 0
##$ASSFAC= 0
##$ASSFACI= 0
##$ASSFACX= 0
##$ASSWID= 0
##$AUNMP= <proc_1d>
##$AZFE= 0.1
##$AZFW= 0.1
##$BCFW= 1
##$BC_mod= 2
##$BYTORDP= 1
##$COROFFS= 0
##$CY= 11.3945322036743
##$DATMOD= 1
##$DC= 2
##$DFILT= <>
##$DTYPP= 0
##$F1P= 15.9154993809931
##$F2P= -4.1035820241983
##$FCOR= 0.5
##$FTSIZE= 0
##$FT_mod= 4
##$GAMMA= 1
##$GB= 0.15
##$INTBC= 1
##$INTSCL= 1
##$ISEN= 128
##$LB= 0.24
##$LEV0= 0
##$LPBIN= 0
##$MAXI= 10000
##$MC2= 0
##$MEAN= 0
##$ME_mod= 0
##$MI= 1.114404
##$NCOEF= 0
##$NC_proc= 0
##$NLEV= 6
##$NOISF1= 3.799351
##$NOISF2= 2.8
##$NSP= 1
##$NTH_PI= 0
##$NZP= 0
##$OFFSET= 15.70392
##$PC= 1
##$PHC0= -11124.23
##$PHC1= 14.40099
##$PH_mod= 1
##$PKNL= yes
##$PPARMOD= 0
##$PSCAL= 0
##$PSIGN= 0
##$REVERSE= no
##$SF= 200.130013532006
##$SI= 16384
##$SIGF1= 3
##$SIGF2= 2
##$SINO= 400
##$SIOLD= 16384
##$SREGLST= <1H.CDCl3>
##$SSB= 0
##$STSI= 0
##$STSR= 0
##$SW_p= 3612.71676300578
##$SYMM= 0
##$S_DEV= 0
##$TDeff= 0
##$TDoff= 0
##$TI= <>
##$TILT= no
##$TM1= 0
##$TM2= 0
##$TOPLEV= 0
##$USERP1= <user>
##$USERP2= <user>
##$USERP3= <user>
##$USERP4= <user>
##$USERP5= <user>
##$WDW= 1
##$XDIM= 8192
##$YMAX_p= 0
##$YMIN_p= 0
$$ End of Bruker specific parameters
$$ ---------------------------------
##NTUPLES= NMR FID
##VAR_NAME=  TIME,          FID/REAL,        FID/IMAG
##SYMBOL=    X,             R,               I
##VAR_TYPE=  INDEPENDENT,   DEPENDENT,       DEPENDENT
##VAR_FORM=  AFFN,          ASDF,            ASDF
##VAR_DIM=   8192,          8192,            8192
##UNITS=     SECONDS,       ARBITRARY UNITS, ARBITRARY UNITS
##FACTOR=    0.0002944,     1,               1
##FIRST=     0,             0,               0
##LAST=      2.4114304,     0,               0
##MIN=       0,             -117953,         0
##MAX=       2.4114304,     103038,          0
$$ Real data points
##PAGE= N=1
##DATA TABLE= (X++(R..R)), XYDATA
0 0 0 0 0 0 0 0 0 0 0 0 0 0 0 8 -8 8 -8 14 -16 16 -24 24 -32 32 -40 48 -56 64 -72 82 -96 108 -122 138 -156
35 -156 176 -196 220 -246 274 -304 338 -372 412 -456 504 -556 613 -672 742 -817 900 -993
53 -993 1094 -1213 1342 -1493 1666 -1870 2112 -2403 2766 -3229 3841 -4689 5942 -7972 11787
68 11787 -21289 90290 103038 -117953 60889 -6435 -31437 78927 -40431 -21369 36763
79 36763 -23539 46498 -13973 -37370 37972 -23013 6901 34687 -39200 15954 13828 -9353
91 -9353 22358 -21220 6000 23426 -22410 31838 -4182 -33590 45005 -2820 -12729 21047 -34268
104 -34268 18925 22488 -37246 21956 -9250 -15049 48324 -36181 -25269 34539 -20024 11314
116 11314 8324 -27994 17567 -5080 -1677 8422 -32754 22509 12408 -25244 28548 -16165
128 -16165 -20155 32263 -15611 -374 10627 -16500 21499 -6759 -12406 18925 -23727 8674
140 8674 21225 -28577 11706 3035 -15647 21403 -14941 -7055 18110 -16408 11195 4245 -21882
153 -21882 20319 2045 -6686 15980 -13893 4837 14346 -8031 13867 -7805 -1944 28815 -18636
166 -18636 -3772 16490 -18312 15740 6803 -19054 13719 -8417 -2202 10547 -22110 11368
178 11368 1749 -17786 24497 -15725 -16675 22524 -18035 2884 11330 -22197 11800 -3114 -8979
191 -8979 15046 -23934 144 16216 -20135 7521 -6693 -16935 18391 -11774 -6910 4864
203 4864 -19062 13683 -1742 -21505 16487 -10075 -6863 16375 -17689 1150 6876 -12575 13042
216 13042 -3419 -5348 12971 -14032 8135 12635 -19622 12126 9106 -9248 13481 -3943 -3808
229 -3808 12541 -2813 7494 -124 -5950 18009 -3086 -6161 10294 -8440 8214 9428 -13582
242 -13582 6297 2469 -3783 9248 -8992 148 8640 -10118 8055 2436 -13900 8639 1257
255 1257 -3110 4485 -9054 2084 3870 -6462 6690 -6146 -7526 10853 -6112 -5018 2226
268 2226 -8717 3165 1638 -7065 -928 -6578 2735 1800 -11825 4118 379 -7242 7883 -5730
282 -5730 -7125 7038 -2779 400 172 -5208 5240 -1849 -2130 3871 -6810 2536 7270 -4606 572
297 572 612 -314 5792 -781 -90 2428 -542 6225 2251 -2289 3868 693 2622 5663 -1414 -265
313 -265 1373 2903 5319 -2720 -1596 5190 -345 1571 1991 -4858 1606 5027 -1086 -1254 -1105 648
329 648 2190 -1137 -88 -1386 -1271 3068 -1330 -4347 104 -1 -806 -836 -1524 -2443 -2446 1076 -32 -4473
347 -4473 -1322 202 -778 106 -1303 -2990 -1023 2901 1540 -3984 -2016 1974 2141 312 -2525 -1096
363 -1096 1183 2304 1442 -4918 -1048 5371 -1647 -323 1941 -2898 2662 2244 -995 2103 -1083 2037
379 2037 3467 -1541 3762 1068 -2019 6409 1866 -1131 2860 155 4622 3077 -1430 3488 -78
394 -78 3352 5987 -4876 1119 5556 -1549 3972 -764 -3116 4954 -605 2 166 -5151 4552 446
410 446 -6259 3166 -3293 -3293 3600 -4802 -1686 123 -4544 2425 -2392 -4099 1641 -4852 1282 1863
426 1863 -7676 1733 -148 -3287 3526 -5397 -2171 3566 -5198 2296 -1993 -7854 5667 -2057 -4140
441 -4140 3338 -6367 1111 3497 -5174 3027 -2635 -1657 7963 -5357 310 5095 -5087 6896 2298
456 2298 -4834 7146 -1158 1440 5216 -5081 5559 1647 -3735 7869 -4150 -1182 8503 -6447
470 -6447 2976 3102 -6688 6631 -1228 -3487 6028 -6838 2361 4744 -8099 4043 -1460 -4659
484 -4659 7319 -6157 -2169 3783 -6910 4816 -1196 -8770 6501 -4395 -3660 5347 -9145 836
498 836 2524 -7699 4457 -3757 -4864 6199 -7854 1025 3870 -10599 6090 510 -7411 8351
512 8351 -5296 -2248 8654 -6938 3109 2383 -5561 9910 -2939 -2786 9127 -6222 4898
525 4898 4786 -8362 9033 -100 -3505 9266 -6731 2042 6993 -8336 7018 275 -6026 9056
539 9056 -4369 569 6906 -8867 6008 3158 -5669 8747 -5072 -2091 11277 -6405 1433
552 1433 3979 -6680 8120 98 -5351 5938 -5002 2842 4139 -9567 5212 128 -5658 8049
566 8049 -6673 -3570 7097 -7637 2871 1262 -8991 6688 -1936 -3494 5608 -9033 1596
579 1596 5388 -8410 4879 -2933 -4880 9612 -6443 -2113 4373 -7978 7072 1153 -8860
592 -8860 6908 -3271 -122 6745 -9085 3036 3064 -4294 8233 -6186 -2830 10242 -6494 3353
606 3353 3004 -8811 9911 1436 -5364 7079 -5050 3396 6943 -8239 4857 579 -2821 10016
620 10016 -6189 -1624 8052 -6683 5405 1910 -8584 8005 -1629 -2273 6355 -8601 2221
633 2221 4987 -6651 5114 -4036 -4542 9394 -5974 -668 2956 -8865 8052 541 -8921 6114
647 6114 -4325 -308 6395 -10350 1470 2553 -5833 5558 -6297 -4011 7228 -7072 1513
660 1513 1281 -8742 7287 -1008 -5615 6381 -6012 640 6093 -7431 3845 -113 -4204 8935
674 8935 -4033 -1706 5674 -5834 5739 2897 -7470 6738 -828 -1272 7425 -6765 1370 6154
688 6154 -4703 5390 -1141 -3686 8111 -3469 164 3873 -5788 5734 1249 -5339 6327 -3303
702 -3303 -827 6120 -6423 2290 2566 -5460 5691 -2081 -3305 5306 -4974 1586 2372 -6820 4673
717 4673 -1123 -3826 5521 -5413 -1097 4287 -6118 2375 -136 -5622 4776 -3084 -2619 3138 -5883
732 -5883 1930 1146 -5722 3872 -3058 -2558 5384 -5510 396 2979 -5347 4221 -556 -4016 5408
747 5408 -2936 184 3647 -4864 3419 850 -3659 5436 -2714 -581 5292 -4188 3056 2238 -4053
762 -4053 4830 -572 -1001 4679 -4017 2142 3149 -3418 3842 -1024 -1509 5448 -3563 -20 2833 -3734
778 -3734 3802 -25 -3970 4448 -2009 -692 2858 -3839 1657 1096 -2867 2913 -1636 -1843 3061 -3352
794 -3352 542 1259 -4394 2147 -554 -2419 2626 -3346 -538 2329 -3485 714 -557 -2496 3081
809 3081 -2182 -1465 2092 -2743 1693 333 -3538 2581 -336 -1290 2657 -2622 317 2220 -2247 1678
825 1678 -213 -1516 2477 -1270 441 1614 -2136 1831 937 -1287 2930 -686 49 3050 -855 1107
841 1107 1395 -672 2817 14 -565 2244 -737 1413 1321 -1839 1999 1059 -659 1707 -944 312
857 312 1601 -717 618 -96 -1159 1654 -495 -626 409 -1632 198 405 -1379 -257 -1010 -717 461
874 461 -1302 -879 -108 -1109 455 -629 -1364 176 -828 -334 45 -1449 -133 -183 -814 151 -843 -925
892 -925 215 -169 -286 -451 -575 244 182 -308 -224 120 789 534 -13 260 483 1231 428 290 451 705 1500
913 1500 387 287 814 531 653 818 619 1001 208 554 1126 -368 747 110 -532 1587 -460 -738
931 -738 391 -455 924 424 -1615 757 -33 -965 338 -1439 -363 839 -1509 -198 -707 -1220 695
948 695 -1479 -889 777 -1747 361 -231 -1959 603 -924 -1356 1130 -1070 -198 8 -1529 1588 -792
965 -792 -1629 1468 -1329 150 1537 -2685 1003 1541 -1594 1430 -889 -211 1991 -1416 703 1039
981 1039 -1456 2377 -149 -1160 2960 -1121 540 2082 -1915 2139 309 -1349 2833 -1366 90
996 90 2176 -1762 1995 724 -2134 2999 -555 -254 2650 -2554 1912 1852 -2397 2372 -543 -1900
1012 -1900 3019 -1539 -615 1575 -2324 1432 -208 -1906 1960 -2325 -629 1673 -3606 128 430
1027 430 -2898 2892 -943 -1875 2212 -2489 575 956 -3030 1847 -60 -1681 2727 -2344 -182 2037
1043 2037 -3029 1213 124 -2439 2440 -1697 -267 3094 -3702 2506 1226 -2656 3171 -1736 -864
1058 -864 3344 -2121 1083 1681 -3251 3110 -496 -1446 4164 -2350 595 2226 -3616 2845 1229 -2708
1074 -2708 3537 -1124 -220 2474 -3359 3179 716 -3692 2955 -1334 -1440 3645 -3102 229 1896
1089 1896 -3603 2504 -1026 -1973 3587 -2768 -345 2056 -3673 2271 -460 -3684 3256 -2261 -1106
1104 -1106 2867 -4278 1121 1155 -3938 3205 -1658 -2533 3012 -3221 866 1059 -3980 3092 -522 -2369
1120 -2369 3416 -3611 136 3641 -3894 1436 516 -2513 4152 -1739 -1327 3157 -2479 2430 1021
1135 1021 -3774 3985 -464 -1402 3964 -3151 1328 3293 -2942 3061 -124 -1922 4602 -1584 -222
1150 -222 2730 -3242 3086 1088 -3127 3303 -1738 -39 3368 -4043 1490 1654 -2945 3889 -1598
1165 -1598 -2943 3904 -2612 387 1244 -3945 3091 -144 -2259 2785 -3599 209 2877 -4317 1342
1180 1342 32 -3206 3599 -1958 -2063 2297 -2898 1237 613 -4110 2432 -1047 -1205 2782 -3865 524
1196 524 2542 -3296 2567 -798 -2354 4309 -2228 -487 2754 -3302 2701 1050 -2831 3132 -1196
1211 -1196 10 3350 -3296 1663 1438 -2218 3960 -1034 -1770 4027 -2067 1074 2224 -3466 2698
1226 2698 593 -1467 2910 -2393 606 2844 -3375 1771 305 -2340 3818 -1688 -1279 2587 -2651
1241 -2651 1122 859 -3123 2360 -967 -1358 2783 -2744 21 1584 -3017 1681 -597 -2607 2441
1256 2441 -2050 -451 1650 -3596 1755 676 -2906 2285 -1498 -830 2041 -2487 694 637 -2109 2916
1272 2916 -1434 -1334 3494 -2610 388 1666 -3267 1806 950 -1719 2500 -1700 211 1999 -2386
1287 -2386 2315 777 -1652 3399 -1071 -129 2653 -2344 1185 1415 -1952 2480 -433 -681 2487 -1794
1303 -1794 615 1759 -1949 2098 -214 -1339 2255 -1271 110 1774 -2091 1352 513 -2370 2201
1318 2201 -1033 -1005 1827 -1779 467 549 -1951 1550 -755 -1277 1376 -2221 29 1453 -2343 884
1334 884 -474 -1915 1641 -1516 -658 1249 -1929 909 137 -1775 1255 -646 -660 1558 -1513 265
1350 265 722 -1590 1439 -582 -631 1734 -934 233 974 -1600 1564 452 -818 1544 -473 462
1366 462 1247 -1061 1186 298 -808 1871 -252 -470 1568 -1214 671 1068 -991 941 0 -209 979
1383 979 -991 455 658 -1009 851 -368 -1167 1064 -344 -505 322 -1179 177 168 -899 97 -750
1400 -750 -471 781 -1322 7 220 -1117 260 -306 -665 370 -852 -117 200 -1074 165 -115 -529
1417 -529 616 -621 -538 497 -266 135 90 -514 709 -299 -145 271 -505 399 579 -401 232 -45 177
1436 177 573 51 341 213 191 357 226 292 504 91 122 518 145 337 33 372 255 -198 166 85 -70
1457 -70 164 -53 -54 185 340 43 -489 111 -51 -461 149 -172 -263 -211 -197 -126 -393 -240 52 -677 -437 -98
1479 -98 -739 -134 -35 -653 -137 -349 -167 -111 -643 -55 -352 -690 389 -371 -555 554 -463 -203 324 -594
1499 -594 253 -89 -339 694 -436 -53 792 -462 220 442 -438 713 47 -168 742 -304 926 569
1517 569 -731 999 176 -103 1202 -468 4 898 -559 831 347 -690 1201 -346 -308 1075 -954
1534 -954 664 588 -755 1102 -476 -557 938 -932 301 396 -1162 1094 -234 -1027 1035 -897 -478
1551 -478 677 -1719 293 -224 -955 1029 -1277 -636 953 -1538 341 -44 -1474 1229 -608 -903
1567 -903 949 -1315 -1 499 -1448 884 -580 -993 1301 -941 -39 948 -1331 856 161 -797 1167
1584 1167 -794 41 1467 -1144 689 498 -1036 1645 -157 -380 1695 -901 481 959 -1254 1728
1600 1728 21 -657 1877 -987 -294 1438 -1397 993 623 -1134 1603 -654 -226 1642 -1793 780
1616 780 539 -1875 1632 -744 -1163 1794 -1425 231 806 -1863 1034 -328 -1288 1465 -1904 186
1632 186 1224 -2031 650 29 -1672 1591 -1470 -568 1388 -1890 636 245 -1923 1557 -724 -923
1648 -923 1502 -1568 180 843 -1652 1514 -731 -1406 1872 -1125 280 1226 -1826 1469 962 -1553
1664 -1553 1572 -607 12 1805 -1481 1032 803 -1478 2421 -701 -1024 2010 -1060 417 1032 -1658
1680 -1658 1940 77 -1030 1855 -1314 192 1582 -1768 884 22 -1462 2210 -964 -489 1529
1695 1529 -1801 1193 443 -2188 1529 -764 -768 1882 -2334 -68 1311 -1582 1212 -636 -1477 1894
1711 1894 -1499 -175 757 -2205 1292 219 -2014 1727 -896 -677 1603 -1880 421 512 -1522 1616
1727 1616 -833 -1163 1927 -1596 407 929 -2187 1399 168 -1180 1596 -1482 252 1993 -1767
1742 -1767 1045 67 -1170 2432 -684 -681 1759 -1319 1318 797 -1684 1885 -212 -354 1643 -1499
1758 -1499 373 1608 -1497 1094 -170 -824 2078 -798 -83 1294 -2031 1336 270 -1888 1508
1773 1508 -986 -330 1512 -1564 355 573 -1535 1402 -675 -1011 1701 -1496 60 898 -1995 1171
1789 1171 127 -1287 1236 -1445 -152 827 -1750 774 -97 -1414 1435 -506 -835 1287 -1470 611
1805 611 713 -1485 1255 -471 -473 1657 -1410 349 1158 -1404 1279 104 -1077 1648 -745 -32 1229
1822 1229 -1268 1037 302 -1070 1613 -364 -241 1677 -1218 634 817 -1062 1259 -97 -668 1229
1838 1229 -1081 210 799 -1425 1025 59 -1173 1196 -930 -96 947 -1489 537 60 -1171 895
1854 895 -924 -635 1006 -1250 211 338 -1416 808 -739 -712 635 -1270 145 422 -1458 463
1870 463 -126 -960 1055 -750 -45 575 -1092 531 146 -743 1205 -458 -128 1283 -903 166 837
1887 837 -858 887 -256 -419 954 -372 164 423 -634 960 293 -548 1350 -404 -31 657 -753
1904 -753 510 496 -651 757 -352 -103 1114 -653 167 901 -818 816 -357 -403 1071 -535 -70
1921 -70 524 -775 566 -249 -592 463 -500 -292 436 -583 -9 -184 -536 539 -471 -314 141 -849
1939 -849 145 186 -900 332 -303 -467 583 -480 -50 3 -623 138 8 -482 507 -834 -229 574 -468
1958 -468 370 401 174 240 -48 5 530 -235 -156 -104 -574 351 34 -758 -31 -440 403 -133 -496 -40 78 145
1980 145 532 -659 -232 397 -178 -226 179 -60 193 280 -49 454 -282 -174 -5 -149 180 -36 -218 157
2000 157 0 -145 -72 67 -61 -217 -269 -311 -162 -95 -108 -176 -200 91 -323 -283 -224 63 -291 -161 -24 2 212
2023 212 -302 -166 27 -71 225 -151 -239 271 -253 -140 79 -182 199 -148 -60 188 -53 8 177 -21 346
2044 346 389 -9 454 -90 86 446 40 178 10 -21 362 174 -393 639 -31 49 453 -281 354 10 -145
2065 -145 511 -286 -111 282 -533 193 56 -414 416 -141 -189 205 -430 158 262 -530 475 -140 -496 353
2085 353 -458 -294 190 -535 155 44 -497 237 -419 -409 364 -743 -153 416 -829 178 -72 -524 588
2104 588 -448 -230 649 -526 319 -110 -400 1004 -507 -57 450 -764 381 75 -732 912 -317
2121 -317 -56 723 -662 456 388 -512 855 40 -263 864 -421 275 712 -437 754 36 -432 849
2139 849 -469 2 551 -833 363 161 -747 776 -463 -430 659 -834 270 544 -1053 782 -185
2156 -185 -675 732 -769 -1 636 -956 507 98 -829 683 -748 -287 746 -794 407 155 -1185
2173 -1185 912 -472 -298 646 -891 201 425 -905 531 -231 -764 913 -731 135 448 -1087 711
2190 711 209 -494 1046 -708 -189 1010 -959 615 300 -793 860 -380 -290 944 -743 381 439
2207 439 -798 1040 -37 -178 1330 -601 133 553 -960 601 -181 -820 715 -580 -115 865 -876
2224 -876 391 417 -750 804 -613 -364 1052 -923 165 492 -1074 1134 -217 -780 1058 -778
2240 -778 -228 361 -1451 398 107 -695 926 -1023 -167 679 -1163 463 569 -1278 848 -536 -727
2257 -727 722 -920 410 665 -1084 754 -126 -368 1017 -627 -34 735 -824 806 -75 -801 996
2274 996 -763 -122 850 -900 679 790 -810 1029 -199 -301 1342 -847 227 826 -725 952
2290 952 -28 -755 1071 -542 -24 690 -1237 773 7 -749 789 -682 -325 979 -909 354 106
2307 106 -1177 836 -272 -690 589 -853 248 404 -1138 560 -146 -749 926 -813 -164 485 -855
2324 -855 613 -179 -742 791 -565 -255 701 -931 524 668 -992 611 -360 -495 707 -783 -17
2341 -17 316 -815 641 29 -739 960 -785 14 611 -866 762 402 -438 729 -332 49 921 -723
2359 -723 249 341 -562 918 -129 -128 909 -597 365 542 -597 659 50 -263 820 -560 82 668
2377 668 -927 254 9 -572 848 -275 -368 607 -945 200 236 -800 299 -133 -534 513 -713
2394 -713 -235 446 -789 459 -15 -716 396 -331 -41 364 -742 324 17 -539 678 -303 -236 496
2412 496 -588 317 403 -740 741 35 -525 639 -367 -41 516 -593 484 37 -376 858 -478
2429 -478 71 596 -435 420 347 -448 614 -137 52 486 -607 330 252 -659 672 103 -198 434 -472
2448 -472 106 540 -438 445 -130 -312 356 -302 -381 43 -502 64 -97 -342 407 -125 -239 437 -672 26
2468 26 -37 -438 186 -54 -503 432 -435 -189 13 -268 142 -124 73 302 -277 2 571 -314 129 283 -102
2489 -102 491 205 59 201 -246 121 155 -109 308 115 -5 262 -156 -8 -33 -331 243 212 -67 412 -39
2510 -39 -74 228 -353 182 294 -143 394 -92 1 176 -235 296 -45 -216 309 230 -76 307 100 9 101 -234
2532 -234 3 31 -31 -67 -213 -62 -197 -204 -120 -103 131 84 -126 -264 61 -240 85 74 -213 -29 -225 -227 180 165
2556 165 -95 -16 -40 23 -60 -70 -56 -36 31 74 -70 299 4 -59 20 -75 22 119 28 70 -124 112 92 -8 -101 80
2582 80 237 -55 287 346 -16 -171 64 -78 372 97 -170 22 -222 157 214 -121 284 158 -231 -82 154
2603 154 91 259 -95 25 50 -188 -20 -1 -236 83 -229 -436 -8 -198 75 196 -389 375 -39 86 333
2624 333 -297 24 106 -230 -24 -135 -362 244 -162 405 168 -11 -50 131 -175 220 -140 115 397 -486 93
2645 93 235 -307 -66 -41 -130 397 -100 95 77 -29 254 186 -38 201 -171 265 204 -269 176 57 -116 395
2667 395 148 13 126 -137 383 201 -430 420 -162 -78 349 -162 109 433 -324 51 -47 -170 385 -268 -95
2688 -95 55 -408 252 74 -520 339 -164 -215 322 -484 35 -204 -477 344 9 -224 222 -579 8 121 -429
2709 -429 167 -92 -316 494 -468 -147 395 -586 405 167 -93 622 -241 -128 238 -361 265 106 -240 424
2729 424 -135 -220 379 -355 89 220 -201 280 -9 -199 500 -346 172 508 -428 182 264 -368 631 -169 -213
2750 -213 514 -377 217 159 -353 516 -290 -422 380 -554 146 363 -617 233 95 -416 360 -482 260 272 -933
2771 -933 411 106 -443 370 -247 -104 275 -425 231 143 -646 306 -271 -341 606 -510 148 138 -500 558
2791 558 -54 -265 595 -328 -237 359 -388 473 34 -414 549 -263 62 392 -700 183 288 -639 501 -116
2811 -116 -137 451 -250 17 673 -414 437 107 -332 361 -397 214 220 -383 181 21 -478 431 -176 -169 475
2832 475 -229 300 -56 -553 420 -378 -82 113 -352 143 310 -657 491 -375 -200 608 -458 -418 389 -618
2852 -618 434 -15 -422 124 -189 -416 188 -514 105 228 -551 119 -166 -64 497 -240 103 235 -529 482
2872 482 -82 -387 484 -116 49 524 -521 563 322 -266 541 -156 -278 409 -169 269 119 -501 336
2891 336 29 87 470 -338 105 322 -397 364 461 -156 635 -302 69 350 -165 452 69 -207 517 -180 -173
2912 -173 229 -515 116 256 -340 233 -90 -75 478 -466 -25 254 -390 82 66 -486 418 -339 -39 261 -386
2933 -386 298 301 -642 251 -119 -22 105 -306 219 28 -537 223 168 -464 272 -321 165 228 -398 321 5 -195
2955 -195 323 -18 -125 149 -106 153 153 -298 125 -271 -168 492 -321 143 331 -312 647 -28 -316 460 -287
2976 -287 -274 311 -465 77 -142 -207 321 -50 80 11 -242 27 67 -295 248 -68 -248 10 -183 370 189
2997 189 -495 122 -8 -356 398 -155 -285 31 -328 -63 -36 -82 292 -32 92 316 -162 386 -17 -280 315
3018 315 -242 -107 -58 -150 15 88 -253 41 44 70 83 -221 317 102 49 81 -77 -65 270 86 -36 -10 -307 -160
3042 -160 37 -193 62 -140 251 215 129 239 353 -147 156 12 -27 175 9 207 -145 -245 217 -108 -245
3063 -245 366 120 -319 -49 40 -575 -44 -58 -444 669 -243 -151 -439 -67 196 -243 -377 305 -100 511 -192
3084 -192 155 -58 -153 -109 -149 -128 -179 -97 -116 -172 -84 25 152 -10 -140 246 51 -179 210 -107 -226 247 -282
3107 -282 43 350 222 150 -93 208 125 144 55 -294 -24 22 81 85 -28 253 253 -23 281 90 102 -269 -145 166
3131 166 226 138 286 -139 131 -82 9 -291 202 158 -3 -6 145 -74 -59 -125 -144 -43 -153 -105 112 -243 -86
3154 -86 33 -153 262 42 -232 48 -84 128 32 101 -63 235 -23 6 127 -49 110 -67 -40 183 -45 101
3176 101 -192 146 199 -126 -21 124 -65 -45 210 287 122 71 81 68 -114 240 157 -86 446 22 171 270 458
3199 458 -160 396 -390 -128 54 -309 -156 157 410 1072 -108 -368 1094 -105 -228 -11 327 680 473
3218 473 143 -520 -229 116 -252 -109 33 -235 40 21 -88 -160 22 -261 268 -26 -59 44 182 412 232
3239 232 -404 50 111 -78 336 -383 14 -41 -56 93 -96 40 181 -68 -8 182 -207 320 -35 76 169 -101
3261 -101 -260 224 -18 134 109 -109 8 25 -159 55 -416 249 -244 -111 -112 35 66 22 -363 -164 39 -199
3283 -199 44 -762 -9 222 298 -180 355 207 23 192 -539 71 463 -265 102 -141 -125 136 223 3 -147
3304 -147 51 493 -633 -366 16 -191 314 222 -512 264 162 -334 -12 -134 216 19 -1103 242 -1064
3323 -1064 -571 857 114 435 18 314 298 -509 -455 346 -136 -85 313 -198 204 -121 -42 115 -1 95 201
3344 201 -292 195 121 -124 206 -191 -222 185 -39 121 285 -150 235 245 -312 100 -240 257 258 -247 129 -1
3366 -1 -196 135 -102 -10 39 -180 223 272 -276 255 -451 -60 170 498 1258 75 -74 211 -89 15 366
3387 366 -347 -2 -67 -252 166 81 -336 219 -91 -27 -55 -63 11 104 -328 227 -57 -221 37 -397 73 4 -288
3410 -288 223 -89 -242 231 -228 233 156 -147 72 42 -83 193 -52 83 214 -394 13 -41 -203 -21 -245
3431 -245 -131 185 -299 153 354 -86 -50 232 18 250 -334 80 155 -262 117 148 -131 308 -30 -152 68
3452 68 -290 -83 -98 -198 -18 -104 160 168 1 -77 82 -336 -76 -62 -236 320 -7 -101 47 -6 126 220 -198
3475 -198 158 -134 86 14 -184 331 173 -326 172 -46 160 47 -269 179 273 -369 113 -263 -52 502 -45
3496 -45 -114 269 -140 -96 -55 -70 -54 67 -12 -25 -188 -243 247 -366 258 -111 -143 27 4 -250 113 -252 53 20
3520 20 -159 146 -36 116 83 -226 202 12 -93 140 -203 -47 -115 -195 76 -28 -39 206 -126 65 62 -190
3542 -190 82 -4 -22 154 -67 -217 32 -34 6 60 -282 137 192 -48 139 -96 -73 -115 -113 63 -20 65 175 -8
3566 -8 63 102 80 180 -36 46 -76 169 -195 85 25 -1 -61 170 274 77 -44 -89 52 -187 -71 -24 -76 11
3590 11 133 189 75 115 193 -302 -112 152 -40 2 -13 -55 -28 -5 92 74 -34 -185 46 -62 -111 143 -72 1
3614 1 152 43 129 -58 30 -43 37 28 158 13 125 -45 48 85 -87 78 -77 194 163 84 111 -197 -159 -20 5
3639 5 -233 35 34 71 -258 -72 58 127 350 62 36 173 47 0 -162 -38 35 8 -63 -61 -17 -9 84 68 73 41 161
3666 161 314 298 -172 -32 -107 -180 64 6 19 13 -95 36 138 -106 -50 68 73 67 -49 -192 56 194 -16 -63
3690 -63 80 166 39 20 143 137 -124 166 -119 -80 0 -27 41 64 -119 175 165 -6 200 222 45 194 186 -251 154
3715 154 30 93 88 26 15 -103 -102 99 145 68 293 77 64 -113 -58 74 -64 40 82 284 39 190 -33 8
3739 8 39 -127 -101 -12 -182 256 60 200 316 -80 61 56 -175 -19 -37 -120 -41 205 64 -21 33 -61 -341 -114
3763 -114 118 -54 -33 52 84 -34 -265 73 408 -254 102 -39 92 6 -147 146 62 7 -24 -11 -150 -126 82
3786 82 68 78 -11 266 -216 -10 239 61 -129 80 13 38 178 -187 96 91 -38 -128 -100 -150 11 -223 113 52
3810 52 66 58 121 -133 217 -163 -144 32 -310 80 48 6 155 -50 -196 151 135 -72 65 -108 -209 77 35
3833 35 229 -160 81 88 -71 -41 -55 -195 366 -47 -49 12 66 157 102 -87 -95 93 -66 16 -5 -112 -23 143 119 -126
3859 -126 -66 -2 -184 -90 -20 -111 75 -65 -354 266 -27 -91 241 -91 148 41 -147 174 -10 131 52 95 21
3882 21 164 14 -4 -43 40 321 -22 -217 21 -6 219 218 -90 156 -90 -95 371 1 25 99 -227 294 81 -377
3906 -377 -56 31 -132 328 -129 45 71 -66 12 -177 -250 -122 36 -132 29 -234 54 6 -111 53 -320 183
3928 183 133 -183 83 -28 -183 217 -196 -107 39 -227 306 -72 -260 216 25 62 132 34 12 -56 -155 348 -73
3951 -73 -259 223 -30 22 340 -80 113 13 -13 133 254 106 147 -58 -20 -14 -138 73 -46 -80 36 -121 14
3974 14 62 -222 -143 -95 17 401 100 180 -16 51 185 -4 -142 345 -246 -127 144 -140 -113 60 -323 16
3996 16 185 83 265 53 -19 -45 46 188 72 -332 178 70 -12 -1 -103 -74 275 -79 79 -39 16 128 64
4019 64 -3 306 -228 20 -49 72 294 -335 82 -15 -31 173 15 -97 258 -79 244 205 -239 196 97 -388
4041 -388 94 -287 -89 205 -41 -200 111 -65 114 -119 81 30 30 142 34 -10 236 -131 -112 89 -16 -109
4063 -109 128 -170 -36 -96 -131 117 -130 -99 111 -125 -114 28 -75 -227 75 -65 157 104 116 16 240 45
4085 45 -121 -142 24 -136 -168 61 -182 -29 -81 95 -230 -35 153 -97 -71 -76 30 -175 -16 -26 -21 -113 -97 -105 281
4110 281 209 -7 -141 26 -3 -52 7 69 -281 -363 28 -148 -5 -164 -30 -53 -68 -385 -173 -245 87 -156 35
4133 35 184 -151 230 59 -5 -22 -14 27 12 -186 -237 207 90 160 49 -20 219 20 160 -42 -105 -108 60 -91
4157 -91 -284 44 -9 61 -68 -128 138 163 81 56 -104 133 201 -230 134 34 -63 -48 -218 96 142 -175 -29 -235
4181 -235 -166 -59 -113 -43 30 -9 -197 173 77 45 -183 183 -104 -176 -33 -18 34 -108 70 7 -54 -76 -33 101 103
4206 103 157 -177 -140 82 -187 -29 64 22 86 -84 -116 -20 130 -3 121 -232 60 202 28 -159 74 -147
4228 -147 39 -61 42 -118 -175 24 -194 129 23 90 -225 162 -245 230 141 97 -13 -100 152 -16 160 26
4250 26 -75 -42 -277 39 298 -24 86 -123 181 251 252 2 -47 15 123 161 228 -10 167 33 60 -111 132
4273 132 98 -77 -227 209 -52 -223 26 83 47 -73 224 89 -105 62 -159 -125 12 109 89 -162 -179 -121 -155
4296 -155 82 117 6 135 34 8 -34 -52 -48 128 -358 76 -7 26 4 -406 -133 27 -149 120 22 -51 133 72
4320 72 -118 -145 202 -253 40 -307 108 -44 -109 129 -52 209 -227 -54 -153 -13 -39 -76 187 -140 3 -67
4342 -67 78 -122 -142 249 9 97 169 -176 -10 26 1 277 100 90 69 -205 -230 174 -46 220 -122 102 244
4365 244 -133 88 122 -99 304 -42 -134 288 -68 23 171 -41 6 23 139 159 65 -103 58 -139 -241 8
4387 8 -295 -88 68 146 19 -164 41 182 -303 135 -6 -322 100 11 -78 51 -109 24 -4 -207 6 -90
4409 -90 44 197 16 -80 83 -126 197 -66 -52 200 59 -47 171 -140 113 96 135 147 -245 5 334 22
4431 22 -85 -29 -158 118 -19 -134 107 -4 -87 75 -16 96 3 16 126 -3 -147 145 -263 -15 75 -290
4453 -290 -26 -58 -43 100 -55 -104 -39 -181 15 100 256 237 -399 101 -21 -144 -62 -25 40 178 -72 -35 148
4476 148 -95 110 -164 -12 -132 -111 -89 176 -208 126 100 -286 59 -200 60 279 -188 -37 185 -210 -89
4497 -89 -23 119 70 -172 -20 150 -92 37 -60 -56 173 76 -152 79 -105 45 88 101 -80 -135 11 -27 129 -20
4521 -20 -76 -124 25 -153 -125 349 -205 -71 -183 -80 -159 -169 -333 -17 -225 -162 -207 -241 -71 244 8 -98 573
4544 573 -13 860 -312 209 284 54 214 -553 -520 663 130 19 -52 -255 305 -72 249 -319 204 131 109
4565 109 -195 -71 -218 -83 252 155 69 -96 -124 -207 -44 11 222 -12 -186 226 -126 -210 133 13 -104 116
4587 116 -10 148 -95 -13 190 -123 119 148 -131 272 -8 -133 136 -141 -25 40 -214 1 164 -43 50
4608 50 -116 -79 -17 -251 11 -223 -204 139 -163 77 62 26 306 -30 -321 -29 228 -134 168 -214 24 115
4630 115 11 82 151 74 -119 110 -237 -103 102 214 -31 -114 78 -278 -101 -67 161 1 89 -3 77 159 -154
4653 -154 103 -143 -89 44 -182 1 -30 76 118 -57 -172 169 -18 114 -30 -138 20 20 -287 -30 -179 68
4675 68 108 -203 134 -23 -5 60 -286 -161 131 110 -238 28 -63 70 216 116 -4 -86 -133 41 -13 136 16
4698 16 -119 -8 -147 35 -22 5 -11 265 -37 255 27 -45 27 -12 -46 -86 -142 286 260 23 214 121 -131 -19
4722 -19 5 145 -227 81 44 -43 136 15 111 169 -124 -83 35 -136 48 114 -114 344 71 -26 -48 47 -147 30
4746 30 -62 -95 -73 258 335 175 60 -174 212 -120 178 92 -63 27 66 -23 -60 -239 19 39 -249 -2 -104 -261
4770 -261 -49 -93 61 68 -30 -36 -13 -44 -84 53 124 -86 32 135 -116 16 33 152 93 144 207 55 -53 -87 201
4795 201 191 -22 83 112 36 -47 -144 127 84 -54 197 -83 60 94 -129 247 -79 -22 1 70 -40 35 29 -38 -12
4820 -12 187 -31 63 36 99 16 73 124 -273 -71 170 54 31 -82 109 199 -232 -32 0 -115 -86 147 -96 -76
4844 -76 -5 -88 -159 33 -349 -27 -164 -34 -50 -52 99 -135 -217 38 -113 59 -109 19 95 -164 -76 163 -111
4867 -111 14 49 69 146 83 -146 100 -199 -36 42 117 112 20 81 89 61 -39 -243 90 -121 171 -173 264 -143
4891 -143 138 -57 77 23 360 -315 114 62 -135 67 -51 243 135 -149 -61 225 4 -75 153 -84 -13 -163
4913 -163 -38 118 -332 -12 -218 75 -58 -126 -108 -152 105 270 -32 -175 -44 -88 -268 102 -29 -66 -86 89
4935 89 245 -87 -144 -98 -197 -16 225 -130 4 51 19 169 40 -152 -166 3 79 164 120 154 77 -287 229 -156
4959 -156 -149 -66 -24 122 -159 21 467 -593 149 -224 438 -217 -33 256 -354 71 -38 36 -398 -79 -72 -176
4981 -176 225 69 -100 -55 -834 309 -632 246 797 225 -336 -104 -184 -288 181 -395 -312 -109 89 96 -34
5002 -34 -105 -138 277 174 -2 -257 29 129 56 228 -204 -464 -47 66 -163 -106 -86 227 -555 217 385 -227
5024 -227 -87 136 12 697 -72 98 337 50 1190 147 -613 203 144 -253 110 -257 42 405 -198 -30
5044 -30 107 73 375 -31 80 219 -154 -161 125 -349 5 97 -125 31 -143 -108 70 -54 176 26 -145 55
5066 55 145 71 26 -16 -144 60 -153 6 39 -115 150 55 210 -203 -146 360 55 44 21 -33 195 -34 -97 -15
5090 -15 -88 48 261 162 -92 93 -18 211 -214 -98 95 -1 -24 79 -5 35 -40 -96 378 21 -18 329 -122
5113 -122 -12 13 -115 206 -91 66 58 -247 27 95 -171 54 -147 97 273 -163 -3 21 25 184 -180 -423
5135 -423 -127 -2 -125 32 -56 255 251 -271 30 24 -105 129 -72 24 171 -97 62 -8 -182 42 -210 -2
5157 -2 305 3 62 -75 -225 75 -300 35 71 -23 96 159 -248 -63 -85 -8 220 -230 -100 137 -72 -39 53
5180 53 -215 -83 -22 -54 -143 83 -31 86 -82 208 10 -55 74 -48 -36 -35 201 46 77 -90 -148 -446 15
5203 15 290 -188 215 19 -187 -21 -91 87 22 -210 24 162 -135 36 71 104 97 -177 -95 -38 -216 162 41
5226 41 -1 -37 -104 205 62 -162 -190 152 -130 135 262 61 14 11 83 170 68 60 134 -23 116 357 160 147 69
5251 69 -199 -32 84 134 -233 -76 -56 -392 186 -6 -94 106 -32 183 -13 -106 -34 20 38 24 29 -14 -91 -54 -123
5276 -123 -208 93 -220 -251 -40 -59 9 123 210 -232 -47 -77 166 -212 -142 91 20 143 -254 -271 -243 -153 -145 3
5300 3 -70 -237 19 -21 46 -133 106 -62 -150 -146 22 -248 -10 -3 -93 -123 86 12 43 188 235 -198 109 47 188
5325 188 -112 -109 -73 -150 208 -140 -174 -173 10 129 2 46 -45 -153 -91 44 18 -87 -37 -35 146 85 -312 -148 111
5350 111 -40 164 -58 32 -14 8 -58 -71 -49 23 -52 160 -97 -117 -55 -12 -37 25 214 21 -99 221 -71 -47 51
5375 51 -24 -67 -48 -101 -240 -108 -140 -58 7 25 -62 -65 91 -117 -52 141 148 -138 8 -81 195 -75 40 -144 71
5400 71 -160 -52 93 131 353 -153 -72 207 15 87 -52 -98 -82 -155 -58 62 -96 -75 -35 -117 -184 -241 27 167
5424 167 28 -53 53 147 173 -62 -71 -91 -69 75 -143 -12 99 -74 -30 7 -22 -16 -55 14 99 -1 195 -19 -110
5449 -110 6 178 -167 50 -100 -75 34 -212 64 -129 -236 43 113 -60 122 -83 -109 144 44 151 21
5470 21 -54 18 -114 -119 128 -50 -159 52 189 -186 195 99 44 46 143 159 -48 -162 338 10 71 -119 -96 66
5494 66 126 -34 -45 -10 184 91 -47 200 -245 284 162 -73 47 177 -145 26 -12 75 94 -8 21 -174 -170 167
5518 167 10 117 194 -76 145 -16 -146 79 -74 -248 74 204 -150 28 -226 30 -234 133 201 -98 -146
5539 -146 2 -31 -176 76 94 -19 121 113 -38 -91 -187 199 81 -16 -87 -430 86 -95 -489 -76 -358 -113 307
5562 307 -61 -587 -1094 -592 -158 450 -187 8 -54 -217 -103 152 115 -85 49 80 28 68 148 53 137 -142 -351
5585 -351 92 -188 316 103 -110 -108 -166 -123 -49 -71 88 128 -243 -76 -74 -72 31 -170 -181 12 -170 165 255 -198
5609 -198 68 -284 -19 0 -98 5 237 -140 200 -38 -32 -384 -224 130 8 -129 -49 -87 -194 32 -158 98
5631 98 304 -61 205 -49 14 179 161 -18 102 -205 -68 687 -436 294 -134 51 171 60 -85 56 -19
5652 -19 91 -47 -129 7 -79 303 202 -163 -136 -86 20 -2 221 -119 187 -187 166 160 -230 131 -161 78 77
5675 77 -86 -75 65 -148 -2 244 144 -71 -130 137 -60 -268 -142 132 -33 -52 -157 126 93 -24 123 108
5697 108 -138 72 -173 65 197 -208 75 -17 30 122 164 -42 81 -255 130 -135 -204 129 166 -197 232 -15
5719 -15 -201 281 -163 -150 118 118 41 184 -252 140 77 -15 -90 -76 168 -206 -205 -158 73 -166 42 -10 57 110 -125
5744 -125 -127 -58 38 -161 -37 38 74 137 135 60 -176 113 -157 -59 85 -178 13 -25 -155 233 -72 28 -310 -182
5768 -182 4 23 -265 34 111 -146 -99 51 103 -205 17 -56 -173 71 24 -170 -160 -62 -188 181 -115 -265 -46
5791 -46 49 22 136 -159 93 115 -254 99 -259 2 -27 -56 -6 1 86 -22 41 -120 36 -29 -52 -174 -224 211 -41
5816 -41 88 37 3 68 -260 -259 139 -26 156 7 -232 -62 -172 59 1 -61 159 -70 25 68 38 -110 -90 11
5840 11 89 78 55 -207 41 159 -70 -22 -69 -14 -294 -107 152 -54 -38 -85 -183 113 -15 58 31 164 123 283
5864 283 -115 143 156 2 -213 98 113 249 -184 210 73 201 -232 -142 -75 54 206 -50 326 -746 -46
5885 -46 -697 -290 70 -136 84 -256 61 315 -330 24 -192 -171 233 26 23 -135 57 403 -7 140 150 207
5907 207 571 -912 258 478 240 -409 266 411 494 -228 -282 135 -624 -135 864 -443 -584 -582 321 -173
5927 -173 122 64 443 526 39 -449 386 454 62 46 -136 -9 -454 370 13 -522 -296 457 254 -373 -62
5948 -62 25 -26 265 -308 -175 182 -141 -19 214 -346 252 377 -132 -71 155 -82 -166 154 4 68 2 -47 -71
5971 -71 244 -19 -44 -83 -11 -57 -41 -120 69 -58 14 336 34 84 74 -37 -112 177 35 6 -68 -273 34 10 56
5996 56 33 -50 17 246 71 -45 -52 25 -126 158 -104 107 159 50 149 11 -25 -139 -160 -122 67 -99 299 74
6020 74 23 117 61 -75 -106 -56 42 131 48 102 -59 -208 204 -160 -41 86 68 173 35 -86 101 -58 47 -90
6044 -90 -114 -241 -133 -225 -32 -96 116 182 -116 289 116 27 -105 -5 -200 255 -164 206 4 -315 -191 -300
6066 -300 -95 -7 -220 107 78 19 214 5 126 52 -41 132 167 -67 -162 -167 126 -227 90 54 -90 -114 209 -124
6090 -124 261 -55 -98 11 286 -41 122 363 157 -156 -59 -29 149 181 33 65 -247 -33 17 -81 48 -201
6112 -201 -1 -21 -162 50 -102 -276 97 -17 -50 56 -108 295 60 -232 211 -146 -314 -55 -104 -218 76
6133 76 -201 -142 129 -23 35 -436 98 -73 -85 -124 -163 144 -10 -55 153 -246 310 -221 -36 -265 -188 -138 196
6156 196 -493 -15 -93 379 -293 -250 -70 -64 355 -287 -532 -247 98 -38 85 -265 28 107 164 -264 -14 -47
6178 -47 4 6 228 -124 -197 64 -41 -390 50 -136 81 134 91 -44 33 -10 -86 -99 181 197 -244 76 -149 -9
6202 -9 197 107 235 -221 42 -86 -235 37 35 -183 160 76 -126 47 -28 -69 13 88 -63 45 -118 -75 288 -79
6226 -79 151 113 -169 -49 -45 0 66 -146 -61 48 -88 -135 -243 17 134 -15 19 77 -227 205 85 86 130 73 114
6251 114 -51 61 250 111 52 67 -132 -150 62 -248 236 -49 -48 174 -20 -52 -174 -173 63 87 -86 -16 58 -114
6275 -114 53 -207 147 -39 -110 11 16 136 90 -162 -22 39 -12 -214 43 -71 79 22 -85 67 101 49 -38
6298 -38 66 104 32 -69 -30 149 23 -35 72 135 -115 51 240 69 26 148 -14 87 -36 -25 99 100 -79
6321 -79 21 150 -66 -88 24 -41 -227 20 139 -157 188 -134 113 169 -214 54 6 -20 104 -52 -220 75
6343 75 -60 70 -67 16 35 122 -24 -1 97 -209 -46 0 -63 164 -16 -36 209 -261 159 82 -28 141 -201
6366 -201 155 137 139 87 -147 277 -5 10 -36 217 28 157 207 -169 77 -77 184 57 89 69 20 -85 268
6389 268 -47 -41 111 41 -251 1 235 -56 244 -50 135 -159 17 57 -69 167 -30 -6 84 -104 -117 71
6411 71 -204 -152 43 -136 -136 -92 88 28 -41 -138 -155 76 60 14 -116 25 -134 -170 173 -108 -86 -128 -1 -153 9
6436 9 42 -35 20 -106 137 9 -104 -359 -146 122 179 120 111 171 130 -6 292 127 -23 -61 159 -27 67 9 -65
6461 -65 -121 -15 -10 -45 77 30 92 100 -19 102 90 -38 65 -123 -110 45 35 -21 -3 88 146 44 -125 92 -186
6486 -186 15 93 -227 -134 155 -13 13 -142 -27 43 51 109 -59 -149 12 -119 -125 66 -151 -16 -138 11 -67 -80
6510 -80 29 -38 223 -73 -116 -123 55 -246 -40 98 70 -89 27 121 235 127 -111 -101 -31 133 33 -2 196
6533 196 -93 126 93 173 31 298 26 138 31 55 361 144 -360 33 125 -27 7 312 12 28 41 7 -134
6556 -134 -36 -35 75 -74 17 -168 8 -188 -47 160 -48 -48 32 157 186 49 -119 -50 -236 -18 -19 -104 -179 22
6580 22 78 -71 -97 -101 -46 -37 78 178 3 -122 46 -437 -42 232 141 243 -104 242 20 -281 95 152 46
6603 46 36 -135 -89 60 -150 275 181 -129 -93 216 -97 155 -193 -89 -114 -139 -23 -34 26 57 60 -141 190 214
6627 214 124 -90 -199 64 61 -15 -207 -191 -39 48 46 11 -134 -78 65 27 65 -16 -81 -53 161 141 -59 -18 78 139
6653 139 69 -54 -108 -98 -82 -404 327 -9 -454 -105 -164 326 382 53 113 110 299 852 334 -313 108 -375 1170
6676 1170 -274 -17 48 -263 104 422 -96 -273 -66 411 616 342 -525 -800 388 -324 -311 -417 -183 -15
6696 -15 -66 -301 -162 -46 332 -437 427 26 140 153 -194 88 -127 -151 -151 -2 45 -145 17 30 -80 -100 -4
6719 -4 63 -30 -132 -31 -112 -27 30 136 157 -99 72 42 0 85 64 -130 246 -60 -224 151 45 95 -72 -26 79
6744 79 -87 118 135 -131 -214 -105 -77 46 -45 11 141 63 28 397 -261 -71 -46 123 -3 112 24 152 149 106
6768 106 -87 36 266 -235 -47 49 19 30 112 -47 160 158 137 -54 24 -30 -33 -211 179 0 28 91 43 3 -2 -12
6794 -12 141 134 -253 -14 -116 -49 -111 -22 -154 32 364 122 10 -268 -138 -160 49 24 124 87 -157 32 135
6817 135 50 -74 30 -175 -122 -94 143 212 52 -41 -1 -54 -75 -132 -110 204 -17 -82 44 -51 97 84 -122 -80 38
6842 38 -68 -115 69 207 -97 -2 -147 -109 83 112 101 214 -55 -101 20 263 99 -24 306 -219 -22 -272
6864 -272 -28 -97 -16 -80 -95 -231 59 -125 -59 -47 70 239 -28 -19 -11 -289 152 -23 -112 -13 -100 -27 -67 27 278
6889 278 202 147 99 -53 145 -20 -28 -122 -133 -119 -159 58 -32 116 -84 -30 135 48 -188 -264 -88 -83 -138 -102 -189 -50
6915 -50 345 -83 -240 -213 297 94 -255 107 156 110 -15 45 216 -87 -210 24 -84 213 77 263 -143 -35
6937 -35 31 56 -108 48 48 -233 180 136 189 251 -93 63 112 78 40 -308 -164 -189 -213 119 113 -258 83 -175 6
6962 6 53 -153 195 105 -49 -217 174 37 103 -404 -29 84 69 79 -216 756 142 65 250 4 -377 95 -124
6985 -124 285 -165 -253 755 -455 -217 -262 22 -25 -145 182 -285 334 602 262 -230 -6 -254 28 297
7005 297 -22 -298 630 33 147 -281 166 -214 48 342 -127 -42 -66 121 105 277 85 -72 132 -3 184
7026 184 2 42 -41 -262 -231 -82 -163 203 -6 -45 16 171 37 109 -4 -235 26 -188 -35 83 -98 -38 70
7049 70 8 -86 -22 -92 57 61 -87 -146 -20 -46 221 -11 89 82 98 152 56 -32 128 -208 -119 93 61 64 -29 6 74
7076 74 -12 -136 -79 258 7 154 -139 -70 -18 20 2 49 -244 173 197 293 148 298 -38 28 -74 -330 -52 28
7100 28 -102 -57 298 -81 -68 77 -141 -34 -31 96 65 48 292 -65 -66 216 8 75 -69 -221 -125 -5 -186 56
7124 56 -139 21 -261 23 -76 -121 1 165 37 -129 -80 -158 -50 56 -107 -36 -47 36 168 -68 32 149 -241
7147 -241 19 -110 -54 156 -151 -5 82 4 27 4 262 -226 -175 69 76 -144 -151 72 -182 157 21 -3 99 -26
7171 -26 109 -168 -122 197 40 68 -65 -61 81 -143 -129 155 -101 -175 111 -1 -72 -159 -37 40 71 -18 -201 149
7195 149 -171 1 -52 -42 -301 20 145 -135 -190 -86 52 -143 -64 -63 71 -89 228 116 -168 45 -87 126
7217 126 10 -204 102 -182 -29 82 -25 -166 117 9 -202 7 -90 228 115 -120 -197 184 -76 -162 -52
7238 -52 92 60 -60 -3 -132 210 -57 -2 -44 110 38 133 -62 152 143 -40 -294 -198 338 18 249 36 338
7261 338 163 -375 -690 -288 -53 -76 109 -516 -44 -435 -261 199 -134 557 -210 -268 -266 169 -425 -316 -38
7282 -38 101 372 348 -49 -56 564 107 363 -10 46 -550 -258 -31 557 183 -154 -162 325 179 112 -223 -218 131
7305 131 -145 -166 -367 -207 -12 -106 -319 233 155 180 49 -183 -102 -124 193 49 90 -42 -102 178 -136 194 224
7328 224 291 -153 69 -51 -190 190 17 -199 -142 47 211 272 -44 86 -328 -103 52 -11 -30 55 -182 55
7350 55 -123 207 71 -216 85 -148 56 -27 206 -17 55 -317 -42 -31 62 75 -18 5 215 28 -128 64 35
7373 35 -79 -104 -20 162 -227 -270 259 -16 64 128 -57 -78 295 119 10 -75 93 260 166 250 -117 201 117 -13
7397 -13 -142 139 -153 -16 -158 215 45 16 -16 -12 49 139 154 -121 246 146 -29 168 -9 -80 32 105 -150
7420 -150 -129 160 -48 -125 -101 -32 -101 -149 -251 -29 12 -11 70 -48 -161 104 238 -306 -7 -38 -111 -85 174 -70
7444 -70 -125 -82 164 -126 -268 -89 94 372 128 -88 -105 -104 -247 385 -110 -91 32 -273 103 34 -24 78 -58
7467 -58 22 -68 162 32 28 252 236 186 -128 253 26 -134 196 31 -9 6 136 -136 33 -75 117 -63 -144
7490 -144 61 -238 -21 62 -111 -50 -80 -43 -8 -88 -104 -52 -37 53 76 63 53 107 209 -113 -90 -224 68 -112 86
7515 86 262 -423 -112 80 -130 63 -182 -190 -200 126 35 15 112 -57 159 220 97 64 -201 -27 -204 245 417
7538 417 81 -227 94 -211 -179 113 58 138 -230 120 -57 -32 5 48 139 112 195 199 -118 36 121 72 -37 -124 -116
7563 -116 191 -34 -3 -70 37 195 -36 -147 -80 -58 -163 -15 -206 1 86 -125 8 241 127 -137 -165 -206
7585 -206 166 -90 109 41 -137 -60 -222 -164 -186 -311 358 316 373 -136 -4 216 -33 401 115 120 -286 163 63
7608 63 72 -581 -133 46 -80 -238 -921 561 316 -205 76 -62 293 8 38 263 -158 640 0 323 8
7629 8 -217 507 481 -26 256 -139 -117 204 203 -638 -494 -100 0 82 -630 4 -281 461 -187 -121 -464 51 404
7652 404 396 230 21 112 -790 -315 572 115 698 232 -279 -586 -41 -102 153 -15 477 -266 43 -119 57
7673 57 333 -26 21 -140 -73 458 49 69 78 -38 190 -35 179 8 -162 -10 111 208 -83 -115 121 29 -116
7696 -116 -40 -16 34 -283 -53 63 -10 107 -54 302 -16 148 84 -93 -42 55 95 -36 -159 6 -53 -65 162
7719 162 -120 98 -43 155 -3 153 91 70 -35 150 -28 -277 -40 -38 -82 269 148 28 -1 57 38 20 19 -43
7743 -43 189 36 -7 -146 -78 -87 83 -52 -205 72 -126 -142 205 85 -205 -56 -58 -4 46 -242 -241 44 68 -37
7767 -37 77 75 -34 81 -14 -10 -167 -107 100 -94 -9 47 21 -35 -417 -146 63 64 -59 194 -112 179 -125 36
7791 36 -57 -5 -51 383 -29 295 106 -172 253 37 19 -382 277 -248 213 -193 622 -241 157 -11 242 74
7813 74 141 37 -362 -216 143 -462 -318 198 -532 -504 -255 28 230 262 167 58 -14 36 -177 -293 -237 -245 -46
7836 -46 -112 411 -168 -171 -18 -247 230 208 284 114 -214 -161 -141 -167 267 -229 -270 70 635 -262 27 -173 305
7859 305 -368 -31 197 -96 -197 -48 -118 -16 -208 -40 110 -122 -37 -139 69 -187 144 25 -184 -257 -145
7880 -145 -98 -127 0 63 138 74 87 39 16 -68 4 -21 60 144 6 -199 -9 -169 -136 -101 6 -30 -301 -54 -51 -135
7906 -135 -109 41 190 79 -29 152 230 146 88 8 149 -151 -13 -175 81 -135 26 -93 32 -61 -11 -57 -62
7929 -62 -85 -99 -118 -42 -28 59 47 -37 25 21 52 -172 -122 52 345 -181 93 -158 126 -85 97 379 16 -216 90
7954 90 -231 75 -76 -75 -11 190 103 -33 15 34 32 159 109 108 78 4 -38 88 -47 -65 -18 -137 175 28 19 108 210
7981 210 -141 305 60 -137 41 97 24 -51 153 -150 -18 -197 -80 -67 -54 200 -127 -29 -242 11 107 -173
8003 -173 -410 -282 128 -496 414 -439 149 -90 20 153 44 49 1 -133 18 -217 -213 -244 -19 26 189 -54
8025 -54 208 4 141 235 128 -29 110 -99 81 -40 -170 -190 -70 66 89 193 104 -103 64 -67 -154 81
8047 81 -24 25 -21 -40 242 -48 619 321 439 319 64 -49 232 418 192 463 56 -105 316 -523 199
8068 199 56 -553 -680 -49 46 -257 -740 216 -539 -241 252 8 112 104 177 40 -1 -336 -366 273 -171 65
8090 65 195 -59 -37 -348 72 -216 -1 -20 -85 52 222 88 -116 219 32 -56 84 -100 371 -221 42 241
8112 241 70 113 -49 -56 49 -79 -226 -64 40 65 -165 -51 -42 24 18 11 -6 155 168 110 121 209 78 66 64 20 -461
8139 -461 185 149 -226 -466 -141 -300 98 482 64 -517 -7 60 -108 -101 333 337 -82 -230 360 -58 -32 82
8161 82 93 7 37 -33 -20 -189 34 -11 -230 56 -96 -80 15 178 -14 139 -49 -185 20 33 98 -231 -65 -1
8185 -1 -63 -155 -326 -9 -124 -35
8191c5
$$ Imaginary data points
##PAGE= N=2
##DATA TABLE= (X++(I..I)), XYDATA
0 0 0 0 0 0 0 0 0 0 0 0 0 0 0 8 -8 8 -8 15 -16 16 -24 24 -32 39 -41 49 -57 69 -80 89 -105 121 -137 153 -175
35 -175 198 -222 247 -278 310 -344 384 -427 472 -524 580 -638 706 -779 856 -944 1039 -1146
53 -1146 1264 -1395 1541 -1708 1896 -2114 2369 -2671 3033 -3482 4052 -4802 5839 -7383 9948
68 9948 -15284 53631 -102474 -19741 90925 -65543 73309 3745 -51487 59797 -283
79 -283 7602 17419 -55997 38211 1499 -20855 38204 -38686 -10200 28796 -33503 12750 -17394
92 -17394 -21746 32751 -31534 48 15601 -53245 30471 13946 -44473 19622 -19110 -9145 34820
105 34820 -39206 -1979 14874 -27537 29661 -15489 -43112 35974 -2025 -12045 11573 -24848
117 -24848 5376 6304 -11802 9111 -21753 10047 25652 -30546 12529 4623 -30489 32853 2357
130 2357 -18831 23643 -10074 6548 14395 -21540 18246 2113 -8494 31847 -15568 -6730 24708
143 24708 -14961 10217 5484 -17896 20057 -5239 -6423 12811 -22492 8689 11376 -21708 10034
156 10034 -10193 -10549 18832 -16991 589 1924 -19221 24745 -12046 -25023 25956 -14673 -2681
169 -2681 17977 -27531 4977 4945 -16034 12219 -15637 -3617 12738 -21907 10630 -3261 -26593
182 -26593 20709 -6870 -11125 14752 -18962 3115 7835 -14141 15010 -11046 -6769 26759 -14128
195 -14128 -594 11142 -15274 19154 5460 -14686 15555 -5664 4475 15329 -18827 10783
207 10783 10713 -13719 16485 -2520 -9040 16593 -5836 3989 7999 -9964 10849 -3673 -2952 17975
221 17975 -15621 1833 18932 -14408 6412 3533 -12069 15055 -1431 -2916 7331 -11510
233 -11510 11971 4192 -17807 12043 -1633 -4104 14251 -14479 -2301 10250 -9536 4403
245 4403 -3969 -7859 9263 -8772 -1298 4424 -14601 2960 4072 -7816 1222 -7565 -1476 5317
259 5317 -8306 3049 -1981 -9552 10743 -1153 -9064 6014 -3602 1040 7306 -7067 -568 1873
273 1873 628 5617 -6097 194 8544 -4948 3306 3349 -7304 7610 5272 -2525 3419 -453 4229
288 4229 4107 -2190 5475 -944 730 10792 -3754 -1715 5276 -1736 5574 876 -4589 4916 -1198
303 -1198 1749 4552 -6276 2035 3295 -2651 4235 -1885 -4412 2942 1305 2063 -3094 -4640 4136
318 4136 -907 -1739 520 -5411 1 2540 -2824 -3026 -3633 244 979 -4061 -631 -1576 -2814 3009
334 3009 -1745 -4923 1075 1210 -1189 -428 -844 -1732 -463 1554 -132 -2107 -984 1127 1699 -1264
350 -1264 -748 276 -706 3854 2895 -4159 141 4459 2615 1940 -584 890 3858 3905 2368 -2010 948
367 948 6809 1386 -841 2785 382 2085 2529 -449 853 -474 1302 2772 -2659 666 1007 -3956
383 -3956 2670 1484 -5359 79 -636 -813 1579 -4912 -1832 814 -2795 1643 -4366 -5490 5110
398 5110 -2260 -3627 458 -5276 1373 1025 -4714 -14 -3839 1093 2600 -7707 966 452 -5478
413 -5478 4191 -3051 -4439 3038 -4881 1171 777 -6427 3688 -1598 -1840 5421 -6692 385 5904
428 5904 -3995 3744 -113 -3217 7225 -876 805 3720 -4704 5710 3383 -4480 4707 -1471 9
443 9 5959 -4047 1114 1051 -3273 7003 -2962 -4207 6629 -4378 1155 4571 -7597 3817 2780
458 2780 -3891 4939 -3583 -591 5689 -5505 3579 1146 -6132 7522 -2500 -4046 5998 -6199
472 -6199 1355 3324 -6943 3982 -2652 -3615 6948 -7386 -812 3999 -7310 5766 -1480 -7275
486 -7275 7244 -4518 -394 4820 -10277 5162 3010 -7956 7297 -3939 -3607 8554 -6256
499 -6256 1568 3568 -6517 6979 -1533 -3129 8077 -7121 1889 6971 -8277 6380 1054 -5608
513 -5608 10059 -3671 -1637 6787 -5749 6612 2470 -7082 10122 -1676 -1055 9179 -7292
526 -7292 4554 7418 -7024 8103 -98 -4045 10077 -5207 118 6470 -8016 5307 1340
539 1340 -6051 6849 -6183 -1700 6603 -8443 2729 20 -8631 9058 -4099 -6959 6362
552 6362 -7237 1798 4035 -10533 4126 -652 -4456 6460 -8914 -483 6241 -9016 4760
565 4760 -464 -8988 8511 -3332 -3501 6165 -8369 3215 4167 -7144 5679 -3708 -2395 9353
579 9353 -6945 782 3838 -6557 9006 -800 -6367 8501 -4309 2314 6827 -9702 5747
592 5747 3737 -4290 8222 -4740 -1536 9001 -4815 4199 648 -6805 10584 -1831 -4040 6689
606 6689 -7120 3943 6167 -9397 4012 -95 -2952 7400 -7462 -1130 5418 -6410 5950
619 5950 -2230 -8293 8931 -4342 -2636 5673 -10023 3274 4073 -8312 5349 -4793 -4594 8515
633 8515 -7398 -747 1617 -8350 7655 -1847 -7570 6298 -6322 2106 5819 -11213 4178 2062
647 2062 -4914 7820 -6602 -2268 8319 -5334 3459 496 -6052 9679 -2495 -3181 6881 -7204
661 -7204 4597 5532 -8506 5902 -276 -3676 8799 -4906 -752 5435 -4998 6133 997 -6088
675 -6088 7091 -2269 208 6060 -7495 3422 4638 -4950 5968 -2994 -3436 8175 -4522 258
689 258 3223 -6324 5820 125 -5699 5143 -4428 118 4721 -8047 2950 1328 -6215 5904
703 5904 -4553 -3746 5678 -6510 938 1646 -6819 4411 -2012 -3546 4423 -6266 816 3356 -6403
718 -6403 4258 -1249 -4633 6555 -4049 -957 4303 -5676 3775 1481 -4890 5188 -2290 -505
732 -505 5455 -5263 2558 2341 -4360 5922 -1372 -2754 6213 -3396 1201 3682 -4474 4367 901
747 901 -2466 5113 -2775 831 4026 -4155 3840 1115 -3556 5243 -2424 -762 4865 -4519 1967
762 1967 2333 -3902 3935 -1462 -1957 4711 -4161 -59 2125 -3838 4036 -1325 -3947 3848 -3037 -398
778 -398 1612 -5397 2112 426 -4113 2632 -3090 -1595 3069 -4078 957 402 -3469 3131 -1631 -1861
794 -1861 3046 -3785 640 2496 -3443 2143 -399 -2315 3843 -1718 -916 2391 -2225 2755 599
809 599 -2789 2982 -168 341 2617 -2592 2157 2266 -1588 2858 -454 -396 3849 -1314 560 2046
825 2046 -1634 2308 422 -978 2316 -1441 368 2448 -2028 908 433 -2030 2531 -567 -1638
840 -1638 1249 -1462 514 305 -2379 923 -321 -1046 934 -2413 -194 916 -2280 180 -848 -1352
856 -1352 1057 -1496 -1328 199 -1737 569 -486 -2140 674 -1060 -695 912 -1741 -388 132 -1113
872 -1113 753 -562 -1075 417 -635 33 158 -1086 412 497 -163 447 -289 459 845 41 624 234
890 234 209 1335 558 302 536 264 854 581 -35 149 245 762 630 -237 -172 720 502 -103 221 -33 370
911 370 988 13 -367 180 -302 -51 700 -418 -365 -34 -172 645 -533 -480 -24 -733 422 -316 -1459 245
931 245 132 -779 -327 -1860 -114 508 -1391 -59 -882 -731 1264 -1503 -707 625 -1189 447 -226
948 -226 -1112 1148 -559 -824 1609 -1733 477 1135 -1522 1178 -6 -1047 1039 -678 831 973
964 973 -1404 1807 1076 -745 2376 -974 365 3206 -986 1014 919 -755 2722 -375 -872 2200
980 2200 -1142 1459 1553 -1962 2445 579 -940 2841 -1272 26 2005 -2376 1500 200 -2336 1940
996 1940 -1309 -931 1534 -2981 597 179 -2745 1689 -1901 -1335 1971 -2719 -66 898 -3037 2076
1012 2076 -724 -2591 2454 -2262 -149 1471 -2889 1519 -241 -2258 2869 -2469 -1322 2954 -3168
1027 -3168 761 911 -3181 2099 -338 -1458 2631 -2214 1142 1900 -3316 2405 -583 -1388 3795 -2096
1043 -2096 573 2735 -2608 3035 1167 -1725 3075 -1474 -924 3373 -2695 1487 1676 -2380 3213
1058 3213 -956 -1180 2987 -2246 1193 2410 -3024 2979 -221 -2061 3154 -1710 -810 1536 -3156
1073 -3156 1321 592 -2475 3036 -3146 -68 2840 -4092 1186 1283 -4518 2553 -1596 -2129 3624 -3195
1089 -3195 -135 1624 -3329 2894 -637 -3043 3178 -2434 -74 2078 -4144 2276 694 -2894 3728
1104 3728 -2457 -957 3618 -3521 1420 1617 -3408 3573 -565 -1357 3301 -2925 1439 2521 -3303
1119 -3303 3109 -448 -2022 4684 -2592 -595 3564 -2484 2649 903 -3036 3698 -618 -462 2961
1134 2961 -3712 2161 2165 -3265 3077 -1080 -1753 4048 -2966 -77 1993 -3621 2954 -113 -3078 3244
1150 3244 -2337 -293 2840 -4463 1315 694 -2747 3544 -3001 -1934 3506 -3749 871 677 -4564
1165 -4564 3283 -535 -2479 2382 -3247 697 2222 -3762 2158 -791 -2041 4085 -3084 -930 3081
1180 3081 -3263 2244 840 -3615 3482 -803 -615 2697 -3329 1555 2255 -2428 2841 -1404 -1153 4235
1196 4235 -2459 386 1971 -3051 3306 566 -2524 3322 -1477 161 3248 -3362 1918 1117 -2076
1211 -2076 3504 -1669 -951 3378 -2727 1510 1207 -3432 3477 -486 -1879 2750 -2680 243 2300
1226 2300 -3217 1347 -449 -1959 3187 -2740 -698 2219 -3360 1837 167 -3675 2621 -1387 -1400
1241 -1400 1990 -3384 954 1069 -3121 2224 -1357 -1875 2995 -2637 205 1641 -3196 2655 362
1256 362 -2228 3121 -2037 6 2635 -2764 1360 885 -1816 2630 -1441 -701 2585 -1895 1430 438
1272 438 -2647 2719 -502 -1199 3376 -1967 327 2905 -2517 1669 935 -1478 2369 -1128 157 2597
1288 2597 -2529 1748 627 -2020 2366 -1166 -1121 2480 -2110 563 1228 -2296 1818 -905 -1736 1781
1304 1781 -1901 -38 1153 -2658 1138 -351 -1811 1749 -1850 -582 1550 -2707 1015 386 -2450
1319 -2450 1984 -1283 -1013 1761 -1906 585 718 -1942 1620 -540 -1086 2270 -1655 39 1331 -1970
1335 -1970 1363 430 -1320 1822 -815 436 1613 -1562 1155 494 -1244 1873 -432 -374 2043 -969
1351 -969 1012 961 -1386 1748 -127 -579 1466 -1100 231 1247 -1352 822 252 -756 1405 -637
1367 -637 -275 993 -1305 755 389 -1383 1097 -536 -830 1225 -1150 -213 420 -1146 768 -578
1383 -578 -793 778 -1125 -107 427 -1728 592 147 -1471 258 -714 -199 486 -1268 295 69 -840
1400 -840 520 -601 -584 753 -901 -81 462 -716 324 40 -223 834 -381 137 492 -456 890
1417 890 106 -548 891 291 210 484 -225 1107 274 -9 581 -13 122 1051 -71 328 706 311 321 254
1437 254 -6 490 209 302 361 -57 69 214 -273 101 53 -310 91 -59 -120 -432 -201 -63 -139 -358 -392 -341
1459 -341 -256 -163 -332 -423 -332 -84 -257 -141 -262 -565 -167 -333 -203 -147 -391 -22 51 -527 -38 -361 -84 304
1481 304 -428 -225 409 -198 309 -8 -316 352 -365 141 622 -551 696 258 -183 1011 -160 18 735
1500 735 -88 666 -41 -270 1007 2 131 602 -818 559 629 -935 499 -26 143 935 -922 350
1518 350 532 -1155 825 81 -583 1082 -440 -296 238 -805 814 -224 -978 581 -773 -536 490
1535 490 -1160 200 52 -1301 379 -543 -857 516 -1189 144 537 -1410 601 -47 -811 1098 -718
1552 -718 -619 729 -751 595 -1 -1206 1332 -598 -321 1232 -1137 665 838 -1239 1341 -127
1568 -127 -552 1279 -897 528 732 -1216 1425 185 -719 1769 -856 183 1773 -1377 947 293
1584 293 -959 1752 -672 -192 1716 -1095 692 1072 -1225 1456 -269 -709 1458 -1229 647 895
1600 895 -1627 1403 -336 -1129 1448 -1663 -428 1237 -1714 626 204 -1514 1069 -1054 -662 1422
1616 1422 -2005 513 650 -1830 1202 -866 -999 1526 -1406 139 1135 -1677 1092 -293 -987 1812
1632 1812 -1323 -379 1438 -1726 1087 348 -1501 1949 -700 -253 1917 -1767 837 1045 -1503 1747
1648 1747 -427 -778 2139 -1398 524 1095 -1587 1778 241 -1090 1932 -1146 266 2051 -2002
1663 -2002 1148 695 -1330 1672 -1026 -481 1607 -1618 709 188 -2147 2047 -446 -1279 1619 -1800
1679 -1800 169 1003 -1989 1116 -437 -1260 1993 -1550 -615 1199 -2126 979 62 -1919 1384 -1183
1695 -1183 -410 1566 -2207 586 639 -1728 1652 -812 -1332 2063 -1163 -84 797 -1605 1725 -116
1711 -116 -1285 1613 -1290 201 1754 -1923 1018 852 -1411 2170 -737 -621 2033 -1117 1091 889
1727 889 -1716 2056 70 -1090 2080 -1766 528 1833 -1720 1575 -194 -1093 2314 -1332 -282
1742 -282 1325 -1952 1484 605 -1950 1475 -669 -115 1468 -2149 760 820 -1614 1406 -1010 -1272
1758 -1272 1936 -1377 -184 876 -1639 1060 -278 -1511 1085 -1378 -158 971 -2043 548 352
1773 352 -1719 1457 -978 -957 1500 -1489 485 426 -1913 1392 -305 -979 1486 -1540 322 1301 -1758
1790 -1758 914 334 -1505 1831 -818 -78 1681 -1622 1341 604 -1373 1513 -251 -334 1807 -1212
1806 -1212 594 990 -1155 1614 -330 -870 1818 -896 -34 999 -1318 1164 119 -1046 1613 -939
1822 -939 -39 737 -1475 829 135 -1331 1391 -688 -686 1234 -963 345 393 -1247 929 -383 -805
1839 -805 1028 -1223 -23 807 -1288 443 -345 -1080 1259 -1138 -305 880 -1420 484 214 -1256
1855 -1256 1144 -530 -625 1052 -1049 471 594 -1167 901 -303 -765 1377 -940 189 934 -933
1871 -933 852 102 -759 1166 -424 -244 977 -819 690 437 -757 1272 -259 -381 969 -770
1887 -770 409 660 -804 869 -166 -514 1183 -650 92 634 -1062 539 225 -716 1062 -432 -25
1904 -25 842 -544 124 -181 -899 644 -580 -616 375 -964 33 131 -725 117 -418 -641 524 -848 -360
1923 -360 404 -940 297 146 -429 575 -357 -227 344 -629 162 194 -489 535 66 -471 603 -715
1941 -715 -43 627 -615 364 599 -23 663 -81 -95 1050 -292 385 32 -240 707 -60 -37 1118 -620
1960 -620 421 270 -713 629 -385 118 474 17 678 592 -253 46 143 331 -244 -22 573 621 -787 -165
1980 -165 198 -291 826 -174 205 -49 -384 67 -589 -621 -228 -143 -213 4 -628 -415 -98 -349 -120 120
2000 120 -365 -32 199 1 -259 -437 -168 67 -213 11 188 0 -69 71 142 -128 23 17 273 43 -65
2021 -65 168 84 204 172 -15 269 17 -25 361 180 52 321 23 242 43 -125 362 235 -29 339 -238
2042 -238 59 355 -189 129 214 -137 155 -169 -223 197 -443 -55 71 -331 444 181 -506 506 -344 -121
2062 -121 251 -259 91 28 -456 260 -46 -207 345 -605 -35 115 -544 182 -176 -253 357 -526 87 222 -754
2083 -754 508 -4 -381 293 -266 -113 445 -562 370 -124 -394 544 -365 -129 616 -728 450 555 -475
2102 -475 594 -15 -536 821 -323 50 596 -577 670 246 -224 829 -322 -102 857 -558 272
2119 272 125 -478 826 -245 -225 441 -688 166 611 -738 650 -86 -541 864 -656 86 455 -898
2137 -898 579 54 -970 944 -744 -405 643 -853 328 -5 -787 580 -369 -407 786 -1032 274
2154 274 268 -994 694 -196 -469 786 -1069 156 375 -766 687 -154 -646 982 -402 -282 792
2171 792 -884 645 431 -754 980 -416 20 1228 -846 577 544 -900 841 -24 -505 842 -608
2188 -608 129 617 -681 492 -64 -568 1124 -376 -270 928 -785 484 379 -642 902 -131 -456
2205 -456 696 -942 165 346 -1162 968 -357 -883 1196 -852 -177 495 -1031 509 215 -1145
2221 -1145 765 -552 -294 992 -1221 291 298 -943 1036 -584 -646 1288 -878 219 446 -1029 682
2238 682 37 -530 1137 -465 39 938 -923 470 -207 -939 1337 -497 -396 1017 -857 531 493
2255 493 -1090 1044 17 -340 1186 -933 442 800 -580 933 -68 -650 1268 -587 14 937
2271 937 -1118 796 221 -678 1039 -560 -264 1175 -905 276 393 -779 966 -393 -430 780 -1090
2288 -1090 247 313 -1152 760 -41 -868 796 -647 -219 551 -975 513 -128 -827 821 -505 -411
2305 -411 704 -1054 619 165 -1052 837 -251 -439 754 -856 -18 274 -977 576 -123 -500 902
2322 902 -377 150 649 -868 739 256 -884 1027 -459 -19 1030 -1015 591 411 -691 997
2338 997 7 -415 919 -812 237 407 -900 802 247 -524 1021 -664 -173 922 -797 372 151
2355 151 -811 879 -453 -347 848 -885 439 400 -980 552 -214 -453 853 -689 143 468 -854
2372 -854 316 130 -814 849 -646 -45 557 -875 405 -11 -739 658 -728 -268 566 -720 230
2389 230 209 -871 671 -260 -432 804 -668 72 234 -736 537 66 -470 585 -397 -39 624 -650
2407 -650 469 185 -259 600 -240 -156 676 -476 141 377 -183 786 27 -135 778 -422 5 427 -441
2426 -441 486 -105 -211 772 -382 -95 534 -448 578 272 -483 136 -496 -443 266 -644 104 67 -655 198
2446 198 -173 -332 516 -553 -189 83 -484 333 -74 -323 455 -312 -101 113 -434 296 134 -572 331 -344
2466 -344 -183 289 -555 99 308 -367 312 -114 -310 339 -299 16 255 -335 357 -92 -294 213 -90 0
2486 0 534 -192 217 111 -317 499 -187 23 415 -40 94 341 -357 380 -16 -91 315 12 11 134 -258 157
2508 157 -181 -305 242 31 -152 169 -304 -177 118 15 81 -191 -49 269 -376 -306 -10 -267 -131 18 -14
2529 -14 9 -21 -261 60 -112 -117 -82 -262 120 -314 -294 -107 -84 -50 -105 -205 -143 -60 -190 -70 -147 81 -29 -59 296
2554 296 143 10 11 68 -48 -81 171 -22 39 445 -7 -47 92 265 -28 239 53 7 183 276 78 -92 219
2577 219 86 276 216 -242 77 -169 -372 50 42 -147 -15 21 -96 102 -132 52 -205 -170 -92 -18 -232 -99
2599 -99 -279 -128 131 -73 -43 -89 -131 -171 -207 -36 29 -156 -46 131 -184 157 -163 138 77 -221 94 -195 -78
2622 -78 207 -109 -254 -110 -114 177 114 -326 247 92 -181 302 -118 150 249 -259 228 94 -73 554 75 38
2644 38 311 -311 408 55 -145 317 -154 -102 464 -352 -37 210 -229 124 216 -348 651 -150 -112 60 -329
2665 -329 335 -191 -92 276 -308 -33 276 -325 174 137 -399 254 -101 -224 501 -403 109 216 -616 196 -213
2686 -213 -184 374 -377 -235 237 -474 131 -114 -460 96 -444 -105 332 -296 177 155 -331 418 -260 -103 402
2707 402 -250 194 259 -183 298 -48 -103 642 -202 -171 700 -232 416 69 -329 465 -448 31 328 -304 287
2728 287 224 -272 384 -232 -220 447 -125 87 348 -238 556 -28 -419 269 -449 -29 303 -395 231 113 -440
2749 -440 281 -184 -288 263 -665 203 60 -855 469 -7 -143 547 -502 115 389 -542 340 -33 -589
2768 -589 435 -447 -158 346 -305 450 196 -171 573 -338 -43 554 -434 402 149 -618 308 -155 -202 591
2788 591 -332 -35 289 -499 294 -57 -377 666 -145 -24 323 -681 391 233 -166 550 -268 101 276
2807 276 -385 76 307 -343 425 -248 -445 397 -329 -163 320 -441 178 -43 -364 626 -330 -113 406 -605
2827 -605 291 -211 -282 740 -221 -297 441 -379 -35 73 -620 67 -124 -121 407 -391 -214 288 -210 162 -408
2848 -408 -555 438 -200 -139 344 -459 212 -15 -245 204 9 -234 558 -743 396 -183 -509 652 -144
2867 -144 -247 493 -545 291 297 -204 182 92 -193 506 -628 -79 383 -588 277 -62 -349 323 23 -201
2887 -201 320 -515 67 64 -362 126 287 -97 422 -260 251 103 -432 360 174 -488 265 -391 65 560 -669
2908 -669 -113 264 -217 24 -197 -394 261 -411 -13 271 -421 539 -129 -300 474 -93 52 506 -268 267
2928 267 53 -292 422 -168 26 141 -253 255 184 -542 528 -39 3 578 -523 131 12 -352 310 148
2948 148 -99 415 8 -24 306 -230 414 327 -355 425 -78 -65 395 -338 104 244 -373 231 -20 -158 98
2969 98 -197 125 189 -447 178 145 -246 231 -153 -189 172 -277 56 50 -174 -8 -200 6 320 -377 217 207
2991 207 -477 493 152 -385 330 -233 7 243 -212 252 -187 -319 179 -93 55 48 -197 319 225 -200 155
3012 155 281 40 327 -48 387 8 -154 277 -187 -405 242 -279 165 184 -84 40 -152 -306 297 -164
3032 -164 -201 135 -275 145 20 -379 19 37 107 108 -222 65 -12 -120 260 -39 0 377 -152 7 100 -16 149
3055 149 -182 -220 -94 -134 -134 -40 -221 -34 -247 -295 -300 -418 -89 269 10 -36 412 -139 -373 478 -243 -257 -301 718
3079 718 172 -404 420 -369 -411 89 -199 -31 390 -15 122 2 -282 -85 47 -96 -34 -248 -115 -38 -39 25
3101 25 115 -122 126 -55 12 -279 -17 -308 57 307 -98 -218 -123 137 -62 97 107 16 17 -50 206 -90 209
3124 209 -100 -131 135 -108 146 24 -19 8 294 -216 -32 -56 109 28 92 14 88 -230 -174 7 -19 77 118 -279
3148 -279 -194 -62 32 48 21 131 -217 -61 -154 -157 152 -60 -146 -160 -63 70 100 -242 166 -83 -45 69 144 -59
3172 -59 170 -153 4 -209 -141 46 -52 198 153 263 30 66 -222 272 35 -87 110 -45 -172 209 -148 29
3194 29 288 -75 254 5 -487 -204 -42 -76 -119 -171 -226 -189 136 290 -574 492 231 -257 626 -115 -26 -307
3216 -307 -559 -93 518 -248 221 0 199 375 -180 -243 217 29 -40 270 -178 133 -134 -175 274 -39 33
3237 33 157 -272 77 78 26 197 14 -46 215 -165 106 269 -204 255 44 137 31 -341 61 154 -186 262
3259 262 141 -240 183 -290 345 -8 -244 204 180 -174 -22 -126 -57 -231 -262 57 -169 -231 -65 -220 -449
3280 -449 111 161 -88 24 -204 650 -449 -202 336 3 -255 751 310 182 224 -626 -46 -269 79 142
3300 142 -174 -238 -248 -470 166 -243 -47 145 -110 -516 -138 -278 270 -47 -356 461 -463 -91 -378 -328 -90
3321 -90 715 -553 262 -467 104 6 -557 -709 -201 -350 -406 28 68 152 81 70 113 -232 53 171 -121 248
3343 248 -58 70 222 -189 -139 181 -181 256 -143 -112 366 -309 76 93 -364 29 163 -287 92 -503 164
3364 164 -207 -182 103 -141 -33 230 -170 140 280 -352 40 -78 -172 329 -283 305 578 -306 118 -160 -153
3385 -153 -5 77 -337 86 -259 176 -199 80 -86 -59 -34 185 -19 -70 156 -98 54 55 -151 95 -21 -38
3407 -38 98 -112 -85 60 -98 217 -68 -72 145 -95 -27 47 -117 21 68 -186 153 80 -93 272 -178 128 77
3430 77 -128 400 -307 -171 -118 -124 -196 244 -146 -3 97 -5 -90 -90 -168 -71 -389 26 -131 -13 213 -59 25 128
3454 128 -76 7 -65 -239 155 -120 36 74 -53 155 267 -181 207 -47 -117 -35 -306 208 79 -368 -85 170
3476 170 -190 92 -36 -4 229 56 201 154 -181 121 -30 -295 182 -238 266 -81 -139 48 178 -182 265
3497 265 -345 -9 244 -153 201 -206 -241 -7 129 -179 56 -170 55 129 -118 69 -40 -30 -15 -182 38
3518 38 240 -171 -20 130 -250 229 -56 -89 145 -169 -14 237 -195 144 163 -220 -37 -40 -2 -114 -149 85
3540 85 73 -67 112 -241 -52 13 129 -98 -138 -89 245 -96 201 71 -252 262 29 -187 83 -89 134 37
3562 37 -133 178 -223 63 128 -148 -123 210 -78 132 66 -149 -196 78 4 203 -119 -244 174 -205 -71 105
3584 105 -169 283 -109 -84 194 -186 -99 106 -79 -245 -28 113 -122 -67 -123 -267 -144 124 91 1 278 29
3606 29 -123 65 -81 -5 -249 28 -319 -123 139 29 59 33 -130 72 -67 -43 137 35 -229 -283 80 -106
3628 -106 162 36 38 -92 22 -38 220 -286 -78 134 -72 82 80 -118 95 -178 -18 91 -102 84 -212 -176
3650 -176 -131 27 -173 117 -156 -45 213 -79 76 40 4 181 30 236 21 15 -4 154 255 -93 -249 119
3672 119 115 -209 -253 53 100 28 70 -26 -27 -83 23 -169 81 -40 -71 -158 149 71 -42 -37 178 92 -89 -72 -59 -86
3698 -86 159 -131 152 17 -18 10 0 18 -43 36 -116 -150 160 94 -52 -52 -19 -42 79 33 -152 154 -73 160 167
3723 167 -65 -33 -134 -35 126 119 163 -19 142 -27 -79 115 18 158 -92 14 -213 51 -167 -237 -19 -16 253
3746 253 106 323 -62 80 -91 -62 51 -196 2 75 167 -188 73 -223 -29 6 39 -42 -185 36 -77 54
3768 54 -102 -87 41 -47 75 -67 69 -21 44 -127 33 -60 135 -96 80 15 5 81 -106 151 -31 115 39
3791 39 99 1 31 14 -88 -165 53 21 40 -14 109 2 124 -140 -26 124 -115 319 -128 -296 -10 -258 -14
3814 -14 -27 -62 123 9 -133 13 -38 -206 -153 -269 19 -63 -223 113 -41 19 163 -88 153 90 -112 139 65
3837 65 106 181 -131 226 353 302 38 26 218 144 -165 6 -29 -287 122 36 41 204 -231 -137 151 -170 77 85
3861 85 127 141 104 -85 152 -339 -48 89 -26 190 65 42 272 -3 138 -229 -1 88 -271 -171 -117 -95 13
3884 13 161 -12 5 -45 53 264 250 -232 163 90 176 201 -143 -32 -194 -48 233 -216 -49 223 -254 294 -127
3907 -127 -234 109 57 -126 67 -83 239 -36 -358 181 -27 88 -53 -56 2 -24 -141 146 192 -74 85 -129
3929 -129 227 104 -302 -203 65 -332 172 -53 92 121 -115 137 -23 -154 103 44 2 144 -56 -91 -75 -55
3951 -55 -90 56 -131 59 -66 -282 181 81 102 266 -177 249 -35 50 230 -79 211 -80 -97 4 160 -40
3973 -40 259 -181 -31 17 139 15 88 -147 -41 -416 -78 81 29 84 92 -73 126 97 52 6 -247 -1 37 -34
3997 -34 -41 -121 169 310 103 -83 -28 -272 -83 142 -135 12 -143 422 234 -245 233 209 -51 113 61 62 -1
4020 -1 -9 -257 -67 -237 339 41 -162 101 -10 172 -75 -124 159 22 -60 292 200 -227 119 -210 -25 122
4042 122 -84 136 169 -62 52 -93 13 184 -40 129 84 -142 -45 -231 -191 2 -163 95 -27 38 75 -99
4064 -99 -123 119 -170 203 92 -111 -57 -48 -267 257 -3 -22 68 21 -103 38 152 185 50 263 314 108 87 -60
4088 -60 -154 122 -115 23 190 -139 -97 -222 -90 -3 37 -206 77 -35 -106 167 -47 -2 -170 -79 -209 -194 -98
4111 -98 -85 -238 -109 53 9 461 -54 -109 -88 81 48 198 221 233 -194 -32 188 -178 -13 74 55 28 65 -281
4135 -281 85 -73 -35 143 -28 -138 4 90 3 -132 -48 -69 -353 -62 61 53 161 -104 -107 -147 1 -348 -30
4158 -30 -381 127 168 95 16 122 119 -173 -71 -232 -214 -127 -12 20 155 112 -3 -158 74 170 185 3 166 83
4182 83 -61 -36 3 114 6 -85 -98 -13 -7 -84 -37 31 -150 -74 36 45 -66 -52 66 149 70 166 -205 -4 26 -126
4208 -126 -118 -228 -98 -86 -82 -22 -26 -34 418 -134 -114 -89 161 315 216 113 -184 2 155 25 93 349 158 226 -76
4233 -76 43 -27 14 -14 -17 -24 226 33 75 -143 -28 -73 69 -249 6 44 78 170 67 -28 358 -80 49 -107 -214
4258 -214 -100 -180 -218 99 -184 130 161 -129 87 -16 -14 100 -101 61 -61 -6 -53 -113 -168 -114 137 127 -30 -191
4282 -191 -18 41 166 -11 57 -102 84 -92 -197 -153 -81 90 -280 19 144 -136 35 -81 -95 -47 146 100
4304 100 212 -163 -72 -60 92 141 -211 -155 -44 -9 -148 -75 44 315 113 -99 9 142 -33 64 -153 28
4326 28 75 3 249 177 95 151 -26 290 40 28 -130 23 -83 -104 -103 -189 298 -36 -29 -191 -35 92 193 -4
4350 -4 91 -161 -110 123 -231 26 -34 -22 -40 -81 103 -197 269 -39 38 45 -106 -354 0 66 -78 55 -33 -214
4374 -214 160 13 -75 64 -262 -254 8 -28 212 -96 -214 290 64 190 152 0 120 78 72 137 -119 -49 -9 -88
4398 -88 287 79 -96 111 -176 105 26 -165 -12 -156 -184 378 -43 -83 155 -148 -97 170 -111 162 -49 -179
4420 -179 215 24 111 101 -323 110 -82 -14 129 107 -205 167 -114 8 177 -128 98 -71 -153 42 -127 134
4442 134 -95 -182 124 -47 -18 -44 103 68 92 -75 -113 24 -206 -209 -213 104 175 15 183 53 -314 7 -238 -63
4466 -63 29 -101 10 155 -200 -11 -35 -167 -8 -64 40 170 18 -15 425 -289 73 -13 -84 4 -133 97 72
4489 72 -48 104 244 -11 110 -46 -25 -60 -156 90 -19 -135 -30 -66 -47 275 -53 252 -23 -240 155 -89
4511 -89 -226 -123 37 -275 131 -98 -48 152 70 79 -51 -232 11 109 140 91 -189 -151 -40 -72 99 -101 -98 132
4535 132 -13 96 76 -174 92 -3 -146 -79 -229 417 -99 139 790 -266 17 181 -211 -115 17 -475 -36
4556 -36 226 352 721 -442 -257 52 262 -92 48 -17 350 70 262 92 46 154 -20 -166 216 102 18
4577 18 5 -104 34 187 -18 83 71 221 11 -156 35 -107 -133 64 87 -67 -99 -88 113 -184 -80 113
4599 113 -190 -137 -35 84 63 -103 33 -80 171 56 21 224 321 -14 198 218 76 -96 133 -287 -6 124
4621 124 5 -25 108 -94 -15 74 -151 143 -73 6 -139 -9 164 178 -11 215 98 139 50 -94 13 29 -118
4644 -118 -14 68 -26 -22 229 96 292 -53 115 -20 -189 368 21 -103 -59 -208 -5 35 29 108 -58 -10 -103 -269
4668 -269 -32 155 -60 92 -56 -89 74 -78 -108 2 -182 94 93 -44 13 -256 -47 -94 -14 -76 -6 -188 73
4691 73 48 -68 -84 -116 -41 169 69 -2 -17 -89 116 -91 -224 -12 269 198 -109 -41 -163 5 219 91 -127
4714 -127 23 124 -188 -114 41 142 194 173 174 153 41 41 18 -230 16 -112 -220 103 -147 -225 106 -71 4 16
4738 16 272 -166 52 -25 -58 72 126 -94 38 59 118 156 -11 -76 89 122 72 -33 -284 28 190 -287 36
4761 36 -207 -18 220 -110 -103 -46 -94 -16 77 -128 50 -99 152 -101 109 -144 156 56 42 74 44 -77 -27 -84
4785 -84 72 -10 -17 -169 -254 -368 -2 -8 138 -35 -107 84 87 -144 170 140 -167 -43 151 -171 47 -54 -107 -42
4809 -42 127 68 101 50 32 101 145 -129 -90 199 83 -184 -114 -31 -154 -143 -164 56 -100 -176 -32 -209 -241 77 -12
4834 -12 35 -83 -151 -8 -175 61 39 -153 -28 34 40 90 285 -155 11 30 36 107 41 -196 -82 -58 88 -153 -117
4859 -117 79 34 -286 -22 104 103 -70 -97 215 -38 -320 13 95 -31 131 -176 354 30 57 51 65 75 -33
4882 -33 -144 151 -86 -70 6 -125 -228 7 -175 46 0 26 -37 -135 192 42 -203 -212 -90 20 -112 12 55
4905 55 66 -188 -112 86 40 -125 -38 -96 -55 38 40 86 -246 226 -211 207 -137 -28 91 143 43 84 176 -104 162
4930 162 -44 243 22 22 45 116 21 40 -261 200 59 -31 -204 183 -285 -125 173 -130 61 33 -57 -146 -90 370
4954 370 -98 -351 -89 -112 18 355 -117 103 -146 -195 149 -48 -218 103 -108 -214 337 106 116 136 -144
4975 -144 -222 -494 242 -393 -182 438 22 222 388 -6 410 137 335 369 -186 -552 -243 136 -409 -123 -298
4996 -298 -176 77 86 409 134 -21 14 -223 -163 54 -392 262 125 57 55 -202 -106 51 602 -499 -160 -166 -47
5019 -47 262 215 -475 223 445 461 19 -134 -279 -293 115 -497 474 466 -297 361 65 -53 -291 -196 83 -107
5041 -107 -72 36 375 -120 308 -56 123 255 -103 24 -43 -319 -29 -141 -160 -117 -125 -234 -120 -134 -44 -135 -194
5064 -194 207 -82 -131 -97 -128 122 320 78 -83 160 -76 -15 137 94 124 -32 49 -6 15 198 204 -88 -12 -195
5088 -195 -71 110 61 53 -170 -10 -66 -259 -20 115 -187 104 86 24 -59 191 71 183 -245 198 -63 15 110
5111 110 -67 -82 -234 -13 -59 27 243 64 -60 -281 -14 -33 -110 119 -143 259 -193 -42 207 -61 -41 127
5133 127 -7 217 -251 -127 25 -185 -17 286 -142 57 -32 -255 14 -178 2 48 -7 -15 68 137 201 62 205
5156 205 144 129 -67 43 7 225 32 -117 157 158 145 167 -108 72 64 -230 147 -97 -67 36 97 -189 -81 -271
5180 -271 64 -33 79 95 198 179 248 -135 -86 -38 -54 10 -22 8 219 -243 -220 -19 -34 215 -70 98 6 -74 -158
5205 -158 99 14 -23 62 89 30 -206 125 35 -132 -50 77 -9 60 -106 -223 212 -225 135 -60 -76 25 75 -237
5229 -237 117 -18 42 104 -13 -3 133 -38 159 -250 -82 -111 -199 -146 -61 73 47 184 29 30 -389 111 109 -50
5253 -50 21 -170 -167 -74 -20 8 -124 -125 -11 11 -55 -102 86 10 -68 -29 -130 -83 -117 -15 107 -99 -45 245 -271 -151
5279 -151 -152 -163 93 -105 -266 101 -23 -94 -117 -95 28 -23 180 -60 -11 100 203 125 -214 -51 236 -239 -69
5302 -69 168 -127 -98 64 25 149 243 8 4 -328 -35 113 -102 185 -102 -7 -135 54 21 -190 -92 106 89
5325 89 116 491 -179 40 79 -276 -202 57 33 76 58 84 -27 131 59 -109 91 -294 -18 21 208 45 -51 44
5349 44 46 166 63 58 135 107 -265 -8 93 -131 -132 -53 -161 72 37 362 -140 -133 61 84 -164 -71 -110 -47 -249 17
5375 17 117 -84 -51 -147 143 164 -44 -162 -80 195 129 -36 150 155 -145 139 -74 51 101 -111 20 -150 -4
5398 -4 63 4 -102 8 173 -20 128 209 121 111 -285 -36 90 -4 -150 91 83 241 -81 119 -114 -112 8 -172
5422 -172 180 12 -159 -36 -64 2 55 -142 236 -216 -10 -72 -162 48 -90 -41 -18 -8 93 158 -96 61 -22
5445 -22 78 232 -34 -13 -302 -9 32 33 -117 23 298 -41 -41 -157 -74 35 -42 88 156 -91 -15 177 -55 275
5469 275 188 -6 43 112 -11 -117 -66 170 -49 -330 -113 259 -213 174 82 206 86 169 136 -9 175 174 -205
5492 -205 272 47 -259 122 -436 -242 137 47 81 90 -109 -101 -69 9 -42 5 133 -9 99 159 -147 -174 -69 -41
5516 -41 132 142 14 0 -79 120 4 16 50 -133 44 222 -54 -304 181 -146 -139 26 164 171 43 -182 -123 -109
5540 -109 -215 1 -228 98 2 -62 324 182 -136 65 -327 -158 40 64 207 215 32 140 196 -192 384 432
5562 432 227 32 -455 -183 82 -315 140 -121 113 -123 169 -13 -343 163 -78 -98 -197 224 -200 -96 63
5583 63 -261 127 -83 -386 111 -269 18 -76 -296 319 -130 -150 178 -62 5 -115 -21 -79 -137 -128 -124 53 174 229
5607 229 -144 -75 48 191 47 63 -151 40 -177 -272 -203 -89 -61 -45 200 115 124 156 218 167 137 -206 -132 79 -114
5632 -114 71 -38 119 -137 63 -292 -8 494 -86 -372 -583 247 293 -90 96 -68 104 -26 -94 2 38
5653 38 -123 230 32 -33 48 12 64 91 65 123 -115 -68 215 -129 111 177 -271 -12 -24 -152 18 51 25 216
5677 216 -4 -54 29 134 419 142 -121 -291 -49 -122 131 -145 157 -195 -283 -10 23 -66 168 -46 137 2
5699 2 -53 -19 79 21 -91 -153 46 -54 7 -53 82 -275 140 146 48 51 -9 -22 9 -155 50 164 9 -220 -89 67
5725 67 31 51 -100 -19 3 25 -178 24 -39 60 168 53 46 43 -158 89 138 -146 32 52 -160 156 -53 -116 -3
5750 -3 -24 325 -34 -246 16 14 -67 16 3 -50 -74 -143 -225 -179 -230 -93 -41 316 -207 -44 183 43 243 235 3 118
5776 118 36 -253 55 -184 -136 -4 89 -86 -209 66 202 -55 -143 328 -76 30 -150 -89 -79 -12 -152 -52
5798 -52 34 69 11 9 20 -62 -80 145 18 -37 -38 -168 -54 52 -10 -149 -23 -17 143 -4 -143 59 -6 33 -212 -145
5824 -145 63 74 28 -135 -42 109 186 -159 -134 -74 222 -114 -25 -145 -50 -97 -235 -35 -67 68 -162 -10 237
5847 237 21 97 17 -164 -135 -324 213 102 33 -32 -229 -131 100 83 -103 89 -110 -180 -190 178 -209 -4 -56
5870 -56 105 -29 -52 11 64 -85 -44 -146 -342 -36 -374 55 -228 -340 -323 -51 147 104 130 455 -75 201 54
5893 54 -308 40 -160 541 91 -545 1 185 -596 759 166 654 111 -245 -588 458 -380 -315 138 59
5913 59 -286 274 -34 -138 -156 -216 646 803 159 -1092 -530 -615 670 -579 211 -695 -146 79 -284 -361 -555
5934 -555 241 -655 474 290 36 420 185 -245 -367 -172 1431 -176 -611 -533 158 -93 -326 -243 453 310
5954 310 -266 105 -402 -404 585 79 -244 220 -58 85 200 54 92 -9 0 -168 -144 26 208 48 -49 -26 -227
5977 -227 -290 136 33 94 150 13 48 -66 21 88 130 2 -82 122 8 34 -12 -12 -51 176 95 -163 283 -79 -78
6002 -78 131 -39 -134 -30 -62 36 -172 156 -22 -122 74 149 -47 -32 -41 -24 -46 -144 -138 -46 -74 -57 -178 53 -76
6027 -76 -118 115 39 -208 77 52 179 50 -105 254 -253 9 -69 78 2 131 -104 20 -26 245 -88 -211
6049 -211 -31 -98 -96 -86 54 55 -69 28 79 34 -21 42 117 -150 -58 -16 -215 -3 90 110 75 -56 -33 21 -1 203 -62
6076 -62 -308 102 -114 -53 79 -137 -190 -89 111 -147 -181 -138 251 -304 54 -44 -148 149 248 -54 -5 -267 -44
6099 -44 56 -8 251 30 100 -44 -123 57 -24 -101 -36 -282 -52 -8 -120 -196 121 -288 336 -36 144 -44 5
6122 5 -158 196 53 303 227 -189 142 -143 10 73 -42 -34 143 -187 255 -81 51 -39 -173 -135 113 256 -90
6145 -90 85 -145 -129 241 40 44 347 -339 37 377 -472 -429 -344 244 -257 -107 210 -161 -303 -370 -279 30 -32
6168 -32 -283 508 -105 250 140 -79 181 2 -176 -191 174 110 -40 125 209 23 129 -80 38 34 -100 -127
6190 -127 53 -121 -108 51 -79 88 128 -188 -127 62 -236 310 -50 49 -8 -169 4 -60 -137 72 -87 6 181
6213 181 -11 -163 26 -20 262 71 -88 62 -67 -24 -110 1 -54 -112 119 -69 -88 231 50 -163 -11 -102
6235 -102 -81 -74 78 64 41 -183 -143 11 -216 -116 8 1 77 -114 195 -175 -121 -15 189 -127 64 -75 -325
6258 -325 -190 -136 -59 27 -59 -8 -128 64 -52 -156 227 34 -144 74 -71 -69 222 -376 131 -46 -96 -72 -332
6281 -332 -11 170 -5 -8 72 -103 -17 131 -94 32 -183 53 166 -39 -53 -103 -315 -108 179 4 136 -26
6303 -26 93 37 -117 131 56 -240 175 -84 -28 -60 132 -36 65 -182 -93 -48 302 193 209 339 32 68 -30
6326 -30 132 116 212 -31 -81 100 -121 -51 149 11 -36 115 -32 -81 6 -246 -127 18 35 70 182 102 40 -77
6350 -77 127 -28 -41 86 124 -134 -103 -9 238 36 149 -127 85 -46 32 39 138 14 11 126 -56 36 -110 31
6374 31 172 242 78 209 107 -96 -67 142 -5 -8 110 175 -101 -41 173 -115 -105 64 296 -417 -123 -16 -177
6397 -177 -132 -100 -290 -194 -39 -283 -120 -24 -18 34 -50 85 -72 255 -84 80 29 -46 74 238 -126 -134 170 38
6421 38 33 -174 -149 28 10 98 28 -207 -127 14 0 27 105 -38 -95 122 343 110 -178 -195 -130 168 -155 185 -130
6446 -130 97 205 140 44 175 -36 -167 -46 -47 89 46 333 -6 96 53 83 194 -9 -43 156 -87 58 154
6469 154 -109 -14 7 274 -56 146 49 67 -52 17 45 -102 15 30 -195 -45 117 76 188 130 -24 -68 131
6492 131 -16 38 50 158 65 -132 72 -121 21 -63 64 164 19 83 39 -119 73 70 28 39 -326 43 7 -131
6516 -131 -5 -18 -36 105 246 209 141 -40 -133 -62 141 -86 37 135 0 -43 19 126 -68 -241 -53 59 -30
6539 -30 -23 249 -68 274 -131 3 116 -115 -140 85 -141 -64 -31 -85 34 -127 -41 -2 -95 -60 128 175 -41 41
6563 41 -112 43 221 -126 304 -164 243 -48 -17 -34 71 -13 257 82 -52 -182 -65 -28 97 193 -39 36
6585 36 132 137 -250 55 -160 -114 123 96 -146 -191 51 141 216 120 19 128 158 15 -73 -7 30 117 107 -13 58 70
6611 70 83 -218 86 -73 285 48 -167 127 149 197 71 -62 -71 286 -100 252 142 150 -102 -74 -14 -97 33 198
6635 198 -87 53 80 -45 -14 35 -77 -13 -103 -156 127 -115 -53 -134 61 246 145 58 -201 -38 -101 191 28
6658 28 -7 57 385 279 -156 -311 390 -57 15 551 -168 15 300 154 345 -135 146 0 46 300 27 -181
6680 -181 -172 202 -518 -409 340 575 -40 34 720 424 650 150 85 -171 -25 179 177 -6 -148 -5 -142 72
6702 72 -124 47 128 -52 -260 -67 101 -155 -68 87 137 -70 60 -26 77 -110 14 -41 -2 194 -111 -245
6724 -245 -41 -55 10 84 -21 -189 18 -49 185 32 -218 -99 -218 150 45 13 94 -124 177 217 88 -56
6746 -56 -146 81 136 -291 18 135 -68 227 -92 144 99 -77 75 123 -42 51 -40 -84 124 -227 -39 -25 -153
6769 -153 -123 22 -288 155 -15 -112 84 -15 -231 73 -90 145 33 3 48 -146 -225 -128 -148 130 -56 132 29
6792 29 -81 -117 -18 -52 234 88 10 -41 90 -92 238 -56 46 88 -65 181 34 59 209 276 -102 173 -133
6815 -133 -183 25 -66 -7 -84 21 25 -170 -120 117 37 -90 -47 27 62 -69 -54 273 69 318 91 70 -139 -181 15
6840 15 341 -87 88 88 -106 206 -72 -92 34 27 -119 135 1 -69 255 4 134 -115 -42 119 -130 -105 14
6863 14 -177 115 -298 134 -81 -177 -258 14 -39 -13 106 -126 214 -32 19 54 196 2 2 29 -328 -281 -121 -58
6887 -58 119 148 301 -54 -23 -96 -45 -167 145 191 -245 -103 124 150 -3 -15 133 -63 101 -135 -153 -72 255
6910 255 66 -248 55 55 135 91 -40 -55 125 224 49 52 -42 -103 -13 -306 231 -246 141 -239 -162 2 -48 182
6934 182 116 132 197 57 238 188 61 -69 160 12 292 2 -87 -52 -179 -17 111 -68 184 115 37 -35 139
6957 139 -27 273 -164 -39 -126 1 248 -80 47 66 -22 -178 413 36 100 -156 336 -338 -250 316 -37 -82
6979 -82 99 -343 406 531 238 192 158 -253 112 201 291 -299 126 162 -904 854 256 -500 -89 258 369
7000 369 270 -522 -149 -88 58 321 -602 -146 -135 -83 70 -97 91 107 -76 230 221 99 239 191 201 -38 -52
7023 -52 -21 81 -1 -17 -101 -199 -56 41 -30 -356 71 92 86 -153 -206 62 -4 59 -68 115 238 8 70 -40 -87
7048 -87 -32 -76 -135 10 -71 65 126 9 70 -41 -114 6 159 74 -71 9 -53 -135 -175 120 100 23 -36 124 -142
7073 -142 80 39 104 224 155 -84 -105 167 64 62 -170 114 -45 9 16 -184 8 -164 11 -179 282 129 99
7096 99 90 9 -133 29 9 -41 -184 119 -108 -86 151 -21 -29 -93 60 78 178 -270 32 33 251 -152 27 -281
7120 -281 -139 -5 182 -41 -31 -108 1 92 -69 77 -135 28 -105 143 -122 78 -22 124 -9 -52 5 -7
7142 -7 -299 -101 -46 -143 -9 0 -78 62 -33 7 4 -299 287 47 98 147 -121 -45 -97 107 28 119 15 22 126 -56
7168 -56 8 21 -148 19 -74 29 -43 -196 79 -19 21 -21 -139 7 93 -166 -115 -61 -49 235 69 40 -142 134
7192 134 47 -97 94 -64 165 -2 -162 12 54 -155 -109 -112 8 179 39 -37 -121 15 -28 49 -9 -18 68 -97
7216 -97 6 79 18 129 -45 -44 169 -109 221 300 52 44 7 91 -142 -194 64 -105 246 -23 145 52 246 144
7240 144 -60 73 -264 97 -55 -11 -8 -32 152 -10 -1 7 339 -127 251 -288 -40 85 -89 357 -23 -134 -500
7263 -500 -387 266 -116 463 183 402 820 -696 420 273 -520 269 188 580 644 -25 -127 1037 -384
7282 -384 -204 -57 -79 -163 164 -250 -115 -452 -87 174 -87 -31 -162 202 192 78 -5 -186 -292 -106 354 -72
7304 -72 -170 178 -321 82 362 -115 -201 28 97 -47 -34 -422 -25 -123 -23 434 84 -496 -111 -204 -249 36 -107
7327 -107 43 130 -45 -51 24 -129 20 178 176 -11 142 -99 -201 -24 67 -52 98 39 -55 19 49 -20 -58 173
7351 173 212 68 44 -3 152 -2 -61 -51 36 -1 -109 172 1 -102 179 85 -134 -114 -131 -93 -126 -326 155 -48
7375 -48 5 -158 -77 -4 132 -147 113 -68 -79 -119 109 27 -122 82 -158 254 -87 132 30 -128 -24 -184
7397 -184 -63 55 26 154 -94 -53 52 126 68 -206 213 -57 180 15 169 -213 -81 25 37 9 -119 149
7419 149 125 62 100 126 -110 297 -288 -190 -92 124 -6 -183 122 -69 184 -78 4 -56 -140 82 2 16 -90 141
7443 141 60 -3 67 -38 -52 -18 96 -89 -52 30 -2 -78 1 198 -53 17 -14 -224 60 -213 136 266 155 44
7467 44 -186 30 140 135 225 -50 177 71 -60 277 -130 -178 -133 129 -67 -233 44 90 -59 117 352 -25
7489 -25 -193 -170 160 50 116 198 -232 140 33 67 -113 56 -27 129 81 8 -163 217 -48 164 99 80 71 83
7513 83 56 251 62 21 -146 -292 123 -256 -31 -140 49 -4 50 88 -140 3 90 -186 121 -63 -138 -59 -5
7536 -5 -166 120 -11 158 -158 -352 -10 50 -25 82 203 9 24 78 -146 -49 -5 127 98 -22 200 -6 -204
7559 -204 -104 -258 25 182 -19 -142 -110 46 35 -202 -288 -77 14 169 137 29 130 201 -83 404 -79 -112
7581 -112 -45 -91 -210 -17 -138 25 -130 -22 -567 36 108 -199 -167 -148 160 -150 231 23 -140 -101 88 92 160
7604 160 -263 632 -122 -378 14 -137 -255 624 -74 -145 358 58 -312 -227 378 459 -11 -135 87 -42 146
7625 146 66 53 244 91 330 780 -47 -116 420 -305 652 -62 171 55 -273 67 -430 275 -531 144 170
7646 170 149 -516 293 -229 251 289 -194 239 -110 -652 348 -55 -186 167 318 -43 -88 -292 170 -670 -26
7667 -26 -74 -28 -243 348 -60 142 67 275 247 115 -231 328 -59 -233 -279 -138 13 78 -211 -125 46 -24 -131
7690 -131 -73 -256 -111 103 -209 -103 -205 114 137 8 -82 193 231 -65 35 163 117 167 -140 -41 -74 17 107
7713 107 -42 10 -131 45 6 -29 51 2 45 114 172 40 -110 -181 146 -123 55 -11 68 89 -29 -86 -74 112 24
7738 24 66 40 -75 0 172 55 164 213 61 7 -186 114 0 -84 38 112 152 17 56 14 140 -186 8 221
7762 221 135 65 37 -263 98 -34 -215 80 65 -9 82 -9 61 30 110 52 -390 85 -176 -35 -4 -47 -110 26 -67
7787 -67 55 56 29 166 -45 -184 -32 320 155 -280 -105 64 -27 4 -481 -56 48 266 295 146 -80 -417
7809 -417 53 -77 -569 -24 195 540 -217 -19 411 147 474 317 -94 437 161 113 -352 437 372 49 -23
7830 -23 197 194 116 254 -335 95 -129 -86 34 -85 -80 331 41 -122 -336 -531 387 -717 -62 410 460 -623
7852 -623 159 305 10 -151 -208 530 -140 187 -52 -262 -25 27 -233 85 0 -292 37 -198 350 -147 -115
7873 -115 -171 38 106 7 215 29 -107 -32 -140 16 -165 61 -19 -170 82 -37 265 46 -159 54 -72 190
7895 190 17 -30 -27 -34 105 -54 -165 -47 -65 -91 22 -144 137 64 169 -20 163 -22 26 -16 -120 89 -48
7918 -48 216 330 49 13 -156 -124 -256 47 -36 -26 -9 7 -202 -96 -140 -11 -73 -1 -31 7 106 57 -42 142 37
7943 37 -24 -8 -65 132 -85 -24 188 -95 254 207 -64 75 253 81 -88 9 -99 17 232 32 75 166 85
7966 85 -247 97 -44 -42 -7 36 -228 -44 143 -48 72 -322 57 189 18 162 -144 68 30 -128 27 -30
7988 -30 -42 -34 103 -173 -175 -45 -60 32 197 178 116 -199 142 -171 186 266 470 95 -307 319 14 39 -89 -22
8012 -22 -10 -132 95 -64 259 -4 71 101 -24 114 -27 -149 266 -207 -66 -125 81 -75 165 149 176 172 -114
8035 -114 -64 -3 -139 111 106 -185 -110 199 27 298 -131 -11 -93 133 -241 -299 60 -53 156 90 -127 -298 -22
8058 -22 -378 28 154 45 -55 344 -13 -204 -487 175 464 116 -169 45 -327 -384 85 83 444 -23 105
8079 105 106 -405 173 -74 -198 288 189 -80 -628 -339 95 -33 331 357 -56 148 -44 11 -300 -128 77 -208
8101 -208 -90 -174 18 129 -280 89 141 181 66 -142 -493 -168 -14 -6 -149 -78 -93 122 -47 -60 -219 93 100
8124 100 -168 17 112 61 -247 -87 204 -345 -325 -28 -63 -38 47 423 451 -286 -680 -476 -83 -149 -166 -13 -287
8147 -287 294 148 145 4 149 87 84 -173 356 143 -162 4 -78 103 352 158 -2 -63 28 -62 45 -79 -176
8170 -176 15 51 -228 30 6 2 -107 -130 -168 123 -76 -70 103 -107 -22 9 -70 -334 377 59 -223
8191b23
##END NTUPLES=NMR FID
##END=
