##TITLE=1H_SL 19a-Dau
 CDCl3, 8 sc, 
 26.08.2021
##JCAMPDX= 6.0         $$ Bruker NMR JCAMP-DX V2.0
##DATA TYPE= NMR FID
##DATA CLASS= NTUPLES
##ORIGIN= UXNMR, Bruker Analytische Messtechnik GmbH
##OWNER= root
$$ XWIN-NMR		Version 3.5
$$ Thu Aug 26 09:30:27 2021 Russian Standard Time (UT+4h)  she@DPX200
##.OBSERVE FREQUENCY= 200.131506
##.OBSERVE NUCLEUS= ^1H
##.DELAY= (6, 6)
##.ACQUISITION MODE= SIMULTANEOUS
##.ACQUISITION SCHEME= undefined
##.AVERAGES= 8
##.DIGITISER RES= 18
##SPECTROMETER/DATA SYSTEM= spect
##.PULSE SEQUENCE= zg30
##.SOLVENT NAME= CDCl3
##.SHIFT REFERENCE= (INTERNAL, CDCl3, 0, 15.7039)
##AUDIT TRAIL= $$ (NUMBER, WHEN, WHO, WHERE, WHAT)
$$ ##TITLE= Audit trail, XWIN-NMR		Version 3.5
$$ ##JCAMPDX= 5.01
$$ ##ORIGIN= Bruker BioSpin GmbH
$$ ##OWNER= she
$$ F:/spectra/data/she/nmr/H-F/1/audita.txt
$$ ##AUDIT TRAIL=  $$ (NUMBER, WHEN, WHO, WHERE, WHAT)
(   1,<2021-08-26 09:29:31.07 +0400>,<she>,<DPX200>,
      <created by zg, POWCHK disabled, PULCHK disabled
       configuration hash MD5:
       00 E9 B6 7A A2 85 ED C7 34 08 36 98 17 FE 4E 26
       data hash MD5: 16K
       A1 5D E3 60 6D 0E EB 3E 05 32 3E 58 1D D3 40 A7>)
$$ ##END=
$$ 
$$ hash MD5
$$ 00 2D 06 A5 E2 10 8C 96 58 CB CB 8A A2 CE E3 D6
##$RELAX= 
##$RELAX= 
##$RELAX= 
##$RELAX= 
##$RELAX= 
##$RELAX= 
$$ Bruker specific parameters
$$ --------------------------
##$DU= <F:/spectra>
##$EXPNO= 1
##$NAME= <H-F>
##$PROCNO= 1
##$TYPE= <nmr>
##$USER= <she>
##$AMP= (0..31)
100 100 100 100 100 100 100 100 100 100 100 100 100 100 100 100 100 100 
100 100 100 100 100 100 100 100 100 100 100 100 100 100 
##$AQSEQ= 0
##$AQ_mod= 1
##$AUNM= <au_zg>
##$AUTOPOS= <>
##$BF1= 200.13
##$BF2= 200.13
##$BF3= 200.13
##$BF4= 200.13
##$BF5= 200.13
##$BF6= 200.13
##$BF7= 200.13
##$BF8= 200.13
##$BYTORDA= 1
##$CFDGTYP= 0
##$CFRGTYP= 5
##$CHEMSTR= <none>
##$CNST= (0..31)
1 1 145 1 1 1 1 1 1 1 1 1 1 1 1 1 1 1 1 1 1 1 1 1 1 1 1 1 1 1 1 1 
##$CPDPRG= <>
##$CPDPRG1= <>
##$CPDPRG2= <>
##$CPDPRG3= <>
##$CPDPRG4= <mlev>
##$CPDPRG5= <mlev>
##$CPDPRG6= <mlev>
##$CPDPRG7= <mlev>
##$CPDPRG8= <mlev>
##$CPDPRGB= <>
##$CPDPRGT= <>
##$D= (0..31)
0 1.2 0 0 0 0 0 0 0 0.06 0 0.03 0 0 0 0 0.0002 0 0 0 0 0 0 0 0 0 0 0 0 
0 0 0 
##$DATE= 1629955770
##$DBL= (0..7)
120 120 120 120 120 120 120 120 
##$DBP= (0..7)
150 150 150 150 150 150 150 150 
##$DBP07= 0
##$DBPNAM0= <>
##$DBPNAM1= <>
##$DBPNAM2= <>
##$DBPNAM3= <>
##$DBPNAM4= <>
##$DBPNAM5= <>
##$DBPNAM6= <>
##$DBPNAM7= <>
##$DBPOAL= (0..7)
0.5 0.5 0.5 0.5 0.5 0.5 0.5 0.5 
##$DBPOFFS= (0..7)
0 0 0 0 0 0 0 0 
##$DE= 6
##$DECBNUC= <off>
##$DECIM= 32
##$DECNUC= <off>
##$DECSTAT= 4
##$DIGMOD= 1
##$DIGTYP= 9
##$DL= (0..7)
0 120 120 120 120 120 120 120 
##$DP= (0..7)
150 150 150 150 150 150 150 150 
##$DP07= 0
##$DPNAME0= <>
##$DPNAME1= <>
##$DPNAME2= <>
##$DPNAME3= <>
##$DPNAME4= <>
##$DPNAME5= <>
##$DPNAME6= <>
##$DPNAME7= <>
##$DPOAL= (0..7)
0.5 0.5 0.5 0.5 0.5 0.5 0.5 0.5 
##$DPOFFS= (0..7)
0 0 0 0 0 0 0 0 
##$DQDMODE= 0
##$DR= 18
##$DS= 0
##$DSLIST= <SSSSSSSSSSSSSSS>
$$ [...]
##$SUBNAM2= <"">
##$SUBNAM3= <"">
##$SUBNAM4= <"">
##$SUBNAM5= <"">
##$SUBNAM6= <"">
##$SUBNAM7= <"">
##$SUBNAM8= <"">
##$SUBNAM9= <"">
##$SW= 20.0188882624521
##$SWIBOX= (0..15)
0 0 2 0 0 0 0 0 0 0 0 0 0 0 0 0 
##$SW_h= 4006.41025641026
##$TD= 16384
##$TD0= 1
##$TE= 0
##$TE2= 300
##$TE3= 300
##$TEG= 300
##$TL= (0..7)
0 120 120 120 120 120 120 120 
##$TP= (0..7)
150 150 150 150 150 150 150 150 
##$TP07= 0
##$TPNAME0= <>
##$TPNAME1= <>
##$TPNAME2= <>
##$TPNAME3= <>
##$TPNAME4= <>
##$TPNAME5= <>
##$TPNAME6= <>
##$TPNAME7= <>
##$TPOAL= (0..7)
0.5 0.5 0.5 0.5 0.5 0.5 0.5 0.5 
##$TPOFFS= (0..7)
0 0 0 0 0 0 0 0 
##$TUNHIN= 0
##$TUNHOUT= 0
##$TUNXOUT= 0
##$USERA1= <user>
##$USERA2= <user>
##$USERA3= <user>
##$USERA4= <user>
##$USERA5= <user>
##$V9= 5
##$VALIST= <valist>
##$VCLIST= <CCCCCCCCCCCCCCC>
##$VD= 0
##$VDLIST= <DDDDDDDDDDDDDDD>
##$VPLIST= <PPPPPPPPPPPPPPP>
##$VTLIST= <TTTTTTTTTTTTTTT>
##$WBST= 1024
##$WBSW= 4
##$XGAIN= (0..3)
0 0 0 0 
##$XL= 0
##$YL= 0
##$YMAX_a= 123333
##$YMIN_a= -259203
##$ZGOPTNS= <>
##$ZL1= 120
##$ZL2= 120
##$ZL3= 120
##$ZL4= 120
##$ABSF1= 10
##$ABSF2= 0
##$ABSG= 5
##$ABSL= 3
##$ALPHA= 0
##$AQORDER= 0
##$ASSFAC= 0
##$ASSFACI= 0
##$ASSFACX= 0
##$ASSWID= 0
##$AUNMP= <proc_1d>
##$AZFE= 0.1
##$AZFW= 0.1
##$BCFW= 1
##$BC_mod= 2
##$BYTORDP= 1
##$COROFFS= 0
##$CY= 11.3945322036743
##$DATMOD= 1
##$DC= 2
##$DFILT= <>
##$DTYPP= 0
##$F1P= 2.36226072786647
##$F2P= -0.459571619588291
##$FCOR= 0.5
##$FTSIZE= 0
##$FT_mod= 4
##$GAMMA= 1
##$GB= 0.15
##$INTBC= 1
##$INTSCL= 1
##$ISEN= 128
##$LB= 0.24
##$LEV0= 0
##$LPBIN= 0
##$MAXI= 10000
##$MC2= 0
##$MEAN= 0
##$ME_mod= 0
##$MI= 1.114404
##$NCOEF= 0
##$NC_proc= 0
##$NLEV= 6
##$NOISF1= 3.799351
##$NOISF2= 2.8
##$NSP= 1
##$NTH_PI= 0
##$NZP= 0
##$OFFSET= 15.70392
##$PC= 1
##$PHC0= -13362.49
##$PHC1= 19.20099
##$PH_mod= 1
##$PKNL= yes
##$PPARMOD= 0
##$PSCAL= 0
##$PSIGN= 0
##$REVERSE= no
##$SF= 200.130013532006
##$SI= 16384
##$SIGF1= 3
##$SIGF2= 2
##$SINO= 400
##$SIOLD= 16384
##$SREGLST= <1H.CDCl3>
##$SSB= 0
##$STSI= 0
##$STSR= 0
##$SW_p= 3612.71676300578
##$SYMM= 0
##$S_DEV= 0
##$TDeff= 0
##$TDoff= 0
##$TI= <>
##$TILT= no
##$TM1= 0
##$TM2= 0
##$TOPLEV= 0
##$USERP1= <user>
##$USERP2= <user>
##$USERP3= <user>
##$USERP4= <user>
##$USERP5= <user>
##$WDW= 1
##$XDIM= 8192
##$YMAX_p= 0
##$YMIN_p= 0
$$ End of Bruker specific parameters
$$ ---------------------------------
##NTUPLES= NMR FID
##VAR_NAME=  TIME,          FID/REAL,        FID/IMAG
##SYMBOL=    X,             R,               I
##VAR_TYPE=  INDEPENDENT,   DEPENDENT,       DEPENDENT
##VAR_FORM=  AFFN,          ASDF,            ASDF
##VAR_DIM=   8192,          8192,            8192
##UNITS=     SECONDS,       ARBITRARY UNITS, ARBITRARY UNITS
##FACTOR=    0.0002496,     1,               1
##FIRST=     0,             0,               0
##LAST=      2.0444736,     0,               0
##MIN=       0,             -259203,         0
##MAX=       2.0444736,     123333,          0
$$ Real data points
##PAGE= N=1
##DATA TABLE= (X++(R..R)), XYDATA
$$ [...]
$$ plain form
1972 560 443 -285 -261 396 466 -132 -95 619 113 -228 504 506 148 -115 523 483 277 503 224 1 200 427
1994 427 172 637 751 376 -340 253 704 340 -181 426 609 112 147 757 747 -230 52 753 799 -184 281
2015 281 998 271 -145 692 1089 -5 -201 569 879 204 -4 460 420 122 204 591 371 237 133 281
2035 281 451 329 200 0 -372 297 442 151 7 237 75 -73 617 96 -426 -537 233 -72 -457 -128
2055 -128 257 -416 -747 -70 61 -284 -896 -216 -164 -866 -687 11 -418 -823 -591 -119 -313 -767 -790 -467 -435
2076 -435 -982 -314 -286 -858 -943 -207 -453 -584 -470 -842 -817 -314 -443 -575 -492 -728 -585 -494 -461 -280 -777 -770 -118
2099 -118 -193 -782 -586 -208 -172 -425 -149 105 26 -719 -212 472 205 -291 177 602 -118 -173 486 625 -79
2120 -79 36 487 410 -59 322 768 309 121 596 666 235 310 -1 411 652 570 514 396 308 502 166 558
$$ packed form
1972E60j17p28K4O57P0n98L7P14n06l41P32Kl58k63O38m0k06K26k79k23J99K27
1994D27k55M65J14l75p16N93M51l64n21O07J83m97L5O10j0r77K82P01M6r83M65
2015B81P17p27m16Q37L97j094j96P70L10o75k08M64m0k98Q2L87k20j34j04J48
2035B81J70j22j29k00l72O69J45k91j44K30j62j48O90n21n22j11P70l05l85L29
2055a28L85o73l31O77J31l45o12O80N2p02J79O98m29m05K32M72j94m54k3L23L2
2076d35n47O68K8n72q5P36k46j31J14l72K5N03j29j32Q3k36J43R1L3J81m97PO52
2099a18p5n89J96L78L6k53K76K54p9p45N07O84k67m96M68M25p20n5O59J39p04
2120g9J15M51p7m69L81M46m59j88M75P0m31P5l11M12K41q2n6j18q8J94l36L92
$$ plain form
2142 558 506 468 203 302 838 467 198 451 456 429 363 624 577 -51 -119 781 702 -175 185 631 621 -395 248
2165 248 393 -111 -170 20 357 87 -293 -26 244 157 -525 381 264 -34 -500 102 435 -25 145 -211 19
2186 19 10 147 -12 48 0 -446 -428 411 70 -423 -166 -24 56 -340 -299 21 -45 -187 7 424 -228 -468 -273
2209 -273 365 -417 -383 471 -212 -507 -324 -22 -79 -253 -490 -356 -112 -264 -129 -60 -336 -548 21 179 -249
2230 -249 -493 -211 -603 -262 -498 -595 -515 -98 -161 -838 -210 20 -571 -675 53 -325 -571 -249 -108 -446 -837
2251 -837 -565 74 -70 -318 -642 273 -130 -370 82 371 -797 -431 447 -103 -418 -59 -63 9 -167 -225 -197
2272 -197 212 10 -410 21 190 -76 -131 48 -97 79 228 270 67 326 448 170 928 767 -376 441
2292 441 1054 396 352 578 361 318 583 647 553 557 499 618 847 52 299 920 885 -293 373 1090 539 241
$$ packed form
2142E58n2l8k65R9N36l71k69K53Nk7o6K61m7o28o8R00p9q77L60M46j0j016O43
2165B48J45n04n9J90L37k70l80K67K70q7o82R06j17k98m66O02L33m60J70l56K30
2186A9rJ37j59O0m8m46J8Q39l41m93K57J42Q0l96M1L20o6j42J94M17o52k40J95
2209b73O38p82L4Q54o83k95J83L02n7j74k37J34K44j52J35O9k76k12N69J58m28
2230b49k44K82l92L41k36r7Q0M17o3o77O28K30n91j04P28l78k46L22J41l38l91
2251h37K72O39j44k48l24R15m03k40M52K89j168L66Q78n50l15L59mP2j76n8K8
2272a97M09k02m20M31J69k66n5J79j45J76J49M2k03K59J22k78P58j61j143Q17
2292D41O13o58m4K26k17m3K65O4r4Mn8J19K29p95K47O21l5j178O66P17n51k98
$$ plain form
2314 241 385 471 495 663 621 527 333 443 302 580 37 -40 -10 583 243 113 5 21 -131 205 -108 -152 247
2337 247 -60 -435 -29 -175 -788 -173 267 -440 -556 9 127 -124 -466 -636 -213 178 -625 -289 96 -401
2357 -401 -543 211 -236 -1209 -274 70 -178 -547 -394 -790 -337 -224 -442 -359 -582 -130 -411 94 -148 -340
2377 -340 37 -86 -391 -236 -88 -208 -40 -33 -634 -56 181 -71 -668 -25 42 -185 13 223 -210 -324 -38
2398 -38 355 -67 -381 -108 587 302 -511 -194 345 -60 -397 154 190 -350 -73 271 -90 66 404 278 -45
2419 -45 -49 -146 90 408 165 -211 22 152 412 215 -165 -378 221 316 -51 244 430 -235 -304 520 172 -462
2441 -462 311 199 -57 -46 326 453 -120 55 275 236 161 462 641 495 -318 212 862 346 -109 229 560
2462 560 92 161 167 460 160 288 317 307 246 219 276 515 56 216 108 149 101 547 536 84 555 30 -103 441
$$ packed form
2314B41J44Q6K4J68m2r4j94J10j41K78n43p7L0N93l40j30j08J6j52L36l13m4L99
2337B47l07l75M06j46o13O15M40p07j16N65J18k51l42j70M23L91q03L36L85m97
2357d01j42P54m47r73R35L44k48l69J53l96M53J13k18Q3k23M52k81N05k42j92
2377c40L77j23l05J55J48j20J68Po01N78K37k52n97O43O7k27J98K10m33j14K86
2398c8L93m22l14K73O95k85q13L17N39m05l37N51L6n40K77L44l61J56L38j26l23
2419d5mr7K36L18k43l76K33J30K60j97l80k13N99R5l67K95J86o65o9Q24l48o34
2441d62P73j12k56J1L72J27n73J75K20l9p5L01J79j46q13N30O50n16m55L38L31
2462E60m68O9OK93l00J28K9j0o1k7N7K39m59J60j08M1m8M46j1m52M71n25j33N44
$$ plain form
2486 441 688 -18 -89 360 43 35 37 303 119 -171 198 472 36 -375 -266 341 -190 -510 -106 289 -407 -414
2508 -414 65 -269 -545 -250 11 -470 -337 32 -499 -663 -344 -514 -355 -258 -248 -318 -512 -425 -223 -365 -400 -278
2530 -278 -217 -417 -636 -197 -329 -638 -445 -152 -482 -563 -257 -114 -545 -336 -113 -197 -603 -630 34 -143 -415
2551 -415 -100 160 190 -561 -55 182 -86 -284 3 286 -31 36 431 34 -154 27 113 116 227 190 255 434
2573 434 194 184 462 -45 164 646 91 177 469 276 215 446 205 8 211 334 428 -22 439 404 131 505
2595 505 547 610 137 201 592 483 -22 40 512 201 43 118 286 428 92 103 138 32 -98 159 760 25
2617 25 50 256 24 219 11 40 40 -111 -201 -13 346 127 -112 75 90 184 65 -205 73 80 -123 -306 227
2640 227 151 -382 -337 62 90 -349 -37 76 166 -285 -161 111 -373 -225 -129 144 -405 -427 52 -133 -151 -273
$$ packed form
2486D41K47p06p1M49l17qKK66j84k90L69K74m36m11J09O07n31l20M04L95o96p
2508d14M79l34k76K95K61m81J33L69n31j64L19j70J59R7J0p0j94Q7K02j42l5J22
2530b78O1k00k19M39j32l09J93K93l30q1L06J43m31K09K23q4m06k7O64j77k72
2551d15L15K60L0p51N06K37k68j98K87K83l17O7L95l97j88J81Q6LJ11l7O5J79
2573D34k40j0K78n07K09M82n55Q6K92j93o1K31k41j97K03J23R4m50M61l5k73L74
2595E05M2O3m73O4L91j09n05O2M72l11j58P5J68J42l36J1L5j06j30K57O01p35
2617B5K5K06k32J95k08K9%j51r0J88L59k19k39J87J5R4j19k70K78Pk03j83N33
2640B27p6n33M5L99K8m39L12J13R0m51J24K72m84J48R6K73n49k2M79j85j8j22
$$ plain form
2662 -273 28 -428 -349 -60 6 -34 -103 -210 -264 -481 -188 -69 -179 20 -59 -257 -477 103 -26 -287 -304 146
2684 146 -259 -216 33 2 -273 -588 -67 -136 -577 -478 -184 -122 -264 -119 -346 -207 -366 -212 56 -216 -78 61
2706 61 -162 -383 -614 153 -125 -341 -56 -110 138 -96 192 -169 -166 83 132 59 -16 -124 101 20 213 157 125
2729 125 -87 297 86 95 221 361 114 25 528 389 234 92 337 475 274 338 558 484 162 186 358 349 30
2752 30 288 688 455 50 394 433 188 202 485 143 355 364 188 136 295 47 108 591 300 86 225 56
2774 56 126 86 61 22 156 79 -97 302 -42 -164 -109 58 86 -341 -25 191 -88 -404 8 -274 -217 -232 79
2797 79 199 -211 -254 -227 -19 -553 -233 226 -287 -522 -177 -284 -91 -321 -258 -269 -422 17 -145 -278 -63 -353
2819 -353 -298 -17 -24 -209 -374 -266 -206 -63 -171 -26 38 -352 -517 53 307 -387 -564 -192 146 -175 -14 -48
$$ packed form
2662b73L01m56P9K89O6m0o9j07n4k17K93J19j10J99p9j98k20N80j29k61j7M50
2684A46m05M3K49l1k75l15N21o9m41R9K94O2j42J45k27J39j59J54K68k72J38J39
2706F1k23k21k31P67k78k16K85n4K48k34K88l61LK49M9p3p5j08K25q1J93n6l2
2729A25k12L84k11RJ26J40k47q9N03j39j55j42K45J38k01O4K20p4l22K4J72rl19
2752C0K58M00k33m05L44L9k45J4K83l42K12Rj76n2J59k48O1M83k91k14J39j69
2774E6P0m0k5l9J34p7j76L99l44j22N5J67K8m27L16K16k79l16M12k82N7j5L11
2797G9J20m10m3K7K08n34L20M59n13k35L45j07J93k30O3j1j53M39j62j33K15k90
2819c53N5K81pj85j65J08O0J43j08J45O4l90j65N70K54o94j77L72L38l21J61l4
$$ plain form
2841 -48 -328 -360 246 -27 -201 153 -181 406 360 -362 -276 289 50 222 -63 34 -174 32 194 -242 -55 -15
2863 -15 -243 -73 268 -135 32 168 297 -81 -106 46 456 82 40 186 127 -69 -246 571 228 -374 277
2884 277 563 121 -347 143 520 55 130 316 -54 -83 153 191 139 190 225 397 448 7 139 387 142 -36
2906 -36 508 182 98 443 278 -160 352 549 120 169 -30 -91 150 745 0 -132 255 144 294 77 6 244
2928 244 432 278 -1 254 221 -331 6 395 14 -245 383 204 -304 -234 103 35 221 -155 -33 63 179
2949 179 -273 -160 140 -619 -35 228 -179 -367 28 -340 -213 -104 -272 -285 -141 -244 -417 -135 -78 47 -341
2970 -341 -297 -421 -433 -351 -112 -164 -165 -581 -256 19 -170 -718 -355 88 -535 -306 -35 -214 -493 -144 16 -271
2992 -271 -299 50 82 4 -457 -145 159 -136 -415 -220 87 -35 49 -58 -388 -134 413 -87 -6 240 60 12
$$ packed form
2841d8k80l2O06k73j74L54l34N87m6p22Q6N65k39J72k85R7k08K06J62m36J87M0
2863a5k28J70L41m03J67J36J29l78k5J52M10l74m2J46n9j96j77Q17l43o02O51
2884B77K86m42m68M90L77m65P5J86l70k9K36L8n2N1L5J72N1m41J32K48k45j78
2906c6N44l26q4L45j65m38N12J97m29M9j99o1K41N95p45j32L87j11J50k17p1K38
2928B44J88j54k79K55l3n52L37L89l81k59O28j79n08P0L37o8J86l76J22R6J16
2949A79m52J13L00p59N84K63m07j88L95l68J27J09j68j3J44j03j73K82N7J25l88
2970c41M4j24j2Q2K39n2jm16L25K75j89n48L63M43o23K29K71j79k79L49J60k87
2992b71k8L49L2p8m61L12L04k95k79J95L07j22Q4j07l30K54N47n00Q1K46j80m8
$$ plain form
3014 12 129 63 -156 39 240 343 50 -50 208 138 -26 -233 -4 97 -33 25 521 95 106 54 544 226
3036 226 -53 548 362 -50 49 231 198 467 -83 396 434 161 36 180 67 -111 516 438 -91 -7 252 53
3058 53 402 202 106 -59 361 315 -20 37 345 -204 172 50 -34 106 -115 46 228 -149 -215 -83 268 -116
3080 -116 -237 -21 65 -63 -48 85 -251 -244 -93 65 8 -293 -176 240 -61 61 -354 -125 98 -13 116 125
3102 125 -99 -203 -71 -106 -49 105 -263 -84 40 -145 121 223 -139 88 -221 198 -120 -259 57 -171 -79
3123 -79 -35 29 244 -205 -441 -243 306 -43 -564 -47 -143 -630 -431 -3 -245 -270 -242 -200 -162 -223 49 -175 -170 -389
3147 -389 -375 -128 -345 -182 3 -259 -99 -18 38 -58 -156 163 -261 -108 176 0 -217 144 52 51 -223 214 -15
3170 -15 -323 -36 37 111 -132 99 352 -63 -198 -121 169 208 165 426 312 17 92 180 703 312 34 238 237
$$ packed form
3014A2J17o6k19J95K01J03k93j00K58p0j64k07K29J01j30N8M96m26J1n2M90l18
3036B26k79O01j86m12R9J82l3K69n50M79L8k73j25J44j13j78O27p8n29Q4K59j99
3058E3L49k00r6j65M20m6l35N7L08n49L76j22q4J40k21J61J82l77o6J32L51l84
3080a16j21K16Q6j28J5J33l36PJ51J58n7l01J17M16l01J22m15K29K23j11J29R
3102A25k24j04J32l5N7J54l68J79J24j85K66J02l62K27l09M19l18j39L16k28R2
3123g9M4O4K15m49k36J98N49l49n21N17r6m87J99M28k42k5K8M2L8o1K72k24Nk19
3147c89J4K47k17J63J85k62J60Q1N6r6r8L19m24J53K84j76k17L61r2jk74M37k29
3170a5l08K87P3P4k43K31K53m15j35P7K90L9m3K61j14k95P5Q8N23l91k78K04j
$$ plain form
3193 237 -1 251 258 265 254 397 262 326 314 121 363 264 530 388 177 219 226 123 372 282 249 274 248 13 174
3218 174 -140 260 120 138 -77 110 348 42 51 -174 102 -80 153 29 113 -94 -73 160 76 -101 85 -75
3240 -75 -101 192 343 -25 22 -31 -128 215 -92 -231 -132 -60 -64 -266 -255 -346 -124 -161 -243 -7 -183 -359 -543 -215
3264 -215 -289 -307 -288 -159 -290 -373 -438 84 -155 -413 -303 183 -113 -206 119 -28 -206 -36 -14 -66 -294 -154 266
3287 266 -145 -169 -70 -107 -183 32 -125 475 131 -444 68 -92 196 189 -154 -367 -111 39 -77 158 144 -58
3309 -58 -256 -114 243 -20 -163 60 329 -43 3 108 -127 -134 177 180 349 -75 -154 305 299 -362 327 211 -331
3332 -331 -82 -42 281 -297 206 195 -10 63 285 95 -1 27 176 226 211 107 122 -14 241 154 92 307 107
3355 107 65 -110 -45 163 174 225 275 179 38 22 373 42 151 68 127 228 -56 75 193 348 167 12 105
$$ packed form
3193B37k38K52PPj1J43j35O4j2j93K42r9K66j42k11M2Pj03K49r0l3K5k6k35J61
3218A74l14M00j40J8k15J87K38l06Rk25K76j82K33j24Q4k07K1K33q4j77J86j60
3240g5k6K93J51l68M7n3r7L43l07j39R9P2mk02J1r1K22l7q2K36j76j76j84L28
3264b15p4j8J9J29j31q3o5N22k39k58J10M86k96r3L25j47j78J70K2n2k28J40M20
3287B66m11k4R9l7p6K15j57O00l44n75N12j60K88pl43k13K56J50j16K35j4k02
3309e8j98J42L57k63j43K23K69l72M6J05k35pL11LJ69m24p9M59oo61O89j16n42
3332c31K49M0L23n78N03j1k05P3K22j90r6K8J49N0j5j04J5j36K55q7o2K15k00
3355A07m2j75O5K08J1N1N0r6j41j6L51l31J09q3N9J01k84J31J18J55j81j55R3
$$ plain form
3378 105 63 103 318 451 -18 -7 57 23 -67 8 118 -127 59 96 60 -50 35 72 -145 89 47 -74 23 30 -288
3403 -288 -11 -354 166 141 -155 -6 249 -78 -143 -422 -176 -200 -218 17 -159 13 -19 -246 -21 -304 -509 119
3425 119 -55 -266 -366 218 -22 -595 -128 -92 -91 -317 176 -86 -93 -156 -315 -144 -225 -70 -174 -80 105 103 -35
3448 -35 -151 -240 113 68 -46 -252 150 51 37 -15 -146 -204 302 31 -146 -308 4 116 92 -177 178 246 12
3471 12 38 103 181 -42 230 264 144 -105 217 350 130 432 208 363 -2 170 -36 89 311 215 -78 172
3493 172 192 97 18 92 -138 213 50 77 205 23 258 20 99 -128 51 326 72 41 334 313 10 102 251
3516 251 322 111 -197 92 24 146 -150 159 231 -177 -271 34 74 -252 128 122 -141 -61 152 -76 -382 -289 72
3539 72 331 339 -45 -134 -80 -23 146 -36 -66 -162 -169 -236 -269 140 -241 -359 -124 -4 -146 -310 234 55 -359 -78
$$ packed form
3378A05m2M0K15J33m69J1O4l4r0P5J10k45J86L7l6j10Q5L7k17K34m2j21R7Pl18
3403b88K77l43N20k5k96J49K55l27o5k79K46k4j8K35j76J72l2k27K25k83k05O28
3425A19j74k11j00N84k40n73M67L6Jk26M93k62po3j59J71q1J55j04R4J85kj38
3448c5j16q9L53m5j14k06M02r9j4n2j31n8N06k71j77j62L12J12k4k69L55O8k34
3471A2K6O5P8k23K72L4j20k49L22J33k20L02k24J55l65J72k06J25K22r6k93K50
3493A72K0r5p9P4k30L51j63K7J28j82K35k38P9k27J79K75k54l1K93k1l03R2J49
3516B51P1k11l08K89o8J22k96L09P2m08r4L05M0l26L80ok63Q0K13k28l06R3L61
3539G2K59Ql84q9N4N7J69j82l0r6po7l3M09l81j18K35J20j42j64N44j79m14K81
$$ plain form
3563 -78 163 44 -101 -42 55 -102 -48 -13 -112 -134 -210 -80 -145 -267 -181 298 -96 -257 -62 100 -96 140 108 -36
3587 -36 222 0 -39 -126 -437 -62 -259 -96 -127 -190 -103 8 -198 -295 124 -198 -19 -6 -84 193 148 -185 -70
3610 -70 147 205 -3 -162 104 -137 -56 36 144 -24 -213 -63 222 67 -14 159 351 93 197 438 307 110
3632 110 -109 64 23 283 319 249 289 90 -68 334 71 213 128 89 338 180 245 45 271 461 97 264
3654 264 278 225 38 315 372 179 17 26 466 185 144 128 152 43 90 316 -22 201 89 -6 -59 -76 -142 -9
3678 -9 164 -70 115 171 -62 -152 -4 -4 123 173 -69 -115 98 41 -175 183 -70 -282 -59 -170 -170 -182 -63 -175
3702 -175 -308 -42 -221 -86 14 -234 -215 -38 -170 -106 151 0 -64 -136 -131 133 -143 -156 -438 236 -278 0
3724 0 -38 -127 116 -279 128 -104 -430 -235 -251 255 -97 -111 46 -316 175 117 -71 -19 -116 -65 -151 23 -174 15
$$ packed form
3563g8K41j19j45N9R7j57N4L5r9k2p6J30o5j22Q6M79l94j61J95J62j96K36l2j44
3587c6K58k22l9q7l11L75j97J63l1o3Q7J11k06r7M19l22J79J3p8K77m5l33J15
3610g0K17N8k08j59K66k41Q1R2J08j68j89J50K85j55q1J73J92k58J04K41j31j97
3632A10k19J73m1K60L6p0M0j99j58M02k63J42q5l9K49j58O5k00K26J90l64J67
3654B64J4n3j87K77N7j93j62RM40k81m1j6K4j09M7K26l38K23j12r5n3j7o6J33
3678iJ73k34J85N6k33r0J48%J27N0k42m6K13n7k16L58k53k12K23j11%j2J19j12
3702a75j33K66j79J35J00k48J9J77j32O4K57j51o4p2NK64k76j3k82O74n14K78
3724@l8q9K43l95M07k32l26J95j6N06l52j4J57l62M91n8j88N2r7N1q6J74j97J89
$$ plain form
3748 15 6 -55 -332 -20 65 -133 -49 -152 120 -1 -256 121 111 109 199 -47 128 -285 -5 10 -56 -91 -12 -70 151
3773 151 -4 -83 103 173 204 -159 233 3 8 152 14 96 -170 -109 92 182 -116 -69 93 367 269 192 -40 325
3797 325 285 -200 7 110 123 12 -33 258 478 285 192 89 249 -14 362 101 -101 -133 70 307 180 178
3819 178 71 29 -66 -187 323 65 24 -166 144 -87 63 60 27 -13 -204 54 320 203 -45 73 280 -62
3841 -62 85 -84 -178 2 -32 46 -232 -101 -85 -40 96 -127 -450 -130 56 64 -28 -15 -34 -193 -188 35 -64 -39 98
3866 98 -100 101 72 3 -67 81 -649 -102 119 -198 -285 10 169 -142 -38 -44 -126 -188 -131 -259 -21 329 -75
3889 -75 -186 -168 -91 323 13 -117 -128 -59 -261 -171 -109 -124 -354 -98 100 68 -169 -196 -79 -145 38 -72 72 64
3913 64 102 316 -19 -60 -46 -109 -127 57 268 251 241 -34 -46 365 254 18 32 136 161 -33 -156 211 174 88
$$ packed form
3748A5ro1k77L12Q5j98Q4j03K72j21k55L77j0kR0k46J75m13K80J5o6l5P9n8K21
3773A51j55p9J86P0L1l63L92k30NJ44j38Q2k66O1K01R0k98M7J62K74r8p7k32L65
3797C25m0m85K07J03J3j11m5K91K20j93r3j03J60k63L76k61k02l2K03K37j27k
3819A78j07m2r5j21N10k58m1j90L10k31J50ll3m0j91K58K66j17k48J18K07l42
3841f2J47j69r4J80l4P8k78J31J6M5J36k23l23L20J86Qr2J3j9j59NK23r9K5J37
3866I8j98K01k9o9p0J48p30N47K21l17q7K95J59l11J04oq2o2N7j28K38L50m04
3889g5j11J8P7M14l10j30j1O9k02R0O2j5k30K56J98l2k37k7J17o6J83j10J44q
3913F4L8K14l35m1J4o3j8J84K11j7j0k75j2M11j11k36J4J04K5j94j23L67l7q6
$$ plain form
3937 88 127 8 138 31 112 288 22 -43 301 46 185 159 65 324 420 5 25 17 121 155 164 150 -12 201 176
3962 176 -15 -66 20 229 -75 -299 174 -108 197 -52 51 150 15 -62 210 -130 -171 322 263 381 -131 24
3984 24 138 -46 201 -54 -221 342 -274 33 14 99 -174 -248 -5 -152 84 -17 -85 76 89 137 -247 -124
4006 -124 -264 -95 -148 -97 105 233 7 108 -404 -172 -319 -116 77 -56 -152 217 -228 -270 -169 -126 -156 -225
4028 -225 -133 -322 114 -216 -203 -147 48 -120 178 -9 -18 -312 -144 171 -28 50 -153 -78 189 -23 -135 -174 -143
4051 -143 -222 -89 -5 -384 -383 -48 84 -374 42 -67 -40 -45 14 76 -208 68 113 294 28 27 265 38 -390 165
4075 165 2 4 31 52 -50 120 56 81 111 246 200 250 106 2 182 123 230 121 427 -34 111 105 198 141 -12
4100 -12 206 465 -60 165 139 -157 -226 -18 -44 -100 467 22 34 63 29 209 126 -29 95 205 167 211 192 95
$$ packed form
3937H8L9j19J30j07Q1J76k66o5L44k55J39k6r4K59R6m15K0qJ04L4Rj4j62K13k5
3962A76j91n1Q6K09l04k24M73k82L05k49J03R9j35p7K72l40m1M93n9J18n12J55
3984B4J14j84K47k55j67N63o16L07j9Q5k73p4K43j47K36j01o8J61J3M8l84J23
4006a24j40J69n3N1K02J28k26J01n12K32j47K03J93j33r6L69m45m2J01M3l0o9
4028b25R2j89M36l30J3N6J95j68K98j87rk94J68L15j99P8k03P5K67k12j12l9L1
4051a43p9J33Q4l79JL35J32m58M16j09K7nN9O2k84K76M5J81k66jK38k27m28N55
4075A65j63KK7K1j02J70o4K5L0J35m6N0j44j04J80n9J07j09L06m61J45oR3n7j53
4100a2K18K59n25K25k6k96o9K08k6n6N67m45J2K9l4J80q3j55J24J10l8M4j9r7
$$ plain form
4124 95 -41 -168 85 155 14 -5 45 -192 -187 -88 299 62 -38 -87 -27 -131 -19 106 -376 -180 -132 106 -31
4147 -31 -4 139 -255 -75 46 31 -218 -109 -54 -60 -312 -113 -168 -6 -260 -228 87 -79 -97 90 -44 -263 -128
4170 -128 -110 -52 72 -46 226 298 1 -203 -19 1 -28 8 -55 60 -122 -114 -109 5 62 22 -126 -7 -200 -163 -120
4195 -120 -154 -145 174 100 -92 -133 -208 -99 99 194 -258 -162 -41 -113 273 24 -49 14 228 -134 323 103 -162 134
4219 134 -52 301 224 124 180 20 62 184 80 -34 -67 205 -36 -101 -89 -85 304 -133 -29 2 292 -58 -20
4242 -20 -75 -60 -76 -255 -255 -16 76 273 164 118 129 122 221 -101 96 96 238 174 138 121 162 -61 151 -77 -31 -47 130
4269 130 -18 248 95 48 64 415 42 120 128 1 80 73 39 24 -32 -118 -23 1 90 139 35 104 17 -208 142 -59
4295 -59 10 -103 61 -128 -237 -152 84 15 -37 0 -32 122 -200 16 -364 -383 -96 19 176 -173 92 -279 -124
$$ packed form
4124I5j36j27K53P0j41j9N0k37NR9L87k37j00m9O0j04J12J25m82J96M8K38j37
4147c1K7J43l94J80J21j5k49J09N5ok52J99n5J62k54L2L15j66j8J87j34k19J35
4170a28J8N8J24j18K72P2k97k04J84K0k9L6o3J15j82QNJ14N7m0j48J19j93L7M3
4195a20l4RL19p4j92m1p5J09J98R5m52R6J21p2L86k49p3O3K14l62M57k20k65K96
4219A34j86L53p7j00N6j60M2J22j04j14l3K72k41o5J2ML89m37J04L1K90l50L8
4242b0n5J5j6j79%K39R2J97j09m6J1pR9l22J97%J42o4l6j7M1k23K12k28M6j6J77
4269A30j48K66j53m7J6L51l73P8Qj27P9pl4j5n6q6R5K4Q9M9j04O9q7k25L50k01
4295e9O9j13J64j89j09Q5K36o9n2L7l2J54l22K16l80j9K87J15J57l49K65l71J55
$$ plain form
4318 -124 -36 16 -154 288 -234 -39 80 -44 -75 -311 -150 279 30 -143 -317 -200 -325 -70 27 -110 -234
4339 -234 -58 -17 233 -156 -140 35 48 -215 -52 -50 -130 -93 29 -72 -16 -224 303 18 32 -98 129 -46 4
4362 4 261 -94 134 117 8 -7 54 241 -83 143 305 -115 207 210 -127 102 -51 -2 134 38 -94 -10 13 -90
4386 -90 -49 -164 126 -195 127 -27 156 -24 367 221 89 60 2 59 146 164 -62 227 189 -58 -13 -49 -120 -226
4410 -226 -154 256 197 -280 -210 219 -53 446 2 127 -295 -373 108 338 68 42 -175 -175 61 -102 18 205
4432 205 166 44 -35 -75 -199 10 -138 -106 56 66 58 77 110 -90 390 -125 186 -160 -202 12 115 -53 -37 -47
4456 -47 -225 -125 12 -42 -46 118 -60 39 -117 127 -142 113 -93 -25 -134 88 -105 313 -35 36 359 141
4478 141 -55 16 -196 -168 6 158 -102 -192 26 321 -194 -203 -351 63 -101 -178 239 -43 -88 53 -58 -55 -110
$$ packed form
4318a24Q8N2j70M42n22J95J19j24l1k36J61M29k49j73j74J17j25K55R7j37j24
4339b34J76M1K50l89J6J75J3k63J63Kq0L7J22j01N6k08N27k85J4j30K27j75N0
4362DK57l55K28j7j09j5O1J87l24K26J62m20L22Ll37K29j53M9J36r6j32Q4K3j03
4386i0M1j15K90l21L22j54J83j80L91j46j32k9n8N7Q7J8k26K89l8k47M5l6p1j06
4410b26P2M10n9m77P0M29k72M99m44J25m22p8M81K30k70k6k17%K36j63J20J87
4432B05l9j22p9m0j24K09j48L2J62J0qJ9L3k00M80n15L11l46m2K14J03j68J6j0
4456d7j78J00J37n4mJ64j78R9j56K44k69K55k06O8j09K22j93M18l48P1L23k18
4478A41j96P1k12K8J74J52k60r0K18K95n15rj48M14j64p7M17k82m5J41j11Ln5
$$ plain form
4501 -110 -6 84 -146 -12 112 -58 -64 77 194 -171 -111 85 -85 -13 18 -143 81 -50 65 -53 -244 25
4523 25 135 -256 -93 -66 24 -26 -242 173 158 7 25 421 230 170 -107 -76 56 -76 73 251 266 122 193
4546 193 49 336 208 299 228 90 -40 -86 -65 88 341 -122 -325 81 18 12 -18 34 88 42 -203 -100 75 -132
4570 -132 -66 230 161 -117 -56 -98 184 -324 -23 180 -22 390 -82 26 -115 -129 -319 -66 -87 -300 43 -70
4592 -70 66 102 41 -255 -224 -96 -34 -153 54 -86 -181 9 -287 -144 -252 115 -266 -157 -81 -279 -45 89
4614 89 104 -6 -145 -222 -137 -90 -52 -168 18 -174 -25 162 -470 -115 -117 -213 -156 -29 23 -37 -49 -32 143 -169 -345
4639 -345 65 -244 23 221 -74 220 27 230 -44 -42 -45 -88 -44 47 148 -98 146 -2 189 6 -11 -61 -208
4662 -208 -56 -111 92 404 -104 48 -110 -70 -60 -338 51 -122 -128 -69 -110 -92 104 25 217 109 -130 -341 -56
$$ packed form
4501a10J04R0k30J34J24j70oJ41J17l65O0J96j70P2L1j61K24j31J15j18j91K69
4523B5J10l91J63K7R0n0k16M15j5j51J8L96j91o0k77L1J32j32J49J78J5j44P1
4546A93j44K87j28R1p1j38j30m6K1J53K53m63k03M06o3ol0N2N4m6k45J03J75k07
4570a32O6K96o9k78O1m2K82n08L01K03k02M12m72J08j41j4j90K53k1k13L43j13
4592g0J36L6o1k96L1J28O2j19K07j40r5J90k96J43j08L67l81J09P6j98K34J34
4614H9J5j10j39p7Q5M7L8j16J86j92J49J87o32L55kr6N7J27N2o0j2J7J75l12j76
4639c45M10l09K67J98k95K94j93K03k74Klm3M4R1J01k46K44j48J91j83j7n0j47
4662b08J52n5K03L12n08J52j58M0J0k78L89j73oN9m1J8J96p9J92j08k39k11K85
$$ plain form
4685 -56 -164 168 13 -10 -7 278 128 17 139 -139 227 26 -41 106 59 -124 -42 10 -176 321 181 142 -241
4708 -241 185 106 87 140 137 35 -213 258 -134 -192 -109 168 106 175 156 21 24 127 -156 40 233 149 24 58 135
4733 135 -189 316 129 115 191 267 -162 -150 -65 101 60 42 179 316 -151 -120 -267 -204 65 -22 -25 5 133 142 -121
4758 -121 -44 113 143 50 -104 -45 -72 -170 -221 -27 82 -20 -216 -147 223 147 168 -218 101 -259 57 -171 -121 -238
4782 -238 -53 -332 14 -324 -4 -181 -332 154 11 -14 -190 98 -44 -157 -271 29 -154 -17 -70 32 -115
4803 -115 124 12 39 11 -3 -89 64 -304 96 110 16 73 74 194 71 325 295 268 4 226 -63 155 7 167
4827 167 196 56 81 293 -15 48 -273 96 207 -147 123 86 -227 31 -77 52 127 -117 123 374 2 164
4849 164 -127 -194 99 290 -44 -154 259 55 -311 36 -58 51 -164 -130 142 132 138 -85 -118 -57 135 -83 237
$$ packed form
4685e6j08L32j55k3LK85j50j11J22k78L66k01o7J47m7j83Q2N2j86M97j40l9l83
4708b41M26p9j9N3lj02k48M71l92n8Q3K77o2O9j9j35LJ03k83J96J93q4j25L4P7
4733A35l24N05j87j4P6P6m29J2Q5J66m1j8J37J37m67L1j47O3K69q7lL0J28Rk63
4758a21P7J57L0r3j54N9k7r8n1J94J09j02j96O9L70p6K1l86L19l60L16k28N0j17
4782b38J85k79L46l38L20j77j51M86j43k5j76K88j42j13j14L00j83J37n3J02j47
4803a15K39j12K7k8j4q6J53l68M00J4r4N7JJ20j23K54l0k7k64K22k89K18j48J60
4827A67K9j40K5K12l08O3l21L69J11l54K70l7l13K58j08J29P5k44K40K51l72J62
4849A64k91o7K93J91l34j10M13k04l66L47r4J09k15L4K72j0Ok23l3O1J92k18L20
$$ plain form
4872 237 -77 320 18 -39 -2 -16 -51 4 -137 -28 -94 295 271 135 22 -40 -279 183 -159 -75 153 137 -100
4895 -100 -106 -92 -51 28 -46 123 -10 -187 2 -289 -56 121 -180 41 -270 189 -103 241 -79 19 -36 -152 -275
4918 -275 223 -191 -48 102 -40 3 -173 24 -4 -101 -179 241 -112 153 -55 -125 184 12 -208 -206 -20 55 -205
4941 -205 -173 -194 -61 99 -248 -399 8 58 85 -235 10 180 127 -117 -57 -133 86 123 -279 -156 51 -183 224
4964 224 -3 37 -64 93 22 225 -115 -27 -97 -18 302 3 164 84 -62 83 -227 30 199 -166 133 -24
4986 -24 -14 -74 -125 -6 -56 -131 311 -28 179 183 -210 -113 60 86 -96 201 -52 44 37 112 18 -6 51 102 3 -91 201
5013 201 85 -41 91 36 69 157 -295 -88 -172 -38 145 176 -138 -26 -79 11 11 -178 27 223 -120 -77 128
5036 128 -184 -71 -214 322 14 -150 200 105 149 118 -173 -89 -209 -142 -32 128 -29 -297 -26 -176 123 -325
$$ packed form
4872B37l14L97l02n7L7j4l5N5j41J09o6L89k4j36j13o2k39M62l42Q4K28j6k37
4895a00oJ4M1P9p4J69j33j77J89k91K33J77l01K21l11M59k92L44l20R8n5j16j23
4918b75M98m14J43J50j42M3j76J97k8r7p8M20l53K65k08p0L09j72k20KJ86P5k60
4941b05L2k1J33J60l47j51M07N0K7l20K45J70n3k44O0p6K19L7m02J23K07k34M07
4964B24k27M0j01J57p1K03l40Q8p0P9L20k99J61q0j46J45l10K57J69l65K99j57
4986b4J0o0n1J19n0p5M42l39K07Ml93R7J73K6j82K97k53R6pP5r4k4N7N1r9r4K92
5013B01j16j26J32n5L3Q8m52K07q4J34J83L1l14J12n3R0%j89K05J96l43M3K05
5036A28l12J13j43N36l08j64L50r5M4l1k91Q4j20O7J10J60j57k68K71j50K99m48
$$ plain form
5058 -325 -401 -24 11 -310 -142 -178 51 127 187 167 1 77 192 224 -22 0 12 -185 -14 -67 -2 -23 20 -15 -68
5083 -68 69 258 289 -93 -69 30 -112 12 19 -60 -239 98 -43 -45 -153 -51 115 -119 224 -86 201 -72 -173
5106 -173 -331 -191 -86 -117 22 -108 -113 74 0 -11 239 40 -102 -87 13 -8 -31 137 201 225 -76 -174 -204 273
5130 273 -394 88 42 179 137 30 -139 -76 256 -76 250 -73 71 98 63 -27 58 110 82 127 234 -117 9
5153 9 271 112 132 -126 150 314 -172 3 353 79 -61 254 184 37 286 209 73 19 165 77 147 -33 151
5176 151 -178 -11 40 13 5 -117 -208 -137 106 -46 24 -5 156 291 125 52 167 -296 114 -109 -98 113 -208
5199 -208 203 51 114 200 -54 -73 231 267 7 99 45 -222 -131 -89 -286 42 21 -237 -19 -214 115 -228 -149
5222 -149 -65 53 -18 36 37 17 -18 -118 -58 -134 59 -53 16 173 -128 -115 -80 -83 109 -17 -63 -74 -37 -24 -139 143
$$ packed form
5058c25p6L77L5l21J68l6K29P6O0k0j66P6J15L2k46K2J2j97J71n3O5k1M3l5n3
5083f8J37J89L1l82K4R9j42J24Pp9j79L37j41kj08J02J66k34L43l10K87k73j01
5106a73j58J40J05l1J39j30nJ87p4j1K50j99j42J5J00k1k3J68O4K4l01r8l0M77
5130B73o67M82m6J37m2j07j69O3L32l32L26l23J44K7l5r0Q5N2k8M5J07l51J26
5153IK62j59K0k58K76J64m86J75L50k74j40L15p0j47K49p7j36n4J46q8P0j80J84
5176A51l29J67N1k7qj22r1P1K43j52P0k9J61J35j66p3J15m63M10k23J1K11l21
5199b08M11j52O3Q6k54j9L04L6k60R2n4k67R1M2j97L28k1k58K18j95L29l43P9
5222a49Q4J18p1N4Jk0l5j00O0p6J93j12O9J57l01J3L5lJ92j26m6j1L7J3j15K82
$$ plain form
5248 143 133 -190 102 123 35 309 -52 -9 -24 91 94 -51 -135 -246 25 245 14 -58 -92 105 -36 -97 235 -36
5272 -36 119 86 -183 197 218 -172 -145 361 -74 34 36 39 38 99 -228 2 -9 172 -111 78 229 62 -178 96
5296 96 181 -56 113 86 245 -12 -123 -5 34 -24 79 -132 159 17 102 37 -6 -87 -11 -160 -117 208 19 162
5320 162 43 156 100 83 -159 -181 -23 131 -181 -67 26 -8 -73 54 179 -101 -270 396 -84 -225 119 58
5342 58 -4 -214 -119 10 336 -213 -37 109 -41 15 85 -169 -131 163 -41 187 -118 -87 -173 -63 -89 28 -18
5365 -18 -18 -55 26 -181 -206 -63 -111 -131 -170 -115 -52 -112 23 -213 228 -112 82 37 39 76 -10 -144 30 36 -186 194
5391 194 -214 4 -287 106 -62 -75 -51 23 -141 -120 -328 -49 -48 -65 77 -36 9 -23 -23 -142 25 -44 153 -141
5415 -141 -47 -55 99 -138 112 105 36 -134 33 197 83 -103 157 -193 6 358 10 -169 -24 -84 288 174
$$ packed form
5248A43j0l23K92K1q8K74l61M3j5J15Lj45q4j11K71K20k31p2l4J97j41o1L32k71
5272c6J55l3k69L80K1l90K7N06m35J08KLjO1l27K30j1J81k83J89J51j67k40K74
5296I6Q5k37J69k7J59k57j11J18L9n8J03k11K91j42Q5o5m3q1P6j49M3L25j89J43
5320A62j19J13n6j7k42k2J58J54l12J14R3l4o5J27J25k80j69O66m80j41L44o1
5342E8o2k10R5J29L26n49J76J46j50N6P0k54L8K94k04K28l05L1q6J10k6J17m6
5365a8%l7Q1k07k5J43m8k0l9N5O3o0J35k36M41l40J94m5KL7q6j34J74Ok22L80
5391A94m08K18k91L93j68j3K4P4j64K1k08K79Jj7J42j13M5l2%j19J67o9J97k94
5415a41R4qJ54k37K50po9j70J67J64j14j86K60l50J99L52l48j79J45o0L72j14
$$ plain form
5437 174 -9 -104 -42 219 252 35 134 -174 -44 -145 -108 23 241 223 146 246 -48 19 -138 -98 207 -262 -49
5460 -49 -217 92 17 102 142 130 110 -73 14 69 -131 208 -179 -239 59 -172 323 12 31 5 -97 227 -302 261
5484 261 -21 -246 126 20 -157 181 60 -158 246 -289 -123 -211 40 54 -9 133 -178 -406 -87 35 161
5505 161 95 -49 115 -301 -94 -66 196 181 -41 240 200 1 -61 78 -185 -121 11 -201 -99 91 46 46 -6
5528 -6 11 130 375 -201 -46 92 -125 28 61 241 243 -91 50 128 40 28 8 -84 -62 433 33 170 39 30 47
5553 47 28 -95 102 267 -58 159 128 53 -83 -96 -209 -468 347 -147 116 92 66 39 65 -144 73 68 166 19
5577 19 -118 -234 71 136 152 -47 199 9 9 -29 -159 139 -20 -39 -316 -15 133 174 15 -52 -59 63 79 -233
5601 -233 157 -146 -45 341 -274 169 213 187 -151 -96 -25 218 357 30 -149 -256 119 -97 147 9 34 -25
$$ packed form
5437A74j83r5O2K61L3k17R9l08J30j01L7J31K18j8p7J00k94O7j57M0L05m69K13
5460d9j68L09p5Q5M0j2k0j83Q7N5k00L39l87o0K98k31M95l11J9k6j02L24n29N63
5484B61k82k25L72j06j77L38j21k18M04n35J66q8K51J4o3J42l11k28L19J22J26
5505A61o6j44J64m16K07K8K62j5k22K81m0j99o2J39k63O4J32k12J02J90m5%n2
5528fJ7J19K45n76J55J38k17J53L3J80Kl34J41P8q8j2k0r2K2M95m00J37j31rJ7
5553D7j9j23J97J65l25K17l1p5j36j3j13k59Q15m94K63k4k6k7K6k09K17nR8j47
5577A9j37j16L05O5J6j99K46j90%l8j30K98j59j9k77L01J48M1j59o7pJ22J6l12
5601b33L90l03J01L86o15M43M4k6l38N5P1K43J39l27j79j07L75k16K44j38K5n9
$$ plain form
5623 -25 100 131 -209 238 -218 -447 -175 128 -185 -30 54 171 101 -61 -61 -236 -45 -198 19 -83 108 33
5645 33 147 -64 7 -62 -81 123 -54 30 -164 105 159 -175 66 46 -46 -289 116 -244 -221 134 -57 -97 -28 -33
5669 -33 146 -183 9 -32 -137 -13 48 -165 -183 143 -158 -28 -113 133 -47 38 -27 68 -229 16 -37 81 -310
5692 -310 -105 5 13 310 69 -184 46 -288 -121 16 -103 -125 80 162 216 10 39 157 -382 -99 64 176
5714 176 213 -75 -12 104 -95 77 -93 -65 341 -16 291 -155 257 36 -16 237 -19 67 50 -69 72 -98
5736 -98 24 155 -17 181 49 -24 -251 -57 70 -84 114 -18 -203 -127 200 11 -12 54 189 -12 93 63
5758 63 -242 49 -147 54 -38 87 -36 -70 -269 47 19 -229 6 -25 -165 20 29 -260 -354 -61 63 400 221
5781 221 17 -68 296 -385 -370 -218 -140 -68 130 -87 -198 -47 230 37 84 79 91 137 192 -24 -79 61 -86 32
$$ packed form
5623b5J25L1l40M47m56k29K72L03l13J55Q4J17p0j62%j75J91j53K17j02J91p5
5645C3J14k11P1o9j9K04j77Q4j94K69N4l34K41k0r2k43M05l60K3L55j91m0O9n
5669c3J79l29J92m1j05J24O1k13j8L26l01J30q5K46j80Q5o5R5k97K45n3J18l91
5692c10K05J10QK97k41k53K30l34J67J37j19k2K05Q2N4k06K9J18n39K83J63J12
5714A76L7k88O3J16j99J72j70K8M06l57L07m46M12k21n2K53k56Q6j7j19J41j70
5736i8J22J31j72J98j32p3k27J94J27j54J98j32j85P6L27j89k3O6J35k01J05l0
5758F3l05K91j96K01r2J25j23l4j99L16k8k48K35l1j40J85Rk89r4K93J24L37j79
5781B21k04q5L64o81J5J52P8P2J98k17j11J51K77j93M7nJ2M6N5k16n5J40j47J18
$$ plain form
5805 32 182 -192 199 -138 -108 81 -145 -79 62 177 30 19 -74 -115 -195 -56 112 92 113 -36 46 -211 -91
5828 -91 23 -114 -138 -34 113 189 2 -371 -267 -324 -60 -78 115 -89 24 -231 -261 119 113 -112 -46 241 298
5851 298 61 95 19 -191 72 84 -99 -38 -38 -33 44 17 75 124 450 -246 202 -150 -101 273 -203 -97 2 -249 -188
5876 -188 -23 186 81 133 84 21 -235 -116 60 -54 1 -51 -184 171 -91 168 109 266 219 195 71 -219 9
5899 9 -153 144 86 -23 -100 54 97 222 311 138 111 -101 99 247 245 -10 -319 -177 -6 -18 -23 -201 105 -230
5923 -230 -194 81 23 11 -20 -137 140 244 15 -124 -59 214 130 -12 -66 137 -34 -30 9 -128 -58 17 58 -127
5947 -127 279 -76 -59 -3 225 153 150 -176 14 143 -4 234 47 61 52 -136 -48 -55 -47 55 -22 57 56 -55 -20 -26 -138
5974 -138 -216 22 -80 42 140 -125 -254 -11 -120 -97 11 -20 -34 -64 151 -100 -3 -65 86 29 58 -31 -95 -83
$$ packed form
5805C2J50l74L91l37L0J89k26O6J41J15j47j1r3m1q0J39J68k0K1j49Q2k57J20
5828i1J14j37k4J04J47P6j87l73J04n7K64j8J93k04J13k55l0L80ok25O6K87N7
5851B98k37L4p6k10K63J2j83O1%NP7k7N8M9L26o96M48l52M9L74m76J06R9k51O1
5876a88J65K09j05N2m9o3k56J19J76j14N5n2j33L55k62K59n9J57m7k4j24k90K28
5899Ij62K97n8j09p7J54M3J25Q9j73k7k12K00J48kk55l09J42J71j2nj78L06l35
5923b30L6K75n8j2l1j17K77J04k29j39O5K73q4j42n4K03j71ML9j37P0P5M1j85
5947a27M06l55J7N6K28p2ll26J90J29j47K38j87J4rj88Q8pQJ02p7P9jj11L5oj12
5974a38p8K38j02J22R8k65j29K43j09K3J08l1j4l0K15k51R7o2J51n7K9q9o4J2
$$ plain form
5998 -83 146 -190 -359 -230 171 145 -149 241 128 -143 97 -12 -41 -200 127 -223 -207 55 -79 -105 -33 265
6020 265 -108 -210 -28 11 39 8 84 -59 -274 125 98 -37 34 -237 269 -88 -25 46 -119 -93 134 14 -146
6043 -146 15 -4 11 159 138 60 311 86 -58 -137 62 8 307 -187 -95 221 -14 -216 107 -56 242 115
6065 115 -208 18 -402 11 -116 91 38 247 -217 2 192 -170 -23 250 -22 -297 76 110 -124 -122 98
6086 98 -389 21 4 50 265 16 8 91 -182 -239 420 286 -76 290 174 0 -103 -73 27 184 13 -7 -102
6109 -102 -139 75 -158 29 -66 -9 233 -28 128 23 -34 -23 -126 10 10 -35 59 -155 211 -138 75 -75 -138
6132 -138 120 -13 99 -100 210 146 135 -111 -7 -37 -41 -235 -74 265 -28 67 -23 -105 200 190 5 175 -255
6155 -255 -246 50 69 99 -25 171 30 139 -73 108 -120 41 -298 90 -27 81 -55 173 34 -1 24 108
$$ packed form
5998h3K29l36j69J29M01k6k94L90j13k71K40j09k9j59L27l50J6K62j34k6P2K98
6020B65l73j02J82L9K8l1P6j43k15L99k7j35P1k71N06l57O3P1j65K6K27j20j60
6043a46J61j9J5J48k1p8K51k25j44p9J99n4K99m94R2L16k35k02L23j63K98j27
6065A15l23K26m20M13j27K07n3K09m64K19J90l62J47K73k72k75L73L4k34KK20
6086I8m87M10j7M6K15k49qQ3k73n7O59j34l62L66j16j74j03L0J00J57j71k0r5
6109a02l7K14k33J87r5N7K42k61J56j05n7J1j03J36%m5R4k14L66l49K13j50o3
6132a38K58j33J12j99L10o4j1k46J04l0mj94J61L39k93R5r0q2L05j0j85J70m30
6155b55RK96J9L0j24J96j41J09k12J81k28J61l39L88j17J08j36K28j39l5K5Q4
$$ plain form
6177 108 -15 -59 220 334 76 -221 -56 -152 -194 16 16 91 79 -132 149 247 135 -81 -73 131 -30 247 365
6200 365 -295 33 -61 -42 -97 272 9 46 -46 216 -16 127 -66 -256 -106 -191 -72 -153 133 48 248 -138 -119
6223 -119 96 233 -136 -171 -47 49 -5 -145 -168 156 82 114 -170 -10 114 -395 -96 178 -87 -96 89 -309 35
6246 35 -119 -11 -63 -122 -199 6 21 -6 227 -77 -187 151 128 -123 44 167 35 -62 -298 -34 -69 36 -131
6269 -131 39 -39 2 206 -40 -47 -49 164 270 40 64 30 -133 92 104 102 374 188 111 -209 -86 -397 -78 -270
6293 -270 11 -99 -29 76 -57 118 -85 233 181 113 -129 -83 102 9 -91 30 118 -248 18 -432 22 77
6315 77 -103 -53 32 -146 109 205 -12 80 -37 -7 144 -133 30 -5 102 -111 183 -96 -14 -238 0 -4 151
6338 151 -188 159 -213 -109 -249 279 11 -84 72 101 -113 -14 -168 185 -20 190 34 -103 -224 75 -178
$$ packed form
6177A08j23m4K79J14k58k97J65r6m2K10%P5j2k11K81R8j12k16QK04j61K77J18
6200C65o60L28r4J9n5L69k63L7r2K62k32J43j93j90J50q5J19q1K86q5K00l86J9
6223a19K15J37l69l5J24R6n4j40k3L24p4L2k84J60J24n09K99K74k65rJ85l98L44
6246C5j54J08n2n9p7K05J5k7K33l04j10L38k3k51J67J23j32r7k36K64l5J05j67
6269a31J70p8M1K04k46pkK13J06k30K4l4j63K25J2kK72j86p7l20J23l11L19j92
6293b70K81j10P0J05j33J75k03L18n2o8k42M6J85r3j00J21Q8l66K66m50M54N5
6315G7j80N0Q5j78K55R6k17R2j17L0J51k77J63l5J07k13K94k79Q2k24K38mJ55
6338A51l39L47l72J04j40N28k68r5J56K9k14R9j54L53k05K10j56j37j21K99k53
$$ plain form
6359 -178 -42 264 267 136 -245 121 86 190 -302 -156 -20 179 -91 115 202 64 -37 -78 84 57 164 224
6381 224 149 149 164 -53 127 -282 -21 -220 -165 15 135 -217 -56 -40 -175 63 150 247 -76 188 -236 -81 143
6404 143 154 85 -94 -44 23 -220 65 173 -18 -249 62 141 264 -65 75 122 -32 -90 84 271 158 -182
6426 -182 265 -148 -56 247 -120 55 206 -92 -223 -46 -188 268 149 -24 -4 152 -65 -57 -254 -79 -176 -30
6448 -30 -188 317 -88 37 127 -248 -26 264 -120 -223 -23 -161 -15 -176 110 -51 -101 -257 -194 74 226
6469 226 -151 130 202 -204 -125 -17 -88 149 -101 109 84 -255 178 216 0 -104 124 267 -174 -41 249 226
6491 226 27 -71 227 196 -16 58 -44 47 79 81 117 -151 31 197 -137 138 -233 32 335 -100 -20 -91 54
6514 54 145 -253 74 -73 -17 151 -74 -72 -105 89 104 33 -106 -80 265 318 -68 -214 189 -201 -79 -82 -11 -31 64
$$ packed form
6359a78J36L06Lj31l81L66l5J04m92J46J36J99k70K06Q7j38j01m1J62k7J07O0
6381B24p5%J5k17J80m09K61j99N5J80J20l52J61J6j35K38Q7R7l23K64m24J55K24
6404A43J1o9j79N0O7k43K85J08j91k31L11P9J23l29J40M7j54n8J74J87j13l40
6426a82M47m13R2L03l67J75J51k98j31J77j42M56j19j73K0J56k17Qj97J75r7J46
6448c0j58N05m05J25R0l75K22K90l84j03K00j38J46j61K86j61n0j56O3K68J52
6469B26l77K81P2m06P9J08p1K37k50K10k5l39M33L8k16j04K28J43m41J33K90k3
6491B26j99r8K98l1k12P4j02R1L2KL6k68J82J66l34K75l71K65L03m35Q0p1J45
6514E4R1l98L27j47N6J68k25Kl3J94J5p1j39K6L45N3l86j46M03l90J22lP1k0R5
$$ plain form
6539 64 -48 45 131 32 -197 56 -329 -29 -165 -115 -68 -96 37 -102 -166 62 -101 51 8 -41 159 31 -20 -165
6563 -165 -101 -196 -77 90 -74 -195 -199 -360 -327 -58 -114 200 -223 27 -70 -446 77 -2 154 204 -88 10 84 18
6587 18 151 58 121 77 27 122 424 -71 86 -43 90 96 -181 -109 -35 -61 17 -245 -56 -20 51 -269 52 11 -243
6612 -243 152 72 171 -264 152 115 -54 153 -18 122 -49 -21 47 -93 175 -196 -154 -50 47 -146 -135 9 149
6635 149 281 -192 32 41 196 23 -146 -101 -118 -145 100 207 12 -252 85 -60 -148 -270 -18 194 -140 226
6657 226 -83 67 25 79 -103 -33 -279 44 12 111 36 -141 228 -135 -103 11 33 -104 -2 -129 -40 -58 -160
6680 -160 -181 -97 -181 187 52 10 50 -120 -246 234 183 -102 106 155 -67 -114 140 -210 68 62 -46 221 108
6703 108 -37 77 127 -131 -138 -188 122 -68 125 86 -186 -162 91 -129 -180 -93 268 165 11 60 -500 55 -82
$$ packed form
6539F4j12R3Q6r9k29K53l85L00j36N0M7k8J33j39o4K28j63J52m3m9K00j28n1j45
6563a65O4r5J19J67j64j21mj61L3K69n6L14m23K50r7l76N23p9J56N0k92R8P4o6
6587A8J33r3O3m4n0R5L02m95J57j29J33Ok77P2P4k6P8k62J89L6P1l20L21m1k54
6612b43L95q0R9m35M16l7j69K07j71J40j71K8O8j40K68l71M2J04R7j93J1J44J40
6635A49J32m73K24RJ55j73j69M5j7k7K45J07j95k64L37j45q8j22K52K12l34L66
6657B26l09J50m2N4j82P0k46L23l2R9p5j77L69l63L2J14K2j37J02j27Q9j8j02
6680a60k1Q4q4L68j35m2M0j70j26M80n1k85K08M9k22m7K54l50K78oj08K67j13
6703A08j45J14N0k58pn0L10j90J93l9k72K4K53k20n1Q7L61j03j54M9n60N55j37
$$ plain form
6726 -82 129 165 -223 41 140 -145 -83 153 -128 64 -123 -90 8 -3 141 -3 100 -24 -21 103 95 -274 -192 -203
6750 -203 132 68 158 126 -80 46 47 157 69 467 150 71 80 -201 -119 -68 -115 -81 -103 166 57 9 -103 -17 13 -189
6776 -189 121 -4 -28 -17 -98 171 -164 -325 -182 114 65 107 253 150 60 -70 69 -152 -66 -286 -56 -173
6798 -173 143 -208 38 -135 157 62 136 -125 54 61 95 169 22 -60 22 -203 60 68 205 -231 374 213 -130
6821 -130 12 192 99 -93 86 88 -100 -68 -13 -95 -86 -73 -226 -14 39 -55 -108 55 138 363 23 -2 -52 64 -36
6846 -36 54 -14 -132 -34 44 108 174 180 -58 55 39 -132 143 -78 -204 -99 -47 -49 -1 70 -69 -6 -229 130 210 85
6872 85 16 205 -117 156 82 85 335 -72 37 16 -265 0 91 -64 47 123 214 -36 39 69 -94 18 282 -118
6896 -118 214 -38 -41 2 3 -60 -71 -123 280 -80 -369 -175 164 -73 -64 -152 10 -21 149 -40 143 -94 -215 -13
$$ packed form
6726h2K11L6l88K64R9k85O2K36k81J92j87L3R8j1J44j44J03j24LJ24ql69Q2j1
6750b03L35o4R0l2k06J26JJ10q8L98l17p9Rk81Q2N1m7L4k2K69j09m8j12Q6L0k02
6776a89L10j25k4J1q1K69l35j61J43K96m9M2J46j03r0j30J39k21Q6k20K30j17
6798a73L16l51K46j73K92r5P4k61J79PL4P4j47q2Q2k25K63QJ37m36O05j61l43
6821a30J42J80r3j92J79Kj88L2N5q2RJ3j53K12N3r4n3J63Q3K25l40k5n0J16j00
6846c6R0o8j18R8P8O4O6Ok38J13j6j71K75k21j26J05N2kM8P1j39O3k23L59Q0j25
6872H5o9J89l22K73p4LK50m07J09k1k81K65R1j55J11P6R1k50P5L0j63J12K64m00
6896a18L32k52lM3Jo3j1n2M03l60k89J94L39k37Rq8J62l1J70j89J83k37j21K02
$$ plain form
6920 -13 55 -14 -201 -36 285 -188 18 -89 -82 38 132 33 136 -43 184 31 -79 135 67 -26 -180 121 2
6943 2 -8 268 13 -114 100 -51 185 205 -124 -192 -115 95 36 -21 -3 -75 355 148 -218 2 93 24 76 -20 161
6968 161 -243 129 72 73 132 102 -30 318 126 -252 -108 -62 143 -91 170 150 -149 -85 -18 -53 162 62 89 142
6992 142 -35 -29 47 -107 90 -34 -104 36 253 213 -37 -198 46 47 68 237 -7 -24 45 -94 -126 -222 -18 -168
7016 -168 111 235 -103 -147 200 146 -1 186 -131 -61 -35 -17 14 -47 265 93 121 -42 -36 85 28 320 -3 145
7040 145 -267 38 4 122 -34 3 63 -77 -78 -26 -135 85 29 12 279 67 40 -98 -306 -175 -6 58 -14 131
7064 131 46 43 -139 17 136 -187 -142 103 76 145 151 109 -32 105 65 -84 -11 -251 -330 119 -238 -63 -39 -148
7088 -148 -2 227 -13 46 215 -89 255 304 -94 -92 167 42 117 -74 -125 -39 81 170 38 -17 -57 273 -82
$$ packed form
6920a3O8o9j87J65L21m73K06j07PJ20R4r9J03j79K27j53j10K14o8r3j54L01j19
6943Bj0K76k55j27K14j51K36K0l29o8P7K10n9n7J8p2M30k07l66K20R1o9N2r6J81
6968A61m04L72n7JN9l0j32L48j92l78J44M6K05k34K61k0k99O4O7l5K15j00K7N3
6992A42j77OP6j54J97j24p0J40K17m0k50j61K44JK1J69k44j7O9j39l2r6K04j50
7016a68K79J24l38m4L47n4j47J87l17P0K6J8L1o1L12j72K8j63OJ21n7K92l23J48
7040A45m12L05l4J18j56L7O0j40jN2j09K20n6j7K67k12k7j38k08J31J69O4p2J45
7064A31q5lj82J56J19l23M5K45k7O9Om2j41J37m0j49P3k40p9M49l57J75K4j09
7088a48J46K29k40N9J69l04L44M9l98KK59j25P5j91n1Q6J20Q9j32n5m0L30l55
$$ plain form
7111 -82 53 -36 197 128 211 412 -14 -122 -155 63 -62 262 6 205 114 -39 -61 -184 -92 73 176 -74 130
7134 130 115 9 16 -25 103 -90 -116 37 -309 -90 24 98 -42 13 89 18 -152 192 -295 131 -32 137 -347
7157 -347 61 203 -5 -308 -76 289 -39 -92 -221 11 187 195 -101 -71 87 -36 -208 -72 -158 60 44 -59
7179 -59 42 -108 19 -93 194 -99 -47 38 301 9 235 141 7 -202 398 -76 -153 33 60 -95 -396 -24
7201 -24 -1 60 -129 -89 145 160 45 -64 60 -143 -15 -138 -28 -98 -127 -310 92 -305 16 -52 64 119 -121
7224 -121 207 -140 -114 56 153 -143 93 -45 182 -182 -88 228 240 -137 164 -1 -116 -50 25 108 -63 159
7246 159 -55 130 -143 -2 -158 94 47 -55 -64 284 177 -23 177 -47 10 251 -209 -59 87 -28 151
7267 151 -240 37 42 -75 -102 -238 24 188 -91 -78 -53 88 224 -98 -48 6 -145 22 -198 -86 197 198 118
$$ packed form
7111h2J35q9K33o9Q3K01m26j08l3K18j25L24k56J99r1j53k2j23R2J65J03k50K04
7134A30j5j06Pm1J28j93k6J53l46K19J14P4j40N5P6p1j70L44m87M26j63J69m84
7157c47M08J42k08l03K32L65l28n3j29K32J76Qk96L0J58j23j72J36q6K18j6j03
7179e9J01j50J27j12K87k93N2Q5K63k92K26r4j34k09O00m74p7J86K7j55l01L72
7201b4K3O1j89M0K34J5j15j09J24k03J28j23J10p0k9j83M02l97L21o8J16N5k40
7224a21L28l47K6J70R7k96K36j38K27l64R4L16J2l77L01j65j15O6P5Q3j71K22
7246A59k14J85k73J41j56K52m7j02rL48j07k00K00k24N7K41m60J50J46j15J79
7267A51l91K77Nj17k7j36K62J64k79J3K5J41J36l22N0N4j51J67k20J12K83Jq0
$$ plain form
7290 118 -197 68 -97 83 -96 -131 -19 119 -80 -43 45 162 -56 -15 -151 -93 64 -58 161 59 -18 -169
7312 -169 159 139 -73 143 -140 -50 -146 -63 69 -226 -85 -115 -40 52 4 183 -216 -152 234 -445 52 -200 -108
7335 -108 -161 -50 -110 -70 61 169 15 36 55 -82 -156 181 2 145 216 -4 38 364 -75 -69 198 54 24 -10
7359 -10 109 142 -233 51 -23 -63 35 -137 -19 -37 -63 199 -20 -20 148 -182 303 171 -310 9 77 -3 -319 -60
7383 -60 282 19 4 -34 -246 22 -80 8 -39 61 -15 -272 -96 -94 -27 -17 145 -42 -37 69 -136 -176 167 87 146
7408 146 -31 145 19 -151 138 -65 -7 -58 189 304 4 -32 117 71 63 -163 121 90 330 15 32 79 176
7431 176 69 79 54 110 28 93 -171 8 52 6 -53 -71 -31 228 108 -152 -38 58 90 -104 78 -7 88 135 162
7456 162 -216 -4 -137 -72 -66 -47 -69 74 63 280 162 91 12 13 120 -66 -26 165 21 96 153 -5 -88 -54 -46 -105
$$ packed form
7290A18l15K65j65J80j79l5J12J38j99L7Q8J17k18M1j36N8J57j22K19j02p7j51
7312a69L28k0k12K16k83R0r6Q3J32k95J41l0P5R2m8J79l99O4L86o79M97k52R2
7335a08n3J11o0M0J31J08j54K1J9j37p4L37j79J43P1k20M2L26m39OK67j44l0l4
7359a0J19L3l75K84p4m0R8j72J18j8k6K62k19%J68l30M85j32m81L19O8q0l16K59
7383f0L42k63j5l8k12K68j02Q8m7J00p6k57J76KO7J0J62j87NJ06k05m0L43q0N9
7408A46j77J76j26j70K89k03N8n1K47J15l00l6J49m6qk26K84l1K40l15J7M7R7
7431A76j07J0k5N6q2O5k64J79M4m6n9j8M0K59j20k60J14R6L2j94J82q5R5M7K7
7456A62l78K12j33O5OJ9k2J43j1K17j18p1p9JJ07j86M0J91j44P5N7j58q3L4Qn9
$$ plain form
7482 -105 -161 -16 59 -333 -117 14 1 -140 -85 20 59 -177 66 -152 70 108 -89 64 108 -17 -7 -177 -94
7505 -94 53 -203 2 37 38 -106 -93 -76 174 40 -181 -110 -158 158 -79 -37 113 -127 -75 -36 24 35 -44 -71 -92
7530 -92 207 135 152 -144 119 59 35 39 328 175 -46 219 180 347 94 14 -134 -49 81 12 73 67 97 57 -209
7555 -209 175 48 58 149 116 -237 11 -88 -51 -47 -119 -115 -122 90 -50 120 -88 9 98 169 -116 62 23 54 246 84
7581 84 -77 -87 114 -256 -222 125 66 -231 -211 39 5 -142 -26 84 216 322 24 -186 -29 88 53 69 -57
7604 -57 66 57 -178 -165 1 -105 -22 140 -114 -44 -55 -74 85 -82 -42 26 148 -57 -39 -170 -145 -35 -64 134
7628 134 -110 -45 203 -71 -97 -62 -7 277 170 154 -143 205 122 25 -41 77 367 139 -72 -26 -9 -182 135
7651 135 103 14 -204 136 -74 123 317 -160 -106 -120 37 -35 -93 -92 -292 -46 -61 -82 54 -65 49 -195 -38
$$ packed form
7482a05n6J45P5l92K16J31j3j41N5J05L9k36K43k18K22L8j97J53M4j25J0j70Q3
7505i4J47k56K05L5Jj44J3J7K50j34k21P1m8L16k37M2J50k40N2L9O0J1p9k7k1
7530i2K99p2J7k96K63o0k4MK89j53k21K65l9J67k53q0j48Q5J30o9O1oL0m0k66
7555b09L84j27J0R1l3l53K48r9L7Mp2MpK12j40J70k08R7Q9P1k85J78l9L1J92j62
7581H4j61j0K01l70L4L47n9k97K0K50l4j47J16J10J32J06k98k10J57J17l5J6j26
7604e7J23rk35J3J66j06Q3J62k54P0j1j9J59j67M0O8J22k05J8j31K5J10k9J98
7628A34k44O5K48k74k6L5N5K84j07j6k97L48q3r7o6J18K90k28k11M6J7j73L17
7651A35l2q9k18L40k10J97J94m77N4j4J57p2n8Jk00K46j5k1J36j19J14k44J57
$$ plain form
7674 -38 237 -2 190 104 232 107 -98 399 -51 -118 -92 101 23 -124 -25 -65 32 -75 -276 110 -128 -202 66
7697 66 -33 108 -109 -23 -111 89 -102 155 -100 63 241 -80 102 -41 119 -6 -70 -92 -102 -7 63 147 -166
7720 -166 -151 311 -33 54 -162 -200 40 -16 -156 -4 103 96 71 -126 111 -232 210 181 -62 -143 392 -96 -425
7743 -425 139 -52 -196 -35 0 -96 8 173 243 36 69 -161 -60 -10 -84 18 16 110 -54 -12 -65 -43 -250 -88
7767 -88 -24 161 -153 -145 273 12 -258 -199 146 132 -134 -53 -149 108 26 142 -33 -147 40 -126 -84 -38 229 -127
7791 -127 -96 -166 -55 73 -108 -24 135 54 -116 60 51 365 79 34 267 17 -20 74 22 99 -53 121 39 5
7815 5 -60 -76 -45 -87 -191 10 -74 52 -67 -111 198 63 40 -67 20 -148 62 55 8 -30 74 -96 317 9 57
7840 57 -164 118 -160 77 119 -31 81 121 114 -127 -72 95 276 18 45 44 -28 -80 -90 47 17 -77 29 142 -19
$$ packed form
7674c8K75k39J92q6J28j25k05M97m50o7K6J93p8j47R9m0R7j07k01L86k38p4K68
7697F6r9J41k17Q6q8K00j91K57k55J63J78l21J82j43J60j25o4k2j0R5P0Q4l13
7720a66J5M62l44Q7k16l8K40n6j40J52J07pk5j97K37l43M42k9k43q1N35m88l29
7743d25N64j91j44J61L5r6J04J65P0k07L3k30J01N0p4J02kR4j64M2n3K2k07J62
7767h8O4J85l14QM18k61k70N9L45j4k66Q1r6K57q2J16j75j14J87j66M2M6K67l56
7791a27L1p0J11J28j81Q4J59q1j70J76rL14k86m5K33k50l7R4n2P7j52J74q2l4
7815Eo5j6L1m2j04K01q4J26j19m4L09j35k3j07Q7j68K10pm7l8J04j70M13l08M8
7840E7k21K82k78K37M2j50J12M0pk41N5J67J81k58K7jp2n2j0J37l0r4J06J13j61
$$ plain form
7865 -19 -106 -179 -108 196 -197 -86 114 226 -267 -29 26 -112 179 54 -269 276 30 -78 22 276 -55 -12
7887 -12 -8 -8 390 -175 30 82 -97 169 -214 -174 129 146 -50 -53 -74 173 -129 -100 207 -71 -263 -152 -184 178
7911 178 206 9 -118 19 336 268 -185 98 -209 -100 -256 -43 -73 9 188 -107 -111 -50 -45 -158 -108 -231 176
7934 176 -107 -86 -68 -12 322 -214 7 -5 68 81 -46 -180 22 349 347 117 270 -232 -55 -197 86 -235 28
7957 28 -109 -27 245 185 4 177 -78 -204 44 83 -33 -90 -139 133 -2 113 -54 60 203 -101 -91 36
7979 36 70 125 44 -96 153 -71 303 25 -284 -88 -100 70 -293 -238 88 -91 33 106 -23 28 16 263 18
8002 18 -46 -213 -65 -202 115 -138 155 51 -61 77 -68 -120 67 -137 165 310 -66 74 -39 -17 -296
8023 -296 75 65 148 43 210 237 294 -19 116 126 -100 73 -8 -126 -83 5 506 21 123 156 -101 -54 23 -14
$$ packed form
7865a9q7p3P1L04l93J11K00J12m93K38N5j38K91j25l23N45k46j08J00K54l31M3
7887a2M%L98n65K05N2j79K66l83M0L03J7j96lk1K47l02K9L07k78j92J11l2L62
7911A78K8j97j27J37L17o8m53K83l07J09j56K13l0Q2J79k95mO1Nj13N0j23M07
7934A76k83K1J8N6L34n36K21j2P3J3j27j34K02L27kk30J53n02J77j42K83l21K63
7957B8j37Q2K72o0j81J73k55j26K48L9j16n7m9K72j35J15j67J14J43l04J0J27
7979C6L4N5q1j40K49k24L74k78l09J96j2J70l63N5L26j79J24P3j29N1j2K47k45
8002A8o4j67J48j37L17k53K93j04j12J38j45n2J87k04L02J45l76J40j13K2k79
8023b96L71j0Q3j05J67K7N7l13J35J0k26J73q1j18M3Q8N01m85J02L3k57M7P7l7
$$ plain form
8047 -14 -74 -36 -111 23 -126 -240 212 -304 -211 182 30 -140 -67 -295 -54 42 84 -136 -65 -138 -94 -190 -134 -26
8071 -26 -3 132 -174 -211 240 -77 179 6 -56 -51 31 344 -18 -252 -157 -26 -201 0 68 6 128 -61 -93 -13
8095 -13 31 -205 114 -21 55 -48 -168 80 -106 74 -16 -74 3 -51 -137 26 -142 40 -12 20 -13 33 178 -360
8119 -360 -109 -2 -66 -125 180 -133 91 -95 -95 -92 80 -61 144 92 80 99 -2 159 -62 -93 -72 120 134 -3
8143 -3 22 20 1 -185 106 61 74 -143 184 337 254 -113 137 -60 56 -66 91 136 -103 148 48 -77 -170 -72
8167 -72 20 -208 42 -240 -128 -151 180 120 121 -65 -37 -8 -80 145 38 -148 -82 74 190 -51 227 64 -36
8190 -36 157
$$ packed form
8047a4o0L8p5J34j49j14M52n16R3L93j52j70P3k28K41R6M2k20P1p3M4r6N6J08
8071b6K3J35l06l7M51l17K56j73o2NQ2L13l62k34R5J31j75K01O8o2J22j89l2Q0
8095a3M4k36L19j35P6j03j20K48j86J80r0n8P7n4q6J63j68J82n2L2l3M6J45n38
8119c60K51J07o4n9L05l13K24j86%LJ72j41K05n2j2J9j01J61k21l1K1J92J4j37
8143cK5kj9j86K91m5J3k17L27J53q3l67K50j97J16j22J57M5k39K51j00j25r3R8
8167g2R2k28K50k82J12k3L31o0Jj86K8K9p2K25j07j86O6J56J16k41K78j63j00
8190c6J93
8191A57
$$ Imaginary data points
##PAGE= N=2
##DATA TABLE= (X++(I..I)), XYDATA
$$ plain form
0 0 0 0 0 0 0 0 0 0 0 0 0 0 0 -8 8 -8 8 -8 16 -16 16 -24 24 -32 32 -40 48 -56 64 -72 80 -93 104 -118 134
35 134 -150 168 -188 209 -233 259 -288 319 -353 390 -430 474 -523 576 -634 698 -769 848 -938
54 -938 1037 -1151 1280 -1430 1606 -1815 2070 -2388 2798 -3342 4110 -5267 7199 -11005 21225
69 21225 -104410 -259203 70727 90179 -85151 -9236 74726 -35632 -45815 7171 -4680
80 -4680 -19656 -11928 -22850 -7954 8818 8011 -3010 -12775 -23401 -22537 -8669 2662 -23832 -29287
94 -29287 11742 2473 -32368 363 -3478 -56944 -29493 6722 -10735 13602 5363 -67020 -41468
107 -41468 25702 -123 -16196 -2710 -27198 -19160 4683 -14375 2113 19375 -34923 -35902 32281
120 32281 25855 -26005 -25501 1796 7865 -8784 -3401 25572 -6020 -48766 3641 42192 -4942
$$ packed form
0@%%%%%%%%%%%%%qJ6j6J6j6K4l2L2m0M8n6O4p2Q8j04J20j36J52j73J97k22K52
35A34k84L18l56L97m42M92n47O07o72P43q20R04r97J099j210J332j467J617j786
54i38J975k188K431k710L036l421L885m458N186o140P452r377J2466j8204L2230
69B1225j25635j54793L29930J9452j75330P5915Q3962j10358j0183N2986j1851
80d680j4976P728j0922J4896J6772q07j1021r765j0626Q64J3868J1331k6494n455
94b9287M1029r269l4841L2731l841n3466K7451L6215j7457K4337q239p2383K5552
107d1468O7170k5825j6073J3486k4488Q038K3843j9058J6488J7262n4298r79O8183
120C2281o426n1860N04K7297O069j6649N383K8973l1592m2746N2407L8551m7134
$$ plain form
133 -4942 -16261 2501 -21404 -19027 19513 20384 1343 -8494 -9773 2315 3498 -6542 848 4052
147 4052 5068 18555 8836 -2352 15580 4823 -18184 9993 31518 11727 3226 9549 16290
160 16290 20367 7686 7847 10780 -22355 -10982 56405 44100 -10145 1924 1405 -24152 8667
173 8667 34404 7011 739 4381 -4057 12610 15876 -11846 -8342 10678 5246 2337 8724 5335
187 5335 -1115 -292 8079 8160 -2203 2646 7548 -5221 6817 23553 500 -6395 9958 -5535
201 -5535 -2182 31579 12507 -21410 -4023 9407 4847 10666 6973 1101 437 -14873 -5436 26455
215 26455 6386 -26334 -1590 19711 380 -7108 2335 -2729 -14538 -4761 17219 9556 -17143
228 -17143 -10009 6650 -2336 38 9324 -6590 -13020 -4097 -4457 4292 10151 -8354 -10912 2410
$$ packed form
133d942j1319J8762k3905K377L8540Q71j9041r837j279J2088J183j0040P390L204
147D052J016J3487r719j1188J7932j0757k3007K8177K1525j9791q501O323O741
160A6290M077j2681J61K933l3135J1373O7387j2305n4245J2069n19k5557L2819
173H667K5737k7393o272L642q438J6667L266k7722L504J9020n432k909O387l389
187E335o450Q23Q371Q1j0363M849M902j2769J2038J6736k3053o895J6353j5493
201e535L353L3761j9072l3917J7387J3430m560N819l693n872o64j5310R437L1891
215B6455k0069l2720K4744K1301j9331p488R443n064j1809R777K1980p663k6699
228a7143P134J6659q986K374R286j5914o430Q923l60Q749N859j8505k558J3322
$$ plain form
242 2410 -4845 -7488 -738 -9726 -8579 828 -5758 -3543 4048 -13672 -21065 -1588 2110 -10847
256 -10847 -14069 -4391 768 -11336 -13018 8834 444 -33321 -21473 10103 6321 -3618 -4383 -11805
270 -11805 -11884 -5474 -1411 6608 -2422 -17836 -1505 10692 -7447 -6904 8148 -1291 -9508 1143
284 1143 6842 1319 -7532 -6577 7594 11065 1411 -1846 -2301 -122 5532 461 70 12472 3962
299 3962 -9894 6383 17199 3810 -2026 -376 102 6104 8529 11787 14551 -1428 -9851 11281
313 11281 15822 -1073 1656 10295 6007 5491 8946 8727 2768 -6206 3226 20466 8850 -4100
327 -4100 5650 4016 -2936 8464 12113 3420 1452 -2971 -2317 10123 7490 -4190 -1286 4041 3390
342 3390 2326 -1205 -157 2617 -5860 -5632 7531 4781 -5956 -2657 723 -1333 -3169 -3033 381
$$ packed form
242B410p255k643O750q988J147R407o586K215P591j7720p393J9477L698j2957
256a0847l222R678N159j2104j682K1852q390l3765J1848L1576l782r939p65p422
270a1805p9O410M063Q019r030j5414J6331J2197j8139N43J5052r439q217J0651
284A143N699n523q851R55J4171L471r654l257m55K179N654n071l91J2402q510
299C962j3856J6277J0816j3389n836J650M78O002K425L258K764j5979q423K1132
313A1281M541j6895K729Q639m288n16L455k19n959q974R432J7240j1616j2950
327d100R750j634o952J1400L649q693j968m423O54J2440k633j1680K904N327o51
342C390j064l531J048K774q477K28J3163k750j0737L299L380k056j836J36L414
$$ plain form
357 381 -4486 -11685 3890 14746 -5895 -16750 -2602 -640 -4578 1861 3078 -2426 -9150 -10362
371 -10362 4028 8818 -8659 -9643 950 -5336 -5391 4407 -2862 -8202 -350 -1067 -3138 -1385 -6608
386 -6608 -8182 -3118 -1208 1868 495 -7595 -5079 -2573 -8911 -701 7051 -8562 -12208 3581 4943
401 4943 -3733 -4978 -2243 -3351 -8807 -5575 10690 7918 -11476 -8243 4199 -1424 -5497 537
415 537 154 -2914 -3838 1472 6145 -5476 -14015 45 6427 -2116 1280 1282 -9528 -5935 1776 412
431 412 2379 599 -6924 -1590 3775 -460 234 -1520 -4439 3474 4024 -464 6325 4375 -7662 -1159
447 -1159 10177 3541 -964 2923 6075 5636 542 3292 10501 -1366 -10185 9530 17439 294
461 294 -1392 6629 492 -2142 7166 11204 2974 -6817 313 12577 5962 -1489 4713 4198 -224
$$ packed form
357C81m867p199J5575J0856k0641j0855J4148J962l938O439J217n504o724j212
371a0362J4390M790j7477r84J0593o286n5R798p269n340P852p17k071J753n223
386f608j574N064J910L076j373q090K516K506o338Q210P752j5613l646J5789J362
401D943q676j245K735j108n456L232J6265k772j9394L233J2442n623m073O034
415E37l83l068r24N310M673j1621q539J4060O382q543L396Kj0810L593P711j364
431D12J967j780p523N334N365m235O94j754k919P913N50m488O789j950j2037O503
447a159J1336o636m505L887L152m39n094K750P209j1867q819J9715P909j7145
461B94j686Q021o137k634R308M038q230r791P130J2264o615p451O202n15m422
$$ plain form
476 -224 3300 4029 4729 7208 -133 -377 10754 8367 -105 1377 -47 3036 12171 5819 -298 7313
492 7313 1981 -3907 9471 9309 -4231 -31 5833 2237 2831 5039 2632 -1622 -6009 -1140 9072
507 9072 3319 -6319 -770 3504 -2929 -4770 1812 3884 -5358 -8935 4922 8286 -7338 -7307 1098
522 1098 -4432 -1497 7297 -1711 -8034 -2630 -4470 -2312 4675 -3349 -9143 -2657 -1786 -2187 -1349 -7903
538 -7903 -7364 -1942 -7446 -6694 2424 -4501 -13346 -5500 -1612 -7680 -7512 -2478 -3441 -10733 -9836 3196
554 3196 2243 -13964 -12149 1596 -438 -5219 -1503 -2497 -6474 -5235 284 5486 -1156 -8943 -1736
569 -1736 3600 -2493 237 3919 -2125 -3073 1362 1189 1897 -74 -3769 1159 2525 58 4717 1986
585 1986 -6478 -71 4659 -1397 4694 7243 -6869 -4499 10917 6047 -3428 154 2688 1860 3427
$$ packed form
476b24L524P29P00K479p341k44J1131k387q472J482j424L083R135o352o117P611
492G313n332n888J3378j62j3540M200N864l596N94K208k407m254m387M869J0212
507I072n753r638N549M274o433j841O582K072r242l577J3857L364j5624L1Q405
522A098n530K935Q794r008o323N404j840K158O987q024n794O486Q71m01Q38o554
538g903N39N422n504P52R118o925q845P846L888o068J68N034r63p292Q97J3032
554C196r53j6207J815J3745k034m781L716r94l977J239N519N202o642p787P207
569a736N336o093K730L682o044r48M435j73P08j971l695M928J366k467M659k731
585A986q464O407M730o056O091K549j4112K370J5416m870r475L582K534q28J567
$$ plain form
600 3427 5191 5672 1603 -3537 2352 8557 3315 -960 4085 5423 -1089 -2103 7754 7655 -5712 -3022
616 -3022 8957 2757 -1589 4607 -466 -6154 3265 5286 359 2732 -2478 -7509 4558 7697 -2765
631 -2765 -1492 1310 -1864 3584 4899 -2342 749 3442 -2556 2117 8640 1481 -2756 4085 4297
646 4297 -1407 1537 8714 3527 -4836 169 8324 3774 -1357 1240 1489 529 2549 4372 3803 -2184
662 -2184 -7061 2936 10772 -575 -5837 1895 245 -2862 2795 1479 -2239 817 -439 -2044 2098
677 2098 1016 -2791 -2269 -1890 198 2930 -502 -2256 -1354 -4409 -2290 4674 -596 -7088 -2576 264
693 264 -2319 -1946 -1354 -3412 -6506 -5582 2005 3300 -6967 -9704 -1327 623 -5529 -5371 33 -1529
709 -1529 -7425 -5697 1682 -1095 -6995 -2463 -900 -4697 -508 1541 -4127 -4657 -1625 -1857 2450 2693
$$ packed form
600C427J764M81m069n140N889O205n242m275N045J338o512j014R857r9j3367K690
616c022J1979o200m346O196n073n688R419K021m927K373n210n031J2067L139j0462
631b765J273K802l174N448J315p241L091K693n998M673O523p159m237O841K12
646D297n704K944P177n187q363N005Q155m550n131K597K49r60K020J823n69n987
662b184m877R997P836j1347n262P732j650l107N657j316l718L056j256j605M142
677B098j082l807N22L79K088K732l432j754R02l055K119O964n270o492M512K840
693B64k583L73N92k058l094R24P587J295j0267k737Q377J950o152J58N404j562
709a529n896J728P379k777n900M532J563l797M189K049n668n30L032k32M307K43
$$ plain form
725 2693 -5108 -4049 1172 -142 780 1872 -3715 -2744 2495 551 20 2092 -2345 -3315 3398 3485 -2036
742 -2036 -484 4425 326 -3964 2566 7283 233 -3523 2388 4396 1244 2773 2644 715 1227 1907
758 1907 5018 7131 -453 -3683 5644 6630 414 3623 5009 -560 743 5113 3102 2408 2061 603
774 603 2463 4322 2265 1153 885 997 1847 1931 2458 3127 -181 -2082 1591 3525 1433 -369 -650
791 -650 774 955 410 2352 1621 -4690 -2697 5227 2515 -3392 -118 1392 -2382 -1955 1297 2251 -1267
808 -1267 -4210 -876 2590 -1310 -3086 -178 -1115 -2456 -1 425 -995 -1903 -3933 -1881 1668 -810
824 -810 -2934 -1736 -2455 -1535 487 -1191 -1819 -972 -3387 -2423 3022 -208 -4950 -2003 902 -1576 -2190
841 -2190 427 553 -3193 -4403 1261 2542 -3256 -3379 251 -454 -1874 -631 -364 -881 -3060 -2506 2240
$$ packed form
725B693p801J059N221j314R22J092n587R71N239j944n31K072m437r70O713Q7n521
742b036J552M909m099m290O530M717p050l756N911K008l152J529j29j929N12O80
758A907L111K113p584l230R327R86o216L209J386n569J303M370k011o94l47j458
774F03J860J859k057j112k68J12Q50Q4N27O69l308j901L673J934k092j802k81
791f50J424J81n45J942p31o311J993P924k712n907L274J510l774M27L252R54l518
808a267k943L334L466l900j776K908r37j341K455M26j420r08k030K052L549k478
824h10k124J198p19R20K022j678o28Q47k415R64N445l230m742K947K905k478o14
841b190K617J26l746j210N664J281n798j23L630p05j420J243K67n17k179N54M746
$$ plain form
858 2240 1567 -3930 -2311 434 -2367 -1094 1833 -1010 -2631 -1004 -1253 -682 898 -1475 -2453 -722
874 -722 288 239 -974 -1212 -523 -1789 -1661 2287 1738 -3554 -2466 2062 1147 -1299 -971 951 760 -2283
892 -2283 -236 5199 1029 -4791 17 3716 -21 -373 2571 635 -1803 298 2673 3000 -526 -1427
908 -1427 2321 2245 -230 1934 2142 -554 638 2368 2092 2239 1272 -432 1341 2738 2390 2184 1011
925 1011 1382 2954 1714 2275 4901 1737 -1779 2930 5864 1851 291 2372 2866 1714 1310 3834
941 3834 4070 -907 -886 4930 3886 -927 1152 2940 442 94 2107 2750 250 -2199 383 3492
957 3492 611 -1320 1416 -317 -2407 133 1326 -536 -1375 -1579 -1512 163 -344 -1941 -1877 -1891 -460
974 -460 -690 -2245 -947 -734 -3927 -3085 974 -782 -3963 -3040 -1310 -1878 -2832 -1921 -696 -3043 -5423
$$ packed form
858B240o73n497J619K745k801J273K927k843j621J627k49N71J580k373r78J731
874g22J010m9j213k38O89j266J28L948n49n292J088M528r15k446L28J922j91l043
892b283K047N435m170n820M808L699l737l52K944j936k438K101K375L27l526r01
908a427L748p6k475K164K08k696J192J730k76J47r67j704J773J397l48k06j173
925A011L71J572j240N61K626l164l516M709K934m013j560K081M94j152m04K524
941C834K36m977K1N816j044m813K079J788k498l48K013O43k500k449K582L109
957C492k881j931K736j733k090K540J193j862q39k04O7J675n07j597O4j4J431
974d60k30j555J298K13l193Q42M059j756l181R23J730n68r54R11J225k347k380
$$ plain form
991 -5423 -1141 1494 -3800 -5301 -727 -1685 -3980 -1591 -67 -2363 -3778 -2904 68 188 -3063 -2153
1007 -2153 326 -1945 -1888 824 -83 -1904 -995 -94 365 969 -261 -1440 -843 375 1129 380 -390 346
1025 346 -461 -1202 1436 2140 -1008 -1880 1262 1380 -104 -443 934 1167 -2249 -970 3804 1731 -3102
1042 -3102 -273 2943 -500 -428 2769 1131 -1153 377 2155 2524 11 -1665 1287 2457 -185 980
1058 980 2540 -272 -1058 1888 1733 620 530 519 206 525 1411 1119 245 465 884 64 1122 3105 246
1077 246 -1510 813 2699 1244 363 504 1188 1432 187 1920 3873 -609 -1833 3602 3484 -1097
1093 -1097 437 3092 381 -393 2211 2716 849 -712 117 1906 677 -197 1380 1182 -1495 -523
1109 -523 1845 1301 -790 -1115 -682 576 1020 48 -1400 -1057 511 370 -749 -152 16 -1481 -1023 896
$$ packed form
991e423M282K635n294j501M574r58k295K389J524k296j415Q74K972J20l251R10
1007b153K479k271N7K712r07j821R09R01M59O04j230j179N97J218P54p49p70P36
1025C46q07p41K638P04l148q72L142J18j484l39J377K33l416J279M774k073m833
1042c102K829L216l443P2L197j638k284J530J778L69k513j676K952J170k642J165
1058I80J560k812p86K946j55j113r0j1l13L19Q86k92q74K20M19q20J058J983k859
1077B46j756K323J886j455q81J41O84K44j245J733J953m482j224N435j18m581
1093a097J534K655k711p74K604N05j867j561Q29J789j229q74J577j98k677R72
1109e23K368n44k091l25M33J258M44r72j448L43J568j41j119N97J68j497M58J919
$$ plain form
1127 896 179 -1339 -867 -8 -338 -1135 -1122 843 -510 -3960 -1269 2026 -1420 -2634 240 -1254 -3631
1144 -3631 -214 926 -1933 -3448 -2091 -210 777 -2212 -3458 -1146 -817 -2388 -881 183 -2196
1159 -2196 -2298 -625 -908 -1573 -660 -602 -2215 -1041 -71 -1624 -375 835 -1899 -2940 857 1749 -1539
1176 -1539 -1608 -512 -614 735 140 -664 -2 -956 -1702 2191 2171 -3141 -1487 2988 293 -1696 1839
1193 1839 1422 -1292 199 1976 1367 803 379 946 1022 641 1090 2640 2096 -277 294 2714 2779 756
1211 756 981 1230 1095 2313 2651 432 733 1812 677 1519 3380 1031 -1327 1931 2764 585 304
1228 304 1328 1040 945 53 936 2556 162 -1513 838 1545 -568 549 1903 -400 -1743 809 2114
1245 2114 634 -1208 -1041 798 837 -577 -349 332 -1048 -628 578 607 -935 -1087 -222 -7 -771 -385
$$ packed form
1127H96p17j518M72Q59l30p97J3J965j353l450K691L295l446j214K874j494k377
1144c631L417J140k859j515J357J881R87k989j246K312L29j571J507J064k379
1159b196j02J673k83o65R13N8j613J174R70j553J249J210k734j041L797Q92l288
1176a539o9J096j02J349n95q04O62r54p46L893k0n312J654M475k695j989L535
1193A839m17k714J491J777o09n64m24N67P6l81M49J550n44k373N71K420O5k023
1211G56K25K49j35J218L38k219L01J079j135Q42J861k349k358L258Q33k179k81
1228C04J024k88r5q92Q83J620k394j675K351P07k113J117J354k303j343K552J305
1245B114j480j842J67J839L9j414K28O81j380M20J206K9j542j52Q65K15p64L86
$$ plain form
1263 -385 -615 -950 -343 -688 -1339 413 876 -2075 -1912 476 -144 -1228 -504 -1086 -1431 -746 -280 404 -300
1282 -300 -3009 -1369 2215 -391 -2943 141 947 -2252 -882 1171 -1003 -2190 -1018 190 80 -570
1298 -570 -1022 -634 -348 -816 -1014 368 361 -1465 -1737 -72 -13 -684 -624 -1163 -1503 534 -19 -1194 423
1317 423 -305 -2070 -17 1595 -1225 -1656 407 140 -890 -351 18 -492 -1016 -971 160 949 -1243 -964
1335 -964 1158 -147 -1731 593 1612 -506 -1824 454 1392 -99 -855 162 41 -416 881 1441
1351 1441 166 -160 171 452 1492 898 -173 334 805 833 1198 661 563 1050 437 310 2297 1811 -165
1370 -165 825 1963 830 637 1594 1438 427 301 1694 2987 747 -760 1854 2150 340 957 2252
1387 2252 659 -138 1135 2183 1051 -158 143 1090 874 320 882 944 127 281 414 918 570 -432
$$ packed form
1263c85k30l35O07l45o51J752M63k951J63K388o20j084P24n82l45O85M66O84p04
1282c00k709J640L584k606k552L084Q06l199J370K053k174j187J172J208j10o50
1298e70m52L88K86m68j98J382pj826k72J665N9o71O0n39l40K037n53j175J617
1317D23p28j765K053J612k820m31K063k67j030N39L69n10n24M5J131P89k192K79
1335i64K122j305j584K324J019k118j318K278R38j491p56J017j21m57J297N60
1351A441j275l26L31K81J040n94j071N07M71K8L65n37r8M87o13j27J987m86j976
1370a65R90J138j133j93R57j56j011j26J393J293k240j507K614K96j810O17J295
1387B252j593p97J273J048j132j209L01R47k16n54N62O2q17J54J33N04l48j002
$$ plain form
1405 -432 -404 188 330 390 64 -986 -239 151 -1176 -206 803 -1208 -2393 133 473 -1537 -903 -38
1423 -38 -1224 -1798 -493 -177 -871 -2408 -1448 165 -925 -2253 -570 -381 -2134 -1685 -7 -519 -1998
1440 -1998 -2207 -550 -368 -1664 -1031 -420 -1670 -1474 -332 -719 -623 -697 -1381 -956 -94 -446 -1136 -864 -913
1459 -913 -326 -210 -482 5 -44 -1216 -341 818 -306 -960 50 730 -554 -430 779 558 -1085 -1296
1477 -1296 922 787 -544 -230 1020 120 -543 542 1105 -195 -608 558 1295 679 -358 697 1032
1494 1032 -276 683 1495 203 27 572 821 782 1026 541 295 527 626 857 546 799 757 131 155 1340
1514 1340 1092 -400 95 1281 870 -43 673 1156 120 -788 555 1831 236 -686 712 1396 88
1531 88 20 1286 501 -604 504 1613 1049 -307 -53 635 119 -135 918 727 -362 173 402 659
$$ packed form
1405d32K8N92J42O0l26j050P47L90j327R70J009k011j185K526L40k010O34Q65
1423c8j186n74J305L16o94j537R60J613j090j328J683J89j753M49J678n12j479
1440a998k09J657J82j296O33O11j250J96J142l87R6p4o84M25Q62l52o90K72m9
1459i13N87J16k72M87m9j172Q75J159j124o54J010O80j284J24J209k21j643k11
1477a296K218j35j331L14J250r00o63J085N63j300m13J166P37o16j037J055L35
1494A032j308R59Q12j292j76N45K49l9K44m85k46K32R9K31l11K53m2o26K4J185
1514A340k48j492M95J186m11r13P16M83j036r08J343J276j595r22J398O84j308
1531H8o8J266p85j105J108J109n64j356K54O88n16k54J053j91j089N35K29K57
$$ plain form
1549 659 440 79 -57 148 382 156 371 -255 28 149 -344 302 1014 -224 -1268 416 1100 -628 -941
1568 -941 713 36 -807 -61 1133 -13 -1231 -550 642 -37 -1088 31 445 -694 -1047 242 523
1585 523 -970 -1140 -216 -244 -1094 -451 9 -956 -1491 -406 78 -775 -1114 -1255 -793 -602 -721 -1018 -902 -1353
1605 -1353 -1022 -735 -752 -472 -301 -1570 -1166 107 -623 -1630 -282 66 -1128 -1229 156 -102 -1214 -1293
1623 -1293 42 271 -444 -724 283 -296 -1097 -198 892 -87 -1534 -299 979 -15 -362 568 373 -381
1641 -381 375 1006 142 268 490 634 666 947 432 847 870 417 1219 1350 984 1010 695 271 1211 2081 687
1662 687 5 1658 1254 453 1035 1737 230 -382 1189 1894 524 -106 763 1252 520 189 680 956 -37
1681 -37 -152 1362 1009 -345 179 906 274 -482 846 692 -175 -28 -213 87 804 -83 -689 -80 252
$$ packed form
1549F59k19l61j36K05K34k26K15o26K83J21m93O46P12j238j044J684O84j728l13
1568i41J654o77q43P46J194j146j218O81J192o79j051J119M14j139l53J289K81
1585E23j493j70R24k8q50O43M60r65n35J085M84q53l39j41M62J91j19k97J16m51
1605a353L31K87j7K80J71j269M04J273p30j007J348L48j194j01J385k58j112p9
1623a293J335K29p15k80J007n79q01Q99J090r79j447J235J278r94l47R30j95p54
1641c81P56O31q64J26K22J44L2K81n15M15K3m53Q02J31l66K6l15m24R40Q70j394
1662F87o82J653m04q01N82P02j507o12J571P05j370o30Q69M89p32l31M91K76r93
1681c7j15J514l53j354N24P27o32p56J328j54q67J47j85L00P17q87o06O09L32
$$ plain form
1700 252 -85 257 18 -824 -569 -45 20 342 -71 -1356 -200 786 -440 -992 359 57 -1187 -568 473
1719 473 -650 -849 -378 -93 -631 -700 -241 -40 -455 -1119 -723 1061 -264 -1781 -271 291 -654 57 439
1738 439 -937 -1005 160 112 -156 140 -919 -658 526 -18 -1179 -248 243 -902 -573 -343 -339 -139 -224 -1104
1758 -1104 24 266 -744 -636 350 -704 -1258 596 806 -1005 -1178 387 147 -710 -295 -416 -291 -59
1776 -59 202 -96 -22 -822 -442 871 -73 -1038 132 688 -473 -400 394 -119 399 219 -402 -232 1081 192
1796 192 -301 303 -220 -115 812 522 -136 -110 -73 576 1096 111 -618 942 1011 -25 281 1354 517 70
1816 70 877 1344 75 34 1179 802 49 253 1030 1239 543 -317 691 1529 544 147 899 451 11 1374
1836 1374 1399 -65 383 1070 359 966 905 -263 315 1074 429 -93 683 315 8 77 232 334 329 -201 -192
$$ packed form
1700B52l37L42k39q42K55N24O5L22m13j285J156R86j226n52J351l02j244O19J041
1719D73j123j99M71K85n38o9M59K01m15o64L96J784j325j517J510N62r45P11L82
1738D39j376o8J165m8k68K96j059K61J184n44j161R31M91j145L29K30MK00q5q80
1758a104J128K42j010J08R86j054n54J854K10j811j73J565k40q57M15j21J25K32
1776e9K61k98P4q00L80J313r44r65J170N56j161P3P94n13N18j80o21J70J313q89
1796A92m93O04n23J05R27k90o58K6L7O49N20r85p29J560O9j036L06J073q37m47
1816G0Q07M67j269m1J145l77p53K04P77K09o96q60J008Q38r85l97P52m48m40J363
1836A374K5j464M48O87p11O07o1j168N78P59o45n22P76l68l07O9J55J02nn30R
$$ plain form
1857 -192 268 -211 -546 384 376 -1174 -898 730 323 -1329 -489 246 -698 -678 -220 -394 -905 -734 -461 -70
1877 -70 -681 -1095 -641 150 -1021 -1032 -139 -501 -1156 -422 -311 -809 -570 -598 -1061 -470 -158 -637 -800 -410 -475
1898 -475 -1174 -557 -25 -480 -1075 -826 -25 49 -695 -340 -35 -332 -877 -188 338 -690 -917 102 597 -496
1918 -496 -313 419 33 -431 247 572 281 -272 -167 391 351 -394 357 670 -333 -112 798 447 91 367
1938 367 70 -69 802 235 -60 434 612 370 598 627 261 166 155 843 656 58 -47 633 267 55 311
1959 311 963 340 -634 -28 610 93 -252 448 573 -130 -39 716 682 -178 -16 311 840 63 -298 467 197
1980 197 86 229 645 -74 74 631 452 437 319 -29 -229 284 225 93 405 549 200 -415 405 643 108
2001 108 -228 306 331 303 83 59 207 -204 -258 346 913 -525 -463 573 388 -733 190 724 -250 -568 -25
$$ packed form
1857a92M60m79l35R30qj550K76J628m07j652Q40P35r44K0M58j74n11J71K73L91
1877g0o11m14M54P91j171j1Q93l62o55P34J11m98K39k8m63N91L12m79j63L90o5
1898d75o99O17N32m55n95K49Q01P4p44L55L05k97n45O89N26j028k27J019M95j093
1918d96J83P32l86m64O78L25k91n53J05N58m0p45P51L13j003K21R10l51l56K76
1938C67k97j39Q71n67k95M94J78k42K28K9l66r5j1O88j87n98j05O80l66k12K56
1959C11O52o23r74O06O38n17l45P00J25p03R1P55l4q60J62L27N29p77l61P65k70
1980A97j11J43M16p19J48N57j79j5j18l48k00N13n9j32L12J44l49o15Q20K38n35
2001A08l36N34K5k8k20k4J48m11n4O04N67j438O2J036j85j121R23N34r74l18N43
$$ plain form
2022 -25 350 -138 -479 -390 -38 -459 -57 211 -209 -455 -155 -193 -88 -353 -532 -698 -619 -443 -282 -489 -830
2043 -830 -794 -577 -968 -114 -250 -1208 -875 -489 -363 -903 -572 -189 -438 -1093 -573 -106 -670 -1086 -327 -110
2063 -110 -582 -849 -93 -221 -759 -378 101 -101 -657 -510 29 -42 -495 49 453 -557 -387 204 293 24
2083 24 50 250 381 410 606 169 173 306 122 599 439 779 173 193 504 894 253 249 583 603 503 407 1025
2106 1025 781 217 408 1047 644 -40 594 1044 69 378 1004 767 182 46 718 846 237 319 377 526
2126 526 112 552 725 192 -1 107 593 310 219 292 1 145 261 263 233 122 202 0 177 257 225 -259 -427
2149 -427 168 -178 -184 227 79 -303 -359 257 491 -566 -626 -123 -62 -707 -166 267 -259 -658 -59 -1 -185 -233
2171 -233 -416 -21 -228 -508 108 -33 -598 -546 -3 84 -181 -90 -316 -480 -302 -63 -189 -166 -412 -472 -285 411
$$ packed form
2022b5L75m88l41Q9L52m21M02K68m20k46L00l8J05k65j79j66P9J76J61k07l41
2043h30L6K17l91Q54j36r58L33L86J26n40L31L83k49o55N20M67n64m16P59K17
2063a10m72k67P56j28n38L81M79k02n56J47N39p1m53N44M04j010J70N91Q9k69
2083B4K6K00J31K9J96m37MJ33j84M77j60L40o06K0L11L90o41mL34K0j00r6O18
2106A025k44n64J91O39m03o84O34M50r75L09O26k37n85j36O72J28o09Q2N8J49
2126E26m14M40J73n33j93J08M86k83r1P3k91J44J16Kl0j11Q0k02J77Q0l2m84j68
2149d27N95l46oM11j48l82n6O16K34j057o0N03O1o45N41M33n26l99N99N8j84m8
2171b33j83L95k07k80O16j41n65N2N43Q7k65R1k26j64J78K39j26K3k46o0J87O96
$$ plain form
2193 411 -64 -348 -372 -36 -155 -473 -281 9 -56 -521 -10 236 272 -663 -120 234 -269 -486 392 41 -814
2214 -814 -394 273 19 -243 -370 -451 -383 -171 -3 -233 -415 -451 196 246 -29 -544 -314 181 61 88 69 -62
2236 -62 208 345 -157 167 100 -94 -181 432 78 -398 220 362 -4 -11 17 539 227 -203 -271 464 543 -126 359
2259 359 540 -112 -12 774 490 51 449 604 494 438 111 323 632 597 493 583 675 152 286 510 29
2280 29 245 935 633 193 336 89 216 707 559 -437 160 932 441 -559 492 451 325 59 113 -63
2300 -63 -220 -86 206 472 -168 -473 253 334 -741 -295 442 -114 -799 -225 -210 -294 -48 -109 -368 -436 -467 -151
2322 -151 -87 -222 -1016 -739 -29 -267 -683 -465 -634 -397 -175 -451 -874 -293 -126 -516 -313 -190 -797 -447
2342 -447 -88 -597 -825 -125 83 -466 -636 -238 -151 -110 -382 -421 -153 -240 -533 241 207 -606 -347 312 -126 -305
$$ packed form
2193D11m75k84k4L36j19l18J92K90o5m65N11K46L6r35N43L54n03k17Q78l51q55
2214h14M20O67k54k62j27q1O8K12J68k30j82l6O47N0k75n15K30M95j20K7j9j31
2236f2K70J37n02L24o7j94q7O13l54m76O18J42l66pK8N22l12m30o8P35P9o69M85
2259C59J81o52J00P86k84m39L98J55j10n6l27K12L09l5j04R0R2n23J34K24m81
2280B9K16O90l02m40J43k47J27M91j48r96N97P72m91j000J051m1j26k66N4j76
2300f3j57J34K92K66o40l05P26Q1j075M46P37n56o85N74J5q4K46o1k59o8l1L16
2322a51O4j35p94K77P10k38m16K18j69K37K22k76m23N81J67l90K03J23o07L50
2342d47L59n09k28P00K08n49j70L98Q7M1k72l9K68q7k93P74l4q13K59O59m38j79
$$ plain form
2364 -305 138 95 -263 95 0 -113 192 237 -75 405 423 -80 92 223 -220 -74 506 139 57 129 -199 160
2386 160 698 304 -295 126 581 53 280 516 -66 -121 402 474 389 -126 51 419 397 -241 -148 516 408 -313
2408 -313 371 307 -210 -30 510 120 -192 377 532 200 350 92 185 235 315 -101 226 256 649 225 -138 25
2430 25 20 542 63 75 372 -156 28 604 308 -502 14 568 31 -194 418 399 26 26 191 456 63 -285
2452 -285 264 -83 -369 -12 750 44 -658 -127 433 -187 -559 150 -194 -76 -135 -59 -236 8 -365 -190 98
2473 98 -282 -384 -234 -67 -678 -451 -111 -486 -79 -413 -574 -169 -103 -368 -432 10 -465 -916 -282 -87 -446
2494 -446 -706 -272 -129 -366 -537 -424 -100 -490 -796 -111 235 -595 -419 -343 -29 -554 -442 -143 -409 -390 -8
2515 -8 -241 -275 -316 -165 -59 177 -201 -338 39 11 42 -118 147 -100 57 23 -78 393 24 -142 -266 655
$$ packed form
2364c05M43m3l58L58r5j13L05M5l12M80J8n03J72J31m43J46N80l67q2P2l28L59
2386A60N38l94n99M21M55n28K27K36n82n5N23P2q5n15J77L68k2o38R3O64j08p21
2408c13O84o4n17J80N40l90l12N69J55l32J50k58R3N0Q0m16L27L0L93m24l63J63
2430B5nN22m79J2K97n28J84N76k96q10N16N54n37k25O12j9l73%J65K65l93l48
2452b85N49l47k86L57P62p06p02N31N60o20l72P09l44J18n9P6j77K44l73J75K88
2473I8l80j02J50J67o11K27L40l75M07l34j61M05O6k65o4M42m75m51O34J95l59
2494d46k60M34J43k37j71J13L24l90l06O85L46q30J76P6L14n25J12K99k66J9L82
2515hk33l4m1J51J06K36l78j37L77k8L1j60K65k47J57l4j01M71l69j66j24R21
$$ plain form
2537 655 193 -165 248 289 32 320 648 459 114 24 527 408 364 540 541 320 240 67 783 255 190 782
2559 782 557 404 439 528 283 234 265 612 567 417 359 237 499 350 479 314 116 298 147 510 261 354
2581 354 96 21 203 -45 90 336 132 64 -205 144 168 -75 -228 -161 55 -10 -166 237 325 -450 10 78
2603 78 105 -466 -387 249 -68 -229 -190 44 -357 -211 -81 193 -170 -464 -260 61 -88 -295 -140 -397 -40
2624 -40 25 -393 -202 175 -183 -213 -168 129 -183 -624 -106 -101 -372 -32 83 -84 -322 -79 66 224 -246 29
2646 29 1 -117 -580 -235 160 -199 -271 257 -200 -353 -197 124 -108 -315 -61 36 -287 -363 -259 107 -89 -75
2668 -75 -475 -76 72 -240 102 87 6 -212 -90 39 -130 -79 -202 70 12 -28 58 319 207 -135 68 436
2690 436 392 -113 81 220 416 -20 159 516 157 27 292 502 320 55 472 399 167 255 143 532 151
$$ packed form
2537F55m62l58M13M1k57K88L28j89l45r0N03j19m4J76Jk21q0j73P16n28o5N92
2559G82k25j53L5Q9k45m9L1L47m5j50n8j22K62j49J29j65j98J82j51L63k49R3
2581C54k58p5J82k48J35K46k04o8k69L49K4k43j53O7K16o5j56M03Q8p75M60O8
2603G8K7n71P9O36l17j61L9K34m01J46J30K74l63k94K04L21j49k07J55k57L57
2624d0O5m18J91L77l58l0M5K97l12m41N18Nk71L40J15j67k38K43J45J58m70K75
2646B9k8j18m63L45L95l59p2N28m57j53J56L21k32k07K54R7l23p6J04L66j96J4
2668g5m00L99J48l12L42j5q1k18J22J29j69N1j23K72n8m0Q6K61j12l42K03L68
2690D36m4n05J94J39J96m36J79L57l59j30K65K10j82k65M17p3k32Q8j12L89l81
$$ plain form
2711 151 125 277 324 448 263 121 415 414 327 390 170 158 247 -55 493 364 -28 589 461 489 -14 208 210 217
2735 217 177 457 452 277 -251 100 558 22 26 131 283 10 13 146 289 -215 -334 53 110 -379 -26 -255 -220
2758 -220 42 -57 -226 -232 -166 -318 -444 -211 -359 -228 -343 -143 -268 -387 -97 -178 -604 -484 -319 -40 36 -683
2780 -683 -272 -140 -374 -439 -149 93 -724 -209 -64 -364 -415 -256 -238 -371 -359 -360 17 -74 -386 -294 94 -269 -190
2803 -190 -68 -368 -458 -336 200 -152 94 152 -23 -192 -136 -66 -571 -299 -128 -251 29 -15 -93 96 377 122
2825 122 69 10 -36 397 -5 -22 60 620 87 -110 292 308 193 79 390 -16 432 590 262 146 206 84
2847 84 365 158 286 129 306 274 -45 343 -98 -238 401 359 216 120 475 -26 -17 236 -112 -136 447 116
2869 116 -78 79 289 170 127 -53 36 131 67 -15 345 91 64 223 451 -63 -227 80 377 -86 136 380
$$ packed form
2711A51k6J52M7J24j85j42K94jq7O3k20j2Q9l02N48j29l92O17j28K8n03K22KP
2735B17m0K80nj75n28L51M58n36MJ05J52k73LJ33J43n04j19L87N7m89L53k29L5
2758b20K62r9j69oO6j52j26K33j48J31j15K00j25j19K90q1m26J20J65K79P6p19
2780f83M11J32k34o5K90K42q17N15J45l00n1J59J8j33J2jL77r1l12R2L88l63P9
2803a90J22l00r0J22N36l52K46N8j75j69N6P0n05K72J71j23K80m4p8J89K81k55
2825A22n3n9m6M33m02j7Q2N60n33j97M02J6j15j14L11m06M48J58l28j16O0j22
2847H4K81k07J28j57J77l2l19L88m41j40O39m2j43r6L55n01RK53l48k4N83l31
2869A16j94J57K10j19m3j80Q9R5o4q2L60k54k7J59K28n14j64L07K97m63K22K44
$$ plain form
2891 380 25 135 164 -42 215 9 -24 307 88 -349 86 491 -64 -282 17 207 327 94 -95 -181 -264
2912 -264 197 -175 -90 89 -113 -281 -208 -150 -49 -347 -4 159 -384 -513 -200 130 -430 -401 -204 -167 -431 -396
2934 -396 -54 -186 -442 -146 -162 -482 -345 -40 -230 -437 -693 -276 -225 146 -380 4 -224 -589 -395 33 -298
2955 -298 -427 -137 -476 -265 -363 -183 -439 -43 164 -290 -454 105 -62 -248 -140 -167 5 57 -241 -141 72
2976 72 92 174 33 -252 -413 108 341 114 -159 264 169 -298 317 244 75 370 287 315 194 483 290 347 282
2999 282 228 139 379 84 158 539 312 369 784 319 -177 54 154 325 248 133 185 266 492 323 -42 -112 74
3022 74 458 43 171 191 323 -118 58 274 -1 -133 31 444 -72 -245 391 120 -228 -289 143 152 185 -61
3044 -61 141 163 -166 -148 200 -225 -289 -268 177 -136 -403 -384 -369 137 -145 -19 -279 -269 40 -226 -218 -120 76 -266
$$ packed form
2891C80l55J10K9k06K57k06l3L31k19m37M35M05n55k18K99J90J20k33j89q6q3
2912b64M61l72Q5J79k02j68P3N8J01k98L43J63n43j29L13L30n60K9J97L7k64L5
2934c96L42j32k56K96j6l20J37L05j90k07k56M17N1L71n26L84k28l65J94M28l31
2955b98j29K90l39K11r8J80k56L96K07m54j64N59j67j86J08k7J72N2k98J00K13
2976G2K0Q2j41k85j61N21K33k27k73M23r5m67O15p3j69K95q3K8j21K89j93N7o5
2999B82n4q9K40k95P4L81k27N7M15m65m96K31J00J71p7j15N2Q1K26j69l65p0J86
3022G4L84m15J28K0J32m41J76K16k75j32J64M13n16j73O36k71l48o1M32RL3k46
3044f1K02K2l29J8L48m25o4K1M45l13k67J9J5N06k82J26k60J0L09k66QR8J96l42
$$ plain form
3068 -266 -122 -264 -274 10 -434 -37 -313 -426 -257 129 -260 -674 28 153 -242 -131 -94 -84 -423 131 200
3089 200 -89 -187 -81 45 -288 -163 -128 -67 -189 -31 31 123 -150 -242 123 -117 -152 69 -92 -103 161 -369 -101
3112 -101 173 -376 -119 -292 20 -218 -315 -247 7 -275 -593 -41 67 32 -334 -286 123 -260 -105 191 236 -81
3134 -81 23 486 378 -228 -165 124 215 142 81 171 235 45 173 116 320 -153 18 282 90 212 -10 191 -112
3157 -112 97 147 394 461 138 346 105 -11 162 98 149 408 278 27 345 206 289 210 431 256 144 346
3179 346 408 190 -33 364 257 24 -88 278 340 146 128 210 1 -26 81 149 66 -301 -219 206 -174 -266 -226
3202 -226 244 -79 -363 -8 32 -238 21 -41 26 -72 -13 -29 -172 57 -134 -276 -93 16 -353 -356 -23 -34 -83
3225 -83 -310 -111 -361 -429 -223 22 -149 -332 -214 -140 -173 -332 -293 -319 -317 -407 -212 -184 -135 -274 -65 -112 -327 -99
$$ packed form
3068b66J44j42j0K84m44L97k76j13J69L86l89m14P02J25l95J11L7J0l39N54O9
3089B00k89r8J06J26l33J25L5O1j22J58O2R2k73r2L65k40l5K21j61j1K64n30K68
3112a01K74n49K57j73L12k38r7O8K54k82l18N52J08l5l66M8M09l83J55K96M5l17
3134h1J04M63j08o06O3K89R1p3o1R0O4j90J28n7K04m73J71K64j92J22k22K01l03
3157a12K09N0K47O7l23K08k41j16J73o4N1K59j30k51L18j39Q3p9K21j75j12K02
3179C46O2k18k23L97j07k33j12L66O2j94j8Q2k09k7J07O8q3l67Q2M25l80r2M0
3202b26M70l23k84L55M0k70K59o2O7r8N9j6j43K29j91j42J83J09l69lL33j1m9
3225h3k27J99k50o8K06K45j71j83J18P4l3j59L9k6Kr0J95K8M9j39K09m7k15K28
$$ plain form
3249 -99 -126 -199 -24 -97 -118 -18 -135 60 -105 327 25 -139 -144 124 -67 -24 88 -120 75 -367 122 69 -386
3272 -386 83 160 423 139 -2 157 1 45 143 351 191 -81 -35 30 -144 286 -94 278 -26 63 136 176 57
3295 57 51 -46 309 185 -35 412 267 268 76 -31 -88 165 192 46 91 85 -69 -338 143 277 10 -167 211 232
3319 232 352 124 -4 143 40 -81 -76 -51 109 325 422 197 -350 502 83 249 308 -54 111 48 -35 165
3341 165 -49 16 174 -58 165 13 -60 353 223 -44 230 -199 214 13 0 -396 -63 -74 -5 18 34 100 -218
3364 -218 111 -221 -201 -23 84 -14 -250 -331 228 -187 -178 -31 -63 -63 -491 -144 315 -286 -289 59 -52 -407 -240
3387 -240 -232 -269 -375 -246 -78 34 -86 -155 -595 -430 -286 -161 -100 -245 -388 -113 -253 -297 -15 -221 -315 16
3409 16 -209 -291 -368 -168 -55 -342 -88 -27 14 -44 -20 -168 73 -135 -121 72 86 -317 4 210 -12 -86 -79 -77 41
$$ packed form
3249i9k7p3J75p3k1J00j17J95j65M32l02j64nK68j91M3J12k08J95m42M89n3m55
3272c86M69P7K63k84j41J59j56M4R8K08j60k72M6O5j74M30l80L72l04Q9P3M0j19
3295E7or7L55j24k20M47j45Jj92j07n7K53K7j46M5oj54k69M81J34k67j77L78K1
3319B32J20k28j28J47j03j21NK5J60K16R7k25n47Q52m19J66N9l62J65o3q3K00
3341A65k14O5J58k32K23j52p3M13j30k67K74m29M13k01j3l96L33j1O9K3J6O6l18
3364b18L29l32K0J78J07r8k36q1N59m15RJ47l2%m28L47M59o01lL48j11l55J67
3387b40Ql7j06J29J68J12j20o9m40J65J44J25O1j45j43K75j40m4K82k06r4L31
3409A6k25q2p7K00J13k87K54O1M1n8K4j48K41k08J4J93J4m03L21K06k22p4PKJ18
$$ plain form
3434 41 125 216 -54 59 -144 179 -195 164 143 127 168 163 -91 397 287 168 578 186 182 519 159 180 153 208
3458 208 -108 300 367 -25 380 491 506 367 520 47 329 140 40 119 297 116 99 636 -248 -192 206 154
3480 154 -167 -226 361 141 -85 46 -11 -12 150 -96 78 -59 278 -160 -37 135 95 59 -12 -6 175 -208 -119
3503 -119 -278 221 -182 -16 98 30 -235 -22 73 -32 -191 29 -123 -224 0 5 -274 -90 -419 8 189
3524 189 -258 -321 39 93 -138 74 -403 -542 -265 173 105 -347 0 97 -111 48 -31 -6 167 -3 26 -33 156
3547 156 -101 -196 -92 -198 19 -65 -304 117 61 -6 -277 231 121 -405 -111 -92 17 -388 -216 -4 142 -248
3569 -248 64 -94 -35 -273 12 -238 7 -241 -157 138 4 66 13 -141 128 199 -59 28 -39 79 154 223 -105
3592 -105 33 163 -6 -157 -132 -54 300 260 -8 136 393 285 -90 -2 278 120 -6 236 14 254 22
$$ packed form
3434D1Q4R1k70J13k03L23l74L59k1j6M1nk54M88j10j19M10l92mL37l60K1k7N5
3458B08l16M08O7l92M05J11J5j39J53m73K82j89j00P9J78j81j7N37q84N6L98n2
3480A54l21n9N87k20k26J31n7jJ62k46J74j37L37m38J23J72m0l6p1OJ81l83Q9
3503a19j59M99m03J66J14o8k65K13R5j05j59K20j52j01K24Nk79J84l29M27J81
3524A89m47o3L60N4k31K12m77j39K77M38o8m52L47R7k08J59p9K5J73j70K9n9J89
3547A56k57r5J04j06K17q4k39M21n6o7k71N08j10n26K94J9J09m05J72K12J46l90
3569b48L12j58N9k38K85k50K45k48Q4K95j34O2n3j54K69P1k58Q7o7J18P5O9l28
3592a05J38J30j69j51K5P8L54m0k68J44K57j08l75Q8K80j58j26K42k22K40k32
$$ plain form
3613 22 327 56 84 312 -186 67 252 91 383 122 -57 -13 -8 218 -71 85 179 151 -130 335 145 46 105
3636 105 183 165 210 317 -146 15 200 179 197 -39 -16 50 112 2 5 -39 -16 -113 -17 134 -138 102 -61 -13 142
3661 142 -89 -281 -211 103 -350 -177 -56 -32 -63 -181 -131 -218 -165 -126 -67 -210 -141 -233 -69 -231 -143 -321 -198 33
3685 33 -277 -225 -509 -320 -187 -257 -241 -291 42 -321 14 33 41 182 -191 -48 23 -133 -89 157 -222 -310 -451 281
3709 281 -61 -129 -207 32 -116 -211 24 -133 -169 -157 -87 -5 -37 -7 -29 171 -128 139 -242 -5 89 186 75 290
3733 290 140 146 -253 391 26 68 -19 68 356 226 371 381 -38 143 397 298 50 -298 332 110 -191 -68
3755 -68 34 -68 1 -22 4 95 125 290 74 18 114 145 113 -33 278 82 -94 238 170 74 173 -52 -67 87 -24
3780 -24 -84 -65 13 10 76 82 -187 -138 -55 219 76 205 451 47 -234 303 266 35 -168 -56 102 24 -7 -73 -13
$$ packed form
3613B2L05k71K8K28m98K53J85j61K92k61j79M4NK26k89J56R4k8k81M65j90r9N9
3636A05P8j8M5J07m63J61J85k1J8k36K3O6O2j10Lm4K3r7R6J51k72K40j63M8J55
3661A42k31j92P0L14m53J73J21K4l1j18N0q7N3L9N9j43O9r2J64j62Q8j78J23K31
3685C3l10N2k84J89J33p0J6n0L33l63L35J9QJ41l73J43P1j56M4K46l79q8j41P32
3709B81l42o8p8K39j48r5K35j57l6J2P0Q2l2L0k2K00k99K67l81K37R4R7j11K15
3733B90j50Ol99O44l65M2q7Q7K88j30J45J0m19J81K54r9k48l48O30k22l01J23
3755f8J02j02O9k3K6R1L0J65k16n6R6L1l2j46L11j96j76L32o8r6R9k25j5J54j11
3780b4o0J9P8lO6Ok69M9Q3K74j43J29K46m04k81N37l7k31k03J12J58p8l1o6O0
$$ plain form
3805 -13 -70 -66 -1 260 -188 182 -25 -258 135 57 16 -194 72 -27 -101 -133 -151 -223 -104 -155 -243 32 -289 -158 -341
3830 -341 37 -488 -379 -155 -292 -311 17 -310 -271 198 -400 -27 -428 132 46 -361 -389 -294 -303 -374 -20 -53 -324
3853 -324 -276 -129 -129 -179 -204 -246 -165 -228 -252 144 -252 -156 124 38 -225 -71 83 24 -114 -144 -229 43 -231 119 131
3878 131 91 -91 -171 -68 56 -44 13 -104 273 128 -63 277 492 248 51 121 279 387 78 181 149 368
3900 368 11 49 310 88 237 264 177 238 164 165 -244 -541 156 108 289 -13 51 244 157 132 98 19 100 216 180
3925 180 -45 411 -80 70 284 -68 -149 60 -50 20 37 205 302 -165 83 109 76 -174 271 -244 -176 -255 -142
3948 -142 -103 22 132 151 -423 -23 -74 -268 2 144 -341 276 85 -252 -243 -85 -148 -204 26 -148 5 196
3970 196 -52 -158 -84 -99 -328 -211 -36 -188 -36 121 -235 -177 -287 -334 37 111 -137 -43 -59 -103 -433 -120 80
$$ packed form
3805a3n7MO5K61m48L70k07k33L93p8m1k10K66r9p4l2j8p2J19n1q8K75l21J31j83
3830c41L78n25J09K24j37j9L28l27L9M69n98L73m01N60q6m07k8R5rp1L54l3k71
3853c24M8J47%n0k5m2Q1o3k4L96l96R6K80q6k63J54J54n9j38l0q5K72k74L50J2
3878A31m0j82q0J03J24j00N7j17L77j45j91L40K15k44j97P0J58J08l09J03l2K19
3900C68l57L8K61k22J49K7q7O1p4Jm09k97O97m8J81l02O4J93q7k5l4p9Q1J16l6
3925A80k25M56m91J50K14l52q1K09j10P0J7J68R7m67K48K6l3k50M45n15O8p9J13
3948a42L9J25J10J9n74M00n1j94K70J42m85O17j91l37RJ58o3n6K30j74J53J91
3970A96k48j06P4j5k29J17J75j52J52J57l56N8j10m7L71P4k48R4j6m4l30L13K00
$$ plain form
3993 80 -31 -35 -141 -107 244 -85 -154 93 -125 106 115 358 -253 -164 4 0 19 -93 -175 14 -102 -203 -287 -1
4017 -1 211 -193 296 -30 77 -151 134 46 5 12 -132 -7 0 -22 49 -326 107 182 200 234 31 -127 -34 -290 4
4042 4 93 -174 190 136 60 -84 290 371 -91 190 284 -73 45 65 189 32 30 64 154 -107 223 95 -55 43
4066 43 107 -23 72 -107 191 99 -64 223 227 144 -193 -100 51 -58 221 -25 31 66 -18 -52 -69 201 -68 34
4090 34 166 40 26 -18 102 -145 -132 253 -266 216 139 78 78 130 -72 -150 -201 -162 -200 -56 161 50 -58 -91 -223
4115 -223 -55 -9 -164 -35 65 -355 -472 93 -151 -192 -70 -238 -176 -136 40 -287 142 57 -232 170 -148 -40
4137 -40 -38 -1 -154 -77 -310 -73 -107 -251 -83 -70 -251 62 -142 -168 104 -15 -209 -23 -165 -125 -62 37 -230 -1
4161 -1 -33 414 95 -7 81 -48 112 -364 53 7 125 -142 27 -59 6 354 -2 96 37 67 -159 53 69 51
$$ packed form
3993H0j11mj06L4L51l29o9K47k18K31RK43o11Q9J68mJ9j12q2J89j16j01q4K86
4017aK12m04M89l26J07k28K85q8m1Pj44J25Pk2P1l75M33P5J8L4k03j58R3k56K94
4042DQ9k67L64n4p6j44L74Q1m62K81R4l57J18K0J24j57kL4R0k61L30j28j50R8
4066D3O4j30R5j79K98r2j63K87Mq3l37R3J51j09K79k46N6L5q4l4j7K70k69J02
4090C4J32j26j4m4J20k47J3L85n19M82p7o1%N2k02p8n1L9l8J44K17j11j08l3j32
4115b23J68M6j55J29J00m20j17N65k44m1J22j68O2M0J76l27M29q5k89M02l18J08
4137d0KL7j53P7k33K37l4j44J68J3j81L13k04k6K72j19j94J86j42M0O3R9k67K29
4161al2M47l19j02Q8j29J60m76M17m6J18k67J69q6O5L48l56R8n9L0k26K12J6j8
$$ plain form
4185 51 38 181 102 -88 309 67 97 251 430 -51 151 -62 -418 202 26 -250 13 143 -66 125 46 -128
4207 -128 61 81 138 111 12 293 3 -160 26 68 248 58 142 24 59 138 -82 -250 53 -31 -59 64 239
4230 239 217 10 55 20 65 265 128 -205 97 -39 210 319 -38 -46 -24 94 210 116 59 113 -49 -58 -59 195 79
4255 79 53 73 3 -69 115 -327 -65 -108 213 -28 224 -22 37 230 -52 -53 106 -283 -244 -93 -331 40 -352
4278 -352 -56 -123 -3 125 65 241 -336 -130 -30 -332 -299 66 -294 78 -115 -186 -182 35 44 -405 39 -208 -139
4301 -139 -117 -192 100 25 -54 5 -192 -106 -77 -191 -31 20 129 227 -52 79 -19 -193 -18 214 -196 -182 -16 153
4325 153 188 -113 40 -180 279 255 -139 216 -54 -216 192 18 18 -64 411 205 267 -57 179 67 166 -23
4347 -23 58 213 142 -70 -56 -194 68 76 42 58 303 60 47 21 148 23 262 203 -139 219 188 125 -68 228
$$ packed form
4185E1j3J43p9j90L97k42L0J54J79m81K02k13l56O20j76k76K63J30k09J91p9j74
4207a28J89K0N7k7r9K81k90j63J86M2J80j90Q4j18L5P9k20j68L03q4k8J23J75
4230B39k2k07M5l5M5K00j37l33L02j36K49J09l57qK2J18J16r4n7N4j62rjK54j16
4255G9k6K0p0p2J84m42K62m3L21k41K52k46N9J93k82jJ59l89L9J51k38L71l92
4278c52K96o7J20J28o0J76n77K06J00l02L3L65l60L72j93p1MK17Rm49M44k47O9
4301a39K2p5K92p5p9N9j97Q6K9j14J60N1J09R8k79J31r8j74J75K32m10J4J66J69
4325A53L5l01J53k20M59k4l94L55k70j62M08j74%q2M75k06O2l24K36j12R9j89
4347b3Q1J55p1k12J4j38K62Ql4J6K45k43j3k6J27j25K39n9l42L58l1o3j93K96
$$ plain form
4371 228 -111 -217 66 -211 163 14 -65 55 -15 233 -173 162 79 30 -35 -199 -31 159 178 -43 169 -135
4393 -135 118 -242 228 72 -35 168 -67 41 82 -7 -276 13 60 -159 -93 -187 -14 54 -64 164 -62 -103
4415 -103 136 -47 51 -4 -87 0 -73 1 -60 -260 28 -11 -118 -26 -144 24 117 31 -189 -94 25 38 -49 -215 -105
4440 -105 -97 67 -231 183 74 -11 -57 -51 202 -342 39 203 -144 40 -28 2 25 151 98 97 53 -28 -112 -154 77
4465 77 -9 243 -2 -80 76 -256 62 -92 50 235 195 9 -114 147 62 -343 34 72 19 178 16 -74 -42
4488 -42 -3 -105 137 -135 -201 199 305 -98 -56 34 -184 327 125 308 -26 54 207 156 12 80 -98 101 76
4511 76 50 52 103 126 320 251 -64 343 99 183 120 132 -38 -41 35 213 169 8 128 267 -173 271 -86 -229 216
4536 216 -126 -129 22 3 -67 241 107 7 86 114 -85 132 197 153 -100 56 -45 -47 -48 41 -205 -38 2 -51 3
$$ packed form
4371B28l39j06K83k77L74j49p9J20p0K48m06L35q3m9o5j64J68J90J9k21K12l04
4393a35K53l60M70j56j07K03k35J08M1q9k69K89M7k19O6r4J73O8j18K28k26m1
4415a03K39j83R8n5q3Q7p3P4o1k00K88l9j07R2j18J68R3q6k20R5J19J3q7j66J10
4440a05QJ64k98M14j09q5m6OK53n44L81J64l47J84o8L0K3J26n3jm4q1q4m2K31
4465G7q6K52k45p8J56l32L18j54J42J85m0j86j23K61q5m05L77L8n3J59j62r0L2
4488d2L9j02K42k72o6M00J06m03M2R0k18N11k02J83l34Q0J53n1j44O8j78J99k5
4511G6k6KN1K3J94o9l15M07k44Q4o3J2j70lP6J78m4j61J20J39m40M44l57j43M45
4536B16l42lJ51j9p0L08j34j00P9K8j99K17O5m4k53J56j01kjQ9k46J67M0n3N4
$$ plain form
4561 3 -211 -12 37 -158 44 -147 -196 -101 130 128 -36 -104 -155 -259 -133 -174 -324 -159 -24 163 45 86 -106 127
4585 127 -138 -46 12 -135 -50 -235 -138 -70 201 192 -216 -112 -7 -145 63 -28 -197 -62 -117 184 -225 125 -25
4608 -25 74 76 -170 100 141 71 19 4 93 -174 150 77 17 -58 31 -10 14 262 188 147 -147 22 -195 66 -45 -97
4634 -97 -156 84 185 -264 128 -189 278 53 -122 -121 268 -199 -9 94 177 -100 56 81 91 133 55 -169 -1
4657 -1 -153 19 -241 49 222 222 57 282 -42 -90 60 -152 -35 -44 246 -5 8 133 54 38 11 78 19 -46 -44
4682 -44 218 -41 201 -74 -99 126 -305 39 243 97 -225 -112 -28 -6 206 59 -108 -91 11 44 141 -152
4704 -152 173 -77 -7 147 32 -294 -62 -146 -3 34 24 82 58 -115 108 -171 -106 -66 -6 -118 -212 -38 178
4727 178 9 -239 -207 64 109 95 8 47 71 208 114 94 -58 -242 62 -109 -195 -176 -302 -174 -50 -100 -154 -186
$$ packed form
4561Ck14J99M9j95K02j91m9R5K31kj64o8n1j04J26m1j50J65J35J87j18M1j92K33
4585A27k65R2N8j47Q5j85R7O8K71rm08J04J05j38K08r1j69J35n5L01m09L50j50
4608b5R9Kk46K70M1p0n2j5Q9k67L24p3o0p5Q9m1K4K48p4m1k94J69k17K61j11n2
4634i7n9K40J01m49L92l17M67k25j75JL89m67J90J03Q3k77J56K5J0M2p8k24J68
4657aj52J72k60K90J73%j65K25l24m8J50k12J17rK90k51J3J25p9j6k7O7n9o5K
4682d4K62k59K42k75k5K25m31L44K04j46l22J13Q4K2K12j47j67J7J02L3R7k93
4704a52L25k50P0J54j15l26K32q4J43L7j0N8k4j73K23k79O5M0O0j12r4J74K16
4727A78j69k48L2K71M5j4q7L9K4J37r4k0j52j84L04j71q6J9j26J28J24n0n4l2
$$ plain form
4751 -186 -195 -89 182 -219 -23 -101 64 -18 110 -67 69 -50 -77 -150 -209 27 89 202 -31 60 25 -234 218
4774 218 -127 -99 -210 260 106 -21 -127 205 156 195 -27 -20 88 -98 43 202 22 73 -21 227 78 29 -31
4797 -31 373 8 15 -114 -164 189 10 -11 68 94 53 -128 88 241 -256 -6 -22 -125 150 14 98 56 -190 -38
4821 -38 -123 0 105 236 -294 227 -37 -200 -103 109 86 -134 158 131 -112 163 96 -124 -197 -175 200 -150 -5
4844 -5 -9 -60 -129 128 70 209 112 4 -240 187 53 275 -122 -240 196 -29 83 -69 -298 -221 -278 -74 176
4867 176 -86 -168 -86 -40 6 -84 189 186 -147 -178 58 -37 59 16 241 28 -126 -1 6 41 102 100 -19 25 157 -82
4893 -82 -169 -193 67 -105 -81 185 -162 -281 -295 159 -53 -139 -364 -65 -12 190 -283 12 -86 91 91 12 59 -109
4917 -109 178 23 -90 -199 -248 -142 -301 -134 -94 -132 -179 187 -167 -74 44 -56 -202 73 52 -42 79 289
$$ packed form
4751a86rJ06K71m01J96p8J65q2J28j77J36j19k7p3n9K36O2J13k33R1l5k59M52
4774B18l45K8j11M70j54j27j06L32m9L9k22PJ08j86J41J59j80N1r4K48j49m9o0
4797c1M04l65Pj29n0L53j79k1P9K6m1j81K16J53m97K50j6j03K75j36Q4m2k46J52
4821c8q5J23J05J31n30N21k64j63R7K12k3k20K92k7k43K75o7k20p3K2L75l50J45
4844emn1o9K57n8J39r7j08k44M27j34K22l97j18M36k25J12j52k29P7n7K04K50
4867A76k62q2Q2M6M6r0K73ll33l1K36r5R6m3K25k13j54J25PL5O1kj19M4J32k39
4893h2q7k4K60j72K4K66l47j19j4M54k12q6k25K99N3K02m73K95r8J77%p9M7j68
4917a09K87j55j13j09m9J06j59J67M0l8m7L66l54R3J18j00j46K75k1r4J21K10
$$ plain form
4939 289 -272 -125 200 -77 179 2 18 159 -38 -69 -4 85 285 -151 -130 0 65 -186 -151 179 105 23 197
4962 197 -118 35 198 131 -56 73 43 82 -165 150 -310 14 17 -107 48 223 111 -104 41 -59 113 -203
4984 -203 24 -50 -200 94 83 81 -12 98 166 -40 -138 -144 -137 -2 -107 6 144 -47 -69 -30 217 48 -302 -68
5008 -68 -38 -126 78 40 89 224 -197 -25 -266 -93 161 36 -157 20 105 -81 -131 5 -121 109 -215 -175 -21
5031 -21 -14 -217 -181 249 150 24 -123 -252 -85 -191 -76 -151 -243 -59 -101 -109 55 148 271 208 -169 -84 -108 296 148
5056 148 -32 92 106 161 -93 -141 -270 84 44 30 -29 34 25 124 -9 26 144 -83 -14 -103 -18 37 59 269 57
5081 57 12 43 -109 -87 152 7 -79 57 -12 -2 61 -5 185 -359 -70 4 33 140 81 23 210 -268 178 332
5105 332 -82 11 -10 -5 148 16 40 324 -345 -1 -139 -1 53 -124 134 186 -145 -137 -110 -1 -60 47 227 39
$$ packed form
4939B89n61J47L25k77K56j77J6J41j97l1O5Q9K00m36K1J30O5k51L5L30p4q2J74
4962A97l15J53J63o7j87J29l0L9k47L15m60L24Lj24J55J75j12k15J45j00J72l16
4984b03K27p4j50K94j1kr3J10O8k06r8oPJ35j05J13J38j91k2L9K47j69l50K34
5008f8L0q8K04l8M9J35m21J72k41J73K54j25j93J77Q5j86n0J36j26K30l24M0J54
5031b1Pk03L6M30r9j26j47j29J67j06J15p5r2J84m2qJ64R3J23o3l77Q5k4M04j48
5056A48j80J24J4N5k54m8j29L54m0j4n9O3rR9j33L5J18k27O9q9Q5N5K2K10k12
5081E7m5L1j52K2K39j45q6J36o9J0O3o6J90n44K89P4K9J07n9n8J87m78M46J54
5105C32m14R3k1NJ53j32K4K84o69L44j38J38N4j77K58N2l31QK7J09n9J07J80j88
$$ plain form
5129 39 57 -83 89 87 -18 -100 0 -289 -110 35 -43 -15 -10 29 154 -131 -131 180 102 172 9 -206 206 70 161
5154 161 -165 -108 -210 -153 190 -310 -63 82 4 -59 -47 -103 -98 -225 -122 149 326 91 43 127 -11 -307 -78
5177 -78 -393 69 105 35 -161 -67 255 -55 53 126 -31 -41 -5 -204 52 196 -185 -85 -6 223 -40 17 -47
5200 -47 -302 -224 -76 -271 -189 -63 -161 -23 -27 2 41 -106 -199 -96 -52 192 -40 -3 57 -49 48 -42 -51 -135 13 -179
5226 -179 -3 150 -186 42 -40 -47 143 -30 241 94 -26 131 -2 64 21 5 -117 23 163 272 315 57
5248 57 -87 134 72 -58 -44 -168 -13 192 206 -46 -67 -199 238 224 103 -74 174 59 174 -15 62 212
5270 212 42 113 118 128 -143 -83 126 79 12 -191 -351 22 94 52 -28 -107 191 -10 -325 -105 124 51 -28 6 91
5295 91 -132 45 153 -111 -149 22 -10 -227 -37 67 215 -143 276 40 94 30 112 -69 -65 -94 97 -167 86
$$ packed form
5129C9J8j40J72kj05q2J00k89J79J45p8K8NL9J25k85%L11p8P0j63k15M12j36R1
5154A61l26N7j02N7L43n00K47J45p8o3J2n6Nj27J03K71J77k35m8Q4j38k96K29
5177g8l15M62L6p0j96R4L22l10J08P3j57j0L6j99K56J44l81J00P9K29k63N7o4
5200d7k55P8J48j95Q2J26r8J38mK9L9j47r3J03M4K44k32L7O0j06R7r0rq4J48j92
5226a79J76J53l36K28q2pJ90j73K71j47j20J57j33O6m3j6j22J40J40J09M3k58
5248E7j44K21o2j30J4j24J55K05J4k52k1j32M37j4j21j77K48j15J15j89P7J50
5270B12j70P1NJ0k71O0K09m7o7k03j60L73P2m2q0p9K98k01l15K20K29p3p9L4Q5
5295I1k23J77J08k64l8J71l2k17J90J04J48l58M19k36N4o4Q2j81Mk9J91k64K53
$$ plain form
5318 86 71 339 216 -20 168 12 14 45 104 188 -134 -73 -169 67 395 171 -199 -62 -100 -31 -74 87 37 -108
5342 -108 52 -246 -100 -126 -232 -14 23 -284 -167 -174 90 23 157 200 124 19 -60 144 -149 -135 12 -62 129
5365 129 -254 38 -129 -4 40 3 -92 -258 210 65 82 96 179 -80 -104 -173 110 -74 -49 59 35 69 -176 65
5389 65 56 45 222 -143 -41 274 -114 -121 99 -113 13 195 -81 -80 152 113 -70 -6 -31 -13 -69 261 73 -232
5413 -232 -136 57 252 -128 103 -145 -178 211 138 219 2 73 121 -149 -5 7 -57 197 84 -152 -128 45 118
5436 118 288 38 6 -56 81 229 166 -12 -37 247 121 28 -125 122 -99 -20 -208 -137 -45 -52 -121 27 156 -99
5460 -99 -236 -246 -48 -3 -92 131 78 21 -21 -102 -282 29 -22 -50 -135 -41 -30 265 -60 -40 257 -123 -88 -35 -76 223
5486 223 33 59 35 119 113 -235 -45 -48 -410 -1 114 44 -155 -42 164 64 -89 -44 -53 -105 85 -183 178 82
$$ packed form
5318H6j5K68j23k36J88j56KL1N9Q4l22O1r6K36L28k24l70J37l8O9m3J61n0j45
5342a08J60k98J46k6j06K18L7l07J17pK64o7J34M3p6j05p9K04k93J4J47p4J91
5365A29l83K92j67J25M4l7r5j66M68j45J7J4Q3k59k4o9K83j84K5J08k4L4k45K41
5389F5rj1J77l65J02L15l88pK20k12J26J82k76JK32l9j83O4k5J8n6L30j88l05
5413b32R6J93J95l80K31k48l3L89p3Q1k17P1M8k70J44J2o4K54j13k36K4J73P3
5436A18J70k50l2o2J37J48o3j78k5K84j26r3j53K47k21P9j88P1R2po9J48J29k55
5460i9j37j0J98M5q9K23n3n7m2q1j80L11n1k8q5R4J1K95l25K0K97l80L5N3m1K99
5486B23j90K6k4Q4ol48J90ll62M09J15p0j99J13K06j00j53M5rn2J90k68L61r6
$$ plain form
5510 82 -261 -195 -162 259 77 166 252 38 24 -98 112 -40 -28 -38 -180 116 109 9 -182 -54 260 205 103 106
5534 106 77 70 -19 101 44 175 128 131 37 -66 160 -18 126 109 11 35 107 212 -45 -131 286 -171 54 200 -33
5559 -33 49 157 -139 19 78 -41 -174 33 -363 80 214 -115 81 -98 -50 -60 17 220 -79 89 -201 180
5581 180 45 -242 219 36 113 -12 -160 88 -59 -81 -167 -192 -182 -17 -94 216 -42 -77 209 230 -16 159 -58
5604 -58 144 88 109 122 -72 110 176 -82 207 -163 19 19 -323 -1 267 -65 -34 -90 -94 -93 165 -178 2 0 -92
5629 -92 24 -62 -91 -220 -112 -124 -155 -218 -253 -118 299 -28 125 -16 26 -124 119 180 -196 -29 -352 -7 79
5652 79 220 -215 -282 33 157 78 -48 48 271 -153 92 54 242 138 -162 395 110 -95 20 -74 96 -195
5674 -195 15 -200 -11 -295 -47 1 -23 -67 -57 -4 60 58 -27 -36 92 -136 34 -158 -131 -3 104 77 14 135 178
$$ packed form
5510H2l43O6L3M21j82Q9Q6k14j4j22K10j52J2j0j42K96pj00j91J28L14n5j02L
5534A06k9pq9J20n7J31m7Lr4j03K26j78J44j7r8K4P2J05k57q6M17m57K25J46k33
5559c3Q2J08k96J58N9j19j33K07l96M43J34l29J96j79M8j0P7K03k99J68k90L81
5581A80j35k87M61j83P7j25j48K48j47k2q6k5J0J65p7L10k58l5K86K1k46J75k17
5604e8K02n6K1J3j94J82O6k58K89l70J82%l42L22K68l32L1n6mJK58l43J80kr2
5629i2J16q6k9j29J08j2l1o3l5J35M17l27J53j41M2j50K43O1l76J67l23L45Q6
5652G9J41m35o7L15J24p9j26R6K23m24K45l8J88j04l00N57k85k05J15r4J70k91
5674a95K10k15J89k84K48M8k4m4J0N3O4kq5rJ28k28J70j92K7J28J07k7o3J21M3
$$ plain form
5699 178 177 39 20 187 133 -127 -25 -30 -17 36 128 -88 72 -53 52 132 53 10 35 -146 74 214 135 187 156
5724 156 -7 293 77 -145 -48 43 83 -14 24 73 -16 2 53 223 121 166 237 95 -257 328 111 -155 -108 74
5748 74 -390 -33 55 -151 137 -318 -128 -75 -1 36 27 -138 -73 181 -140 273 -193 218 65 -228 16 194 -185
5771 -185 -438 15 98 -163 52 -19 123 -14 -25 231 -248 -71 244 -17 -132 -32 -176 6 -26 -194 161
5792 161 -113 -257 129 -101 100 265 -208 -280 151 56 149 115 18 48 284 -103 -104 -381 33 -97 -177 -223 100
5815 100 122 9 53 73 15 0 -152 -22 -101 -91 -206 0 -8 11 174 -115 -282 -70 -104 -192 176 332 163 26
5839 26 78 88 104 -106 66 -99 128 -177 -53 -25 -37 -6 202 -11 -178 40 42 -26 18 164 43 8 55 -38 -77
5864 -77 51 49 6 122 127 63 76 212 18 235 -116 -216 72 235 183 -194 129 67 107 4 174 -96 176 114
$$ packed form
5699A78jj38j9J67n4k60J02nJ3N3R2k16J60j25J05Q0p9m3K5j81K20J40p9N2l1
5724A56j63L00k16k22R7R1M0r7L8M9q9J8N1J70j02M5P1j42l52N85k17k66M7J82
5748G4m64L57Q8k06K88m55J90N3P4L7rj65O5K54l21M13m66M11j53k93K44J78l79
5771a85k53M53Q3k61K15p1J42j37j1K56m79J77L15k61j15J00j44J82l2j68L55
5792A61k74j44L86k30K01J65m73p2M31r5R3l4r7L0K36l87jk77M14j30q0m6L23
5815A00K2j13M4K0n8j5j52J30p9J0j15K06qJ9J63k89j67K12l4q8L68J56j69j37
5839B6N2J0J6k10J72j65K27l05J24K8j2L1K08k13j67K18Ko8M4J46j21l5M7r3l9
5864g7J28km3J16No4J3J36j94K17l51j00K88J63n2l77L23o2M0j03J70k70K72o2
$$ plain form
5888 114 -2 -21 -15 -301 -135 -13 -171 102 362 24 170 -44 54 -131 -325 -217 -90 -62 103 294 171 -186
$$ packed form
5888A14j16j9Ok86J66J22j58K73K60l38J46k14R8j85j94J08J27K8J65J91j23l57
$$ [...]
8191b
##END NTUPLES=NMR FID
##END=
