##TITLE=1H_SL 18-DNR(f6)
 CDCl3, 8 sc, 
 26.08.2021
##JCAMPDX= 6.0         $$ Bruker NMR JCAMP-DX V2.0
##DATA TYPE= NMR FID
##DATA CLASS= NTUPLES
##ORIGIN= UXNMR, Bruker Analytische Messtechnik GmbH
##OWNER= root
$$ XWIN-NMR		Version 3.5
$$ Thu Aug 26 09:36:20 2021 Russian Standard Time (UT+4h)  she@DPX200
##.OBSERVE FREQUENCY= 200.131506
##.OBSERVE NUCLEUS= ^1H
##.DELAY= (6, 6)
##.ACQUISITION MODE= SIMULTANEOUS
##.ACQUISITION SCHEME= undefined
##.AVERAGES= 8
##.DIGITISER RES= 18
##SPECTROMETER/DATA SYSTEM= spect
##.PULSE SEQUENCE= zg30
##.SOLVENT NAME= CDCl3
##.SHIFT REFERENCE= (INTERNAL, CDCl3, 0, 15.7039)
##AUDIT TRAIL= $$ (NUMBER, WHEN, WHO, WHERE, WHAT)
$$ ##TITLE= Audit trail, XWIN-NMR		Version 3.5
$$ ##JCAMPDX= 5.01
$$ ##ORIGIN= Bruker BioSpin GmbH
$$ ##OWNER= she
$$ F:/spectra/data/she/nmr/H-F/1/audita.txt
$$ ##AUDIT TRAIL=  $$ (NUMBER, WHEN, WHO, WHERE, WHAT)
(   1,<2021-08-26 09:34:44.51 +0400>,<she>,<DPX200>,
      <created by zg, POWCHK disabled, PULCHK disabled
       configuration hash MD5:
       00 E9 B6 7A A2 85 ED C7 34 08 36 98 17 FE 4E 26
       data hash MD5: 16K
       FB 16 EF E8 20 E8 FD 97 4C 3B D5 DD 66 86 77 FD>)
$$ ##END=
$$ 
$$ hash MD5
$$ B5 84 34 3B 14 D9 72 9A 80 B3 55 75 00 DD E1 B0
##$RELAX= 
##$RELAX= 
##$RELAX= 
##$RELAX= 
##$RELAX= 
##$RELAX= 
$$ Bruker specific parameters
$$ --------------------------
##$DU= <F:/spectra>
##$EXPNO= 1
##$NAME= <H-F>
##$PROCNO= 1
##$TYPE= <nmr>
##$USER= <she>
##$AMP= (0..31)
100 100 100 100 100 100 100 100 100 100 100 100 100 100 100 100 100 100 
100 100 100 100 100 100 100 100 100 100 100 100 100 100 
##$AQSEQ= 0
##$AQ_mod= 1
##$AUNM= <au_zg>
##$AUTOPOS= <>
##$BF1= 200.13
##$BF2= 200.13
##$BF3= 200.13
##$BF4= 200.13
##$BF5= 200.13
##$BF6= 200.13
##$BF7= 200.13
##$BF8= 200.13
##$BYTORDA= 1
##$CFDGTYP= 0
##$CFRGTYP= 5
##$CHEMSTR= <none>
##$CNST= (0..31)
1 1 145 1 1 1 1 1 1 1 1 1 1 1 1 1 1 1 1 1 1 1 1 1 1 1 1 1 1 1 1 1 
##$CPDPRG= <>
##$CPDPRG1= <>
##$CPDPRG2= <>
##$CPDPRG3= <>
##$CPDPRG4= <mlev>
##$CPDPRG5= <mlev>
##$CPDPRG6= <mlev>
##$CPDPRG7= <mlev>
##$CPDPRG8= <mlev>
##$CPDPRGB= <>
##$CPDPRGT= <>
##$D= (0..31)
0 1.2 0 0 0 0 0 0 0 0.06 0 0.03 0 0 0 0 0.0002 0 0 0 0 0 0 0 0 0 0 0 0 
0 0 0 
##$DATE= 1629956083
##$DBL= (0..7)
120 120 120 120 120 120 120 120 
##$DBP= (0..7)
150 150 150 150 150 150 150 150 
##$DBP07= 0
##$DBPNAM0= <>
##$DBPNAM1= <>
##$DBPNAM2= <>
##$DBPNAM3= <>
##$DBPNAM4= <>
##$DBPNAM5= <>
##$DBPNAM6= <>
##$DBPNAM7= <>
##$DBPOAL= (0..7)
0.5 0.5 0.5 0.5 0.5 0.5 0.5 0.5 
##$DBPOFFS= (0..7)
0 0 0 0 0 0 0 0 
##$DE= 6
##$DECBNUC= <off>
##$DECIM= 32
##$DECNUC= <off>
##$DECSTAT= 4
##$DIGMOD= 1
##$DIGTYP= 9
##$DL= (0..7)
0 120 120 120 120 120 120 120 
##$DP= (0..7)
150 150 150 150 150 150 150 150 
##$DP07= 0
##$DPNAME0= <>
##$DPNAME1= <>
##$DPNAME2= <>
##$DPNAME3= <>
##$DPNAME4= <>
##$DPNAME5= <>
##$DPNAME6= <>
##$DPNAME7= <>
##$DPOAL= (0..7)
0.5 0.5 0.5 0.5 0.5 0.5 0.5 0.5 
##$DPOFFS= (0..7)
0 0 0 0 0 0 0 0 
##$DQDMODE= 0
##$DR= 18
##$DS= 0
##$DSLIST= <SSSSSSSSSSSSSSS>
$$ [...]
##$SUBNAM2= <"">
##$SUBNAM3= <"">
##$SUBNAM4= <"">
##$SUBNAM5= <"">
##$SUBNAM6= <"">
##$SUBNAM7= <"">
##$SUBNAM8= <"">
##$SUBNAM9= <"">
##$SW= 20.0188882624521
##$SWIBOX= (0..15)
0 0 2 0 0 0 0 0 0 0 0 0 0 0 0 0 
##$SW_h= 4006.41025641026
##$TD= 16384
##$TD0= 1
##$TE= 0
##$TE2= 300
##$TE3= 300
##$TEG= 300
##$TL= (0..7)
0 120 120 120 120 120 120 120 
##$TP= (0..7)
150 150 150 150 150 150 150 150 
##$TP07= 0
##$TPNAME0= <>
##$TPNAME1= <>
##$TPNAME2= <>
##$TPNAME3= <>
##$TPNAME4= <>
##$TPNAME5= <>
##$TPNAME6= <>
##$TPNAME7= <>
##$TPOAL= (0..7)
0.5 0.5 0.5 0.5 0.5 0.5 0.5 0.5 
##$TPOFFS= (0..7)
0 0 0 0 0 0 0 0 
##$TUNHIN= 0
##$TUNHOUT= 0
##$TUNXOUT= 0
##$USERA1= <user>
##$USERA2= <user>
##$USERA3= <user>
##$USERA4= <user>
##$USERA5= <user>
##$V9= 5
##$VALIST= <valist>
##$VCLIST= <CCCCCCCCCCCCCCC>
##$VD= 0
##$VDLIST= <DDDDDDDDDDDDDDD>
##$VPLIST= <PPPPPPPPPPPPPPP>
##$VTLIST= <TTTTTTTTTTTTTTT>
##$WBST= 1024
##$WBSW= 4
##$XGAIN= (0..3)
0 0 0 0 
##$XL= 0
##$YL= 0
##$YMAX_a= 84694
##$YMIN_a= -173234
##$ZGOPTNS= <>
##$ZL1= 120
##$ZL2= 120
##$ZL3= 120
##$ZL4= 120
##$ABSF1= 10
##$ABSF2= 0
##$ABSG= 5
##$ABSL= 3
##$ALPHA= 0
##$AQORDER= 0
##$ASSFAC= 0
##$ASSFACI= 0
##$ASSFACX= 0
##$ASSWID= 0
##$AUNMP= <proc_1d>
##$AZFE= 0.1
##$AZFW= 0.1
##$BCFW= 1
##$BC_mod= 2
##$BYTORDP= 1
##$COROFFS= 0
##$CY= 11.3945322036743
##$DATMOD= 1
##$DC= 2
##$DFILT= <>
##$DTYPP= 0
##$F1P= 2.36226072786647
##$F2P= -0.459571619588291
##$FCOR= 0.5
##$FTSIZE= 0
##$FT_mod= 4
##$GAMMA= 1
##$GB= 0.15
##$INTBC= 1
##$INTSCL= 1
##$ISEN= 128
##$LB= 0.24
##$LEV0= 0
##$LPBIN= 0
##$MAXI= 10000
##$MC2= 0
##$MEAN= 0
##$ME_mod= 0
##$MI= 1.114404
##$NCOEF= 0
##$NC_proc= 0
##$NLEV= 6
##$NOISF1= 3.799351
##$NOISF2= 2.8
##$NSP= 1
##$NTH_PI= 0
##$NZP= 0
##$OFFSET= 15.70392
##$PC= 1
##$PHC0= -13370.33
##$PHC1= 31.00099
##$PH_mod= 1
##$PKNL= yes
##$PPARMOD= 0
##$PSCAL= 0
##$PSIGN= 0
##$REVERSE= no
##$SF= 200.130013532006
##$SI= 16384
##$SIGF1= 3
##$SIGF2= 2
##$SINO= 400
##$SIOLD= 16384
##$SREGLST= <1H.CDCl3>
##$SSB= 0
##$STSI= 0
##$STSR= 0
##$SW_p= 3612.71676300578
##$SYMM= 0
##$S_DEV= 0
##$TDeff= 0
##$TDoff= 0
##$TI= <>
##$TILT= no
##$TM1= 0
##$TM2= 0
##$TOPLEV= 0
##$USERP1= <user>
##$USERP2= <user>
##$USERP3= <user>
##$USERP4= <user>
##$USERP5= <user>
##$WDW= 1
##$XDIM= 8192
##$YMAX_p= 0
##$YMIN_p= 0
$$ End of Bruker specific parameters
$$ ---------------------------------
##NTUPLES= NMR FID
##VAR_NAME=  TIME,          FID/REAL,        FID/IMAG
##SYMBOL=    X,             R,               I
##VAR_TYPE=  INDEPENDENT,   DEPENDENT,       DEPENDENT
##VAR_FORM=  AFFN,          ASDF,            ASDF
##VAR_DIM=   8192,          8192,            8192
##UNITS=     SECONDS,       ARBITRARY UNITS, ARBITRARY UNITS
##FACTOR=    0.0002496,     1,               1
##FIRST=     0,             0,               0
##LAST=      2.0444736,     0,               0
##MIN=       0,             -173234,         0
##MAX=       2.0444736,     84694,           0
$$ Real data points
##PAGE= N=1
##DATA TABLE= (X++(R..R)), XYDATA
0 0 0 0 0 0 0 0 0 0 0 0 0 0 -8 8 -8 8 -8 16 -16 16 -24 27 -32 40 -48 56 -64 72 -83 96 -112 126 -144 160
34 160 -182 205 -230 259 -289 323 -359 399 -443 490 -540 599 -660 730 -802 885 -973 1073
52 1073 -1183 1305 -1442 1596 -1769 1970 -2203 2476 -2802 3201 -3700 4349 -5225 6484 -8449
67 -8449 11976 -20274 84694 -22303 -136966 76883 56106 -32606 10622 48688 -3336 8961
79 8961 9658 11157 28353 5727 -36903 486 24027 3241 -361 13345 -5045 -15845 -4999
92 -4999 5375 -5747 -13811 -9570 -3481 -1640 5814 -1842 -15942 -16456 -14740 -4998 18174 489
106 489 -34936 -11032 17283 -8820 -11004 9201 -11825 -22304 2989 1073 -1991 9878 -20848
119 -20848 -37790 16458 29861 -18471 -17773 5032 -15803 -18128 11811 10034 -12042 -15840 -3939
132 -3939 10086 6141 -10748 -7080 -987 -11939 -1677 20609 8572 -8974 -916 6380 2473
145 2473 -2650 -1466 9917 9049 -4563 6915 21535 4437 -9940 -4481 1292 11119 11944 -4288
159 -4288 -555 11013 -3647 -3682 15120 -2160 -24734 -3830 14530 5512 -149 -3163 -8859 -6897
173 -6897 -3780 157 6510 -4440 -17291 -5699 11267 8415 -7510 -14381 -4357 2594 -4414 -964
187 -964 7988 -3592 -11020 342 2561 -307 1601 -6804 -6507 5272 -2686 -7501 10897 2768 -20894
202 -20894 -3061 15828 -1646 -10072 -3119 -4527 -57 4736 -2009 -167 -262 -11088 -476 16124
216 16124 -306 -15633 -2347 7689 4772 4537 3356 -1100 -3664 -1189 6778 9861 452 -2672
230 -2672 3855 5530 4991 6319 3332 -294 -3940 -1752 11568 12839 -3264 -3832 7305 1918 -1345
245 -1345 5792 1346 -2756 1882 438 3368 10744 -1434 -10657 4175 6666 -4878 444 6921
259 6921 -1636 -4313 1979 7282 5258 -6302 -10000 3846 8529 -361 -1048 -526 -4751 502 6914
274 6914 1674 -5924 -6572 -717 4862 -100 -4509 2539 909 -9249 -3644 4854 -81 -4283 -5537
289 -5537 -5813 2814 5048 -6119 -4523 2388 -6259 -7389 4907 3375 -5513 -3969 -567 1441 2630
304 2630 -2787 -3890 1363 -2159 -4012 5593 6439 -4653 -6013 2245 6999 1630 -4987 -286 4719
319 4719 -1007 329 9474 1227 -8051 824 6515 3042 1864 -1245 -1710 4754 2783 -230 5701
334 5701 2589 -4754 740 4757 1894 3183 562 -3113 2623 4147 -525 3409 2387 -5178 -2136
349 -2136 4912 3402 725 -705 -2220 898 1905 -154 1246 -2113 -5964 1354 6401 261 -3533
364 -3533 -1657 -1152 -754 -929 -1513 786 -1889 -5647 876 5392 -2608 -7646 -3094 -1129 -1005 165
380 165 -1394 -1830 -2639 -4063 -414 2237 -3857 -6913 -915 679 -1007 -157 -534 -2264 -2672 -4292 -1003
397 -1003 4984 517 -6538 -678 3871 -543 -285 1388 -2132 -2995 443 4194 3769 -2187 -4803 2658
413 2658 3948 -2088 536 3457 -2614 -2472 3709 3922 414 -3254 -2018 4117 4080 -2032 677 3434
429 3434 -1989 -1796 3255 2828 2052 -228 -2782 2992 5743 -1046 -2336 2054 499 -110 3070 2569
445 2569 1443 -719 -3629 1001 4158 -1935 -2277 2624 -932 -3272 2507 1835 -4044 -5382 -1929 1592
461 1592 1494 -2795 -2592 -556 -3544 -3175 1933 -1134 -6392 -2834 1868 1787 -1017 -4396 -2504 1086 -2534
478 -2534 -3373 3126 2148 -3194 -972 1361 468 1689 29 -2817 261 3145 1047 2320 1588 -3033
494 -3033 -707 4104 1992 -264 1200 1004 1296 1890 1148 2527 1878 -2421 -330 5891 4393 -886
510 -886 -258 2387 2044 1209 2169 4287 1148 -1243 2900 5359 1373 56 1099 43 2613 3914
526 3914 641 781 1290 -2234 311 4128 -489 -3254 1234 687 -934 750 -918 -2999 -946 -2381
542 -2381 -2614 2804 184 -6110 -2008 1095 -3279 -3609 377 -1068 -3823 -2254 718 1652 -1799 -5675
558 -5675 -2052 1871 -280 -1816 2 -533 -1785 -713 1069 291 -3083 -2747 1154 1172 -1411 349
574 349 21 -2431 -1270 729 -102 -16 -306 -2061 519 2091 -977 -1230 763 -591 -1185 1107 2503
591 2503 1582 -840 -2378 1414 3772 -141 -1167 2171 1215 -114 2477 2604 -546 -1800 212 3162
607 3162 2530 -1318 -265 2691 -689 -2159 2154 1399 -2295 -1259 544 354 703 -737 -2181 -290
623 -290 -789 -1720 1752 1229 -3200 -1947 928 164 -899 -342 -2113 -674 1386 498 -282 358 -913
640 -913 -2345 432 2082 -632 -2441 862 1978 -2034 -1669 2008 633 -2627 -1355 1455 1327 -72
656 -72 -1979 -1776 503 -303 -1559 1499 314 -3449 8 3436 -415 -2274 468 -651 -242 2314
672 2314 439 -1039 1010 456 -405 2154 1351 -1371 1431 2215 -196 1342 2349 360 -493 -182 775
689 775 2718 2323 -1233 -384 1939 1431 -376 -195 1454 425 -1129 1260 3718 -51 -3046 384
705 384 2011 -31 270 688 116 533 -62 103 1116 -449 -1911 946 1375 -837 509 1161 -1610
722 -1610 -1624 -19 402 255 -460 -1683 -121 995 -570 -1274 -669 -1337 -1197 -438 365 106 -1995 -2783
740 -2783 -63 829 -1989 -2207 468 -495 -1565 -231 -50 -528 -1734 -2188 380 1947 -937 -1044 1403
757 1403 -316 -2064 1286 2042 -1149 -1295 804 1580 1062 457 -643 381 523 -285 802 1906 259
774 259 -777 345 1516 1297 -469 -441 1045 905 559 1018 1222 138 -529 22 1278 1932 -139 -650
792 -650 1639 905 -811 1220 1378 -1919 -942 2539 1666 -392 -109 -374 2 -161 -226 505 613 -1639
810 -1639 -757 1567 431 -1678 -676 -416 -905 -425 208 231 -712 -1441 -1314 111 -324 -861 -1100 -1072 -256
829 -256 -7 -962 -821 -584 -1700 -1377 1197 282 -1680 -920 -61 -209 -432 -610 -152 123 -743 -564 2028
848 2028 467 -2245 -618 1192 -547 -263 1154 140 -716 -78 715 1282 -217 -1505 346 1505
864 1505 537 293 1285 458 -458 80 1269 1512 369 -561 597 1407 836 236 353 166 301 149 643
883 643 1774 539 -1863 94 2053 182 -1000 598 674 -389 -57 737 420 -273 -1276 -122 1398
900 1398 -15 -970 284 -185 -1471 -188 636 -686 -1281 -1116 -218 532 -593 -1099 -753 -1020 -1041 -45
918 -45 437 -778 -826 -695 -785 163 -362 -1187 -236 18 -193 711 761 -611 -1088 -319 359 702 56 -161 553
939 553 495 -537 709 1484 -839 -940 1023 1735 602 166 230 1119 323 -208 1344 1289 -490 -271 1407
958 1407 1007 446 87 82 479 745 329 932 879 -423 -251 1218 708 291 94 207 509 1046 129 -31
978 -31 137 -824 -926 1193 1259 -700 -636 254 -40 -340 -635 261 12 -1677 -1029 1494 458 -1757 -1134
997 -1134 -140 -550 -725 -243 -114 -303 -1006 -544 643 -182 -1545 -900 206 -381 29 254 -316 -912 -423
1016 -423 -401 254 399 -743 -963 612 322 -413 -601 -388 -428 -255 -15 565 289 -1003 -750 599 387
1035 387 -643 -91 431 -113 -244 567 702 -569 -1110 322 951 212 -84 884 193 -447 211 1095 211
1054 211 -515 -170 650 1028 370 -194 315 130 -143 756 587 81 30 -231 -2 750 49 -597 522 161
1074 161 -360 204 844 -253 -648 -671 -97 451 -123 -942 267 472 -916 222 624 -564 -1406 340
1092 340 713 99 -289 -325 -144 -228 -511 -494 370 -256 -1154 -251 674 -326 -568 -224 -338 -847 -33 300 -19
1113 -19 -1050 -358 -226 291 363 -565 -788 395 934 -266 320 567 -802 -744 904 994 197 -271 66 835
1133 835 727 -339 238 1241 -98 -413 1410 1499 -98 49 892 14 75 697 406 145 123 74 528 995
1153 995 -307 -458 624 406 312 615 -67 -403 -4 350 368 38 -146 -368 263 216 -417 -193 -39 -44 -390
1174 -390 -213 765 -74 -736 -798 226 -295 -522 -647 18 -378 -853 -382 646 -541 -1629 -488 356 -180
1193 -180 -804 -112 -371 -763 -170 -63 -437 -416 -633 275 373 -192 -48 380 -235 -792 409 682 90 54 11
1214 11 -124 625 476 -335 -20 751 11 430 1115 525 -433 -3 364 800 388 -262 98 1201 343 -360
1234 -360 887 588 -664 17 1048 675 -60 610 322 -171 -294 324 637 312 -312 -170 524 631 -498
1253 -498 -345 254 -33 -270 371 239 -537 75 50 -319 -33 -95 -882 15 394 -710 -336 193 -670 -1151
1273 -1151 -144 197 -180 -426 -572 -758 -202 -322 -476 -83 -449 -958 -38 506 -540 -821 -158 -90 -450
1292 -450 7 220 -209 -339 -115 244 -106 -479 -298 -72 234 -274 177 406 -304 -140 -33 187 346 0
1312 0 5 218 432 398 58 173 692 27 -71 912 539 -85 -169 135 570 151 -62 582 455 206 248 820 200
1335 200 -721 22 637 -239 75 278 390 -318 4 -105 79 -4 -419 -259 488 -91 -524 -62 -210 -657
1355 -657 -176 47 -189 -64 -178 -248 -215 143 -552 -710 -43 -269 -319 70 310 -671 -536 -248 145 -173 -498
1376 -498 -29 142 -174 -375 135 259 -521 -601 324 495 -98 -290 337 -132 -225 95 465 -164 -152 562 558 400
1398 400 -10 -299 472 542 128 135 583 -36 -67 163 172 501 251 182 240 516 294 26 438 343 -332 102 677
1421 677 682 31 14 249 245 -246 -155 111 -41 -432 371 297 -11 -366 -258 304 -356 7 1 169 -197 -302 184
1444 184 157 -198 -450 -261 -137 -264 -47 -81 -529 -413 -338 -158 144 56 -294 -194 -82 -171 -557 -386 -187 -219
1466 -219 -400 67 127 -441 -410 -137 52 -222 36 30 -64 -248 -64 592 182 -470 -163 230 237 -209 458 482 4
1489 4 -102 29 189 103 -81 311 297 508 -177 -110 441 373 169 290 384 44 -61 -65 525 443 -1 15 274 458
1513 458 50 233 730 294 -137 -11 381 227 -259 -31 473 42 -168 274 248 -258 -540 112 345 -113
1533 -113 -438 -60 179 -343 -246 36 -271 -289 -174 129 27 -114 -325 -322 -229 -448 -78 -119 -315 -133 -210 59
1555 59 -260 -140 -464 -136 2 30 -268 95 -303 -458 -221 137 229 -478 -26 219 171 -116 -190 199 209 -600
1577 -600 304 458 -20 -24 182 535 -146 61 527 161 -267 -124 531 311 -17 -108 131 59 170 318 258 72
1599 72 147 25 221 -113 227 -122 88 288 35 228 -241 1 -22 -43 110 271 -539 -223 -4 -49 -246 -312
1621 -312 30 84 -292 -191 62 112 -539 -553 -304 -73 -383 -68 118 -145 -371 -188 -178 40 -676 -347 40
1642 40 117 -224 -290 -207 -210 -385 -94 -30 0 -25 43 87 109 -422 93 68 198 -70 -125 43 178 -128 -203 223 -77
1667 -77 -38 151 452 -25 -385 74 248 28 61 180 513 427 -51 5 342 -92 -66 417 320 -121 337 108
1689 108 -6 525 -27 -11 93 162 -58 202 157 -201 13 96 -3 -103 92 13 209 103 -82 -28 -58 -371 -399
1712 -399 24 509 -202 -489 130 37 -280 11 116 -70 -425 -36 -104 27 -117 -43 -310 157 -37 -110 245
1733 245 -48 -425 -97 -74 -287 -99 69 -297 -62 7 5 277 53 -456 -214 28 -64 -293 -60 27 212 147
1755 147 34 -355 281 -140 149 368 176 -295 175 84 -372 -116 314 180 162 41 347 434 150 40 -126
1776 -126 247 72 334 244 217 -89 15 136 -91 -344 -289 21 -136 14 31 -100 5 -61 -439 313 14 -323
1798 -323 153 -109 -78 -21 -177 -4 -185 37 -141 240 -111 -366 -334 178 147 -339 -202 118 -207 -390 95
1819 95 43 -124 -190 -146 375 -193 -371 119 51 -308 -142 361 241 -88 -9 306 -21 -112 20 -61 -113 -36 99
1842 99 27 61 70 -172 9 396 -201 154 197 303 129 314 24 -14 62 -70 31 102 120 -6 -39 184 -196 21
1866 21 206 163 -161 87 195 176 245 185 163 -306 74 -88 404 91 -103 12 456 -72 -260 -159 -6 -12 124
1889 124 -60 173 -185 -116 -5 11 -122 -207 -81 -163 -237 -264 -427 -257 -66 -269 -89 254 -58 -121 -218 -108 -178
1912 -178 -58 -99 -23 -37 -109 87 -2 -103 -196 202 36 72 -221 103 220 64 -169 91 -141 -216 -137 26 -18
1935 -18 -158 111 243 -20 -68 -40 373 123 109 82 55 323 222 292 29 -4 -27 321 40 117 -126 -211 205 261
1959 261 -131 -6 147 72 -186 -71 208 -15 -152 -61 62 -241 -7 11 218 -263 -17 206 206 -195 -108 -21
1981 -21 31 61 -230 3 -67 -257 -316 180 -69 -197 64 -310 -301 -194 -455 -34 18 -115 -321 176 -135 -304 -97
2004 -97 -208 87 -73 24 25 -37 -11 117 -244 -42 -177 -87 20 293 -2 -61 309 136 7 107 429 52 90
2027 90 -134 242 235 267 -99 268 12 182 101 266 48 189 -44 -73 -2 105 105 85 -2 -14 -231 297 232 -12
2051 -12 127 174 -93 147 85 -135 -251 102 -47 -98 84 -96 221 79 -16 -279 63 -82 -12 -86 -41 252 -246
2074 -246 -121 99 -106 -85 -274 -208 19 -144 -92 -165 -353 -288 -186 -180 -167 -4 -242 -152 76 -138 225 -165 9
2097 9 337 201 67 27 -262 -167 -130 167 -65 5 163 204 -224 -25 259 -191 -186 -251 269 -158 218 119 102 44
2121 44 -100 276 3 113 31 114 115 71 117 332 253 334 259 -118 138 -38 -48 144 -56 77 -83 -311 39 211
2145 211 35 -17 104 110 -241 60 -165 24 -84 -13 195 -67 -16 -104 -22 5 -170 30 262 -73 -184 -137 -45
2168 -45 20 7 -398 24 -247 107 -37 -56 1 -235 -209 10 -159 25 -216 -108 -182 -70 -33 -217 -42 210 324
2191 324 -138 -12 -93 -56 -108 -3 -15 -57 74 41 -42 111 186 -220 -31 1 88 37 -31 -4 224 172 23 280 73
2216 73 48 60 182 37 196 43 -102 76 -176 59 -13 211 192 287 30 -51 -254 119 218 75 115 84 134 224
2240 224 295 -78 -362 140 63 27 35 32 -207 -292 8 -140 -51 97 73 -31 92 -228 -51 -115 133 207 -310 11
2264 11 -19 -29 -42 -131 -109 -96 -33 -108 110 -79 18 -208 83 -212 -412 67 92 -201 -192 207 88 33 28 173 8
2289 8 158 185 -295 162 268 315 180 -57 -15 -4 -57 -16 -218 -29 -6 97 310 335 -114 160 209 -99 156 -78
2313 -78 -13 -124 -154 -102 162 -170 -38 -58 -87 -122 -37 -8 -68 66 -339 147 43 11 -34 -4 6 19 -126 278 -24
2338 -24 240 -124 14 -246 -9 4 181 185 -145 -115 -74 115 -81 -411 1 107 -163 -103 -140 86 -159 -203 107
2361 107 -161 -20 308 -60 -236 -91 -137 -106 -182 -82 -165 85 -282 -45 73 45 4 -17 -35 -300 141 80 36
2384 36 129 -112 213 214 3 -66 -258 -281 333 170 16 -71 159 24 -258 131 158 17 -32 -32 129 108 29 101 108
2409 108 -26 -108 -128 102 103 76 -248 -58 15 -11 -103 149 -295 -65 -30 -26 -206 -139 -76 3 -8 -9 -332 -114 -131 -304
2435 -304 28 50 -481 49 -9 -93 -8 -166 -247 6 -47 -8 260 -205 -244 -341 44 -43 -7 0 29 42 33 152 117 -104
2461 -104 -63 148 88 262 158 28 94 5 67 -49 265 19 -241 132 -31 123 18 -180 -142 150 67 -124
2483 -124 178 183 110 -117 274 -32 -23 16 283 189 316 426 201 7 -21 115 181 61 -88 97 -22 155 71
2506 71 -150 -68 -122 128 188 -171 25 -58 -68 -130 -46 262 -92 -9 -134 -162 15 -260 235 169 -257 -101 -33 -125
2530 -125 -78 98 -27 -53 -16 264 18 -158 178 -65 -209 -294 -94 -185 91 146 64 215 -137 78 153 61 13
2553 13 81 136 84 -42 50 113 142 38 140 23 175 -140 39 -102 63 155 -20 182 27 71 -394 140 -41
2576 -41 81 -140 227 253 -90 -215 192 67 134 175 -130 -15 228 -114 13 359 -99 -82 103 208 -49 165
2598 165 296 92 176 11 165 194 -98 114 -22 24 120 -118 -72 -85 -230 -81 153 21 -37 -134 -73 -88 -11 24
2622 24 -100 17 101 -42 -56 93 12 184 63 -130 -52 -352 -50 -279 153 5 1 -270 -69 131 -72 15 220
2645 220 -142 -81 29 142 -14 -277 -21 -118 -187 -72 -73 263 -28 -35 195 103 0 91 -84 63 -50 140 65
2668 65 14 -25 152 -29 228 -35 195 37 -27 -39 -217 40 -61 89 -9 7 245 72 123 76 -90 -53 -124 -95
2692 -95 272 -46 309 -36 149 143 -152 5 304 -113 -12 -26 -125 96 -130 -217 -81 -42 -222 194 57 51 -222
2715 -222 103 -11 -61 182 -156 -61 141 4 -119 -219 169 -177 143 23 235 15 -119 -70 110 -88 6
2736 6 -148 -277 -113 202 59 -100 134 73 152 73 202 -15 -77 -26 -29 121 -163 -64 251 207 293 326 191 29
2760 29 -39 213 -15 163 140 43 166 77 -134 -291 -3 34 94 64 121 -198 117 93 -151 -48 -44 -98 -45 -1 -32
2785 -32 -4 -63 -172 -150 25 -54 76 -156 -10 379 210 33 15 -397 -301 -42 50 309 238 9 -137 -158 149
2808 149 35 -165 -4 -215 -229 147 159 -51 -40 -173 -145 -183 -64 -234 246 27 244 -205 -150 5 -152 -112
2830 -112 95 191 -272 258 -9 -233 -92 -185 -46 -115 -144 -323 13 11 -47 210 191 -117 10 96 25 163 -67
2853 -67 178 51 -12 8 17 -30 104 63 66 -79 137 -170 -87 -80 -148 -219 -184 51 -232 -131 109 -90 -22 91 11 138
2879 138 240 -127 8 -142 -177 -107 -141 125 -81 -299 -133 131 -74 83 -21 5 60 -248 -231 26 161 -35
2901 -35 -294 -303 -155 -248 -102 -140 -107 -138 -7 -32 -123 137 -44 232 -159 -198 -306 81 200 42 25 171 79 -26
2925 -26 62 -121 61 -69 44 40 93 284 127 14 20 -3 -23 -275 -48 -177 32 -88 -65 -124 188 27 1 -18
2949 -18 199 137 -107 -26 59 -89 195 -94 70 35 -20 113 12 -37 -316 104 -147 -157 -128 99 173 -340 -129
2972 -129 -87 -129 80 -272 134 51 -30 -166 -77 29 -178 251 -192 -132 -225 -163 159 -122 -57 101 -67 -187 -287
2995 -287 19 -80 46 -37 48 -11 -121 -100 -130 -89 33 -61 -174 -61 -101 39 -90 -41 47 219 143 -72 -36 8 -56
3020 -56 168 -15 102 129 229 -128 -122 -242 -150 13 28 143 50 -87 87 167 111 -25 38 -75 240 196 104 58
3044 58 183 -22 336 -62 43 -150 -171 -124 -16 80 271 -53 -194 -20 4 -201 -147 224 17 -130 -103 32
3066 32 -126 -216 77 -7 16 -8 172 -278 -238 -128 17 77 239 -60 57 -16 -58 164 -90 -62 -13 73 -123 18
3090 18 -109 -66 -130 364 98 -10 -100 -125 -3 -78 4 237 -86 58 -15 -2 124 -124 -9 60 -106 -29 60 49
3114 49 0 180 -93 251 39 143 152 -40 -162 11 281 -39 -136 66 -137 72 -167 -157 103 -32 -65 101
3136 101 -119 -36 -50 -49 -218 -104 -155 -174 292 86 -39 183 169 -133 -49 132 230 51 15 -261 -49 -6 -36 114
3160 114 -75 176 32 110 36 2 306 -46 -51 -174 -92 300 8 -205 108 107 -94 3 -61 101 131 253 41 -9
3184 -9 -262 -140 -41 -179 10 77 40 4 -4 -225 -148 -51 -49 116 -84 0 -116 -103 48 -188 -79 -101 248 -26 82
3209 82 78 -95 -133 -245 252 -143 118 -105 70 93 -65 97 77 149 177 9 233 158 109 -87 24 176 52
3232 52 -7 120 98 115 187 122 -46 -3 78 -90 -149 -15 31 -226 36 -55 26 -156 -34 -50 -58 258 58 -252 -214
3257 -214 274 -344 -233 -59 -143 -27 -44 97 45 -52 46 -53 350 -12 104 -359 -7 18 3 -191 -197 -68 -81 -20
3281 -20 40 -75 -131 272 -13 -62 -123 -105 49 139 107 99 277 136 -137 -11 173 -141 104 -18 -40 37 -230 35
3305 35 -41 -114 -272 50 -189 -12 -104 -102 162 -128 -213 -42 -25 242 -56 18 -72 -161 -192 -35 29 175 -107 -1
3329 -1 -105 91 154 113 -230 111 -71 -42 -168 -149 -43 -29 138 -12 172 -95 -12 -113 61 126 -118 -179 -24
3352 -24 0 169 4 101 -26 61 106 -38 -16 24 -20 -85 126 -3 147 -280 372 -10 -126 144 -50 387 3
3375 3 76 235 181 -91 15 207 -62 -61 -203 -30 -326 137 14 -122 133 203 13 65 91 -183 -108 -68 65 -175
3399 -175 -101 402 -158 163 -32 137 21 217 33 -91 85 -225 -112 -15 196 111 -186 -95 76 14 285 230
3421 230 14 233 53 -42 16 118 135 52 158 37 -26 -178 107 -79 -150 -212 -53 80 -40 -59 -152 1 -19
3444 -19 -145 31 -158 99 -174 -191 -114 -131 -300 55 24 -159 -131 61 56 -362 -70 -34 28 -79 242 -175 81
3467 81 138 -351 -220 -98 110 -106 -124 -308 189 -1 -153 61 187 163 140 -235 2 -2 -32 103 -113 -61 -105
3490 -105 244 -62 -106 77 128 10 -133 32 359 -36 143 -187 15 99 231 97 -113 -46 54 106 -255 79
3512 79 184 109 157 97 35 -185 -175 -25 176 200 35 -61 80 18 -72 192 -94 22 120 84 -16 126 50 -5 121
3537 121 176 -140 310 -56 -66 113 70 -59 -118 -31 48 153 152 -158 236 82 -80 106 4 125 257 141 234
3560 234 -40 -5 18 -212 -152 59 187 14 2 81 29 -71 -12 32 96 221 -201 212 -6 -72 207 187 -108 -14
3584 -14 156 -104 -103 32 163 21 181 -26 222 -163 -21 26 8 -15 30 81 -164 -239 88 -80 0 -198 302
3607 302 -93 295 -5 -291 -69 78 8 -275 -160 208 117 -10 186 -70 -21 -4 -57 -110 -190 11 -140 32
3629 32 -7 -52 174 -212 248 82 252 255 -165 -44 -163 0 -266 -111 -156 38 -15 107 135 62 -9 3 79 -170
3653 -170 -101 -166 -251 -151 8 -62 115 -72 -51 101 98 -156 -74 254 -40 182 160 176 -110 148 181 -164 146 -98
3677 -98 18 91 -40 -84 237 159 -16 -122 71 -54 -33 107 -51 119 3 -224 186 -31 -107 -25 -78 152 103
3700 103 68 170 65 -38 -46 -42 -163 147 149 -219 -151 -32 258 79 -56 236 -48 41 -117 34 32 -161 -157 -66 -230
3725 -230 -34 84 -77 55 -89 120 -76 -223 -137 41 -127 -126 -130 -17 96 13 188 373 101 188 -74 199
3747 199 -21 -162 102 29 42 194 -48 207 -6 101 -179 181 60 -125 -34 -26 72 77 29 -193 55 -31 199
3770 199 -280 -31 -8 207 2 -19 10 -238 5 100 19 16 -4 -158 84 -20 117 150 50 -108 -31 -44 285 -33
3794 -33 22 96 156 41 85 -146 234 -113 93 -17 154 104 -151 20 -279 -60 -200 61 -154 -164 -118 77 79
3817 79 227 -170 -1 -134 123 275 -173 -41 1 -135 -51 -26 -79 -65 -146 119 26 6 96 109 66 143 56 -203 -146
3842 -146 -86 -145 -218 110 59 -199 -140 196 122 157 -72 190 -15 27 121 -49 57 -13 -156 -76 35 -134 -146 34
3866 34 -80 -59 168 347 78 -13 -64 20 -14 46 86 116 190 -177 -75 -97 51 -1 124 -221 -67 40 -162 103
3890 103 -51 -49 271 73 38 -160 122 18 -164 -20 -93 146 82 295 -137 -14 -44 11 -105 137 33 -101
3912 -101 -39 -91 116 -180 -230 63 102 50 95 33 54 233 197 -97 105 164 48 -192 -139 -90 111 106 -157 153 5
3937 5 116 112 202 73 -82 179 -96 77 150 -139 38 -62 228 141 307 34 -11 218 -67 259 51 282 16
3960 16 125 -110 -214 113 30 37 -39 -214 102 94 -21 54 78 70 39 -56 111 -97 35 115 83 -127 27 -70 -214
3985 -214 79 42 126 9 -102 -190 -23 52 -193 139 -40 -102 -28 -181 12 -238 133 -21 -138 -85 -3 20 -48
4008 -48 -52 -238 -8 82 -180 25 49 -100 -160 -142 -111 -57 110 -71 -262 218 3 -64 -181 184 -172 34 27 -67
4032 -67 115 25 -125 47 6 -20 70 35 -4 107 161 -144 -183 -158 72 -14 66 63 129 29 201 -128 -33 -109 -69 316
4058 316 94 181 67 -85 -14 41 12 122 -26 -121 -189 -147 4 30 -187 38 111 152 -99 -183 198 -7 -199 231
4082 231 -74 61 -72 59 73 -162 130 -177 209 -247 72 -46 59 -289 -92 -16 -149 -170 448 -249 109
4103 109 69 -288 -36 -220 52 95 -163 92 149 328 9 -88 160 -94 -106 -40 144 -69 209 -20 99 -25
4125 -25 5 63 29 235 218 148 70 -55 -70 137 149 194 -77 -6 -210 63 83 20 196 265 90 -424 -296 62 -71
4150 -71 -244 109 -97 -127 60 72 -92 -37 41 14 -118 322 -73 6 -201 -46 -176 -304 59 68 6 75 -38 44
4174 44 11 28 -250 113 20 -90 160 -24 151 -139 -138 8 -175 -187 148 -246 -9 -14 104 -149 172 -4 129
4197 129 135 -152 -10 -4 176 0 6 76 -116 165 13 80 123 -110 -49 91 -218 168 18 33 -183 -208 -165 130
4221 130 103 -211 -226 96 58 -161 213 -145 -12 7 -86 -27 32 -144 -67 -246 -68 -130 524 49 114 -7 119
4244 119 -70 -62 92 -167 36 203 -61 -53 17 -78 51 -167 -64 -228 81 48 -173 68 -131 -86 -112 -231 -23
4267 -23 166 -48 -99 28 -53 -131 42 117 75 -159 61 -150 240 -106 -219 -86 11 21 216 -26 -129 -190 93
4290 93 -31 64 116 -237 -87 201 93 9 -22 177 89 109 105 110 -78 150 -81 243 46 124 -22 71 -63 201
4314 201 54 160 422 140 -99 -83 -19 -38 -100 177 38 107 41 44 277 -160 256 -39 -60 -28 208 -85 144
4337 144 -33 -13 -3 -73 88 -110 48 84 -171 87 156 142 132 -172 55 -42 17 13 -50 -94 -154 90 -65 89 -103
4362 -103 -319 -125 146 -47 123 -32 138 -64 -350 -2 85 -155 -11 -311 -113 -4 66 229 15 -109 -195
4383 -195 -185 -175 -160 85 -157 57 54 -150 -156 106 -28 -108 33 -64 -242 -13 217 128 167 -77 18 -12 -99 102 96
4408 96 -43 353 138 62 75 30 -28 160 33 6 337 16 108 9 329 165 -178 -80 -30 231 -101 -19 -206 -96
4432 -96 155 215 -361 -302 66 202 103 -67 108 71 -59 123 47 -56 7 167 -145 -210 318 -94 -202 -165 134
4455 134 -130 -155 -73 121 -101 148 18 44 -32 -100 -99 -128 6 -48 101 -62 145 -116 -224 -50 -143 53 210
4478 210 -36 -48 -132 -140 86 62 -220 -79 84 117 60 -46 -9 49 78 -180 7 -4 96 11 126 4 73 109 166
4503 166 318 100 -115 -193 -213 140 -74 -108 11 -160 155 183 -118 10 -91 66 104 206 242 293 18 154
4525 154 -89 -309 -119 187 -218 218 -80 -6 -110 -98 53 -269 194 -2 -132 -253 -129 -74 -15 125 -35
4546 -35 210 153 -228 6 -168 -107 -180 -113 25 47 183 75 -134 186 -196 164 -203 14 -100 52 -58 -1
4568 -1 40 100 30 35 134 -75 -98 42 98 -54 -131 -102 -109 72 184 -90 56 51 24 -215 -38 162 -109 7 31 161
4594 161 118 -108 -104 82 110 -138 -59 -223 6 -57 -326 140 -20 -150 -167 229 24 35 -45 -38 53 -133 -37 11 -132
4619 -132 34 52 -227 44 115 94 -51 17 -39 -199 52 102 26 227 -83 -120 94 -200 17 3 -64 -137 36 61
4643 61 -1 43 -118 170 185 -125 324 -118 -131 -216 -10 148 -3 -227 69 -34 -227 151 33 132 -217 165
4665 165 154 -30 -106 52 89 -150 213 -70 202 108 34 177 227 86 -55 -81 -90 28 -17 -151 -23 -94 -20 -121
4689 -121 81 186 -231 -16 127 132 -116 -12 -58 -45 162 -69 44 152 -82 73 11 284 -146 -66 57 -184
4711 -184 -36 -51 -89 -114 127 -215 60 -112 -181 122 114 149 76 -142 -390 -26 47 56 101 -68 12 -2 -158 95 -366
4736 -366 198 99 -4 179 77 -86 -176 97 -76 -140 -22 110 8 -62 -15 -46 153 228 3 -151 73 56 -104
4759 -104 -36 440 103 -417 -89 -63 -56 -254 60 -108 12 12 -205 -94 -146 116 296 112 54 -188 84 150 -8
4782 -8 61 -25 -147 -89 92 162 -75 83 -32 -491 -323 56 -28 4 87 -140 -111 93 -159 -104 119 54 -120 98
4806 98 46 149 -46 84 160 -189 52 32 300 -212 245 106 -190 -326 136 146 -97 98 141 23 10 59 41
4829 41 46 -308 -56 -125 39 -1 42 -38 102 -19 -71 -102 2 94 -12 -172 192 -209 -27 -206 -6 -281 99
4852 99 247 -184 151 131 149 -26 -217 -196 181 -43 146 269 3 145 278 128 -28 -156 -194 261 -14 -126
4874 -126 91 27 58 146 -294 155 52 -60 110 -94 145 -223 126 58 -90 56 174 -119 22 -75 -165 302
4896 302 71 6 204 130 -55 -113 261 -59 120 241 33 65 -164 -37 -116 8 -24 13 -70 -192 -207 -140 49
4919 49 -92 -107 268 7 12 213 -18 -39 -87 -52 63 48 19 13 -155 -95 114 70 265 -227 33 -120 168 -60
4943 -60 12 161 -14 50 63 152 -3 64 259 -82 -84 244 -35 1 73 70 100 183 -24 -175 121 173 -170 8 363
4968 363 -99 192 -34 175 -66 -185 26 162 253 -76 -94 172 -11 -86 261 74 170 96 109 -75 -75 -43 -189
4991 -189 89 -80 -9 -57 -156 72 -143 30 145 154 145 155 86 231 204 -99 36 -120 66 213 -156 -60 -98 113
5015 113 77 154 60 155 213 174 389 228 -283 -119 -139 -56 -89 -63 218 -8 -318 74 -238 -126 -60 18 -22 -207
5039 -207 -74 -131 -252 -164 -61 -181 163 88 90 77 -180 -140 -22 20 -221 -147 25 263 -81 -17 -94 -292 185 -12
5063 -12 -203 121 -47 71 -208 80 7 -174 -21 -84 -238 141 259 33 -309 116 -120 109 -92 -257 -154
5084 -154 -200 -69 -103 -103 -42 -224 47 -47 -40 114 89 -168 -9 17 50 220 97 -122 268 -169 -145 -66 -21 -31 122
5109 122 58 77 -7 165 19 257 -101 -126 23 -180 -126 140 82 -128 120 -169 78 88 -27 -81 -6 26 201
5132 201 63 12 151 -182 153 163 122 51 1 19 -61 -80 26 156 -82 63 -20 124 10 131 23 17 -123 141
5156 141 -5 -162 200 -121 169 -136 -118 102 -6 -16 14 -76 42 -81 71 49 -278 97 -33 -43 -89 63
5178 63 159 -11 -129 -96 32 59 -76 -82 -143 -32 107 109 -180 -5 -11 -277 133 -19 -8 88 -93 -42 -23 65 199
5203 199 37 -81 199 166 35 79 313 -95 189 156 -223 222 56 -8 -108 -151 128 -173 80 134 -91 22
5225 22 31 81 3 -227 -18 -55 44 -138 201 208 -169 -30 103 -155 -27 -220 229 -24 -39 -99 70 -63 -13 -240
5249 -240 -17 99 -3 307 -121 9 -127 73 252 -366 -144 -2 -157 223 -22 -114 -140 241 419 -87 -141
5270 -141 203 259 3 -89 70 -35 108 135 -178 -144 110 -174 293 -116 173 89 -100 -15 -55 43 -153 3 -104
5293 -104 135 34 195 -103 -29 -77 -126 -311 -280 -177 -88 -73 -181 107 -11 -113 -9 148 80 27 8 66 -198
5316 -198 -8 -43 -135 92 -245 -121 232 -32 92 145 19 249 -206 -303 167 85 16 226 94 -23 10 -189
5338 -189 33 -27 166 -19 -158 63 -99 -85 99 178 17 90 75 -25 -48 173 -130 24 14 -54 -31 254 -230
5361 -230 54 -247 -116 -174 -135 146 216 -19 13 65 -265 -209 -286 -15 -174 -23 -195 -84 110 31 -158 -55 107
5384 107 61 95 -162 -71 23 218 -108 -9 138 36 128 97 -67 136 60 38 8 -62 150 11 92 -253 23 -26
5408 -26 50 -19 -252 -32 -59 -267 -305 72 -240 72 -61 173 63 100 -47 -40 76 -225 22 -18 247 52 18
5431 18 72 -8 183 113 -203 13 -244 154 -69 103 64 145 -180 -126 243 -133 -299 130 -87 40 -130 -27
5453 -27 10 -188 -79 -72 139 -88 -16 226 202 137 38 -80 -151 -31 236 -79 107 -24 -97 38 192 142 61 226
5477 226 -161 -229 4 126 68 -49 -192 -131 197 -43 -174 -104 -141 315 23 2 -163 20 135 -25 9 -163
5499 -163 -39 -51 7 -56 55 69 -63 -18 -445 -108 9 -69 -133 -106 105 88 -293 -55 -154 -25 -58 115 15 -49
5523 -49 197 -106 182 114 129 -62 34 -151 -108 73 -108 -48 -112 62 -120 -113 -135 6 100 341 83 22 185 -199
5547 -199 3 104 -74 -158 47 171 150 -104 40 -161 99 -107 -325 -339 189 223 104 83 36 -143 80 28
5569 28 66 -115 180 45 85 16 -92 -264 29 7 -295 -39 -83 22 -21 72 -172 -92 18 -107 -29 11 -232 -151
5593 -151 101 -65 127 -152 -13 -25 338 -17 -29 -187 -14 -26 -63 5 -42 -239 -263 14 86 41 -105 26 -258
5616 -258 -14 242 246 -53 -78 52 -185 -218 -73 -176 -172 40 160 80 77 40 28 120 197 -93 -240 27 -41 -44 -82 -47
5642 -47 257 -31 2 218 22 -125 -220 80 7 77 28 264 -107 62 -159 1 -165 33 -35 136 -25 238
5664 238 145 142 -93 -15 -6 -232 104 160 198 -167 295 118 14 104 158 -193 167 -172 -134 -34 89 113 84 -24
5688 -24 89 199 -122 224 -33 -95 -143 -192 0 -128 -149 131 -58 -157 -37 -300 25 -28 -11 78 86 180 -276 -34
5712 -34 -74 276 122 -64 -173 134 38 19 43 -7 -175 217 79 -140 376 53 214 0 67 -170 -74 134 -83
5735 -83 -5 -7 -49 -142 273 -147 25 155 201 169 -273 -166 -187 -160 265 77 -103 214 97 219 -353 -23 -84 177
5759 177 132 -141 79 28 145 45 93 -110 -3 -204 -223 -135 86 -128 -8 -1 19 -144 -7 203 144 140 260 94
5783 94 332 -37 15 211 -114 76 67 19 -24 107 245 -191 -73 -37 -38 51 91 -195 87 83 -50 -158 -40 37 -17
5808 -17 113 168 176 26 -50 -218 219 151 -51 -62 -104 -36 32 64 87 -95 -5 -154 -13 -137 -116 -46 -64 -100 -240 48
5834 48 121 170 -85 178 -44 23 145 33 140 225 163 -116 -8 -69 76 -134 -20 42 22 -40 127 84 177 -131
5858 -131 -39 -6 -30 25 -9 174 71 -215 354 -8 -147 82 -81 -121 -80 47 132 -36 -22 -181 123 -86 32
5881 32 408 -62 42 -150 -33 -4 -25 -207 104 128 251 234 -197 176 55 -200 96 -312 51 35 99 207
5903 207 55 -89 47 -45 -225 -229 215 190 -217 140 -20 120 -153 38 188 129 -45 139 -89 -189 149 110
5925 110 -20 -56 28 -82 -17 60 -78 98 -43 102 202 289 -268 292 294 -22 -59 -66 -14 -166 107 72 33 -72
5949 -72 25 135 -14 161 -150 -117 265 -63 189 -98 -116 -103 21 -179 -154 -252 -40 283 113 -372 -132 -103 -302
5972 -302 53 248 182 67 -220 229 -175 -210 64 -202 56 -49 -179 -147 -42 -61 -27 -160 20 -91 58 79
5994 79 -169 -184 -35 146 56 185 -243 -76 40 -50 33 -26 130 -26 -16 21 114 76 53 46 119 130 -127 141 122
6019 122 -44 245 77 152 -31 145 554 229 0 64 -140 165 -24 95 118 -176 -120 -67 -218 230 52 -131
6041 -131 -24 112 492 88 -116 67 -38 50 -67 -179 92 39 94 -100 -120 -128 -274 -207 170 148 -193 17 -49
6064 -49 -120 -133 -96 -316 -227 58 105 -41 34 62 80 -36 103 -115 -121 -132 -58 116 11 67 -110 133 124 5 245
6089 245 34 64 -196 -86 -142 56 -60 -84 -117 -38 38 155 -165 -47 -151 122 170 -29 -70 30 80 -62 22
6112 22 -150 191 68 62 -66 147 94 -297 132 60 -76 58 145 98 -228 145 203 1 -51 243 62 37 -81
6135 -81 182 -201 -132 -50 -77 -89 170 55 161 195 -105 152 177 5 11 -24 -24 64 -53 -260 15 132 7 82 107
6160 107 15 -80 390 166 16 55 -80 249 204 59 98 13 -172 -48 50 195 30 -103 -95 80 112 -128 22
6183 22 77 261 -38 -91 134 -130 119 104 -134 -272 -34 125 92 31 84 28 -109 162 -111 140 480 169 145
6206 145 -71 -59 43 -214 -78 228 -151 -165 204 -188 67 150 76 33 -109 -284 439 214 46 154 -173 6
6228 6 230 -6 81 272 90 156 114 -185 -131 11 -182 -147 -47 38 49 34 92 -127 20 -121 115 45 -84 -65
6252 -65 -70 221 23 113 -331 62 -179 75 26 -35 -120 -32 322 -254 2 -121 -6 24 15 -103 -7 -80 -98 86 82
6277 82 -257 164 -107 65 32 -82 -45 -482 -36 147 151 -14 -106 99 -332 215 201 -73 -144 208 89 -182 388
6300 388 49 139 54 243 372 -192 54 62 19 115 -59 163 -36 -93 205 31 89 -31 -2 8 68 60 56 218 -67
6325 -67 -4 29 2 163 -208 -85 -168 -65 3 -167 -98 18 -35 -237 270 94 -97 83 -367 23 -171 233 -129
6348 -129 120 244 -122 64 -67 123 -172 68 -135 -20 201 88 -207 -199 -2 -110 -3 208 56 133 73
6369 73 192 -10 -264 -44 -109 -25 254 6 55 112 -83 -169 30 73 -7 134 60 173 -136 -152 83 17 -212 388
6393 388 137 -101 217 174 6 47 -325 37 93 10 -3 28 -16 -89 -100 62 73 8 -74 35 -55 202 -208 -60
6417 -60 -128 0 45 -30 125 -82 -381 -142 -61 -261 22 -200 -209 -75 -242 -67 -88 3 11 126 62 384 223 193
6441 193 -99 146 99 -54 -33 152 -156 81 -76 -204 -64 87 -34 54 250 45 18 87 77 -62 33 -170
6463 -170 -114 106 -7 -111 114 80 70 85 101 -101 -153 -61 -211 -133 -146 -12 223 -46 -36 382 116 -90 -290
6486 -290 278 -97 4 126 277 111 309 -198 154 83 49 -50 -228 41 -93 187 -212 -160 61 118 -185 80
6508 80 -43 -26 -62 45 -180 61 29 500 -100 -15 -256 -70 102 -397 -95 -148 168 -92 22 -296 -10 -8 70
6531 70 11 16 121 44 -218 39 -43 157 -58 -115 24 186 -65 70 126 96 17 -98 29 204 -123 193 107 -156
6555 -156 -124 4 -73 -32 -94 -280 -173 164 67 106 128 -131 -84 -19 48 -72 -8 27 56 159 78 233 -263 -148 175
6580 175 -149 153 -134 15 -200 -21 180 -13 129 39 40 -64 -366 10 31 -75 -14 213 -243 -15 39 -235
6602 -235 12 177 -6 52 16 -236 220 65 143 132 -23 -260 -138 69 101 -111 -100 12 -48 -26 -181 -99 84
6625 84 37 300 -94 -18 286 -91 -80 -139 -234 69 84 -61 -2 161 121 -1 -186 20 -95 166 110 -6 211
6648 211 -281 -35 -24 -116 -66 148 -163 124 29 34 -48 21 142 160 26 72 104 132 95 93 78 -93 218 -214 2
6673 2 -307 104 -135 -77 -24 -227 -80 -95 163 45 -402 -11 116 2 196 -114 -114 113 -273 263 22 -253
6695 -253 247 363 -160 -126 -383 319 115 50 -59 -152 14 -29 -1 -30 71 64 127 -7 216 86 301 -156 83
6718 83 -66 -213 -61 168 -192 27 -240 -326 112 193 -61 1 -88 -99 104 110 68 -49 120 -117 -7 -2 -27 -163
6742 -163 45 -7 25 -126 -151 -76 15 103 101 89 111 44 -104 -94 -11 164 166 10 -141 -70 248 -57 -55 130 -13 -219
6768 -219 96 128 -26 -64 -119 -231 -22 123 -144 155 87 -122 -52 -170 71 -63 105 -136 -184 -29 -240 -90
6790 -90 -99 257 -162 -244 -63 -236 203 34 -146 -135 2 -61 175 139 -156 -171 -54 112 71 -102 -88 110 -148
6813 -148 40 108 -236 -53 12 75 152 164 -96 136 -76 182 416 168 -185 -184 -106 -11 68 142 38 -27 -35 -69 199
6838 199 209 52 -51 -161 125 -292 74 44 -5 26 19 122 -35 -26 27 -91 230 333 122 -173 -49 -130 -193 97
6862 97 -103 -98 -88 9 -15 38 165 -167 -68 38 -305 -152 176 71 -97 112 77 -80 244 -46 108 -75 -16
6885 -16 92 -20 319 67 107 -302 135 -16 -129 -251 279 -63 239 39 129 179 -74 15 -2 -5 -341 0 310
6908 310 23 151 80 -56 238 158 199 129 -117 134 89 -38 263 -54 318 -258 96 27 69 82 41 52 53 -99
6932 -99 -60 -41 -27 293 7 -29 -24 -202 -9 103 -123 36 47 -24 -150 -59 56 148 -46 108 131 145 -65 42
6956 42 -484 41 -66 -160 -159 -122 214 97 69 -47 3 155 240 21 -85 -86 -215 -82 -159 -280 91 18 265 -71
6980 -71 -102 83 -13 92 155 49 -120 33 165 189 150 -73 -85 -16 81 -184 168 -51 41 70 -3 -84 -27 166 -109
7005 -109 25 9 103 -71 281 280 3 43 42 -96 242 71 388 130 89 86 -12 10 60 137 -55 59 100 32 41 25
7031 25 15 189 34 5 -3 -33 -69 30 57 -246 -11 21 -4 -108 -331 -68 -226 -145 -10 122 186 116 -10 198 210
7056 210 86 -37 -51 90 74 -139 -225 98 75 -221 100 72 87 -47 -95 119 -268 10 -224 127 81 48 -110
7079 -110 63 -53 -16 -98 -122 -42 143 -128 161 -87 90 -73 236 -296 18 -151 -123 33 -115 138 -44 -48
7101 -48 242 163 -34 15 -116 -289 278 -113 133 -268 77 134 107 54 197 14 -158 281 -59 -248 53 3
7123 3 -178 -192 31 -39 -158 -60 -218 -81 232 -15 9 -189 115 -123 -11 407 87 -84 -75 -181 -51 -296 51
7146 51 184 -212 172 -139 29 19 35 232 154 -146 -75 73 -121 -24 -119 -35 -251 -139 -38 61 88 86 93 26 -54
7171 -54 -2 -55 203 -172 8 -35 -52 298 97 -69 -365 -129 143 58 -101 67 236 -60 18 -194 160 -11
7193 -11 -185 79 31 37 15 -80 -11 119 153 -23 173 -19 146 184 -21 102 20 103 -142 -311 27 142 67 -166
7217 -166 208 -57 -3 -19 -15 115 -262 166 -69 64 -35 165 3 188 -48 87 -128 -8 74 75 173 -128 -229
7240 -229 -165 -171 86 -104 -14 -83 -156 170 75 24 121 115 -100 19 132 77 -148 31 -242 244 31 -136 72 -202
7264 -202 -23 -90 177 -80 -102 -213 -67 -183 32 168 0 36 231 -34 -46 43 -141 85 -51 11 -109 -214
7286 -214 -205 55 -57 96 -252 -17 229 125 32 -204 -187 -101 70 -139 -14 -7 153 262 212 136 1 163 43
7309 43 233 -109 13 71 176 27 -99 205 -307 -14 -29 31 -119 -69 -209 -45 99 -61 -96 45 -172 186
7331 186 85 -310 120 49 210 69 -86 -17 -78 30 -65 -55 -10 200 169 351 -92 272 -158 -71 -244 131 -29
7354 -29 30 -191 -19 89 -46 235 -48 217 102 -62 -93 -132 -154 88 -51 -29 -43 -190 4 -6 64 -133 -57
7377 -57 129 61 141 -123 161 -79 36 -201 -46 -48 -7 105 134 2 84 -5 -59 22 -149 155 333 -77 196 -96
7401 -96 31 168 -93 -103 116 -51 112 270 169 -132 17 -276 -131 -180 0 -25 -4 76 -123 -3 -156 255
7423 255 -80 106 -51 63 42 -172 -130 -27 264 -182 94 59 39 256 -14 161 -100 46 -30 44 57 -89
7445 -89 144 9 183 -143 14 -88 -87 -295 87 8 -107 -136 -221 -10 160 151 -18 -175 200 -147 10 273 36
7468 36 25 106 -144 209 -10 33 -40 26 -156 -7 405 -9 61 -7 313 -108 -59 -59 88 2 -40 145 84 -255 -243
7493 -243 171 -201 82 -93 -3 313 24 -182 58 -205 102 80 -198 -162 114 34 -23 53 5 334 20 -168
7515 -168 -56 -8 -83 51 -92 -37 -82 137 107 85 37 -7 -224 -23 64 -52 151 79 197 86 -8 11 419 38
7539 38 52 -108 -8 224 -104 68 -137 149 39 240 135 128 -59 -244 142 -163 249 -419 -176 -106 -218 65
7561 65 -14 -344 -161 -54 -33 -9 -192 -14 159 234 -156 31 148 204 -204 -3 211 -245 27 -283 -290 -3 -160
7584 -160 -174 140 63 152 62 8 98 97 42 204 91 -105 -175 37 -1 -60 45 106 105 34 -108 86 -209 138 156 -8
7610 -8 -55 69 -82 75 102 -122 56 -91 186 62 -81 -50 -2 -24 28 30 -41 102 -180 -224 129 72 83 277 3
7635 3 16 -38 -9 81 110 -31 103 -176 -156 43 67 -20 147 133 56 100 -77 -9 -20 192 -16 96 -3 -12 41 -129
7661 -129 -200 -105 -7 29 -151 73 142 217 -105 -82 195 71 -124 102 265 49 -103 18 -92 14 82 123 -95
7684 -95 101 -15 -116 129 -21 -4 -61 19 -66 -147 117 99 -109 74 64 17 142 181 211 -89 297 -36 -87 -319
7708 -319 -78 0 -111 31 -32 114 -2 283 -285 -116 -139 24 47 -30 -109 -23 -2 118 91 119 94 -5 -161 161
7732 161 53 252 -133 -70 -48 -70 131 211 74 -39 290 -132 -123 -151 353 -113 -63 126 118 -48 161 19 -79 -105
7756 -105 153 155 -308 -28 -41 -39 193 41 -35 32 25 217 -154 42 -217 215 -109 141 6 12 150 -87 -39 -54
7780 -54 -151 147 -88 79 161 -18 -87 -20 -295 -147 149 296 -43 38 -13 12 44 166 17 -254 136 148 162 20
7804 20 32 -112 -19 135 237 -14 27 146 40 -111 -256 -81 -10 57 -58 -61 145 160 290 0 -91 127 -259
7827 -259 -84 83 -154 -195 173 118 66 272 30 -110 -200 93 -119 379 66 70 -107 28 -47 -8 154 -325 28
7850 28 159 -500 -45 177 -142 188 -112 56 -128 161 -146 -106 -95 -6 -150 -218 39 -76 -89 -149 273 56
7872 56 114 -188 141 81 -105 5 53 -95 -103 -29 -128 16 17 -131 40 49 68 51 276 -390 30 183 -182 -70 -29
7897 -29 228 64 -94 -95 134 -50 -344 98 150 61 61 -292 -142 14 171 202 -23 -34 -60 147 -108 -136 39 5
7921 5 242 -42 159 -41 223 126 -52 -30 84 -69 235 -158 -152 -104 170 -40 176 -97 144 -61 253 -18
7943 -18 -129 10 102 36 -135 47 -141 111 -77 -135 23 -40 196 139 -72 38 131 132 -74 166 -71 -55 118
7966 118 97 44 219 31 290 -126 -205 -207 -233 -44 61 240 7 -55 -9 204 -35 -27 -101 62 -139 210 124 -21
7990 -21 -10 127 -122 -269 123 145 88 90 -16 -105 69 -197 54 -77 343 165 -41 172 -157 -26 199 -69
8012 -69 291 6 130 -70 -48 -60 -70 125 -89 -139 84 23 -126 66 -76 146 -98 154 -123 -1 -215 107
8034 107 50 -18 95 -13 -30 61 -84 3 -247 144 204 80 -5 148 -167 -25 24 -13 126 -201 -104 -68 97 -83
8058 -83 277 88 -41 140 150 -212 46 19 -101 -59 29 120 137 -141 -88 83 49 12 -145 -108 -14 -53 -90 6 -174
8083 -174 -183 -215 80 -149 -116 344 -92 -321 -144 26 254 128 69 73 196 213 -129 268 -82 369 144 64 -3
8106 -3 -35 256 -106 46 124 -8 54 123 186 -159 -148 118 -138 -82 -324 -24 48 -289 -65 -253 -12 -16 19 138
8130 138 -198 177 1 -250 107 225 -104 -14 161 164 61 -74 76 105 -43 15 -85 230 190 -77 106 -141
8152 -141 79 -103 -204 1 -46 -139 -96 -219 -94 185 24 84 128 180 -89 -50 229 -52 302 86 95 20 23 -67
8176 -67 134 -73 25 12 -132 226 -48 -87 40 -6 -49 120 84 -84 77
8191G7
$$ Imaginary data points
##PAGE= N=2
##DATA TABLE= (X++(I..I)), XYDATA
0 0 0 0 0 0 0 0 0 0 0 0 0 0 0 0 0 -8 8 -8 8 -8 14 -16 16 -22 24 -25 32 -38 40 -48 56 -64 72 -80 89 -102 113
37 113 -126 142 -158 174 -195 215 -239 264 -290 322 -354 388 -428 473 -520 575 -634 700 -779
56 -779 865 -968 1085 -1228 1398 -1614 1889 -2255 2772 -3549 4848 -7401 14259 -70016 -173234
71 -173234 51640 74517 -49539 -20518 36938 -12122 -15740 2185 -423 7921 -5320 -36402
83 -36402 -297 31869 5552 -9755 4416 -5038 -15569 -3929 8485 -1888 -12728 -4652 5243
96 5243 763 968 -4330 -18375 -14636 -2466 1557 12568 -510 -32091 -11127 24233 -1551 -17977
110 -17977 7087 -3030 -19211 8623 12894 -3819 4037 -8785 -24219 21440 38456 -16537
122 -16537 -24317 12207 958 -9905 18098 15948 -11899 -11885 4197 12941 5463 -12559 -9817 3867
136 3867 -2882 3 17817 4445 -17407 -6868 4882 -425 -5253 -2227 6268 6584 -5928 -444
150 -444 13483 -1523 -16841 -3058 8080 10990 10182 -4210 -3953 10634 1249 -6128 11730 2216
164 2216 -19152 2733 23696 7382 -5806 -4642 -6425 -2753 2378 3442 4751 -3933 -13781 -1889
178 -1889 13367 4983 -12221 -14809 -1669 6771 -1170 -3173 5027 -3285 -11610 864 6246 -985
192 -985 -513 -2920 -4213 7077 3979 -5415 8578 6836 -14805 -758 21512 2502 -11441 1447
206 1447 4419 4134 8403 1504 -1234 2863 -3823 1453 15932 1618 -15267 735 14288 5799
220 5799 640 -114 -2994 -2815 1330 7475 7920 -1057 -4633 3637 6232 2536 2246 292 -2531 -1718
236 -1718 1641 10448 10285 -5781 -7437 6533 3787 -3935 2551 1938 -4391 914 2098 338 4568
251 4568 -3982 -13120 1045 7308 -6570 -5002 4153 -3751 -8023 -284 2679 -1967 -10019 -11229 2753
266 2753 7781 -4275 -7706 -2804 -4318 -1265 4554 -1460 -8737 -5575 1243 5206 583 -5424 370
281 370 1762 -6984 -2663 7685 1599 -4953 -2419 -809 4884 6571 -4137 -5384 4246 -879 -4490
296 -4490 6792 6237 -4822 -2599 3164 3061 2887 -1051 -3017 3184 2624 -1123 5632 6579 -4362 -4902
312 -4902 4981 7822 1132 -4880 -131 6746 1374 -871 6606 1284 -8444 567 8438 1880 -1355
327 -1355 -2069 -1734 4055 3233 -2499 1736 1140 -6156 -1147 5070 42 -1302 -1259 -4343 -130 3188 -2759
344 -2759 -2058 -255 -6239 -3965 4045 1300 -3861 -3899 -3934 -1222 235 -2269 -2511 -2968 -5864 434 5469
361 5469 -2201 -6942 -2813 -801 -1123 -775 -1315 -173 -806 -3684 911 5216 -2427 -7327 -808 3140
377 3140 1645 1313 49 -1038 -402 -503 1132 3434 -1315 -4073 2060 4985 867 451 851 -689
393 -689 -360 -112 1617 6250 1928 -5238 137 6240 941 -1415 2201 89 -1435 3023 5150 3028
409 3028 -1974 -3546 3664 5665 -1323 -545 3666 -990 -2251 4037 3869 -1401 -3095 -1407 3726 3354
425 3354 -3631 -2425 2075 -2059 -3325 2316 2052 -1631 -2692 -3223 531 3365 -3385 -4995 910 424
441 424 -1459 1088 638 -1705 -2283 -3151 705 4208 -962 -3045 2842 1197 -2562 2346 2945 -3154
457 -3154 -3225 1905 4314 2755 -1555 -1799 1520 -288 -1496 3381 1399 -3980 -459 4499 2580 -1493
473 -1493 -2913 -967 2831 134 -1804 3364 3371 -2906 -1427 2955 1422 1071 504 -1584 1365 4531
489 4531 1387 687 1268 -1951 -325 4625 2579 -1018 490 1130 789 790 485 702 698 -2214 -985 4642
507 4642 2368 -3977 -2741 959 760 -1082 -511 1103 -1487 -3433 169 2446 -1813 -3482 -613 -521
523 -521 104 1541 -1570 -2321 -260 -2322 -1276 3159 -659 -4283 753 1783 -1727 -665 -1011 -3192
539 -3192 -885 -486 -1726 1566 202 -6079 -2669 2230 -2516 -4034 185 -675 -3657 -2033 814 649
555 649 -3190 -5623 -1282 2939 -251 -2287 -533 -200 -1358 -384 1336 684 -1997 -1150 2855 3028 -272
572 -272 390 1091 -966 510 2948 1292 990 1050 53 1303 3082 101 -634 1780 985 -114 2007
589 2007 2704 908 -1085 -1580 1695 4022 -337 -1844 1799 1649 -621 1708 2179 -1136 -1692 978
605 978 3336 1770 -1911 -890 2663 50 -2137 1988 2035 -2204 -975 1876 460 -238 -1182 -2265
621 -2265 -220 18 -1500 560 675 -3783 -3137 783 -295 -2104 -1879 -1910 -1417 628 -331 -2039 -1318
638 -1318 -1393 -2006 319 2048 -760 -2687 670 2385 -1086 -1346 2302 1679 -1881 -151 3013 2467 291
655 291 -905 -199 2160 1821 -130 2088 2134 -1569 898 4750 597 -2369 1316 1691 526 2480 1585
672 1585 -1243 857 1387 -784 1303 1487 -1102 894 2520 -169 406 2108 -12 -1146 546 1357
688 1357 2166 1124 -1912 -1179 1900 960 -1366 -812 518 213 -1533 -386 2203 -1529 -4420 -590
704 -590 1501 -1249 -1854 -877 -1164 -1321 -1082 -1361 -714 -1597 -2773 -289 838 -1903 -1061 77 -2162 -2402
722 -2402 209 478 -716 -711 -1665 -508 1353 -344 -1518 -67 -83 -182 1003 859 285 -1210 -1450 1123
740 1123 2132 -686 -1216 1334 958 -732 349 1203 -63 -792 -473 1498 2557 35 -1174 1251
756 1251 791 -1376 1479 2848 -439 -890 2081 1961 792 515 -296 362 1293 624 868 1610 -54 -1075
774 -1075 839 1644 728 -659 -708 881 869 -263 60 374 -826 -1073 -396 492 514 -889 -2068 421
792 421 439 -2044 -582 500 -2415 -1825 1512 732 -1886 -1641 -843 -775 -459 -786 -465 168 -1400 -1155 850
811 850 43 -2333 -977 668 -253 -204 352 -160 -1026 -1170 -539 444 241 -799 -540 -339 314 880 -405
830 -405 -701 318 -356 93 2038 1391 -1346 -394 1201 588 421 142 243 998 124 266 2284 917
848 917 -1903 -66 1947 632 420 1311 767 -773 143 1516 1413 -92 -955 655 1894 535 -159
865 -159 976 494 -921 194 1034 882 -297 -688 69 822 53 -830 -193 -389 -198 46 -81 515 -290
884 -290 -2215 -812 1630 -209 -1993 -481 491 -811 -437 66 -393 -1061 -1549 -212 1296 -142 -1688
901 -1688 -397 -74 -1049 65 651 -375 -991 -205 499 424 -594 -975 -296 233 -202 551 688 -728 -381
920 -381 157 163 485 135 -859 21 765 146 219 780 -455 -676 666 1140 571 325 130 656 632 -71 915
941 915 1543 -173 -771 1561 2045 220 -411 140 681 541 -76 711 942 -462 -460 1193 823 -671 -392
960 -392 -152 126 533 -29 -110 -130 -681 -1066 398 395 -817 -915 -548 -517 176 -675 -928 -504 -882 -962 269 238
982 238 -1329 -1546 -278 -125 -633 -1018 -178 -267 -1374 -838 735 176 -2347 -1234 335 97 -894 -492
1000 -492 -115 -536 -836 -565 440 -71 -1281 -545 858 -58 -174 33 -305 -498 -223 361 996 629 -401
1019 -401 -83 1073 1292 -108 105 504 685 902 1103 1082 360 -113 308 1266 821 -42 625 1001 442 418
1039 418 698 542 -117 -639 384 1358 186 -314 457 202 -967 -131 1009 -51 -977 -312 656 752 -474
1058 -474 -1071 -204 -88 -225 -81 442 -427 -579 -626 -20 290 -344 -1048 -116 122 -900 -442 355 -850 -1183
1078 -1183 -420 -207 509 -364 -1227 -253 394 -988 -1019 491 -777 -1489 407 1024 -62 -399 -71 174
1096 174 32 3 334 792 99 -397 764 1223 342 -234 758 592 499 815 1101 632 -377 317 670 588
1116 588 485 -203 -140 886 1039 -153 -115 534 -193 -429 1139 1065 -500 -638 34 575 333 -484 -269 847
1136 847 174 -981 873 1404 -904 -607 619 -200 -466 496 -121 -560 -151 -165 -249 295 -833 -1082 11
1155 11 74 -241 -119 -574 -1253 -467 134 -202 -567 -561 -319 -293 -287 -628 -980 -400 -298 -588 157 673 184 -824
1177 -824 -746 439 337 -350 -234 299 146 -448 95 805 -34 -1165 379 1320 104 -463 278 104 -249
1196 -249 143 512 224 37 195 552 749 26 -149 692 428 -475 487 873 354 475 79 37 551 791
1216 791 -112 111 709 169 -42 801 340 -931 40 818 469 110 -362 -64 816 -81 -331 228 308 -671
1236 -671 -496 833 367 -928 -45 155 -518 -691 246 153 -224 -678 -492 227 27 -921 -724 -261 -153 -251
1256 -251 169 41 -685 -544 141 14 -158 -192 -617 -41 849 -360 -870 300 -67 -814 23 476 -81 -362
1276 -362 -112 -209 248 74 -306 588 211 -315 198 1169 43 -593 689 493 -128 335 820 25 -42 451
1296 451 628 198 -206 -319 582 584 97 295 426 -267 -15 223 721 576 78 118 142 255 483 -187 60
1317 60 200 -259 -183 597 249 -618 -302 238 292 -479 -291 108 35 -444 -367 221 -290 -844 -197 640 41 -649
1339 -649 -84 57 -1022 -343 13 -352 -244 -582 -241 279 -41 -522 -382 -94 -611 -271 908 -227 -535
1358 -535 -390 -259 -13 -124 -486 -384 325 0 -260 65 326 -341 -568 351 493 137 -182 369 354 -89
1378 -89 -59 330 496 -217 -265 372 908 -69 -357 285 -10 -169 524 894 -12 96 225 549 284 -101 -277
1399 -277 107 539 -53 394 536 -113 -57 -32 195 -225 90 50 -218 265 46 -111 -279 -29 -643 -252 380
1420 380 -31 -493 -327 -65 -291 -240 -460 120 -293 -398 113 286 -390 -856 -191 -190 -299 -580 -212 131 -309
1441 -309 -335 327 121 -334 -380 19 163 -143 -193 -79 -158 -187 -280 172 101 26 -182 38 259 271 -37 -57 11 66
1465 66 -156 415 633 -86 -76 444 355 12 469 413 414 234 75 498 91 -92 29 664 648 -82 468 482 -97
1488 -97 -240 492 251 206 19 -81 482 289 -206 -374 -66 -121 -43 486 118 -171 -201 -294 -107 65 -356 -273
1510 -273 151 -15 -204 -292 -26 -172 -554 -160 306 -54 -417 -215 -178 -293 -220 75 -53 -440 -320 183 381
1531 381 -49 -285 -122 -33 -166 -171 331 -82 -162 291 170 93 8 -30 -83 143 46 164 109 333 -225 250 33
1554 33 -221 125 38 -2 531 156 43 183 250 44 206 580 314 -88 56 172 97 204 130 510 116 -247
1576 -247 8 446 136 -220 -317 196 -200 12 -88 -174 24 128 188 126 -124 185 14 35 188 137 -82 -200
1598 -200 -232 -586 -149 71 -191 -63 40 -241 -51 -251 -111 -149 -612 -226 -141 245 -161 -325 164 -31 -358
1619 -358 -272 62 -85 -300 -240 176 -21 -498 -533 85 145 -227 34 187 23 -174 221 133 -51 -205 45 129
1641 129 198 -1 -90 -21 -157 221 55 277 376 -125 -77 285 462 -55 -93 -82 139 -118 19 397 191 -152
1663 -152 101 479 354 -99 172 307 149 -221 70 115 -69 -293 121 84 165 -72 108 3 3 -289 -221 95
1685 95 -522 135 435 68 -309 -233 -220 247 -143 -31 -151 20 -37 -446 -62 -26 -214 -179 -81 -33 -241 -334 -318
1708 -318 -239 94 -425 227 586 -74 -341 -174 -16 -303 -83 -17 -40 -19 28 50 -44 -118 -149 265 88 -384 223
1731 223 178 -43 -33 121 264 -64 15 340 -230 178 376 -60 -21 -6 -5 198 176 90 -77 127 193 87 50 -215
1755 -215 243 312 -13 241 434 -118 -3 305 16 -2 -180 -137 82 159 -106 -110 180 157 -362 114 55 371 -114
1778 -114 -123 -197 -354 5 203 -279 -267 34 -106 -170 -445 -166 -332 -310 -243 -215 -338 71 -129 -217 -165 -67 -298 -42
1802 -42 -56 25 59 -38 230 -58 -98 -306 343 227 -259 -110 184 -88 -24 80 247 -227 -212 126 -92 139 -288
1825 -288 230 343 -36 -279 227 292 37 25 211 120 -121 220 -83 29 -107 454 -100 25 86 -9 -136 398
1847 398 39 81 153 24 201 -33 104 -19 184 -78 25 -7 104 -135 82 230 -144 -133 94 -9 -407
1868 -407 -35 49 -73 -26 -46 -71 -147 67 -213 11 -43 -290 9 105 -376 -518 56 -251 -238 -70 187 20 -56
1891 -56 -13 -38 66 60 250 18 122 62 74 -5 0 -97 -79 -106 285 3 -75 -155 -6 -223 -135 423 169 -33 -5 243
1917 243 232 91 -56 208 451 -262 137 291 -31 -186 297 160 182 -49 307 354 156 163 373 95 128 87
1939 87 -9 89 50 260 -157 -139 100 2 -188 -30 264 -74 -207 -26 3 -248 -105 72 247 -47 84 86 -245
1962 -245 21 -322 -246 -261 -106 -138 -46 55 30 22 123 -525 -83 -2 -16 -16 -52 276 -130 -337 -224 183 -47 -172
1986 -172 6 10 230 -17 -320 104 113 -171 -1 -58 113 374 -54 178 123 -100 -16 -24 362 -187 -20 23 119 -173
2010 -173 343 300 -145 -40 -82 232 523 81 -38 81 125 163 220 102 45 -53 -156 193 -174 -38 163 -9
2032 -9 345 49 68 -53 -220 -160 11 36 -81 71 -2 -156 -4 -147 -50 33 -96 -210 9 364 68 140 -208
2055 -208 -200 -44 -117 57 169 85 -451 12 238 -155 -96 -217 38 -7 -125 13 158 -138 -133 -98 249 35 -202
2078 -202 -181 -129 -59 -32 -150 -225 -188 203 189 360 233 -236 153 141 122 -7 172 155 24 -57 -48 276 114 -118
2102 -118 45 243 142 -18 290 233 -153 213 216 173 -247 70 176 146 116 -131 -3 -95 -71 -33 -113 -148 -109 -61
2126 -61 16 64 -347 -114 -56 -1 235 260 45 122 -162 -311 -50 -168 -49 -43 -141 -31 34 -86 59 -184 -77 72
2150 72 111 -203 -35 -186 48 -111 -81 -113 81 -88 -297 129 5 -150 -198 -347 69 94 -158 218 167 2
2172 2 -144 -59 -114 -77 142 -95 4 111 40 -74 65 373 -25 -211 159 77 -168 54 321 264 -11 -89 235
2195 235 -95 -292 57 25 209 92 209 -57 -139 151 -170 -49 -162 134 79 -208 -180 266 -51 -94 144 474
2217 474 10 -111 -210 45 114 14 -74 33 -106 -108 52 -143 -193 -65 52 -206 -75 -76 109 -222 -148 -90 -282
2240 -282 -172 145 -76 9 98 122 -148 -262 2 -53 42 74 -88 172 54 -421 266 92 126 -107 155 260
2262 260 -25 -134 232 28 -118 -75 167 42 198 12 189 249 19 22 -18 13 111 344 -143 15 -18 -14 -85 308
2286 308 96 -158 -17 83 -80 -8 183 18 74 231 361 111 0 56 -9 -128 -165 -78 110 -91 -16 96
2308 96 324 -149 -250 56 7 -186 -51 110 -210 45 31 -176 258 -27 -136 -146 158 -227 -16 133 -29
2329 -29 -241 -196 -31 -52 88 -93 -152 -6 -347 -73 162 -89 -100 -71 -10 -274 -274 -132 -10 22 120 -101 155 142
2353 142 52 -94 98 -162 21 -128 230 -110 -44 124 279 9 -67 290 1 324 246 142 -139 224 84
2374 84 43 207 47 294 84 -63 -91 66 -43 77 9 170 127 270 106 6 232 154 -53 103 -223 16
2396 16 -138 -182 -10 214 -479 119 60 36 223 -169 -57 -163 -75 -83 43 -228 -64 -33 -335 -136 -92 -28 18 -24
2420 -24 -171 -211 -14 -69 84 86 73 -121 -133 -99 -62 -35 -88 70 -14 -7 257 62 -80 34 128 273 129 105 186 21
2446 21 -6 -7 -68 -49 152 -129 6 57 244 110 58 198 25 -51 -1 213 -7 317 28 221 30 65 -31 111
2470 111 -136 162 -176 -2 126 -214 -363 -77 354 -35 -68 -35 -9 -46 121 -65 201 -108 -241 27 -118
2491 -118 -134 105 104 -108 -49 104 56 -109 80 -134 -53 129 -182 -277 -97 -282 114 -261 -90 -134 20 125 -54
2514 -54 -276 -271 -134 -1 244 5 -246 -75 -291 -290 -287 -44 110 307 -129 89 62 17 -197 -321 -107 -187 -20
2537 -20 281 35 -37 -22 -42 154 -19 160 370 133 -256 239 -108 -48 -500 48 148 -249 49 -226 -44 -138
2559 -138 51 22 -155 -57 6 302 282 -195 76 156 -80 -163 187 187 192 -11 -128 67 117 92 50 -51 68 30 -39
2584 -39 -52 227 -33 36 -19 -185 61 -240 -123 50 -81 -36 -69 -190 -185 -217 -26 -31 -156 38 12 -74 -54 6 129
2609 129 -175 125 -66 162 -11 -101 -107 223 -43 -79 297 -28 -10 -168 -198 -89 83 -57 71 223 0 25
2631 25 -43 -207 16 -61 260 -79 -241 153 89 211 -35 -198 108 128 -2 -47 56 -52 37 123 217 330 42
2654 42 23 127 -118 64 325 211 -39 -4 86 21 42 -58 -45 123 -238 248 -4 161 251 -125 -118 -51 47 -18
2678 -18 -84 -252 29 -149 -41 -253 -117 260 93 198 -280 -133 24 -199 -22 111 45 40 -114 116 58 148
2700 148 112 -251 253 102 -185 -128 66 22 -180 -64 -255 21 187 82 -82 -20 57 56 89 -59 -27 -49 -167
2723 -167 47 -17 73 111 80 -160 393 80 161 165 -278 -20 51 9 -32 -48 -223 -122 49 20 46 148 214 -127 328
2748 328 6 -124 -62 -115 -89 151 27 -119 -151 -45 3 69 32 -2 -20 97 72 -135 397 105 -220 -221 -83 45
2772 45 -15 -140 13 -135 64 -190 -39 -11 76 37 37 -8 247 152 179 -405 33 258 -57 -374 206 45 -62
2795 -62 154 -142 -74 -23 -258 25 305 -502 170 -106 48 -262 -199 41 278 -36 205 112 -78 -3 -38 -18 140
2818 140 5 103 20 16 -297 -40 -54 -25 -200 -122 21 174 -123 143 -195 -196 182 110 -167 147 80 -43 -185 -22
2842 -22 225 -363 -241 -67 125 -69 -27 117 -12 -229 -71 97 7 -97 63 -38 2 108 47 38 -22 -64 50
2865 50 -104 -192 -6 51 -225 -336 -47 -10 -80 -59 28 -278 -108 119 -375 199 142 48 54 -11 -26 -20 44 359 -121
2890 -121 -134 -91 13 27 -308 130 -108 208 -5 238 82 102 -254 141 -98 101 160 175 -28 133 264 124
2912 124 -56 326 -76 183 156 73 -47 146 -60 -56 115 -98 -256 75 149 -170 -29 165 -13 119 49 73
2934 73 11 -66 -44 -77 -114 59 -162 35 -186 50 31 -69 -67 -66 151 17 -200 275 -84 35 275 -376 -75 35
2958 35 11 -139 -128 -109 86 -137 -11 22 -142 -103 -21 -217 -189 -65 -49 85 -19 -142 -67 -88 -6 290 20 -1
2982 -1 -150 101 -184 99 -175 -261 56 18 -297 115 227 -99 -55 -55 140 -146 123 -63 -220 -141 24 295 -132
3005 -132 -29 -17 140 141 126 54 137 -63 23 -66 -70 -141 84 -255 70 -89 31 -57 -31 -121 -36 94 -44 155 -64
3030 -64 -40 102 -239 -131 45 48 12 -73 104 -3 6 -11 -113 8 -93 -221 -87 9 106 -146 -121 174 -216 5
3054 5 -43 229 -58 151 56 268 22 -12 -127 76 -129 -118 -206 -170 85 41 21 -122 94 -29 -24 23 140 -200
3078 -200 -266 -96 -118 -96 -211 -74 58 38 60 -184 -21 0 103 -33 41 -13 129 215 -140 -247 88 -135 -67
3101 -67 59 -67 -4 -57 -36 15 -89 2 136 -160 220 -166 186 -200 73 142 34 70 -132 -200 27 85 216
3124 216 -61 -322 57 101 -29 -73 46 -89 22 119 -34 -2 65 -88 -140 -43 -1 61 65 -130 61 -17 -157 -148 -20
3149 -20 -42 -221 41 54 -16 19 52 -267 16 -99 -123 108 -178 -226 -109 -59 129 92 -69 26 287 113 67 15
3173 15 0 -86 192 -31 173 174 -84 -68 -188 -12 12 -209 -71 200 -102 -17 62 14 -196 -442 -68 192 -95
3196 -95 59 156 85 -146 6 -149 89 206 206 -124 -38 309 -185 158 -123 274 9 81 159 47 -142 -19 -88
3219 -88 278 34 20 43 -351 -116 103 -173 -136 170 142 -33 -39 -59 -143 63 -69 -125 -28 -74 -147 -42 345 77
3243 77 4 -117 95 56 131 -138 259 375 -125 -164 -279 -99 -238 162 409 80 -214 -95 -69 75 -28 198
3265 198 -226 32 -85 207 -109 148 25 -106 173 -147 -17 54 -98 203 148 -64 -72 31 -70 -110 245 -86
3287 -86 -80 75 22 98 -39 -114 -138 -279 -99 135 201 -264 35 279 -307 -96 -53 -41 307 -76 -12 12 -1 -158
3311 -158 -191 -130 35 -45 141 324 -19 -43 7 -9 -3 214 109 6 142 122 -123 37 -148 65 87 255 -85
3334 -85 -15 47 198 24 -124 -189 -295 258 173 3 141 40 26 -77 -101 39 211 -108 -28 -94 -153 -18 187
3357 187 -183 127 -285 -64 -143 117 16 29 17 -14 -24 160 -36 41 100 116 114 -155 521 155 -43 -4 42 11
3381 11 -94 36 169 -60 22 116 301 33 283 245 130 -141 -62 142 125 -15 -118 31 75 -70 -70 60 49
3404 49 253 91 -11 2 293 -161 -60 78 -16 52 86 39 38 -132 68 -203 80 87 -105 54 203 -134 -78 173
3428 173 -109 10 13 -184 -22 59 132 -185 -124 354 -88 -177 -194 111 305 -58 179 103 8 38 210 -57 146
3451 146 -138 106 265 -80 130 -69 3 84 106 78 38 -59 -283 -236 -244 -212 1 -129 -171 115 89 -28 316 -34
3475 -34 36 348 131 -84 -41 -5 -108 170 -54 -125 118 27 -76 -41 1 -43 140 -71 -140 -9 47 -178 100 -144
3499 -144 -200 -63 34 -10 -139 -37 325 -100 102 41 -114 153 -62 -142 -98 183 -18 -194 223 67 -85 49
3521 49 -56 154 -16 -51 -34 128 83 -227 236 -151 94 107 14 -93 129 52 -149 -55 -26 132 134 -119 -42 16
3545 16 -14 391 197 -102 -119 -27 -117 -55 32 164 230 -248 122 -77 -35 142 -180 -126 68 -53 -155 198 70
3568 70 204 -27 84 110 187 72 187 270 -144 -110 69 -453 -122 193 -54 81 139 215 25 24 -127 -200 -130 -107
3592 -107 59 -105 54 -261 -136 175 -259 38 287 399 -52 115 -23 -8 36 -92 132 98 97 64 -231 3
3614 3 -69 90 16 -175 223 -165 -239 97 32 -71 -125 214 115 -69 106 -51 75 -97 -163 79 61 -31 -37 -163
3638 -163 91 -243 -4 -183 40 -181 -126 -140 -181 -89 -108 -49 56 114 -115 39 -39 -66 63 -119 -101 330 -117
3661 -117 -61 291 45 -35 60 222 -82 -20 140 256 -92 228 -6 -145 -4 -255 80 107 -80 -137 -73 94
3683 94 -60 79 -120 -242 -3 -87 111 248 -134 237 -56 23 111 -53 100 70 -51 -66 -144 -38 -14 196 58
3706 58 -45 -166 389 -59 -80 -15 -253 69 197 -69 -124 -98 -251 33 247 -65 -353 -22 56 143 82 16 590
3729 590 -92 54 93 -14 -293 -129 135 89 190 -301 -76 -142 -73 169 252 180 41 -5 -216 48 -33 -173 -14
3752 -14 -25 -132 -126 -195 27 310 -343 -78 95 -157 64 -157 -288 37 -316 84 -31 -64 -86 -358 79 86 -42
3775 -42 153 -123 -12 -216 113 13 -131 -57 -117 279 204 4 -6 -93 -130 -308 -229 12 71 -18 185 242 -251 -15
3799 -15 88 -80 206 -35 148 70 194 296 -71 52 -15 -118 244 -78 -17 106 -182 -367 -129 16 -107
3820 -107 -26 128 83 -133 -190 -200 -79 200 149 -204 118 -181 -68 -3 -44 147 466 -95 -98 166 -35 227 84
3843 84 -61 36 232 -16 -7 51 158 -196 200 -31 -325 -3 -117 173 -172 -39 -82 93 -299 -9 -92 16
3865 16 -6 -279 -163 -164 185 -110 -164 46 111 169 -172 -21 83 -398 -33 43 -21 208 -111 -155 -141 -100 72 -67
3889 -67 140 111 -243 -169 150 -68 29 -150 66 70 -26 98 150 99 -122 55 -282 17 -248 -119 293 69 292
3912 292 100 86 61 64 -363 46 122 -85 -55 120 229 156 267 275 -35 -43 -66 85 -104 22 171 -131 -133 -52 131
3937 131 -29 -43 213 -49 -56 7 221 103 145 81 -147 22 54 -12 14 135 86 -28 61 -236 -94 18 -245 125
3961 125 25 30 -56 -52 151 108 252 -29 -264 -159 5 -116 -23 208 -12 -21 -28 48 -12 -34 199 2 -47 -104 101
3986 101 128 -109 -115 -226 -10 96 -95 14 34 -55 37 -71 -35 49 -17 -35 -13 -165 45 -266 -115 -1 123 -66
4010 -66 -13 96 -59 128 -266 -102 12 -85 103 32 115 55 -111 9 104 48 199 235 157 -143 -272 55 -132
4033 -132 65 239 -44 -34 -169 -128 159 90 -99 -65 -119 179 -47 316 -87 -19 172 320 -135 -96 60 -82
4055 -82 36 -119 188 -219 6 -87 18 32 -29 -11 26 350 93 179 -27 162 107 -41 136 -55 39 132 -220
4078 -220 -23 40 -215 -22 -163 59 -122 -87 -61 -40 22 -1 -4 87 251 -113 -20 94 217 199 138 -67 167 -67
4102 -67 14 -97 2 -40 -205 169 53 6 63 64 20 84 84 156 59 256 11 -331 0 -201 303 48 -18 73 97 -103
4128 -103 136 25 -45 76 -85 -22 141 89 -31 -176 -41 -127 100 143 39 146 11 -116 55 23 13 -56 78
4151 78 -95 21 -84 150 -147 231 80 201 85 120 -295 63 175 -64 32 -185 -138 84 97 -132 220 -60
4173 -60 90 -80 95 68 -231 -30 8 -92 23 -19 -178 86 -89 156 -55 185 58 -74 318 -32 -232
4194 -232 -34 110 -75 -356 61 179 -211 72 296 127 -32 189 9 234 21 163 242 -43 -231 146
4214 146 252 57 -101 -12 -18 17 55 11 89 -101 112 16 -20 401 -58 82 164 -40 37 -112 -189 -258 39 -121
4238 -121 7 11 -223 133 155 -62 134 -244 -135 244 85 -45 -135 -43 41 -4 -197 -169 150 -112 -97 -8 96
4261 96 5 196 51 -48 -92 2 -232 -194 167 269 222 -200 -172 -79 85 -56 105 180 137 -32 -72 -131 -63 30 159
4286 159 94 -28 106 12 -140 51 16 -30 60 -220 151 23 -10 -225 -37 218 38 167 -207 -83 0 -226
4308 -226 58 60 -16 175 157 113 159 73 153 -107 78 262 79 -63 90 -29 -73 -182 11 -55 46 -167 55
4331 55 -41 -32 57 -53 -15 -42 53 -208 -173 33 15 71 -105 113 -116 -295 73 22 -62 -218 30 262 -10 -125
4355 -125 121 212 11 89 -220 -176 -42 -41 110 195 -101 -63 225 36 74 -26 135 -120 86 238 215 -146 27
4378 27 -137 -6 -288 -285 0 -151 72 -77 117 -118 260 -15 -256 56 -108 111 -259 56 -159 107 15
4399 15 14 -10 -156 -127 327 -5 153 207 -5 -37 -28 77 -219 -221 -114 -58 -36 -154 256 -83 88 -92 194 -60
4423 -60 169 -37 13 70 210 39 -68 -140 -133 -4 -131 -122 85 166 -289 73 203 -187 -117 -113 -59 57 -4 -87 -212
4448 -212 -37 3 -51 84 -168 114 47 -67 25 50 384 248 -192 -101 140 299 -55 -24 -8 -66 339 15 109
4471 109 -32 23 176 0 -44 220 69 34 -70 226 -129 -66 -31 138 132 114 -111 115 12 115 48 133 -35
4494 -35 -220 -34 201 -66 82 -103 -164 92 -72 -95 158 -9 -232 80 -90 -2 -36 -209 286 -155 -183 94
4516 94 -106 -222 98 -143 -46 -182 315 75 -118 -156 55 -97 -125 -207 160 -119 36 -197 -59 -21 130 -5
4538 -5 22 47 -231 -61 -21 86 -72 92 145 -131 89 342 -20 125 199 53 -152 -130 -24 -8 -197 -151 87
4561 87 -18 -102 46 -143 150 109 78 160 -137 201 172 -91 66 13 172 16 -4 65 -86 61 176 255 79
4584 79 148 77 53 -59 147 -38 -106 13 144 109 -58 181 -3 110 -69 -80 -15 29 35 145 22 18 149 60 -84
4609 -84 5 107 28 13 -76 87 -148 -148 50 89 199 -22 -51 15 -88 -73 -85 -25 85 230 210 140 18 145 17
4634 17 -67 99 99 -16 17 -30 321 17 23 54 -84 -179 161 -53 25 -30 -106 85 -34 -279 171 262 9 45 348
4659 348 112 -4 -114 105 101 -4 44 -68 94 63 41 129 -13 -107 -88 30 -205 -93 -47 300 106 64 -117
4682 -117 -17 185 165 46 -218 -266 -12 69 124 105 24 -44 -235 108 -4 -23 49 -35 -157 -278 55 135 -203 110
4706 110 -190 -83 75 -52 -389 205 204 -48 188 -272 -97 -97 -124 -52 183 -2 -189 -108 -45 -168 117 143 117
4729 117 -8 180 -22 120 -86 46 318 266 -47 -175 -88 28 -31 -242 -133 56 159 -126 -113 -98 -142 336
4751 336 69 156 87 154 -13 414 266 39 37 -85 163 235 21 299 -36 -150 -166 -153 118 74 -62 116 -145
4774 -145 -243 -63 1 -226 -14 146 -53 -60 130 137 -18 -82 21 -35 31 76 -274 -1 94 -280 191 -269 44 -163
4798 -163 -107 -60 -355 -160 -89 70 176 -187 60 -130 -15 79 -194 58 4 361 89 -219 -41 -19 -152 249
4820 249 27 93 -51 113 338 34 95 -42 70 86 -16 -179 15 185 -181 78 203 -141 84 -151 -64
4841 -64 -175 -249 -67 -84 171 -190 254 234 -38 42 85 136 -190 65 41 -126 168 42 129 70 -212 -48 -25 118
4865 118 -168 272 177 54 -128 -93 324 -122 117 32 83 19 84 -294 83 -6 222 -83 -116 33 172 -135 -117
4888 -117 -72 28 162 39 216 -188 -86 -285 -171 -75 -134 110 63 -61 -104 -106 145 -191 65 108 56 -10 -52 243
4912 243 13 -113 -9 -19 -213 47 -145 144 240 264 62 -121 -165 -95 -76 115 -134 -47 -35 61 178 569 -130
4935 -130 3 201 196 -18 49 -141 -11 -154 37 -139 -60 92 -282 -106 -73 12 -36 157 -190 -81 -175 3 -29
4958 -29 5 -27 140 -92 -62 -5 -61 94 92 -215 -141 -239 10 128 -32 71 133 7 -126 -54 -152 67 143 -44 -206
4983 -206 -87 63 37 -27 -175 -47 217 -27 5 -32 -259 -34 -134 -172 237 265 39 -253 63 38 132 184 287
5006 287 -239 -29 12 -66 -53 -56 -69 -51 178 -86 41 82 -119 -106 -56 71 142 16 114 77 92 -124 120 124 -163
5031 -163 182 164 119 -12 23 369 19 -298 -32 -201 -86 -38 -55 198 -213 146 178 122 -91 -96 -185 25 42 -138
5055 -138 122 91 101 -189 -127 -47 -107 199 -84 -270 40 -23 120 133 -99 -7 50 -31 13 139 -57 -264 53 91
5079 91 -186 193 -259 75 86 66 52 325 94 65 -145 -25 -9 88 -144 -16 225 -66 -134 233 210 227 -158
5102 -158 222 100 270 217 183 -132 12 202 -209 -74 126 -130 -113 -28 97 -182 -181 -21 357 193 -115 37
5124 37 41 207 -179 69 -42 160 -182 -211 -31 -183 151 76 -19 -62 -24 -78 -66 151 -59 -65 139 149 90 94 74 166
5150 166 -53 -64 -154 -42 -67 -152 173 70 94 -2 177 274 -16 62 184 -25 43 75 -213 178 293 208 -328 -151
5174 -151 -337 -82 -103 -28 -63 110 -89 -27 -44 -14 108 16 -63 130 83 -6 115 -3 45 281 69 130 33 -24 60
5199 60 -162 -60 -92 -166 -118 -147 -110 173 -18 -97 63 -139 38 -196 37 132 93 -108 -246 173 -57 -2 -26 76
5223 76 -356 27 5 -156 199 161 -234 53 -23 -25 40 97 122 205 80 -164 -62 99 -67 97 159 -98 -77 -53
5247 -53 170 -168 -118 -81 98 -39 -194 152 -29 278 -206 59 -205 89 313 -45 -110 -57 213 -36 -110 41
5269 41 175 -233 -82 -173 -353 254 -152 -116 159 -49 -148 26 4 -8 110 -29 -251 26 73 40 -14 -128 -36
5292 -36 152 15 116 57 -356 207 0 198 60 3 -242 -91 -1 -9 -330 -68 41 -99 38 -11 61 164 149
5315 149 -4 -143 -209 -145 -108 -189 -305 -220 -239 -67 -61 -114 14 23 -133 -46 62 -124 -133 -118 -84 88 -112 -147 -55 -290
5341 -290 70 148 -74 -1 -120 -143 -191 -158 -103 -161 -50 8 123 -142 -70 -188 -50 -175 -191 -75 74 -107 97
5364 97 251 22 204 19 100 174 -246 -90 3 -25 -287 14 -130 65 -5 -65 32 -24 61 278 -263 -31 81
5387 81 251 41 187 -66 -25 124 235 105 225 87 96 -152 54 -7 22 -48 24 18 -62 209 -276 222 -38 -68
5411 -68 10 -1 -103 48 395 38 72 -26 258 -18 59 18 2 -170 -185 140 -22 10 -103 108 206 -136 -95 261
5435 261 84 -7 -59 -16 93 166 -53 -93 -57 150 179 179 256 0 155 235 72 15 -422 -35 25 49 -194 137 237
5460 237 81 -256 -126 -193 265 20 -41 -35 47 193 12 181 -102 -98 -94 100 20 292 197 -28 123 92 82 -308
5484 -308 138 -87 157 -113 -199 15 145 -76 -117 -184 -94 192 63 -74 -23 -50 -42 162 -2 104 -42 -8 255
5507 255 -18 -253 107 2 -101 43 -174 8 28 -339 -191 98 -222 -23 120 37 133 -10 -230 171 -35
5528 -35 -66 5 -123 -190 64 25 -355 -226 125 46 -136 307 -154 -105 -137 110 -53 118 -61 247 5 -39 -124
5551 -124 -59 129 74 84 72 224 -152 103 98 -146 -103 -18 -67 23 231 149 20 74 75 -99 -313 114 15 107 -24
5576 -24 67 70 -133 -69 165 11 -132 -86 -88 28 201 -233 -233 18 -156 7 72 240 -64 50 -74 51 -43 100
5600 100 -184 -261 55 -304 -174 -48 -187 -360 -250 156 52 78 -279 106 190 -199 -119 106 -88 -44 -214 -76
5622 -76 266 -38 14 257 56 -43 14 1 88 41 34 142 62 -172 -7 36 -69 260 61 233 -22 -44 -110 -76 -51
5647 -51 32 19 -118 252 -1 -191 22 36 115 25 99 46 -60 -21 74 -84 -115 29 -147 -18 122 -44 211 -141
5671 -141 287 -140 -6 210 127 -99 -45 -140 -60 35 79 131 -25 256 -166 -130 -59 -118 4 -215 -219 194 -338 -180
5695 -180 114 89 -14 -147 -223 -34 -52 -202 44 -110 -113 -41 -313 54 188 -213 -194 -18 -23 69 338 120 97 -352
5719 -352 -40 -135 79 -113 273 5 4 73 -102 122 83 -12 -21 110 137 158 -168 -128 -158 -244 231 -37 163 -16
5743 -16 0 58 -149 311 289 -114 -23 -21 189 -261 -64 327 135 22 130 147 -81 115 55 -33 115 -166 95
5766 95 -62 9 -366 58 -15 207 74 16 -110 -88 20 -48 164 35 -353 -80 76 -82 -80 -173 -16 166 -192
5789 -192 56 -26 59 192 41 146 -105 132 20 -105 67 -22 49 -23 216 203 111 159 -114 88 -21 135 20
5812 20 -298 244 93 260 -136 -19 -1 38 -87 210 -133 -145 -17 -211 157 -50 225 122 -13 173 66
5833 66 -62 187 -141 72 186 320 -55 119 52 17 14 -199 231 150 197 -33 -26 40 0 16 -155 -100 -89 5 11 -81
5859 -81 -26 102 24 -93 162 54 -94 -84 131 -51 -124 104 76 0 83 47 -53 153 51 -126 -90 -36 -45 -210
5883 -210 -35 28 -141 -107 238 11 64 86 -5 143 67 59 -39 101 174 206 -227 126 -118 106 -75 -11 -67 -137 127
5908 127 -6 -36 -51 13 -70 219 182 -46 -276 59 -58 144 57 40 3 12 206 110 13 157 120 -46 77 118 272
5933 272 -239 43 -73 33 235 -78 -11 -67 105 -186 40 16 -48 32 8 -145 211 -7 -142 -202 134 -123
5955 -123 307 -57 -115 34 -230 463 -201 -9 -56 15 -127 -12 -249 -80 134 91 -171 2 -178 -17 -250
5976 -250 -161 -132 206 193 41 -205 -165 32 -57 -6 120 -61 -8 124 -103 149 -23 -3 -11 -55 -138 54 318 -54
6000 -54 76 -49 194 116 98 146 -70 72 -109 -60 -207 119 26 -161 -21 -201 134 -134 -112 239 -253 30
6022 30 266 -77 -7 21 -16 1 -177 -3 62 -117 91 7 -204 -106 108 76 -258 -16 191 -322 -49 155 224
6045 224 -63 -160 100 -12 -195 -56 -213 93 -62 -70 -40 109 -157 -140 257 61 -192 210 64 -47 195 8
6067 8 137 -91 70 73 277 77 34 -26 23 110 -2 71 88 113 -149 86 140 -78 83 99 -98 -307 80 10 -40
6092 -40 54 -77 72 -18 32 -20 191 288 196 147 72 109 12 -117 -170 -247 -194 73 180 -37 4 164 345 -11 -14 130
6118 130 -25 81 79 97 -158 -59 162 -146 -77 -172 -77 -63 214 -29 -150 -16 -6 185 -51 75 15 160 -55
6141 -55 -243 240 42 60 191 324 -22 -187 -142 -71 -201 369 -95 -26 158 106 -94 -107 63 -39 -182 215
6163 215 -81 153 -81 -117 43 172 -29 177 132 -220 178 -157 105 -286 48 110 -79 -122 -106 -189 -50 90
6185 90 -24 14 13 240 59 107 45 102 -31 4 -177 -162 -14 130 101 199 -74 -65 -48 -24 59 291 -126 -195 134 250
6211 250 -211 -107 222 -268 -176 -19 -128 -309 85 -17 -6 -86 37 -109 -4 -123 -56 -31 301 -49 53 18
6233 18 -401 176 -207 44 66 -58 84 63 312 -323 39 -131 -82 -119 -150 -321 -76 26 16 382 169 -265
6255 -265 95 39 61 -317 130 2 -184 -82 -103 15 -127 42 -45 -64 -48 140 174 13 116 77 -206 117 -110
6278 -110 85 -61 -179 149 -55 -24 19 -79 -150 -188 215 121 58 130 80 -174 -102 -37 0 237 -18 1 -182 109
6302 109 -134 155 -144 -9 -40 96 54 -80 -151 47 95 -236 34 114 -197 -240 64 8 20 -62 -207 -33 119
6325 119 -44 32 350 154 119 -30 49 -254 -34 122 -145 127 73 -38 -305 -52 -48 -172 -38 -81 -30 -111 114
6348 114 202 -31 -135 167 -47 -34 -69 265 -16 -117 236 37 -50 -250 -71 -210 138 110 209 262 -8 48 65
6371 65 134 267 -29 14 67 -65 214 -47 46 -99 164 120 -54 -101 26 111 -253 -114 -152 -7 67 73 48 116 71
6396 71 67 -44 133 -82 -134 -10 2 65 -139 -255 161 204 43 45 -100 -54 -59 154 -33 127 -180 63 252 98
6420 98 8 60 73 -155 4 172 -59 106 -124 66 42 50 312 7 -52 -19 143 -71 62 -89 -147 42 180
6443 180 115 187 128 76 125 185 125 205 59 -123 -236 -17 209 48 205 10 -82 -48 3 45 -27 44 -51 231 -51
6468 -51 1 -2 -171 -24 -73 38 -181 124 -13 4 267 -82 -122 137 48 -20 -209 13 15 170 -83 -32 -121 -139 276
6493 276 219 110 -90 63 133 152 -12 240 69 -187 38 -222 -172 156 43 -143 -208 -28 103 -113 -27 -80
6515 -80 -161 -208 0 98 244 286 69 -212 -49 87 -124 16 239 113 -44 57 19 139 127 136 358 -135 -32
6538 -32 4 -23 -74 -37 63 246 229 -22 228 -228 -35 -191 -203 -366 -54 85 33 -169 48 -197 -120 25 -138
6561 -138 251 -115 103 335 180 65 -131 -201 -267 -97 156 32 -12 273 -140 162 14 -60 -88 91 -79 -134
6583 -134 -173 75 195 129 60 27 -75 -67 -121 -14 68 63 -104 113 98 55 203 -116 -33 -126 1 -69 215 -42 -263
6608 -263 -123 12 -162 -198 311 134 139 83 99 -30 41 -130 18 -19 -174 -172 -150 268 -74 -13 251 127 -106 183
6632 183 112 97 -118 -165 118 -196 -58 184 39 -254 0 -4 66 164 171 -1 93 -24 -147 4 110 255 -176
6655 -176 -104 209 -403 -20 120 171 5 123 -48 120 58 24 53 332 -204 -229 -25 -115 -95 278 150 33 244
6678 244 -356 20 -167 -301 236 98 31 151 -174 -28 -54 -45 -26 13 31 -59 -123 -110 -236 22 132 40 -142 118
6702 118 -294 -55 -12 83 -125 162 80 143 -117 -60 8 57 -144 6 -61 -72 -37 -44 387 -192 -26 29 -130 147
6726 147 168 207 265 5 202 63 -43 5 45 -260 -38 -213 281 23 -35 120 12 9 -154 160 194 -26 -23 60
6750 60 -15 -203 -142 -11 -51 104 -176 -182 100 -186 5 9 -9 -110 132 -36 8 129 -46 -144 -105 71 -44 -68
6774 -68 37 54 92 -97 297 35 -194 -12 -7 -118 -260 -3 185 204 -413 -3 27 363 186 -130 -31 128 57
6797 57 94 -112 -359 443 -2 40 65 79 -159 -15 138 -28 -111 -53 -170 -186 3 265 43 -345 -98 200 85
6820 85 57 -145 218 9 -152 96 270 153 128 -102 27 -33 183 101 -60 214 -42 -45 72 -52 -5 125 -61
6843 -61 14 104 -25 18 -86 268 97 -64 90 -144 -90 80 287 -131 -61 26 -172 -185 -123 162 -113 -212 -152 71
6867 71 -62 -37 -163 190 110 4 -45 -65 113 185 -114 -137 -34 78 449 -91 63 -138 -57 10 -87 118 20 -27
6891 -27 39 119 235 159 90 -82 107 -205 40 -41 -57 83 -68 -47 28 -253 307 105 -81 -73 -29 312 99 -165
6915 -165 119 -131 -194 138 -47 107 -255 109 -78 -95 -16 -182 -94 -260 -216 131 156 88 -43 78 100 52 41
6938 41 -92 32 -23 31 -40 35 4 -33 -366 -31 119 67 147 -23 -17 19 -33 49 -16 52 28 22 0 35 32 -83 -79 -158 -128
6967 -128 -11 205 244 10 4 245 39 265 -60 36 -22 -30 -1 -233 36 -18 -23 -76 -22 -138 -147 18 72 -289 160
6992 160 -27 68 105 -131 -48 67 -59 -11 209 130 -20 -108 311 -210 -229 -16 158 -153 221 257 -95 -227 -216
7015 -216 142 -18 12 -64 7 50 -32 21 -25 -146 -257 -149 51 -17 -78 84 -66 -133 107 -45 -119 -323 -223 153
7039 153 145 -122 51 -7 79 204 -44 -237 74 -35 -147 -230 -145 115 -52 62 -76 -156 -169 -53 -6 59 194
7062 194 92 81 79 234 284 -126 88 218 -38 73 39 -85 47 74 -78 418 88 96 152 276 132 -298 287
7085 287 46 181 -245 -102 28 -50 176 -118 139 54 26 -87 -58 -5 -123 -96 205 -6 70 -146 -12 -140
7107 -140 85 -152 42 290 -61 -5 30 11 -47 107 -170 204 141 147 121 -104 -232 -5 153 -29 -35 51 90 119
7131 119 -24 -80 -149 -74 50 -51 -17 104 158 -25 -13 -71 -31 -27 21 23 118 49 -132 187 -102 -208 -288 94 7 96
7157 96 134 -10 -169 55 -45 -126 -151 -15 -1 -136 -94 68 153 0 -6 110 21 -426 -229 173 67 -50 -97 143
7181 143 223 134 120 192 173 2 69 -30 -29 158 -14 19 99 8 -36 166 -57 -25 19 -53 245 18 -362 -191 378
7206 378 182 1 -104 -201 82 244 -1 -139 -171 151 -134 111 -120 -101 303 -27 -48 -26 66 2 130 49 -55
7229 -55 -60 114 -16 -59 -210 52 -276 251 -164 16 82 31 141 -15 -77 34 -73 69 144 96 102 160 37 -244
7253 -244 17 31 -97 -74 32 97 164 -7 -77 -104 -110 -101 -107 -78 133 53 -162 26 -310 170 203 273 42 -31 22 25 -205
7280 -205 -90 -7 -159 136 48 -212 24 63 65 -227 8 -46 14 106 -105 -85 97 3 148 75 -337 -89 -176 -227
7304 -227 6 120 64 -197 -136 27 -201 -66 -47 -49 153 117 -124 -48 2 115 64 93 259 150 26 -29 7 222
7328 222 -127 -143 54 -277 27 -188 221 -42 318 130 22 -9 39 -6 -41 -59 41 62 68 70 -91 -28 -164 -254
7352 -254 180 44 8 27 12 -188 42 -135 -203 -148 27 -109 -135 -130 248 -15 23 79 -65 168 -112 -255 -75
7375 -75 282 2 174 -24 182 23 286 186 124 54 -144 138 -9 -124 -88 13 142 63 69 -32 224 137 201
7398 201 -19 128 107 101 209 -140 36 93 117 -27 65 -47 -159 -40 187 -56 262 -96 -252 134 65 -64
7420 -64 415 -152 -92 149 10 -51 111 -141 -94 -54 -157 -164 64 230 67 245 66 6 -30 58 21 -224 174 145
7444 145 13 13 -101 -48 14 -40 -99 -221 193 -94 -56 67 -32 -53 11 14 33 154 -217 -147 -235 -46 183 69 -94
7469 -94 33 -236 102 -117 -30 254 109 -163 -20 -54 -117 152 211 2 -11 67 -12 -42 137 -124 142 -135 147
7492 147 192 -92 85 -88 72 84 -75 -147 -47 -2 84 -174 -202 -351 55 204 102 7 -86 -121 153 -18 74
7515 74 119 65 127 -26 259 -99 -33 -171 175 183 122 45 -84 31 -4 -15 -315 39 213 159 188 -297 6 127
7539 127 55 90 10 31 6 -70 60 47 -16 -76 -111 -68 222 17 -65 230 279 -258 -130 -130 55 147 -129 35 -168
7564 -168 -77 65 -103 -213 270 -131 335 229 -18 135 166 -229 -36 44 50 211 84 89 -169 120 -70 77
7586 77 195 -94 -158 -221 12 165 114 126 -357 -185 69 -4 141 -102 -87 -101 9 67 102 -253 215 -96 -24 -37
7610 -37 44 -62 -13 57 -230 42 -202 -97 -111 145 74 46 76 -57 -69 90 -102 194 -170 -44 49 -100 134
7633 134 -212 9 25 -116 284 -48 -41 64 72 -326 -337 -26 -2 45 -173 -27 18 70 -146 43 138 -21 223 27
7657 27 -248 -312 60 178 -64 271 225 26 142 -3 69 -137 -151 -43 -344 -73 -165 -4 49 149 -24 -230
7679 -230 33 154 -64 48 208 128 0 -236 -131 -154 -163 69 10 -25 25 91 42 53 230 167 -357 81 14 -77
7703 -77 -77 -4 137 -253 34 135 32 177 -103 191 -34 0 -41 158 138 100 18 248 -23 0 -121 -85 183 -200
7727 -200 -25 161 16 63 60 135 57 -99 120 -185 115 189 -55 -178 -105 -144 -43 261 -96 217 -28 24 -163
7750 -163 17 -220 -47 73 181 -81 -273 22 -240 -279 32 -28 -173 35 206 17 -95 -25 -14 -47 139 -141
7772 -141 -180 -52 -93 -56 -105 148 185 -144 -5 155 -178 51 60 -89 -35 -123 59 38 61 -22 -49 -149 61 37 -17
7797 -17 93 3 -158 -360 -85 -178 -176 -73 -165 88 169 -92 -47 10 -54 -88 194 55 -98 65 193 62 -131 -132
7821 -132 -52 -107 -20 -170 23 45 33 -223 -149 -26 215 -22 125 337 407 -61 193 143 -260 110 97 59 -98
7844 -98 -161 -90 174 -94 108 95 -235 -43 106 144 24 173 57 166 10 -118 -158 15 -147 -21 -36 87
7866 87 -40 361 167 -77 -104 -221 -75 -120 155 12 219 12 -27 116 272 -234 17 -21 192 -46 -209 -111
7888 -111 -124 9 45 88 -160 -59 -66 -142 -210 238 -133 -98 36 -21 -56 -5 32 -69 -33 -100 -155 -238 -28 173 -55
7913 -55 45 -209 -155 69 125 76 -207 -87 -294 85 -134 95 -150 -86 -32 -130 104 -246 3 215 118 170 -89
7936 -89 239 -62 -21 142 16 -121 -109 -158 97 -131 -50 -189 -202 -263 132 2 -126 -22 -87 -36 33 207 -18
7959 -18 133 115 -60 -234 -41 -82 236 74 -66 -190 -159 66 102 -56 216 -99 -9 -174 -102 198 121 199 -81
7982 -81 -135 82 116 -24 220 -27 139 -46 87 61 209 149 239 -19 114 13 -192 313 -11 -79 162 34
8004 34 165 -128 89 253 34 57 -39 -91 -281 237 72 -151 -50 136 -47 -98 -239 20 162 -211 -69 55
8026 55 6 -10 175 108 -231 -115 -177 37 56 -84 -318 -63 18 -76 374 -140 -175 -47 -207 -4 33 -59 4 171
8050 171 109 -138 -92 -39 -226 -255 53 -42 98 282 68 27 -9 164 260 -52 -37 92 266 -429 50 7 -186
8073 -186 49 107 131 170 -205 25 -219 -170 -40 -194 -111 -165 19 50 48 -37 38 -143 6 240 -64 -254 142 89
8097 89 -25 47 12 186 -25 24 -80 -18 -118 16 -158 74 139 -46 -12 -71 180 80 -57 80 45 -90 57
8120 57 -157 -171 24 -81 86 214 23 -64 53 102 -120 49 57 186 91 0 -50 -56 91 213 32 -113 -82 122
8144 122 -91 212 280 -48 -290 -31 -67 -251 59 140 -293 91 326 14 -23 -18 -8 -126 80 132 134 -100 -89 -53
8168 -53 -178 111 113 -191 41 32 82 -202 87 -34 263 94 -153 210 -28 -135 39 309 -49 212 150 150 68
8191F8
##END NTUPLES=NMR FID
##END=
