##TITLE=1H_SAV77-YbTf3-B(EuFod)
 CDCl3, 8 sc, 
 25.11.2020
##JCAMPDX= 6.0         $$ Bruker NMR JCAMP-DX V2.0
##DATA TYPE= NMR FID
##DATA CLASS= NTUPLES
##ORIGIN= UXNMR, Bruker Analytische Messtechnik GmbH
##OWNER= root
$$ XWIN-NMR		Version 3.5
$$ Wed Nov 25 10:50:33 2020 Russian Standard Time (UT+4h)  she@DPX200
##.OBSERVE FREQUENCY= 200.1315066352
##.OBSERVE NUCLEUS= ^1H
##.DELAY= (6, 6)
##.ACQUISITION MODE= SIMULTANEOUS
##.ACQUISITION SCHEME= undefined
##.AVERAGES= 8
##.DIGITISER RES= 18
##SPECTROMETER/DATA SYSTEM= spect
##.PULSE SEQUENCE= zg30
##.SOLVENT NAME= CDCl3
##.SHIFT REFERENCE= (INTERNAL, CDCl3, 0, 15.7039)
##AUDIT TRAIL= $$ (NUMBER, WHEN, WHO, WHERE, WHAT)
$$ ##TITLE= Audit trail, XWIN-NMR		Version 3.5
$$ ##JCAMPDX= 5.01
$$ ##ORIGIN= Bruker BioSpin GmbH
$$ ##OWNER= she
$$ F:/spectra/data/she/nmr/H-F/1/audita.txt
$$ ##AUDIT TRAIL=  $$ (NUMBER, WHEN, WHO, WHERE, WHAT)
(   1,<2020-11-25 10:49:28.60 +0400>,<she>,<DPX200>,
      <created by zg, POWCHK disabled, PULCHK disabled
       configuration hash MD5:
       00 E9 B6 7A A2 85 ED C7 34 08 36 98 17 FE 4E 26
       data hash MD5: 16K
       7E C8 A6 28 47 2B 38 94 E9 92 50 88 C3 23 DB E3>)
$$ ##END=
$$ 
$$ hash MD5
$$ F6 08 4D 34 4B EF BE 0C BC E0 6E 70 72 45 F6 1E
##$RELAX= 
##$RELAX= 
##$RELAX= 
##$RELAX= 
##$RELAX= 
##$RELAX= 
$$ Bruker specific parameters
$$ --------------------------
##$DU= <F:/spectra>
##$EXPNO= 1
##$NAME= <H-F>
##$PROCNO= 1
##$TYPE= <nmr>
##$USER= <she>
##$AMP= (0..31)
100 100 100 100 100 100 100 100 100 100 100 100 100 100 100 100 100 100 
100 100 100 100 100 100 100 100 100 100 100 100 100 100 
##$AQSEQ= 0
##$AQ_mod= 1
##$AUNM= <au_zg>
##$AUTOPOS= <>
##$BF1= 200.13
##$BF2= 200.13
##$BF3= 200.13
##$BF4= 200.13
##$BF5= 200.13
##$BF6= 200.13
##$BF7= 200.13
##$BF8= 200.13
##$BYTORDA= 1
##$CFDGTYP= 0
##$CFRGTYP= 5
##$CHEMSTR= <none>
##$CNST= (0..31)
1 1 145 1 1 1 1 1 1 1 1 1 1 1 1 1 1 1 1 1 1 1 1 1 1 1 1 1 1 1 1 1 
##$CPDPRG= <>
##$CPDPRG1= <>
##$CPDPRG2= <>
##$CPDPRG3= <>
##$CPDPRG4= <mlev>
##$CPDPRG5= <mlev>
##$CPDPRG6= <mlev>
##$CPDPRG7= <mlev>
##$CPDPRG8= <mlev>
##$CPDPRGB= <>
##$CPDPRGT= <>
##$D= (0..31)
0 1.2 0 0 0 0 0 0 0 0.06 0 0.03 0 0 0 0 0.0002 0 0 0 0 0 0 0 0 0 0 0 0 
0 0 0 
##$DATE= 1606286968
##$DBL= (0..7)
120 120 120 120 120 120 120 120 
##$DBP= (0..7)
150 150 150 150 150 150 150 150 
##$DBP07= 0
##$DBPNAM0= <>
##$DBPNAM1= <>
##$DBPNAM2= <>
##$DBPNAM3= <>
##$DBPNAM4= <>
##$DBPNAM5= <>
##$DBPNAM6= <>
##$DBPNAM7= <>
##$DBPOAL= (0..7)
0.5 0.5 0.5 0.5 0.5 0.5 0.5 0.5 
##$DBPOFFS= (0..7)
0 0 0 0 0 0 0 0 
##$DE= 6
##$DECBNUC= <off>
##$DECIM= 32
##$DECNUC= <off>
##$DECSTAT= 4
##$DIGMOD= 1
##$DIGTYP= 9
##$DL= (0..7)
0 120 120 120 120 120 120 120 
##$DP= (0..7)
150 150 150 150 150 150 150 150 
##$DP07= 0
##$DPNAME0= <>
##$DPNAME1= <>
##$DPNAME2= <>
##$DPNAME3= <>
##$DPNAME4= <>
##$DPNAME5= <>
##$DPNAME6= <>
##$DPNAME7= <>
##$DPOAL= (0..7)
0.5 0.5 0.5 0.5 0.5 0.5 0.5 0.5 
##$DPOFFS= (0..7)
0 0 0 0 0 0 0 0 
##$DQDMODE= 0
##$DR= 18
##$DS= 0
$$ [...]
##$SUBNAM2= <"">
##$SUBNAM3= <"">
##$SUBNAM4= <"">
##$SUBNAM5= <"">
##$SUBNAM6= <"">
##$SUBNAM7= <"">
##$SUBNAM8= <"">
##$SUBNAM9= <"">
##$SW= 16.9725356469052
##$SWIBOX= (0..15)
0 0 2 0 0 0 0 0 0 0 0 0 0 0 0 0 
##$SW_h= 3396.73913043478
##$TD= 16384
##$TD0= 1
##$TE= 0
##$TE2= 300
##$TE3= 300
##$TEG= 300
##$TL= (0..7)
0 120 120 120 120 120 120 120 
##$TP= (0..7)
150 150 150 150 150 150 150 150 
##$TP07= 0
##$TPNAME0= <>
##$TPNAME1= <>
##$TPNAME2= <>
##$TPNAME3= <>
##$TPNAME4= <>
##$TPNAME5= <>
##$TPNAME6= <>
##$TPNAME7= <>
##$TPOAL= (0..7)
0.5 0.5 0.5 0.5 0.5 0.5 0.5 0.5 
##$TPOFFS= (0..7)
0 0 0 0 0 0 0 0 
##$TUNHIN= 0
##$TUNHOUT= 0
##$TUNXOUT= 0
##$USERA1= <user>
##$USERA2= <user>
##$USERA3= <user>
##$USERA4= <user>
##$USERA5= <user>
##$V9= 5
##$VALIST= <valist>
##$VCLIST= <CCCCCCCCCCCCCCC>
##$VD= 0
##$VDLIST= <DDDDDDDDDDDDDDD>
##$VPLIST= <PPPPPPPPPPPPPPP>
##$VTLIST= <TTTTTTTTTTTTTTT>
##$WBST= 1024
##$WBSW= 4
##$XGAIN= (0..3)
0 0 0 0 
##$XL= 0
##$YL= 0
##$YMAX_a= 108154
##$YMIN_a= -104382
##$ZGOPTNS= <>
##$ZL1= 120
##$ZL2= 120
##$ZL3= 120
##$ZL4= 120
##$ABSF1= 10
##$ABSF2= 0
##$ABSG= 5
##$ABSL= 3
##$ALPHA= 0
##$AQORDER= 0
##$ASSFAC= 0
##$ASSFACI= 0
##$ASSFACX= 0
##$ASSWID= 0
##$AUNMP= <proc_1d>
##$AZFE= 0.1
##$AZFW= 0.1
##$BCFW= 1
##$BC_mod= 2
##$BYTORDP= 1
##$COROFFS= 0
##$CY= 11.3945322036743
##$DATMOD= 1
##$DC= 2
##$DFILT= <>
##$DTYPP= 0
##$F1P= 15.9154993809931
##$F2P= -4.1035820241983
##$FCOR= 0.5
##$FTSIZE= 0
##$FT_mod= 4
##$GAMMA= 1
##$GB= 0.15
##$INTBC= 1
##$INTSCL= 1
##$ISEN= 128
##$LB= 0.24
##$LEV0= 0
##$LPBIN= 0
##$MAXI= 10000
##$MC2= 0
##$MEAN= 0
##$ME_mod= 0
##$MI= 1.114404
##$NCOEF= 0
##$NC_proc= 0
##$NLEV= 6
##$NOISF1= 3.799351
##$NOISF2= 2.8
##$NSP= 1
##$NTH_PI= 0
##$NZP= 0
##$OFFSET= 15.70392
##$PC= 1
##$PHC0= -11053.83
##$PHC1= 19.60089
##$PH_mod= 1
##$PKNL= yes
##$PPARMOD= 0
##$PSCAL= 0
##$PSIGN= 0
##$REVERSE= no
##$SF= 200.130013532006
##$SI= 16384
##$SIGF1= 3
##$SIGF2= 2
##$SINO= 400
##$SIOLD= 16384
##$SREGLST= <1H.CDCl3>
##$SSB= 0
##$STSI= 0
##$STSR= 0
##$SW_p= 3612.71676300578
##$SYMM= 0
##$S_DEV= 0
##$TDeff= 0
##$TDoff= 0
##$TI= <>
##$TILT= no
##$TM1= 0
##$TM2= 0
##$TOPLEV= 0
##$USERP1= <user>
##$USERP2= <user>
##$USERP3= <user>
##$USERP4= <user>
##$USERP5= <user>
##$WDW= 1
##$XDIM= 8192
##$YMAX_p= 0
##$YMIN_p= 0
$$ End of Bruker specific parameters
$$ ---------------------------------
##NTUPLES= NMR FID
##VAR_NAME=  TIME,          FID/REAL,        FID/IMAG
##SYMBOL=    X,             R,               I
##VAR_TYPE=  INDEPENDENT,   DEPENDENT,       DEPENDENT
##VAR_FORM=  AFFN,          ASDF,            ASDF
##VAR_DIM=   8192,          8192,            8192
##UNITS=     SECONDS,       ARBITRARY UNITS, ARBITRARY UNITS
##FACTOR=    0.0002944,     1,               1
##FIRST=     0,             0,               0
##LAST=      2.4114304,     0,               0
##MIN=       0,             -104382,         0
##MAX=       2.4114304,     108154,          0
$$ Real data points
##PAGE= N=1
##DATA TABLE= (X++(R..R)), XYDATA
0@%%%%%%%%%%%%%%%qJ6j6J6j6K4l2L2m0M8n6P0p8Q8j04J20j38J60j82K06k33K61
37A38k93L31l71M13m60N12n70O32o98P70q50R37j033J140j257J383j523J682j856
56i73K050k273K527k820L163l570M062m671N450o482P921j0101J3931l5637J35577
71A08154j20336r2200J43084l5190M024m7692R471J04906q5179k4653J06274n8651
83A2012o185J3415k4863N0415l4803k8734P3956l5409l2481K4609l375q05k9190
96b1438J3681M5148n4756J468M1334l8008l33O851p610K8124k3378o533L1445
109A5995k1709j0970J795L848J6537k8052R076L2875l2840k804J8156q929N163
122a859n192J2279J7125k5695R041J5330j9999L651J519M986J3740k4599J709
$$ plain form
0 0 0 0 0 0 0 0 0 0 0 0 0 0 0 0 0 -8 8 -8 8 -8 16 -16 16 -24 24 -32 38 -40 48 -56 64 -74 86 -96 110 -123 138
37 138 -155 176 -195 218 -242 270 -300 332 -366 404 -446 491 -542 598 -659 724 -799 883 -973
56 -973 1077 -1196 1331 -1489 1674 -1896 2166 -2505 2945 -3537 4384 -5717 8214 -27423 108154
71 108154 -12182 -104382 38702 3512 7536 -40156 -30685 74221 -10958 -35611 70663 12012
83 12012 5827 19242 -5621 44794 9991 -18743 55213 19804 -12677 11932 8557 7752 -21438
96 -21438 -7757 37391 -17365 -15897 25437 -12571 -12904 -6053 -13663 14461 -8917 -15450 15995
109 15995 -5714 -16684 -14889 -11041 5496 -22556 -13480 19395 -13445 -16249 1907 -7022 -1859
122 -1859 -7051 5228 22353 -3342 5699 21029 1030 4681 6200 11186 24926 327 2036
135B036K5737k4590j8463J9409Q528j2266q912J4953R510j9009j0755J4152J0746
148A1076j5014o971K3632L845k2526q15J0917R49j3418l628K3620k764k1687J5454
162B670M506j5787M838N908R34K079M42N969o032m793Q252n612j697P835j587
177G925N62k860m466J726o490N96M094m856O655j86q920N437l184o638O824R23
193b858m83K292q11Q65m262l758M339l67r24L419Q44N55l293k932K238N6j3J283
211c810M431M338o872j146O891n887k400O909J149J073j432k200J577l962k394
226c735J298M44N035k343m612N618j936p325K645L416J718r15P09M668l228m885
242c428K569n33J441K057j463L766O25p136L11K552j575l89L108L927j293l595
$$ plain form
135 2036 27773 3183 -15280 4129 12657 391 -8521 6432 15942 -3067 -13822 330 11076
148 11076 -3938 -10909 12723 16568 -5958 -6773 4144 5093 -8325 -11953 11667 8903 -12784 2670
162 2670 7176 -8611 -3773 2135 3069 5148 5590 11559 5527 734 8986 3374 1677 9512 7925
177 7925 8487 5627 1161 2887 -3603 -3007 1087 -3769 2886 2700 -6220 -783 -3967 -10605 -3781 -2858
193 -2858 -3341 -1049 -1860 -995 -5257 -9015 -4676 -5043 -5967 -2548 -1704 -1149 -4442 -7374 -5136 -5080 -5093 -3810
211 -3810 621 4959 -1913 -3059 3832 -2055 -4455 2454 3603 4676 3244 1044 2621 -1341 -3735
226 -3735 -2437 -1993 3042 699 -3913 1705 -231 -7556 -4911 -1495 223 -692 17 4685 1457 -3428
242 -3428 -859 -1392 49 2106 643 4409 5034 -2102 -1791 761 -814 -1203 1905 5832 4539 944
258I44K317q29l288K388J778N31J545j527j044k055k326m55L68J417P26j840R87
275c63r35n074J041J550j416J837K628J06j415j775Q20r61k269M249L184k903
291a696J589K40k839J18k038J851M453k974J650M172m379j670Q69l32L301j704
307F11J351N810n918j960M170m990j56L254k067L401l41m127K191l117j774L383
323b79j855L176K483m790L412k84n076L088J085m36L449j827Q60L70n448K103
339C1J189k382K809J478o41Q22k949n14J701k351J053L356l46l84j187l82L4l642
357b305P90L709j696j403K434j170l256r45J621M98o92K151J862k040o55P13j519
374a903M42J403N92J967k52l71qk035J54J829r58J567J943r76p8j511k21J192
$$ plain form
258 944 3261 2432 -856 1532 3310 3841 5386 3859 2815 760 -1566 -2021 -1653 -236 490 -1350 -363
275 -363 -1298 -6372 -5331 -3781 -5197 -3360 -732 -626 -2041 -3816 -2996 -3957 -6226 -1977 1207 -1696
291 -1696 -107 133 -2706 -2588 -4626 -2775 1678 -1296 354 4526 147 -1523 -654 -986 2315 611
307 611 1962 7772 1854 -106 4064 -926 -1082 2172 105 3506 3165 -962 1229 -1888 -3662 -279
323 -279 -2134 1042 3525 -1265 2147 1863 -3213 -125 960 524 3973 2146 3006 3376 -2072 31
339 31 1220 -1162 1647 3125 2484 3306 357 -157 1544 -807 246 3602 3256 2872 1685 1303 1337 -2305
357 -2305 -1515 2194 498 -905 1529 359 -2897 -3842 -2221 -1723 -2415 -264 1598 -442 -1097 -384 -1903
374 -1903 -1461 -58 534 2501 2249 1878 1870 -165 -11 1818 860 2427 4370 3394 3316 1805 1584 2776
392B776k085J529K793j989R77q66l470K207j796k108L885r28n75j2k983J655j816
409b806l737M997p77k125L419k852k62P62l750K975J001j642M171j910j650L749
425d37l973n00L523j405K495q20n67L916n365n17N030l795J462L148k017J290
441A468j913j048L255m767J307M514l438L89Q2j655J328m288M91N068l560O9K166
458e32j495Q78k783k20L695j472J137R12r26L553l797k344N863j359p96K660n97
475B377J788p55k519K836j182J584J620l247M291Q86n882K095J183j409P34j761
491B639K387K96l792J338k042n96L046m745J180M051m454m78j56q47J952l245
507c466O65M166k790k55J00j282K347k839O49M267l099J414J400l408J977N6o77
$$ plain form
392 2776 691 2220 5013 3024 4001 3135 -335 1872 76 -2032 1853 925 350 338 -2645 -990 -2806
409 -2806 -6543 -1546 -2323 -4448 -1029 -3881 -4143 -3381 -7131 -4156 -3155 -4797 -626 -2536 -4186 -437
425 -437 -4410 -4910 -1387 -2792 -297 -1117 -1684 2232 -3133 -3650 1380 -2415 -953 2195 178 1468
441 1468 -445 -1493 1762 -3005 -1698 2816 -622 -233 -151 -1806 -478 -4766 -4275 793 -2767 -2698 -532
458 -532 -2027 -1149 -3932 -4152 -457 -1929 -792 120 -806 2747 -1050 -3394 2469 1110 314 2974 2377
475 2377 4165 3410 891 3727 2545 4129 5749 2502 6793 7679 1797 3892 5075 3666 4400 2639
491 2639 5026 5322 1530 2868 826 230 3276 -1469 -289 3762 -692 -1170 -1326 -2173 -221 -3466
507 -3466 -2801 1365 -1425 -1680 -1580 -2862 -515 -3354 -2705 1562 -1537 -123 1277 -2131 -154 -98 -775
524g75K488k330L153J966n750K844Q36k167K722l358K483M678p286O13L652l332
540D37Q64k165J143M612n958K19K838l836K419k076k240O648l187k294L309l186
556b453J877l33m015N817o84k828L117k743O13J930n407L589K129l070K302j742
572a901j41K852m480M30L222j117L71j696N40K719m520n38L304p18r7r64J073
589a661J953l734N02J648r23R88L44k17J112j325Q52n3j585L332n2j620K581j116
607A026J00Q61k506K032Q73o07J201k384K284J846o244K264M469l579o30R46J411
624C363j40m375K486K026m305J672J214j783J507j792l60N80k009K742p06k336
640b216L867j157k942K311p77R56p59j534L846n53l124K624j103l1J074j979J808
$$ plain form
524 -775 1713 -617 2536 4502 -1248 1596 2432 265 2987 -371 2112 6790 -496 117 3769 437
540 437 1301 -864 279 4891 -1067 -848 1990 -1846 573 -1503 -3743 2905 -282 -2576 733 -2453
556 -2453 -576 -909 -4924 893 209 -2619 498 -2245 -1632 298 -5109 -1520 609 -2461 -159 -1901
572 -1901 -2042 810 -3670 -3240 -18 -1135 -764 -2460 -1920 799 -3721 -4259 -955 -1673 -1770 -2734 -1661
589 -1661 292 -3442 -2940 -1292 -2215 -1227 -883 -1100 12 -1313 -461 -514 -2099 1233 1181 -439 2142 1026
607 1026 1126 1987 -519 1513 2386 1779 2980 596 2880 4726 -1518 746 5215 1636 1006 1952 3363
624 3363 3223 -1152 1334 3360 -945 727 1941 158 1665 -127 -487 93 -1916 826 120 -2216
640 -2216 1651 494 -2448 -137 -914 42 -717 -2251 1595 1042 -2082 542 -561 -592 482 -1497 311
657C11P89j867J368j372j13K854l195K54L376k519K96j67k37J346k757N48L163
674B078k920R24J394k232O50J94j233J723p16p49J049n76k87J84M29J436j629
691b81q76L365j315j877J832N08j249o95J050K432k395j262K743n62j965N07Q39
708G99M97j574L34J448r41j693J278J36j398J025M01k65q35M03L27j041pJ073
726c3l23q01J097o27l62M53m56j36Q03k21j45J30q8R46j412j13J875r86n84J513
746E30k36j064n6K88J140j030o36K362q34j871J851l09k05o8J04J162n09j482
764h63J765k5j210L04K12N95n86p71J942m49j845J419M93r85K82j33Q57p9j980
783a057J558J40j201K67N50k20p3j083J671M7k494J385J033j450k3L34P3j69o65
$$ plain form
657 311 1100 -767 601 -771 -884 1970 -1225 -971 2405 -114 182 15 -222 1124 -1633 -1085 2078
674 2078 -842 82 1476 -756 -106 88 -1145 578 -138 -887 162 -414 -701 -517 -88 1348 -281
691 -281 -1157 2208 893 -984 848 1356 107 -588 462 2894 499 -763 1980 1418 -547 -40 799
708 799 1296 -278 56 1504 563 -1130 148 284 -1114 -89 312 47 -788 -385 -58 -1099 -1106 -33
726 -33 -356 -1157 -60 -687 -1049 -596 -1052 -1188 -385 -606 -751 -621 -709 237 -1175 -1288 587 -399 -983 530
746 530 294 -770 -826 -538 602 -428 -1064 1298 464 -1407 444 135 -70 -138 -34 1128 619 -863
764 -863 902 877 -333 -29 183 778 192 -579 1363 914 -931 488 981 -4 278 145 1002 923 -1057
783 -1057 501 641 -560 -293 257 37 -36 -1119 552 599 -1895 -510 523 -927 -950 -616 -543 -712 -1377
802a377P64N48j795N51O29p4o15k32J459l10k041J916O70j517M98O25O2m37k38
821i14J475m04j247J320R3r08Q91o0l35J836j762N53J263j006l28R06P88p52r64
840D45J714l27j458R77L96r93K90K21k66K45l83K45L17n09K07o24N91l26q16N63
860E09K30r27Q6O09l3r18K46J073q51n03P22l48m17J96l19O49l81p37J120m0n39
881e73N6k30L40J27r11Q68r6j31O01j090N67J98o40R53n98n76J376n13n09O75
901a06m63K81j68k11Q88l73n30P14l35NK74q70J014J45r08N60J64j47n1p33J115
922B65L47j591J170L42o65K06l88Q39j89m92J021p13l93R85q49k34L66N6N12q19
942b24k65Q96q25l44L99k85P85p09o34J095o28k05j01p4J558j153r23J840p05
$$ plain form
802 -1377 -613 -65 -1860 -1309 -680 -754 -1369 -1601 -142 -452 -2493 -577 93 -1424 -926 -301 -239 -676 -914
821 -914 561 157 -1090 230 323 -585 306 246 -89 1747 -15 538 1801 795 467 1373 2161 1409 445
840 445 2159 1832 374 1351 1747 754 1044 1265 999 1244 861 1106 1423 914 1121 497 1088 762 -54 509
860 509 739 -188 -102 507 474 -444 -198 875 24 -479 243 -105 -522 -326 -645 4 -377 -1114 6 -34 -573
881 -573 -517 -747 -407 -280 -1191 -323 -419 -550 51 -1039 -472 -274 -914 39 -559 -1135 241 -272 -781 -106
901 -106 -569 -288 -456 -667 221 -152 -682 32 -303 -298 -24 -894 120 265 -643 -83 81 -66 -117 -850 265
922 265 612 -979 191 533 -132 74 -314 525 336 -156 865 152 -241 744 -105 -339 27 83 595 -224
942 -224 -489 407 -418 -762 -363 -648 137 -572 -1206 -111 -739 -944 -1045 -1119 439 -714 -1637 203 -502
961e02n47O81j462J764J12j581J654k16N5L59j318J210Q46j693J021p2n5J179
979A435k503J189J891k618J294M16q18J748j618l14J430j220J022j26j648K915
995B475j146k038J816m22M17n94j310K979n92k737K287l61r18R59j497J907j44
1012A081j945J892j226n42K074k419P35K168k596Q49j94j427K654k253m43K559
1028I67j516N91l67j920L147j527j984K857j058K50M78k432K539J72k783K127
1044d59J21m74R64j914J483P75k269J663Kp03K181k082L3J790j250rJ45R0J942
1063B029k075PJ710j120K90m66o20J674l79q53J032p89O82l58j709K273J9j398
1081e1P01l33O71o64j508J695L44j257N42j20r7L75j633P83M9R6M09j335O39R72
$$ plain form
961 -502 -1049 -368 -1830 -66 46 -1535 119 -97 -42 317 -1001 209 1055 -638 383 311 256 1435
979 1435 -1068 121 2012 -606 688 1104 286 2034 416 102 1532 312 1334 1208 -440 2475
995 2475 1329 -709 1107 685 1102 508 -802 2177 1585 -1152 1135 774 -144 815 -682 1225 1081
1012 1081 -864 1028 -198 -740 1334 -1085 -350 1818 -778 71 -123 -1550 1104 -1149 -1592 967
1028 967 -549 42 -325 -2245 902 -625 -2609 248 -810 -560 -82 -2514 25 197 -2586 -459
1044 -459 -338 -812 152 -1762 -279 496 -1773 -110 -108 -811 1370 -712 -679 1111 -139 -148 -3 87 2029
1063 2029 -46 -39 1671 551 841 375 -245 1429 1050 197 1229 440 1122 764 -945 1328 1347 -51
1081 -51 650 317 988 324 -1184 511 855 -402 140 20 -77 298 -1335 -552 -503 -407 2 -1333 -694 278
1101B78r05l60O02j00M71j239K81J795j802L52pn39J785j016j49P93j94m07J54
1120b07n78J359k44j226J053O18p99o59Q08J51K70j002Q96J2K36J22r46K96K43
1139D03p66N91K24r4O80j101J16M94p68M74k34R5Q62q69R6M35r48M52L9l82J377
1160A176n16q15M75k38M3k12k16J049n71o47P97q14K96J75q79N96M14n30k5l45
1180g87O4p9p5O81k22k69P73q20J78K21m46J54r8K07O57n09J32J28n17L91j03
1201c39K73O28j9n11O64m69j03K52o9N92r3m49N30n12k3J63o13O20K65p00P45
1222H32j34n22PJ71m94N89l75M76Q4p43N29p45k45P29k83J97pn28P86l47n92O23
1244Hk96j69O88k68m2qp72O14l71k61P99k59K99J44p54J07K36p31P63M21o54L75
$$ plain form
1101 278 -627 -987 -385 -485 -14 -1253 -972 823 -979 -627 -634 -1173 612 -404 -553 240 46 -361 -207
1120 -207 -785 574 330 -896 157 775 -24 -683 125 276 546 -456 440 452 688 810 -136 160 403
1139 403 -363 228 452 358 1038 -63 53 547 -221 253 19 114 976 107 203 638 -310 142 181 -201 1176
1160 1176 660 -155 320 82 125 -87 -303 746 175 -472 325 -489 -193 -18 -897 -301 113 -417 -442 -787
1180 -787 -723 -802 -877 -196 -418 -687 86 -734 -556 -335 -781 -627 -725 -518 139 -370 -238 -110 -627 -236 -339
1201 -339 -66 562 543 32 696 227 124 376 307 899 806 357 887 375 352 515 -98 522 787 87 832
1222 832 698 176 183 354 -140 449 74 550 634 -109 420 -325 -570 159 -124 73 66 -462 324 -23 -615 8
1244 8 -288 -457 231 -37 -79 -87 -859 -245 -616 -877 -78 -337 -38 106 -648 -541 -305 -1036 -273 148 -506 -131
1266a31m74n2L60p71N17M43o20Q82o3n39L66m32K44M80o61P03L47p24L45m2n78
1287d00M45j0J31P88l14J91j12m88M81j45j98R10m76j23R2o48J65K52m13M41J5
1308E84k0J85o07j61k70j10O44r5k84L38j65l92K13k10j09K46K6K28j59k29k9
1329c76m2j28O1n5L95K41l35K68m37j04N9N0K42j81L23J16L3k77j16J7j30L65
1351a1M04k07K1k99J62N2n21P1P95n58J28M34n24P3J7j76N71l92J77O50p75M60
1373E52m18o9K70J81k98O82o62o3L00m47m0K34j50O20o31k79P90r65K26Q9m98
1394e76R90L3j006M10k97j05q6n91J006J2n37K24Pj18L56j118P28M62k99L89j38
1415b54n06Q34o29k67J017m82N39N0l41Q42j114j31J120n51J98L03n36Q90m21
$$ plain form
1266 -131 -605 -657 -297 -1068 -551 -108 -728 154 91 -448 -82 -514 -270 210 -451 252 599 -125 220 178 -400
1287 -400 45 35 166 954 640 831 719 231 712 567 369 1279 803 680 772 124 289 541 128 569 584
1308 584 564 749 142 -19 -289 -399 245 150 -134 204 39 -353 -140 -350 -459 -213 -187 41 -118 -347 -376
1329 -376 -418 -546 -485 -540 -145 96 -239 29 -408 -512 -453 -403 -161 -342 -19 97 130 -147 -263 -246 -376 -11
1351 -11 393 186 207 -92 70 122 -399 -328 467 -91 37 471 -53 20 37 -139 432 40 217 867 92 552
1373 552 134 65 335 516 218 900 238 175 475 28 -12 222 72 692 61 -218 572 -393 -167 -78 -576
1394 -576 414 447 -559 -149 -446 -551 -637 -1228 -222 -210 -747 -523 -516 -634 -278 -1396 -668 -206 -505 -116 -254
1415 -254 -760 74 -555 -822 195 -287 252 302 -39 803 -311 -442 678 127 325 628 92 982 561
1434E61o54O85PM02J96j084Q84J6j041P85o66L49P81j285P40K29j085M56l85j67
1454b76J015r10Q1P37r81O84p80k12J420q94k26P80l46J78m78r23J421m79n39
1473g28P84k14P42m60j384J367k37o17P11m53N56L19j579P94K84o26Q70q01N02
1492a70J017j444Q5K85m37Q91q55RJ196q87m4L07o62Q99m95m70J524m11o2k50
1512B6o70J497n70j112J478k47j52M48q33N36M22j346R11M10o35N73j261P78O47
1531I00j425L47M16k26Q64r50q3R89j221J43O7O4Q53j079l9P40n44k12k27r3J088
1552C72q20m32Q81m94M8j41l86J237l62m71L68j13L19j48j189J100N23p05M79
1571F6l50L13L48j018M73Q07o24L73m07K20M25j045M09N74j79J66k32k49J142
$$ plain form
1434 561 -93 592 599 1001 1197 113 997 1013 -28 757 91 440 1221 -64 676 905 -180 276 -109 -276
1454 -276 739 -171 -90 647 -334 350 -430 -642 778 -116 -342 438 92 270 -208 -1131 290 -189 -728
1473 -728 56 -158 584 124 -1260 107 -130 -747 -36 -489 67 386 -1193 -399 -115 -741 129 -672 -170
1492 -170 847 -597 -512 -227 -664 227 -628 -619 577 -310 -354 -47 -709 190 -305 -775 749 338 276 26
1512 26 -644 853 283 -829 649 402 250 698 -135 401 823 -523 388 798 163 736 -525 253 900
1531 900 -525 -178 238 12 876 -74 -157 832 -389 -246 -179 -115 738 -341 -380 360 -184 -396 -623 -716 372
1552 372 -448 -880 1 -493 -445 -586 -972 265 -97 -568 -200 -313 6 -142 -1331 -231 292 -413 66
1571 66 -284 29 377 -641 -168 639 15 388 -19 201 626 -419 -10 564 385 551 319 70 1212
1590A212r78k77M23n42Q96n76j28J160p24m99N25q52J018k24n11P65k93l10L66
1609D51r50N69L15r36P82J40m76L23o28L9M23q14O24L04o03N99n29l45P69n69
1629e12K01j36L0R36j172j19P04n36o8O78m16M73m7m86M06k82K66K37m81N54j78
1650E2o84N50k05k22O68k21J5O13o31J40L00l42L42j55j03L20k19K7R7k83L99
1671D58m86J68L84k57K66N0n30K47r9j91M52j49J11J47j31j05j21l85L53k63J19
1692C8J86l55L19j99m65J38J31k94K15%O0r0l77M19l70J40J43q5oL17l87j52j5
1715f89R6N27k48L1K93k28k24l6M72j68K72m3R4J40j25j7Rk2M7J48R1M7M9j48
1739C68r4q1K65l52M94O0m21L30k47k60o1K4L6M37k63j44j2k49K14l91L36q5j26
$$ plain form
1590 1212 234 -43 380 -162 734 158 30 1190 466 -33 492 -360 658 434 -77 688 395 85 451
1609 451 -499 70 385 -551 231 371 -105 218 -410 -371 52 -762 -138 166 -437 162 -367 -712 57 -512
1629 -512 -311 -447 -417 519 -653 -772 -68 -604 -672 6 -410 63 16 -470 -64 -346 -80 157 -324 230 52
1650 52 -632 -82 -287 -509 159 -62 -47 566 -65 75 375 33 375 220 117 437 218 245 342 59 458
1671 458 -28 140 524 267 533 583 53 300 201 10 462 313 424 571 440 335 214 -171 182 -81 38
1692 38 224 -131 188 -11 -476 -338 -207 -501 -286 -286 -226 -316 -693 -274 -644 -504 -361 -446 -452 -135 -522 -674 -689
1715 -689 -593 -66 -314 -283 10 -218 -442 -478 -6 -174 98 55 149 289 164 147 156 134 181 329 420 467 516 368
1739 368 274 193 458 106 600 660 239 569 322 62 1 25 61 498 235 91 79 -170 44 -347 -11 -96 -222
1762b22K99O4m75R5J41l71L95Rk00K64j60L1k18L24l35P4L2L28q3k36J39J27j99
1785a77k8L13k52K62o6j10J59k10Q2j0K85j67j94J97o2k71K43j49J26Q2j59L8
1807f8J57p3m7J31N4m9p0M01n3q1l07L92j46q6j87K41p7M06lk10K06n54O14l75
1831B16J23R2p8J85l39o6L62l01K3J18O3m17J82k95O6J04r7k51q0l4J52l04J32
1854d44m7o3J5J44l1P2m94R3O45o17n8L47j28L01J92o78P45k07N4O1P1J78J6k36
1878f9J94J96k35q5R1K29j23J4L12j03j92J46j34K91M2l86J08K1m3K21k82j32
1900H1M52m38k61M27l07L99l82k11N38l71n6q7j78M83k58o77Q86k27k0K13o55
1921f49P02p0n40L88r8K27J23n14L01K53l88N7K17q2O14o96K45K09l62J75m9j54
$$ plain form
1762 -222 77 141 -334 -239 -98 -469 -74 -65 -265 -1 -161 -130 -348 -24 -359 -285 -253 75 -8 -244 -105 22 -177
1785 -177 -205 108 -144 118 52 -58 101 -109 -27 -37 248 81 -113 84 22 -249 -6 -155 -29 53 -106 -68
1807 -68 89 16 -31 100 154 105 35 436 383 302 -5 387 241 155 -32 209 132 538 535 325 531 -23 591 216
1831 216 339 431 353 538 199 133 495 194 217 335 398 -19 163 -132 -66 38 -59 -310 -390 -424 -272 -576 -444
1854 -444 -491 -554 -539 -395 -426 -354 -848 -755 -110 -727 -785 -438 -566 -265 -73 -751 -6 -213 -159 -98 -27 151 167 -69
1878 -69 125 321 86 1 92 321 198 212 524 421 229 375 241 532 574 188 296 317 274 495 213 81
1900 81 533 95 -166 261 -46 353 -29 -240 298 -73 -129 -216 -394 89 -169 -846 40 -187 -207 6 -649
1921 -649 53 -17 -557 -169 -267 -40 83 -431 -130 123 -265 -208 9 -73 541 -155 90 299 -63 112 63 -91
1943i1O01o47k12R94p92K98j00n60R46j16o24O69l24k4K0n83J115j42q19R09n36
1964a8L36K44r39P11J92l59J06j69J85N54q77J22L50m49N43k70j94R59r19NJl67
1986b53N25k41l31Q83o01k81K97m82P94k88p47P75k06l09K21k05J09J33m67M40
2006b34O8k83J32o02O19M85p76Q4M64l97M13p20L85P32m83j69K86j10K37k08l19
2027c96R93o81L9K01J16J75m91m24Q38k90j02J80j40M26j57m94L83J51p2n0o14
2048d09P40J20l74j0o16O17J36n08K16N49q88M75r4J76L21n50p9M83m99M42n95
2069c47k5P21l59m72N83k98K00P7n46Q42m62l70M37mR8k21l32O62p5n34L12Q5
2091b8M9M6p46O00J49n48O14p7j41J32j82J05Mk1J35j51k26O70n52K96J65l68
$$ plain form
1943 -91 510 -137 -349 645 -147 151 51 -509 437 321 -303 366 42 18 38 -545 570 428 -391 518 -18
1964 -18 318 562 -377 334 526 167 273 104 289 843 -34 88 438 -11 532 262 68 1027 108 113 114 -253
1986 -253 272 31 -300 583 -18 -299 -2 -484 310 22 -725 50 -156 -465 -244 -449 -340 -207 -674 -234
2006 -234 -166 -449 -317 -919 -300 185 -591 -507 -43 -440 -27 -747 -362 370 -113 -282 4 -106 131 -77 -396
2027 -396 597 -84 -45 156 272 447 -44 -468 370 80 -22 158 18 444 287 -207 176 327 255 205 -409
2048 -409 331 451 77 67 -549 68 204 -304 -88 461 -427 48 -46 130 451 -99 -178 305 -194 248 -347
2069 -347 -372 349 -10 -482 101 -197 3 80 -466 376 -86 -456 -19 -23 75 -146 -478 184 109 -425 -113 -28
2091 -28 21 67 -679 -79 70 -478 136 59 -82 50 -132 -27 -23 -44 91 -60 -286 384 -168 128 293 -75
2113g5K70l19m0P26l45j80K31k50M06kn66N30k15j61M70k85K36J02m12L41n8l84
2135B0L50k25J67O0l84J78j00k57K91k35N5K56l42J91m9l51R4L8l51N24l17P3
2157c14R9o5L73n30J72K52n81p08N24M14j02JJ91K16l80J023N3r98P92Qr34J221
2179G27n96J85l1o66M7J126M71j221K65M6R2K40l51L5R8l77N26l41J18j00k44
2200D9J2p1j55M07l28K84j26j48K36j30j48M1L55m21j8Q1k12K95l57QL43l18K83
2223c8J26n6p26K14R77j49q94Q99n44K05L42p05L30j39P7JL9k01K55j17j34K57
2245A9j44K8K15j54p9J91k35J61Q0j66k5K6Rn2K25j29K09l93K66j20M06j69l5
2268A34j0J07k15J61L7j9mj57J47k24L28M7k00k51J81J88k60Q4j09K44j01O6R
$$ plain form
2113 -75 195 -124 -164 562 217 37 268 18 424 422 -144 386 171 10 480 195 431 533 121 462 404 20
2135 20 370 145 312 372 -12 166 66 -191 100 -135 -80 176 -166 25 -24 -375 -281 -243 -594 -70 -387 -314
2157 -314 -215 -280 93 -437 -265 -13 -594 -1302 -778 -364 -466 -465 -274 -58 -438 585 638 -360 432 440 -494 727
2179 727 131 316 285 -381 -334 792 1263 42 307 353 445 685 334 369 467 90 616 275 393 293 49
2200 49 61 -10 -165 242 -86 198 72 -76 160 30 -118 -77 278 -143 -161 -80 -292 3 -354 -346 -3 -321 -38
2223 -38 88 32 -694 -480 497 348 -546 353 -191 14 356 -349 -19 -158 -81 -80 -41 -242 13 -104 -238 19
2245 19 -125 -97 118 -36 -115 76 -159 2 82 -84 -109 -83 -74 -126 99 -30 179 -214 52 -68 338 169 134
2268 134 124 231 16 177 214 195 191 34 181 -43 285 332 132 -119 62 250 -10 74 -35 209 108 174 183
2291A83Oj56n5j84K55j63L3j30j12K59j67j00OL26M6j60o9K36l45L36j81P6k41
2314c01K5J88J49l74J82j41L0K5p9K5L36J38m58K69n3M20m6K7j33%M07k6k79q4
2338B47K63k93J36l87L33J33l33o5K76k91K25m0j55L97j88l00K40k14J84j83k76
2359b91N27l6k64L4k00J20J22m1j48p0J47k84M03j32L06l92j05O15n73M83o21
2380d00J44L97k82K02k51k12O14n69j10N67m1m52L66k73R3k3o7J57m4J34J84l19
2402a85O4L80m27K36J04l11M20k48QM71n90N1L5K9K80k26l07O51k96Q2k5nO09
2425H00m46m03L19P2l7j15k81O8M1l29O55k85j73Kj98N97j49n44J09P3K06J47
2447A29m67k0K84j84k2N8k06M36l66j33P72o72K98J13n44Q14n78J48L91m13M37
$$ plain form
2291 183 189 33 -22 -206 49 -114 -81 -211 -323 -64 -231 -331 -325 1 47 -113 -182 54 -291 45 -136 -60 -301
2314 -301 -276 -88 61 -313 -131 -272 -242 -217 -296 -271 65 203 -255 14 -39 381 335 362 229 229 636 610 331 247
2338 247 510 217 353 -34 299 432 99 34 310 19 244 204 49 446 258 -42 198 -16 168 -15 -291
2359 -291 236 200 -64 -30 -230 -110 12 -29 -177 -247 -100 -384 19 -113 193 -199 -304 311 -262 221 -400
2380 -400 -256 141 -141 61 -190 -402 212 -357 -467 100 59 -393 -27 -300 -207 -230 -297 -140 -184 -50 134 -185
2402 -185 -121 259 -168 68 172 -139 281 33 41 512 -78 -27 8 37 317 91 -216 435 139 221 196 191 800
2425 800 354 -49 270 342 305 190 -91 -23 18 -311 344 59 -114 -112 -310 287 138 -406 -297 -224 -18 129
2447 129 -338 -358 -74 -258 -280 -222 -428 8 -358 -491 281 -391 -93 20 -524 290 -288 -140 251 -162 275
2468B75k53r6M26j46k19K01j39q4L85n34M31j0l67L22j05J11J84o78M22L59o39
2489a54K12J4P6J28l84L73K19n06L46n74M41K18n95L68q2j28J76k75j67P77n49
2510f6j70K82o5K24k58l93O09l55j10J25l5K04J61r13P35k1j15o9p9K12m4m73
2532f14P6N96k9r4k71j64N74n50j44M69j23M61k60J93j81n84O51l54n47Q64r6
2553a27L5J104j806N77P02o24m2K89m31P21n66P29o84p15O01L77M7N20k45l67
2573I5L32n23M22J21n24N44j77j79L04q8m02L27j15J1R8N7Mk01j86M45l35J5O1
2596A06k80L47l04k50O45m85J46NK2p3j17j05K29j60J26N1k72J34J37l05J38r1
2618c56O8K31k01K44J86k82J37k44O3M39k70J48j99nO8O4j65L12k64Q2K68j84
$$ plain form
2468 275 22 -74 352 206 -13 188 49 -35 350 -184 247 237 -130 192 87 198 382 -296 126 485 -154
2489 -154 58 72 148 276 -108 265 484 -22 324 -250 191 409 -186 182 100 -28 148 -127 -294 483 -66
2510 -66 -236 46 -19 205 -53 -446 163 -192 -302 -177 -212 -8 153 -760 -25 -46 -161 -230 -309 -97 -141 -614
2532 -614 -538 58 29 -65 -336 -500 74 -476 -620 -151 -274 187 -73 120 -61 -645 6 -348 -895 -31 -127
2553 -127 -92 1012 -794 -217 485 -139 -181 108 -323 398 -168 561 -123 -838 -237 140 187 707 462 95
2573 95 427 -96 326 447 -77 467 290 111 415 327 -75 252 137 148 246 303 307 106 -80 365 30 45 106
2596 106 -174 173 -131 -381 264 -221 -75 -70 -48 -121 -238 -343 -114 -274 -148 -97 -369 -235 -98 -403 -265 -356
2618 -356 -288 -57 -258 -14 172 -110 27 -217 -154 285 15 163 -36 -41 27 91 -74 238 -26 56 324 140
2640A40k52N82n30J07K35l23K04j29J73O5k89K15j46L02m73P3M03j84j14M06j64
2661C01l39l15J69k08M71p4J58K85l39l92j69J66R33N4r96j21L00n37N42m09O39
2682A19Pl38n3J23ML26o1l11j27j31L16O4R5P9l62L97k5k47K25kj77J23J02j41
2706ERj91M94j21n7Q3%j51J37n7o8K51j23k45J83Jk2J90p6N8k32M1n8J21o4j15
2732gO8J79j59K21m54K47r8K9m50M50N5j47L5k29L66k39j79J01p1N9P1j71K24
2755i9k30L34JL8k84k17L44j22K47j1j85N5K25l83J46J77k8J06J49m69O1j27L92
2778A20k70J83J12L5k39J14L29j12mk44J75j12m2j8N7O0J8r3K9o4m8Q7l9O7j19
2803a8M03m09J95n6j85P9M5k16O24m74M59j13j24k58K62k34j68n42P44L10o51
$$ plain form
2640 140 -112 470 -60 47 282 -41 163 34 207 272 -17 198 52 354 -119 -46 357 173 59 465 301
2661 301 -38 -353 -184 -392 79 5 163 448 109 -283 -452 -286 647 701 -295 -416 -116 -653 -111 -520 119
2682 119 126 -212 -265 -142 -138 188 127 -184 -311 -442 -126 -62 33 112 -250 147 122 -125 100 98 -79 44 146 5
2706 5 14 -177 317 196 139 222 222 71 208 151 83 334 211 -34 149 150 128 318 242 300 68 109 51 172 108 -7
2732 -7 61 240 81 302 -152 95 -3 26 -424 26 81 -66 -31 -260 106 -133 -312 -211 -282 -223 -152 -323 -99
2755 -99 -329 5 6 44 -240 -457 -113 -235 12 1 -184 -129 96 -287 -141 36 8 114 263 -206 -145 -272 120
2778 120 -150 33 145 180 -59 55 384 272 268 24 199 87 45 27 84 144 162 69 98 34 -14 73 34 101 -18
2803 -18 385 -24 171 115 -70 9 54 -162 462 -12 447 334 210 -48 214 -20 -188 -730 14 324 -327
2824c27K52l35j93j6m8M99J2J45k15L56l75P3r2J42J02l66K70j92R2Q6n7K90j48
2847d5l7J67j61l1K53l33o9M52j25k47O50l47K31l73J49J81j66M4J35n0Q3L9j58
2870B42M2j62J00J50k11P8J80k89K87k10l03K45j91o0N27r29O09J2l4j66m4j04
2892b31J69n6k91M53m50L17j05j01K47j29j99K92j44K79k95k43O19k97j02N37
2912B70k76M7l46K40J30k57K64jm46L19L63o93L10M33k04n5n33L67M96n45J99
2933H2j31m0J15N3j86L39j61k3K17j77L09j75k29M90j82Nn61L37J97k98j96N19
2955C04l62K13m2o86P11o3oJ81k27k92M07m07R8J36j15K57k65k66M59l83K90J67
2977A09m38K03j38P4L64l40n9M26k07Lk34J33K89k06K1J68k82J48j09r5N07j54
$$ plain form
2824 -327 -75 -410 -603 -619 -667 -168 -156 -11 -226 130 -245 -172 -264 -122 -20 -386 -116 -308 -216 -130 -187 103 -45
2847 -45 -82 85 -76 -107 146 -187 -256 196 71 -176 474 127 358 -15 134 315 149 193 328 278 361 400 242
2870 242 284 122 222 372 161 239 419 130 417 207 -96 149 -42 -102 425 -504 105 117 83 -83 -127 -231
2892 -231 -62 -118 -409 44 -406 -89 -194 -295 -48 -177 -376 -84 -228 51 -244 -487 132 -165 -267 270
2912 270 -6 41 -305 -65 65 -192 72 71 -375 -56 307 -386 -76 357 153 98 -435 -68 428 -117 82
2933 82 -49 -89 26 79 -107 232 71 48 265 88 397 222 -7 483 301 306 -255 82 279 -19 -215 304
2955 304 -58 155 113 -573 138 75 69 250 23 -269 138 -269 -171 -35 -150 107 -158 -424 35 -348 -58 109
2977 109 -329 -126 -264 -190 174 -166 -225 201 -6 -3 -237 -104 185 -21 0 168 -114 34 -75 -170 337 183
2999A83l66J24K19j85J22k6J70k62m03M18R9K43j35l74o2L59j19J36Q2k51K82
3020B54m88K80R9K0J04j62n0K79l62k21J43J23J24j34j58R9q0J57L50o87O86n33
3042a57M5J36j16k9O6n5k18L27m05J58J93j1N1l34J56J80k07P3J34j29M0l27J98
3065b31L61j84q2K52O6j49J21l60K51nJ36j60k14M17j21l13L37J5k5J6l1L44k00
3088B41k71KN3l9O0J81r3pj88O6K04j78N9K2j19J08j70J65j94N7J24l9R2Mj62
3113b2J83j29m4J86l41L1R4J38k9j45j54J70j49J84j70K87l15K97k34j08K11j23
3135a82p1J21P9j86K00j23J98j01m9J74P8l1k68K3R7QM3L39m27k8J29Q3mJ11k92
3160g9K87o1nJ52J01l86L26k97J24m7N6K3l1J59p0j92M0J6J22j35m6J61M4j58
$$ plain form
2999 183 -183 -59 160 -25 97 71 241 -21 -424 -6 93 336 201 -173 -235 124 5 141 223 -28 254
3020 254 -234 46 145 165 269 107 57 336 -26 -247 -104 19 143 9 -149 -50 -130 27 377 -310 376 -157
3042 -157 -112 24 -92 -121 -55 -110 -328 -1 -406 -248 -55 -66 -15 -349 -193 -13 -220 -147 -13 -142 -102 -429 -231
3065 -231 130 -54 -136 116 182 33 154 -206 45 40 176 16 -198 219 98 -215 122 137 112 128 97 441 241
3088 241 -30 -28 25 -14 46 227 134 127 -61 5 209 31 90 112 -7 101 -69 96 -98 -41 83 44 136 140 -22
3113 -22 161 32 -12 174 -167 -136 -42 96 67 -78 -232 -62 -211 -27 -197 90 -225 72 -162 -270 -59 -182
3135 -182 -253 -132 -53 -239 -39 -162 36 -65 -114 60 138 107 -161 -138 -41 -33 10 349 -78 -106 23 106 102 213 -79
3160 -79 208 147 142 294 395 9 335 38 162 115 171 194 163 322 252 60 100 116 238 103 57 218 262 104
3184A04O6j3k22J81n0p4k0j66J08R2J0j54j65K56J79P2l56j01K92m7j39J36o8
3207g9q2K86k87J80j2j60J31lK24MK2m12M35l36J13L1j53P6O3k02L38k81K41Q5
3231B22k49L02l61J81j0j49L72j53j71J95j23m5m0J83j90lJ14J06k3k67O5K8Q2
3254F6q9j8%N0O4K40k25j55K52k54k7N11n57l4k0K65j02l6q2p5L13k22j2J41P
3279AJ49p2k88J15k19J62j22R0j36J66k60L32k17J85n2j0K58j83l1p4j73L37K6
3302a6J35o9m2L48j27m8Q0k07j44L80m10M21m61N31K54o16L82j24m64N24%k17
3324A10j13L28k79lJ63Rk27k04K52J80j64o9j54rJ13QL0P0J59q2l88P6K72kk12
3349a36j34K72M24m55j65J96J67j81q3J38j87o2J61qm9j07M07p67j62N78k76Q65
$$ plain form
3184 104 170 157 -65 116 66 -8 -28 -194 -86 6 16 -138 -303 -47 132 204 -152 -253 39 -8 -147 -11 -79
3207 -79 -161 125 -162 18 6 -154 -23 -26 198 202 224 -188 247 -89 24 55 -98 -22 41 -161 177 -104 137 222
3231 222 -27 275 -86 95 85 -64 308 155 -16 179 56 11 -29 154 -36 -39 75 181 158 -109 -44 -16 66
3254 66 -23 -41 -41 9 73 313 88 -67 185 -69 -96 415 -142 -176 -196 69 -33 -69 -151 -226 87 -135 -147 -6 1
3279 1 150 78 -210 -95 -314 -152 -274 -184 -320 -154 -414 -82 -299 -114 -166 -176 82 -101 -132 -206 -379 -42 -16
3302 -16 119 50 8 356 229 181 261 54 -90 290 -120 301 -160 371 625 9 391 267 -197 327 327 110
3324 110 -3 325 46 43 206 215 -12 -216 36 216 52 -17 -171 -180 -67 -59 -29 41 200 118 -270 -194 78 76 -136
3349 -136 -270 2 426 -29 -194 2 169 -12 -95 43 -144 -206 -45 -53 -102 -209 198 -569 -731 -153 -429 436
3371D36q35K84L71m35R0k28N7J91j97m6M79L11J23q91P82j57j30l62L35p1Q0q9
3393I8o7J48O5p3k56J83j64J40J97j23r7l19L60K35n83Mk83N89L19j010pK86q2
3416d40Q81o63m2K24k66M69K6k1k28j42r1J94J05j89L01o2j33J2j36O56o72r5
3438c12K70P1p7K83n29K70p7k08M79l82K94l0j67J42j0j10J30k72P1K92l9n5K6
3461F0l6L17N3l78J17j52J46K06l75N01l48j59J02n2R3q4J38J3L3O5j23P7l12
3484i8J23O5j15L58k97q5m6j45L59j91K47k00J11J41n68K36K57l62K57J2j80P8
3506d3j20J73qk15j01n2M28Jk51j26L08L5k63K30J96p0j46k15O14l87J81M7l59
3529a43RO56p96o0R08l91j3Qk23J88J6p60R70k16L34p47L10p24N92Q49j123M93
$$ plain form
3371 436 -399 -115 256 -179 -89 -317 -260 -69 -266 -312 167 478 601 -290 492 335 205 -157 178 107 187 98
3393 98 31 179 244 171 -85 98 -66 74 271 148 51 -268 92 327 -256 -252 -535 54 373 -637 -644 -358 -440
3416 -440 441 -222 -264 -40 -306 163 189 168 -60 -202 -293 -99 6 -183 118 56 -77 -65 -201 455 -217 -312
3438 -312 -42 29 -48 235 -294 -24 -101 -309 170 -212 82 52 -115 27 17 -93 37 -235 -164 128 89 34 60
3461 60 24 341 394 16 133 -19 127 333 -42 459 111 -48 54 2 95 11 149 162 195 260 137 214 -98
3484 -98 25 90 -25 333 36 -49 -95 -240 119 -72 175 -25 86 227 -341 -105 152 -210 47 59 -121 -43
3506 -43 -163 10 2 -213 -314 -366 62 63 -188 -314 -6 29 -234 -4 192 122 -24 -239 375 -12 169 216 -143
3529 -143 -134 522 -274 -334 574 183 170 178 -45 143 159 -601 369 153 487 -260 50 -674 -82 767 -356 137
3551A37J066l84m28m57j42P79r01J23J36l40J77L18l07M68k37J03k99J91j38K09
3571G4k32m8J36L25l08J29J02j93R7j47oJ64j70K31j39l21J32j28L44j39J1J91
3593A05J1k64L73l38K55k23K9K21l37M52j05k99J97M4p5Nj89P7J18j24K02p4M4
3616A05J17j81p9J55r1j22P6m6R2L3k10M60l86K7K52j61O1j32l4J30k36J11R0
3639C1l38K84k6J35j52J9L6L17l07%j32O0j36K34P9m34M87lj81j36J29q1L13j22
3663G6l4j84O3J16j97K06n7O0J53K82n96M75n04K15J94j51j96p5K41M20l28p22
3685e43J530j335M29k0L8k62K52j94L44j68K9J01k54O7P9k64K61j81N0P3K19m3
3707B08m08K50k77J12O8J16j41m0J76m5j4n5R3Q2q3l03K59j55J80m8j63N3R3R1
$$ plain form
3551 137 1203 819 391 -66 -208 571 -330 -207 -71 -411 -234 84 -223 245 8 111 -188 3 -135 74
3571 74 -158 -206 -70 255 -53 76 178 -15 82 -65 -71 93 -77 154 15 -306 -174 -302 42 -97 -86 105
3593 105 116 -148 225 -113 142 -81 -52 169 -168 284 179 -120 77 121 46 51 -138 -61 57 -67 135 61 105
3616 105 222 41 -38 117 26 -96 -20 -66 26 59 -151 309 -77 -50 202 41 102 -30 -64 66 -170 -59 31
3639 31 -307 -23 -49 86 -66 -47 -11 306 -1 -1 -133 -73 -209 25 104 -330 157 154 -27 -163 -34 -115 198 76
3663 76 42 -142 -79 37 -160 46 -11 49 202 484 -112 363 -141 74 268 117 -79 -154 87 507 179 -543
3685 -543 987 -348 81 61 99 -163 89 -105 239 71 100 201 -53 14 93 -171 90 -91 -41 32 251 208
3707 208 -200 50 -227 -115 -47 69 -72 -112 64 19 5 -50 43 125 42 -261 -2 -157 23 -25 -188 -135 -42 49
3731D9k70J23j11P4L34p0k47J26m1J8J25l29K39P2k75J93k24j60L81o3p4O1L7
3754c2j37J64J10M8p9l5M0j49K08j13j23K6j2K76k29j7K82l62R9K29P7j88K08
3777B91j38q7k4O1j76Q7J6j77J78J16O7l44p7J08J07J25q4J51k64K46j03l94N
3800c10J29PL35k63j92L5L58k78Rj13Q3L73k04J16j8l25R0L18k30q5L9K75l79
3823b30L53j24lp8K09j6j87J67j9j83J38J71r8R6j12J32j32N3J00j55n7p2K70
3846B23o5l41L32O9k32J19J4k23K76k24j97L64r6Q7N3l12L14o0l20J29J45k79
3868b24K25j41J86r0n3r8Q3K7K32l44m7M52k42J43L3j2Q7m60J84J07n3r9J44j35
3892i5L36l70k2J40l03L74j90Q9K86l96j23K56K01J21m17oK42j61J6K5m3K45k96
$$ plain form
3731 49 -221 -98 -209 -135 199 129 -118 8 -33 -15 110 -219 20 92 -183 10 -214 -374 7 -56 -130 -69 -32
3754 -32 -169 -5 105 153 74 39 79 -70 138 25 -98 -72 -84 192 -37 -54 228 -134 -35 194 271 83 291
3777 291 153 66 42 103 -73 14 30 -147 31 147 214 -130 -207 -99 8 133 49 200 -64 182 79 -315 -310
3800 -310 -181 -174 161 -102 -294 -259 99 -179 -170 -283 -200 173 -31 85 67 -258 -168 150 -80 -165 -126 149 -230
3823 -230 123 -1 -4 -82 127 111 -76 91 72 -111 27 198 100 196 84 216 84 137 237 82 25 -47 223
3846 223 158 -183 149 218 -14 105 119 -104 172 -52 -249 115 19 106 159 -153 161 101 -219 -90 55 -224
3868 -224 1 -140 46 -44 -97 -195 -112 -85 147 -197 -244 208 -34 109 142 130 217 -243 -59 48 -5 -104 40 -95
3892 -95 241 -129 -151 -11 -314 60 -130 -41 245 -151 -274 -18 183 304 -113 -119 123 -38 -22 3 -40 205 -91
3915i1J40J78k17k64L06qJ3lq6R2O5Mj18K62k47J29j61J6K80j37J0k75j69N57
3939B76m31n9J69O1N9Nm02K38j01Q4r2L7k4J55j20J45K00m01K01j20K81k15j83
3962b37K50j00J60l6j78j5L26j38M1l57L93n9j21J85l1J6m0J8q9O8K5j21Jo7L20
3987B14J30l4p7j88k07L11k2k83N2j5K22J13l72J14p4J34q5m9p7K45oj37J54j64
4011a01K20k64o8L03j90oJ8Q2l8p7K54n7M3j39J6J29k20l7q4M92k14rJ22m61L91
4036A05r4j12J76p1m9R9j12qR8QJ08l27L72J86o41M24J03k90Q1p6l5J05J58l43
4060a35M30m01o6QL29j50oR1q5K17k54j62m8L32K00j10k19K0P4K4k57L41k86j72
4084b85K37J66j10jj61J18J4O3n4o5K07k03k0k45N4K29j13L49m53J89j5J51l40
$$ plain form
3915 -91 49 227 10 -254 52 44 57 54 -32 60 125 129 11 273 26 155 -6 10 290 153 163 -112 -281 276
3939 276 -155 -214 -45 16 75 80 -322 -84 -185 -101 -193 -156 -180 -25 -145 0 200 -201 0 -120 161 -54 -237
3962 -237 13 -87 73 37 -141 -156 170 32 73 -284 109 50 -71 114 83 99 59 77 -12 56 81 -40 -39 -106 214
3987 214 344 310 233 45 -162 149 127 -156 -104 -119 103 216 -156 -42 -116 18 -67 -116 -193 52 46 -91 63 -101
4011 -101 119 -145 -213 90 -100 -106 -88 -6 -44 -121 133 76 119 -20 -4 125 -95 -132 -216 276 62 53 175 -286 105
4036 105 11 -101 75 4 -45 54 -58 -66 32 40 148 -179 193 379 -262 162 265 -25 56 -20 -55 50 208 -135
4060 -135 295 -106 -172 -164 165 15 9 100 15 232 -22 -184 -232 100 300 190 -29 -9 65 89 -168 173 -113 -285
4084 -285 -48 118 8 7 -154 -36 -22 41 -13 -78 129 -74 -94 -339 -285 -56 -169 180 -273 -84 -99 52 -288
4107b88l5M58l73Kj00L56o2p2R5k37PQ3j50L77j62K73k24J65J08k15k25K55j19
4130h3L23k2k37J93n07M58r3J19j29R7k10J53l7J84n7k7p0k6J32Jr3J00l00Q4
4154d7q8Q8j85K98j3M0j08M6P9n0q9k4J90l1q3N3k1j56P6j83k77O51j17j03j37
4179a91J38J15j22L3p5K0J11o9Q5%j38Q1O4j31j9q3o0K44J96k10NQ9j38J35j23
4204d3j13L58k1j46J39q6k42J38j14O2K4O1P3J19j55J29l27L37l09L94k99O1J84
4227B24n2j60j84J37j07J21J04J47l32Kj45P2K44j10Nm9L6J30o8m5j67j2K78j57
4251h8J1J88k08K0M0K49m69M38k68M1J24n7j98P8j02K74j17O4j54J02Qj25L33
4274A84l34K03q9J02K4j52J21O9pk61K87K04k41L3R5r2j58K2K04l81J78J7o0j3
$$ plain form
4107 -288 -323 135 -238 -236 -336 20 -42 -114 -19 -256 -249 -166 -316 61 -101 172 -52 113 221 6 -219 36 -83
4130 -83 240 218 -19 174 -333 125 32 151 22 119 -91 62 25 209 152 125 55 29 161 162 69 169 -131 -47
4154 -47 -135 -47 -232 66 53 93 -15 31 110 60 -29 -53 137 106 23 76 55 -101 -25 -208 -485 166 49 -54 -191
4179 -191 -53 62 -60 -27 -102 -82 29 -40 45 45 -93 -12 52 -79 -98 -181 -241 3 199 -11 -6 83 -55 80 -43
4204 -43 -156 202 181 35 174 88 -154 -16 -130 -68 -44 17 90 209 54 183 -144 193 -116 278 -21 40 224
4227 224 172 12 -172 -35 -142 -21 83 230 -102 -100 -245 -173 71 -39 -34 -83 -47 83 15 -30 -197 -209 69 -88
4251 -88 -77 111 -97 -77 -37 212 -257 181 -87 -46 78 21 -177 -99 -201 73 -44 20 -134 -32 -24 -149 184
4274 184 -150 53 -36 66 90 -62 59 128 121 -140 147 351 110 143 238 146 -12 10 214 -167 11 28 -32 -45
4298d5J67l44K48j00K89j54J43k18r8R9n0q9K34q9p1J41N3k06j02J89k75J80j3
4321a11J53J22j42k70L7K67j41J73q3j52K01O4k85J09J41m06K37J85k44J88OO1
4343A10k11O8r7P5K05n68N93Lj08j58mJ50k4j8J37J34l74L97l36n2j9R1K25l64
4367a45J94j03j84J50O36n88Q21o01K39l28Q7j59j40L73k65k69L36J21j89J93
4387A79l66K34l7P6n3J74k62J4J52j87N3Q0p4R7m4R0j42n3J21l3m5L67l92K2k44
4412b73J57m1J82p4K31k85J7L06l59j10K65K7k20J96Q2j30l4J10k40M6P9nJ83
4435A10q5jj8J03j11N5R5l67L38o1J31o7j00j46k9K10R1k71J30k25oJ52j63K37
4459Bl83P4K0K04K21l28K49M7j86j26J60p1O3j22j47L34J17m33L15K7j92j45M32
$$ plain form
4298 -45 122 -222 26 -74 215 61 204 -14 -112 -13 -63 -152 82 -7 -78 63 116 -90 -192 -3 -278 -98 -111
4321 -111 42 164 22 -248 -211 56 -85 88 5 -147 54 118 -167 -58 83 -323 -86 99 -145 43 49 110
4343 110 -101 -33 -130 -55 150 -418 175 178 70 -88 -92 58 34 16 153 287 -87 310 -26 -78 -97 -6 219 -145
4367 -145 49 -54 -238 -88 548 -40 781 180 419 91 178 19 -121 252 -13 -282 54 175 -14 179
4387 179 -187 47 10 86 33 207 -55 -41 111 -76 -23 57 -17 80 36 126 -16 -69 52 19 -26 341 -51 -29 -273
4412 -273 -116 -157 25 -49 182 -103 -86 220 -139 -249 16 43 -177 19 101 -29 -63 47 -193 -147 -68 -73 110
4435 110 25 24 6 109 -2 53 148 -219 119 58 189 122 22 -124 -153 57 148 -123 7 -218 -224 -72 -235 2
4459 2 -381 -307 -287 -83 138 -190 59 106 -80 -206 -46 -117 -54 -176 -323 11 128 -305 10 37 -155 -300 132
4482A32k19J37K68n94K30K31l32J05k79K82Q5j02K52j68j63O18m11l19K87o2K37
4503B15j73m05N00o9O3r6K69k55J4k43K04J1K12j02J11k00J38l93J5K51r3L49
4525C23r8n55K27L45k29L9K46l32J31K1l48J07K96k7j5o2J19k35P5j7j19J16o1
4548e3R6k44O9J99l9j80%J59Mj81j22K39J3n9J28K7k81N8K80J5k82kK00J28l45
4573a73R3K60k02j05nL26j58N0r8J70k97jL25k08j46M7J77l3j03J11j04R2o5N5
4597Ho7K79k64j58J14j2K79l00j13L67k81K59r0j58K06m28L27J5M4Nk23O0Kp1
4621b00L61j79r1L5j3J46p1J79k48O7J23l4j77K91j32j71O1Q3l5L4J72k75J75
4644A01k20k3j88J84K16J05l91J73K33j73n8J46R2j86p4j78L18J4k66L26j89L12
$$ plain form
4482 132 -87 50 318 -276 -46 185 -147 -42 -321 -39 46 -56 196 28 -135 483 72 -247 40 -22 215
4503 215 42 -363 137 68 131 35 304 49 63 -180 24 35 247 145 256 56 194 -199 -184 67 -26 323
4525 323 225 -330 -103 242 13 52 298 -34 97 118 -230 -123 173 146 131 69 188 -47 28 11 -108 8 -53
4548 -53 43 -201 -132 67 28 -152 -152 7 11 -170 -292 -53 -40 -99 29 56 -225 -167 113 128 -154 -156 44 172 -173
4573 -173 -80 180 -22 -127 -132 194 36 86 -12 158 -139 -140 185 -23 -169 -122 55 22 -81 30 -74 18 -47 8
4597 8 -59 220 -44 -202 -88 -100 179 -121 -234 133 -148 111 21 -137 69 -359 -32 -17 27 32 -191 -131 -129 -200
4621 -200 161 -18 -109 -74 -87 59 -12 167 -81 -14 109 75 -102 189 57 -114 -53 30 -5 29 201 -74 101
4644 101 -119 -142 -330 -146 70 175 -216 -43 190 17 -41 105 197 11 -63 -241 77 91 -175 151 -38 274
4666B74r2k26K22j35n5J12J59m25M0Ko1P3j46J48J16K7J48j94L32m11O7j21J22
4689b4k99L17j14J2K32k81K31j93L16k7k38R1m49M32m8J10k59J96J64l73j2J57
4711e9O5k6oK98j57rj01k23L36L7k08J89m24L30p6q2Q6O7o3J97m3o4P6oR4j59
4737F9R9j95j7n1J85P4j12l0j38J1J65L9R5k98J9J8M21l89p5J89l35K73k7j60
4761a70J44L13j66K1l12K62j82J06j26J5k14L96k6K3k19N5N1J04o9j93J59Lj23
4784a48K72k3l17L17J8k04j53K68P3q9k39K23P3j40K1j22J88K04k41jJ33l3J93
4807B73k30j24J62j50p7M4J94P7k55n4K22l41J86j61m5K26R4mj2m9j71n0L85k15
4831g5J86K0l9n88J4M03K1k4k60O52j82n3J78rk39N49q79N02j22p4Ll5J25Q5o1
$$ plain form
4666 274 182 -44 178 43 -12 100 259 -166 -126 -124 -185 -112 -258 -110 6 33 181 -13 319 -92 -25 -146 -24
4689 -24 -323 -6 -120 -108 124 -157 74 -119 197 170 -68 23 -426 6 -42 68 -191 5 169 -204 -216 -59
4711 -59 6 -20 -26 272 115 106 5 -218 118 155 -53 136 -288 42 -34 -116 -30 37 -26 171 128 64 140 134 228 69
4737 69 168 -27 -44 -95 90 164 52 22 -116 -105 60 99 194 -104 -85 -67 354 -35 -110 79 -256 17 -10 -170
4761 -170 -26 287 121 142 -170 92 -90 16 -110 -95 -309 87 61 84 -135 -80 -29 75 6 -187 -28 -25 -148
4784 -148 124 101 -216 101 119 -85 -238 30 103 14 -225 -2 71 -69 -48 -170 18 222 -19 -20 113 80 273
4807 273 43 -81 81 -69 -146 -102 92 169 -86 -140 82 -259 -73 -234 -279 -53 41 37 25 -24 -195 -245 140 -75
4831 -75 111 131 92 -496 -482 -79 -58 -82 -342 310 128 75 253 244 5 554 -325 177 55 -19 -16 -51 74 159 98
4856I8n5k97L13R8j54Q6k12J93Q8r6J32k73q2j27L73Lj01J29j38R5p0J21j20n9
4880e5M71l53J23k88J49n7R9j13M7P1k51K48j25K21j2j07J23j30M2J01j16n3l12
4903b77N44j34m6q7K0J43k53R5J46k63K26k35j10L04m14M81k75o0m1K20l9J78
4925A23N0n9k90J74L0j86l7q9M22j67Q7j15p1J25j29PR9j14L55p7j99J06p8R7
4949F4j35N2L4J71k36P5J6j22m1p7L0J87j67L59j94q0O6R9l12J75K34j05K33j33
4973A93k21q7K28n4J17m68M18j29P9k40N6J79J34k45n3M8o4O2q1L28l60K39l4
4996D5q2R5j8k57J78rk33L47k30Q1n7P1N8O1K8k67K73N7j2k8r2l8k9n8L85l55
5022h6R4j89K28j02N1K06k65Rl6P5Q6j14n5O8p8j20J57K23k30K88k54J33l9j00
$$ plain form
4856 98 43 -254 59 157 3 89 -123 70 158 62 194 -79 -161 -288 85 88 -13 116 -22 73 3 124 4 -55
4880 -55 416 63 186 -102 47 -10 89 -24 23 94 -157 91 -34 187 175 68 191 61 103 204 88 35 -277
4903 -277 267 133 87 0 20 163 -90 5 151 -112 114 -121 -231 73 -341 140 -135 -195 -236 -16 -55 123
4925 123 173 114 -176 -2 28 -158 -195 -284 138 -29 58 -57 -128 -3 -132 -125 -26 -140 215 138 -61 45 -33 64
4949 64 -71 -19 15 186 -50 25 41 -81 -122 -199 -169 18 -149 210 16 -64 2 101 -211 -36 198 93 326 193
4973 193 -28 -115 113 59 176 -292 126 -3 76 -164 -108 71 205 -40 -93 -45 -109 -47 -128 200 -160 79 45
4996 45 -37 58 40 -217 -39 -48 -281 66 -164 -83 -140 -69 -11 50 78 -189 84 141 129 101 9 -29 -58 -116 269 -86
5022 -86 8 -181 47 -55 -4 202 -63 -54 -90 -15 71 -43 -98 -30 -108 -228 -71 152 -78 210 -44 89 50 -50
5046e0J39N1Q4k1j48j99J38J66k83n3K5R5N1N2m57L64P9L0O4j06j4Mj80J28j37
5071a78m4K23j10K34J64j74l47K9N63m61J09P8j17nmm3N7J32Qj03k24J07K44j57
5095a9Q4q6o4o2P9j09M27k07J57O1n47L4P3N85m40N6J21k28J65k81J18Q7jR3j92
5120i6J88MRlL2j99O9J52nN0j86j62PJ83K8mq3J89j88j42J63N7j22J6k1K1r5J39
5148Aj84R1l8K09j45j18J86l7J0r0L27J09m98M19l05J09k18P5j3P2J5m3mj6M8
5173c8l2n0k40N91k11m9J18Q1m7k18O1Lk3O5oj87K98j72Q8J48k52J7Q1j01l2Q1
5199b6%P9j0Q9M1j65o2Q6K44j67N4k69j29K53nN4Pp5N3j16J72M7k20K7P8j18J9
5226e9k04K43Q1j11K39k20K8m3j26K68j03q9M5k7l8J96k88L01j15m0J03k65J84
$$ plain form
5046 -50 89 140 224 203 55 -144 -6 160 -123 -176 -151 -56 -5 47 -410 -46 33 63 127 21 7 11 -169 -41 -178
5071 -178 -222 1 -109 125 289 115 -232 -203 360 -101 8 86 -31 -36 -40 -83 -26 106 114 11 -213 -106 138 -19
5095 -19 65 -21 -85 -147 -68 -177 250 43 200 261 -286 -252 -179 406 -34 22 143 -85 80 -201 -83 4 3 96 -96
5120 -96 92 96 105 102 134 -65 4 156 151 201 15 -147 -140 43 71 67 -16 173 -15 -157 6 63 -59 -43 -64 -43 -138 1
5148 1 -183 -92 -130 79 -66 -184 2 -35 -25 -115 212 321 -177 242 -63 46 -172 -97 -110 -38 -23 -66 -70 -86 -38
5173 -38 -70 -120 -360 231 20 -29 89 170 123 -95 -34 -31 -54 11 5 -182 116 -56 32 180 -72 -55 26 -75 -107 -26
5199 -26 -26 53 43 132 173 8 -54 32 276 109 163 -106 -235 18 13 67 74 -1 52 -64 108 155 -65 -38 40 -78 -59
5226 -59 -263 -20 61 -50 189 -31 -3 -46 -172 96 -7 -96 -51 -78 -116 80 -208 93 -22 -62 41 -224 -40
5249d0k35K81L6j12R8N7j81k8OK97j05j12k8r1K41o5M08m03j56J18J71k90RN1
5273g3J60J18j53l0k5J58k28J11nPN2K1k75K19O0k59K66k7jL1Ll90J19J42k8J46
5299A19k78J09j78m4M65k78KJ05L%r9qO4j11K81k68J26j39K81j58q1n7Q2L3LJ65
5325A39j84L2j07J00Q1j54NJ00q2K03J97l31O7j42K95L5j70l0L9Q6j23K9j54L1
5349c8Q4Q0n6j51M5K05k68J36m3J57j17j19P5K13k86K3K05l13l8J7ML45k81L5
5373h6j9J5l9J67K6j84K42m81K98j5L4j10K05j58K94j81L2L48k78k68K6K46k78
5396a64L36r0Q9j45R8k89j13K12J80l65q0n3M10j30K71l5j65j3K0K6O6J02m44
5419b76O38l47J55q1k17n0K22L9k8q0j35J63K2O1J04k16J65k25K39j34j77K37
$$ plain form
5249 -40 -275 6 42 -70 28 85 -96 -124 -118 179 74 -38 -66 -157 84 19 427 24 -132 -14 157 -133 -124 -73
5273 -73 87 205 52 22 -3 155 -73 38 33 40 92 113 -162 57 117 -142 124 97 96 127 130 -260 -141 1 -27 119
5299 119 -159 -50 -228 -272 193 -85 -83 22 25 25 -74 -82 -18 -129 152 -116 10 -129 152 -6 -87 -144 -62 -29 -26 139
5325 139 -45 -13 -120 -20 61 -93 -88 12 -70 133 330 -1 66 -76 219 254 84 54 93 179 56 85 -69 -38
5349 -38 46 126 70 -81 -36 169 -99 37 -6 151 34 -85 -10 203 -83 -60 145 -168 -206 -189 -185 160 -121 -86
5373 -86 -105 -90 -129 38 64 -120 122 -359 -61 -76 -42 -152 53 -105 189 8 40 388 110 -158 -132 114 -164
5396 -164 172 82 171 26 124 -165 -278 -66 114 -251 -331 -384 26 -104 167 132 -33 -46 -26 0 66 168 -276
5419 -276 362 15 170 89 -128 -178 44 83 55 -25 -160 3 25 86 190 -26 139 -86 153 19 -158 79
5441G9l7L1m91N31n3k27J24J36j35p6J59R0j41Kn5K37j44o0k10K90k41J40kl25
5465c78L61K00m11R0J60P1L2k48M28k87j05L51l79J19p0k2K05n2j6J73k47M29
5487D04n26P2J30k1J15k45K74k72L6J24O5m4k48k5m1RN18k41JQ3O5k01k33K89
5511H8J0N8r9N0l11L05j36O7m6q7K08j49j12L02j33R3l5J36k28M1p7J11P0l91
5535b65J36l3J21j00L09k02J74pk90j5K20j96J62K1j16K1n5K04j39O4Q6q8J4j72
5559a46K50q9j64J80J10j35j71m6n4L41j07K24o0k75K41j79M1r3Q9p6O0p5J69
5582C5n1k4p0j3J80J31m3l36J81j55K0P4o6r6K63Q0j54L3J13k60R0n3O9m3J9r5
5608a71K67k23N2J3K69m00L39R8k16q0M9J1K20l11P8j55J23J72J4Q0j53nl56L06
$$ plain form
5441 79 42 73 -418 113 60 -167 -43 93 -42 -118 41 131 -10 -8 -63 174 30 -30 -240 50 -191 -51 -53 -378
5465 -378 -17 183 -228 -138 22 93 125 -123 305 18 -87 264 -115 4 -66 -88 117 65 49 222 -25 404
5487 404 -122 -50 80 59 174 -71 203 -69 -33 91 156 112 -136 -161 -202 -193 325 84 85 168 233 32 -201 88
5511 88 98 156 57 107 -204 101 -35 32 -14 -101 107 -42 -154 148 15 108 73 209 -19 22 -55 56 126 -265
5535 -265 -129 -162 -41 -141 168 -34 140 133 -157 -172 48 -148 14 35 -81 -60 -115 89 -50 14 100 12 26 -146
5559 -146 104 15 -149 31 141 6 -165 -211 -265 76 -31 193 133 -142 99 -80 -39 -132 -43 -119 -59 -134 35
5582 35 -16 -40 -110 -123 57 188 145 -191 -10 -165 -145 -71 -137 -233 30 110 -44 -11 102 -158 -68 -121 -52 -95 -76 -171
5608 -171 96 -127 -75 -62 207 -193 146 244 28 -52 -3 8 228 -83 -5 -160 -37 135 149 229 76 71 -285 21
5632B1P5j42j92K33J00k27j76M96k67K17p7Pl2K60j27M3k22j33J03N9Q0k91K03
5655A1k9K91k41m6j12M4PQ2q1j81K59k54K94o9j10R7o0j70J40K09j0J52m15K40
5679D8n9j22J75O7j58K08l38K33p1Lql3J32j82j3Q8J36R7k36N9J42j20k2pj37
5704a18J03k21K23K17K63n80K41N4k89O3L32j35j88K5l42RM47l28M8J43r3K05
5726G9j59j13K83K0K74n00j1K96k68J05J15o5l43L49m3l1l3j30P4LN1K3k1o4J95
5751H6j18J66j48K5K36k81L21n12K71O6k93J37o5K88k12M5P8J31j53j51K44j52
5773IK40k91j36M18j44N4j45K32l32J09K34l6k55P2J42j59N3j35R9j03M50k90
5795H6k15K37l63J28lJ39j08n5L62k44K81P9j47r4k17K44k91N1J7L50k23l4L27
$$ plain form
5632 21 96 -46 -238 -5 95 -132 -308 188 -79 138 61 68 36 296 169 212 -10 -143 -40 19 99 -192 11
5655 11 -18 273 32 -14 -126 -82 -75 7 -74 -255 4 -250 44 -25 -135 -38 -98 -268 -128 81 71 223 -192 48
5679 48 -11 -133 42 109 -49 159 -179 54 -17 -14 -22 -55 77 -105 -118 -30 106 203 -33 26 168 48 26 19 -118
5704 -118 -15 -236 -13 204 467 -113 128 182 -107 -44 288 153 -35 -10 -352 -343 104 -224 -176 -33 -126 79
5726 79 -80 -193 90 110 384 -116 -127 169 -99 6 121 56 -287 62 19 -12 -45 -175 -101 -98 -47 -24 -45 -109 86
5751 86 -32 134 -14 11 247 -34 287 -225 46 112 -181 -44 -109 179 -33 12 90 221 68 -83 161 9
5773 9 249 -42 -178 240 96 150 5 237 -95 14 248 212 -43 29 171 12 65 -70 29 -74 376 86
5795 86 -129 108 -255 -127 -130 9 -99 -154 208 -36 245 324 177 83 -134 110 -181 -130 -113 237 14 -20 307
5818C07l14K14k66J38Lo1O4n6O1K5j97O8m4l3J70P1k39K21n7KK7j68P2m2L2J11
5844A09m1o7N2j72K46o2l7Np2j05L10j77j05M00l04j8J34J1j41m9m1J29m2J73
5868A36j44J96k95j00K13N6j7k42K34r9N2j64K88o0j89K86j70j00J12L1J26p7
5890G3Mr3L9j57L68j94Pl19K67J66j22l2l76L39l17M32r5K5l2k70K41J86k94M06
5914B52k20r1j64L85l68R1J07j04K59j7j53K74k81o3n0J38M2K9j40m82P24j90
5936b2R5n3m8LJ30j20K40m75L69j61mj3j16J66L1j82p1K53k5k71K51J87J07j13
5960A58k69J63L3j33L6j52J40oK91p4l1j25l3k16J13L4K08j49n4J40m33L32Q4
5983E7j7j40J71Rk02O8O5j98J53r5k04J79J90m2M4j03o2J90j46J11J03m3l13K34
$$ plain form
5818 307 -7 207 -59 79 82 21 85 29 90 115 -82 -14 -58 -91 79 150 -89 132 75 77 104 -64 8 -34 -2 109
5844 109 68 1 53 -119 127 65 28 33 -39 -144 166 -11 -116 284 -20 -38 96 107 -34 -83 -124 5 -37 136
5868 136 -8 188 -107 -207 6 62 45 -197 37 -62 -10 -174 114 54 -135 151 -19 -119 -7 24 150 73
5890 73 77 -16 23 -134 234 40 47 -272 -5 161 39 7 -369 -30 -347 85 -10 15 -17 -287 -46 140 -154 252
5914 252 32 -59 -223 162 -206 -115 -8 -112 147 130 -23 251 -30 -93 -143 -5 37 66 -74 -556 168 -22
5936 -22 73 20 -28 -25 105 -15 225 -250 119 -42 -46 -59 -175 -9 22 -160 -231 22 -3 -274 -23 164 271 158
5960 158 -111 52 85 -48 -12 -164 -24 -30 261 187 156 31 -2 -218 -105 -71 137 -12 -66 74 -359 -27 57
5983 57 40 -100 71 80 -122 -54 11 -187 -34 -129 -333 -154 36 -6 38 -65 -127 63 -83 28 131 88 -225 9
6007IR6m1j96L44j18j0J15j92o4J91m8n0K6j76L23r9k69K37j57r1K87j13j05M1
6031f0K42j35q7j90L00j64M7n3K42J37P0m09J51P5k18J1M0J06k47K9m0M24j82
6054H9r7q3J42l20P2N02m84K73j82mJ22p1j6L3p5j1J12l7RK52q6r1j84K61q5l7
6080Dm3l6JL92m25L6j60K65j40pK91k63J44j27P0J1J99j7m4Ko3j66M7J13n5J49
6106A78p8r9j34L10k09Q2M7P7k21o6J19q4mJ67K5O5O7n17J59J25j63J9J09JP9
6131E4l63J85R9j83M10l81K05O2Q4j01nj22r4R6L8R5k33J07P2M1j53K33J13k70
6155a1j91K83o8J32J75K6k8n17o0O42m91J83N11r36K12J52k27J45M7l8J6L5J49
6178A41j08J48J10j85o6p7Q3p8q3L4O5O0j7J50Q6k22j19n9j18K22o7P2M7k04q6
$$ plain form
6007 9 105 64 -132 212 94 84 199 7 -57 134 86 36 62 -114 209 110 -159 78 -79 -170 117 4 -101 -60
6031 -60 182 47 -40 -230 70 -94 -47 -100 142 279 349 -60 91 166 -52 -41 -1 105 -142 -113 -153 271 89
6054 89 -8 -91 51 -269 -197 305 -179 94 -88 -92 30 -41 -57 -24 -99 -110 2 -35 -26 226 140 49 -135 126 41 4
6080 4 -39 -75 -74 318 -107 -71 -231 34 -106 -113 178 -85 59 -68 2 13 212 195 151 153 90 -76 -29 84 29 178
6106 178 100 1 -133 177 -32 50 97 174 -47 -113 6 -78 -82 85 110 175 242 -275 -116 9 -154 -135 -26 -25 54
6131 54 -309 -124 -25 -208 202 -179 26 88 172 71 66 -56 -150 -54 -16 79 -154 -47 25 66 -87 146 259 -11
6155 -11 -202 81 13 145 320 346 318 -199 -259 383 -108 75 586 -350 -138 14 -213 -68 -21 -59 -43 -8 141
6178 141 33 181 291 106 40 -37 46 -32 -115 -81 -16 44 27 177 263 41 -78 -137 -255 -33 -100 -28 19 -185 -271
6203b71K14j6J08P6j12J89m45k2K77l3nR0J48l46L64k04j1j17Q4M9jo9K6J8OP2
6229F9jj50l1r3L68p4K2M7q6k59J14J05j14Q0j48L42l45K12j93L40k64k48L23
6252A6JJ3Kr4K68q0l3k0M10n37J44j01l14M64j35K18o5j68R0J23k34j14J65k46
6276b27L00j16J36K8k62j5K28k55K59j31J85n5j67k2K36k48L16j97J53l16L28
6297A58k51J66j03j04L2K57j15j98J36o3q6L60k02j52R8J65J60m51K14j15N0J35
6319I1m68M50K0p5q4J03n7J87k54J58k58L93k24k57M20p6J98k56j08M1K6j6K36
6342A90k46k12M20m4k18Q6J6m5j39J24K64l49J22L7j17O9k7R8J49j90j17J20J46
6365A37k00N8L9k90M01o0k40n7L45j32j06M47j23j54j41j27K64o6J07kM1k83K19
$$ plain form
6203 -271 -57 -73 35 111 -1 188 -257 -279 -2 -35 -40 50 198 -148 216 12 1 -116 -32 17 16 -53 -27 -9 -3 69
6229 69 68 -82 -113 -206 162 88 110 157 71 -188 -74 31 -83 -3 -151 191 -154 58 -135 205 -59 -307 16
6252 16 17 30 32 -62 206 126 93 73 483 -54 90 -11 -325 139 4 222 157 -11 79 202 -32 -146 19 -227
6276 -227 73 -43 93 121 -141 -156 72 -183 76 -55 130 75 -92 -114 122 -126 190 -7 146 -170 158
6297 158 -93 73 -30 -134 -102 155 40 -158 -22 -85 -171 189 -13 -165 -67 98 258 -193 21 -94 -44 91
6319 91 -377 73 93 18 -66 37 -20 167 -87 71 -187 206 -18 -275 145 69 267 11 -97 -56 -30 -46 190
6342 190 -56 -268 152 108 -110 -24 -8 -53 -192 -68 196 -153 -31 6 -111 -42 -69 29 178 -12 -129 -9 137
6365 137 -63 -5 34 -256 145 85 -155 -212 133 1 -105 342 219 65 -76 -203 61 -5 102 100 141 -142 77
6388G7J19l40L8J88rk42J04J90j30k1l9J77o9k08J43p3P8j31J9m4J27R6l2P1j81
6413i2K19r1N6k49l3P3j7Q6kLP4l43J25O3K57k6q5l00M72j81L2J28q5l28L70J0
6439A36q5J01l01J53l5K17m34K91j51J1K41l15J94m4j0Q8l02J07M1J07L5Q3j76
6462d8J22J51m46J3L97j68J52k82l4K43N0K9k06L9Np3K01ro5K7k89n3K94N8k8
6487H0J42j66q1l9j18K86L8j95J24k24J52L6j72r4K26j55K18J68k43m5J36j00
6509b6J92j78K35m9j96K0j0Q5l50L17L48m79j04K47J32j91J25P4n4k96Q3J03n2
6532b4k56L2J36N9J40j71J62P7l02J49l4JjK3Q5j41j26L62k70J69m3J16j28j6
6556aK36k67R1j79J75l6R4o4n9n8J31M4r9m6K85k98l9J56Ko0m3K41k09%J02j33
$$ plain form
6388 77 196 -144 -106 82 73 -169 -65 125 -5 -26 -65 112 43 -165 -22 -95 -17 -148 -129 -173 -46 50 18 89 -92
6413 -92 127 36 92 -157 -190 -117 -134 -48 -50 -47 27 -316 -191 -128 129 103 18 -282 190 9 41 169 84 -244 126 136
6439 136 51 152 -149 4 -31 186 -248 43 -108 -97 144 -171 23 -21 -31 57 -245 -138 -97 10 45 128 -48
6462 -48 74 225 -221 -208 189 21 173 -109 -143 100 150 179 -27 12 17 -56 145 136 71 98 -191 -244 50 108 80
6487 80 222 56 -25 -64 -182 104 142 -53 71 -153 -1 35 -137 -231 -5 -160 58 226 -17 -62 74 -26
6509 -26 166 -12 223 174 -22 -2 -12 73 -277 40 388 -91 -195 52 184 -7 118 192 138 -158 -75 28 -24
6532 -24 -280 -248 -112 -53 87 -84 78 155 -147 2 -32 -31 -32 -9 76 -65 -191 171 -99 70 27 143 15 -1
6556 -1 235 -32 59 -120 55 19 113 49 -10 -68 63 107 8 -38 247 -51 -90 66 68 8 -35 206 -3 -3 99 -34
6582c4RJ94j72O2Mj44n8L2K15k23J73J08j77l6j5N1n7N7j26J84j30R6P6j76K95
6607B08j11j12j12n2o7K88J89k88L7n4l1L3K0K05l30%P1L31k48M5N4j57R8P3k69
6632a79L49k79J08j59K05k61J99Q4k11oJ30J24j03M3j03J2K06k52J05J43n8j67
6654g0J45J73m33K02j2q5L4j37M96k32N4m14O27j92k18j14L20j50l5m79K91O35
6676D06m12P3r9l04K92j9M4R8L5L0k12l8K06p9j14J67l26n2j45J73M11M8o9J27
6700B41k38L14j87p05N05P2R53p72%o78K34j50K38j2J069j101M43k5m19K60N44
6721E86n00l15M99r8n50N3J28M12l88O61j95K09p01L37M1l69m1O07k44k49L09
6742A92l06K35k20q2K80r9k05L63k55O2k2J3o5J51J14k49J13o1J4K33j92R5L6
$$ plain form
6582 -34 -25 169 -3 59 63 -81 -139 -107 108 -115 58 166 -11 -47 -62 -11 -68 -11 -137 47 -83 13 89 -87 208
6607 208 97 -15 -127 -179 -246 42 231 -57 -20 -74 -105 -72 -52 153 -177 -177 -106 225 -23 22 76 -81 17 90 -179
6632 -179 170 -109 -1 -160 45 -216 -17 67 -144 -150 -20 104 1 44 -59 -47 159 -93 12 155 97 -70
6654 -70 75 248 -185 17 5 -80 -46 -183 313 81 135 -279 348 156 -62 -176 144 -6 -41 -520 -229 406
6676 406 -6 67 -32 -336 -44 -63 -19 79 114 144 -68 -106 100 21 -93 74 -252 -304 -449 -276 135 183 114 241
6700 241 3 317 130 -575 -70 2 955 183 183 -495 -261 -411 -173 -185 884 -217 226 201 -218 42 586
6721 586 86 -229 270 172 -378 -325 -197 215 -173 488 293 502 -199 138 179 -190 -231 376 132 -117 192
6742 192 -114 121 -99 -181 99 0 -205 158 -97 -35 -57 -44 -109 42 156 -93 20 -41 -27 206 14 109 145
6765A45l17J63r2J48j01m2q9J59R6j17K48j55k13P7m5K4K13k42R6oJ24j64K12
6788A22l58M92l16M6j38L58j67k43K24J26j18j10J23j4k22M0L10j97J98j7j25
6809A4l2n5K13l76M21L8m20J00jL3k9K69l6j70n6K0N3j5O2O5j02L3m7j60J02k0
6835i6J42J49j4j19J25J3l56J23N2k37mK03J03j32K01r3k31L11j80P2j15j08K31
6858D0J17j89o3l9L59j68o2J17k26N8o8n9J88Q2q8j80K93j25n1Q9P6j6k25J88
6882D8J02j99M4J2j60P8K57O4j36n1p7k5K1K64m4k89J50J35k6l45J65K57m60J40
6906g5J52l27R7K03J57k39j49J89J9K52k51K56m01L5J80k11J7K23j52Q9J8n2j50
6929a20J48P4O5k90L16o2k52j7J31j50n9k4K88J2p9j94K53J02j75L1j44lJ05R1
$$ plain form
6765 145 -172 -9 -101 47 -54 -96 -185 -26 70 -47 201 46 -167 -90 -135 -111 102 -140 -44 -50 74 -90 122
6788 122 -236 256 -60 -14 -152 206 39 -204 20 146 28 -82 41 27 -195 -155 155 -42 156 139 14
6809 14 -18 -73 140 -236 185 223 -197 -97 -98 -65 -94 175 139 -31 -87 -67 -14 -29 33 98 -4 29 -18 -178 -76 -96
6835 -96 46 195 181 62 187 200 -156 -33 19 -218 -222 -19 84 -48 153 60 -171 140 -40 32 -83 -191 40
6858 40 157 -32 -95 -134 225 57 -5 112 -114 -56 -124 -183 5 87 -1 -181 112 -13 -64 25 101 85 -140 48
6882 48 150 -49 -5 7 -153 -75 182 246 110 59 -18 -43 -22 242 198 -91 59 194 168 -177 -12 245 -215 -75
6906 -75 77 -250 -153 50 207 -32 -181 8 27 279 28 284 -117 -82 98 -113 -96 127 -25 64 82 30 -120
6929 -120 28 102 167 -123 193 131 -121 -138 -7 -157 -216 -240 48 60 -19 -213 40 142 -33 -2 -146 -149 -44 47
6953D7r6Q3n8j13Q5K65j99J91R3l43J69K7j00L77o69kM03k87L07J41J88n11L0
6976B8k24K89j54J487j361m27K36M57m15J01m09L75m1Q01n16k37j6k54P19k48
6996A91M0j29n1j73K94j77j7J73j18J37j08j70K1L31l44R6j16L97k51k02K87k62
7018a51K99k06k03K10j19kJ30J76p8R9j35j73P6RN1J62k34J63j70K10M9k97K72
7041A38o1k43J02O3j58J03K4K69m3m3k21o1K93j95l4p6n4K6J66K2k43M41l57K00
7065E8N2Q8k72Q7O1q3N3J00j02o0Q5Q8q3K6j75J01J47k24j4J20j04J72Q1j64j69
7090a31J11m8K30m7k18K33J18j39j30K11o4k58K51k34q8K59o8j3l05L26P3k48
7112a79K32r6R3j28j56K21J23L0j62j55L62j05r3K47k31j00N7J75j39j27R8k45
$$ plain form
6953 47 -49 34 -24 -137 -52 213 14 205 298 -45 124 151 51 428 -241 -243 160 -127 180 321 509 -2 28
6976 28 -196 93 -61 1426 65 -362 -126 331 -84 17 -392 -17 -58 743 227 -10 -26 -280 439 191
6996 191 231 102 51 -122 172 -5 -22 151 33 170 62 -108 -87 244 -100 -4 -120 277 26 -176 111 -151
7018 -151 148 -58 -261 -51 -170 -172 -42 134 56 155 20 -153 -77 -68 -17 145 -89 74 -96 114 163 -134 138
7041 138 77 -166 -64 -1 -159 -56 -32 237 194 151 -70 -131 162 -33 -67 -143 -197 -171 -5 17 -226 215 -142 58
7065 58 110 198 -74 13 74 -9 44 144 42 -18 67 155 72 98 -77 24 171 -53 -67 53 -51 121 202 38 -131
7090 -131 -20 -68 162 115 -103 130 248 109 -21 190 126 -132 119 -115 -203 56 -12 -25 -330 -4 69 -179
7112 -179 53 -43 50 -78 -234 -13 110 140 -22 -177 185 80 -13 234 3 -97 -40 135 -4 -131 -33 -278
7134b78M63l13K22k26J60j56M42k23l15K53J75l12k63L99L48k13K19l21M7l81
7154b73j51J19O76j22l14j81K32K63n24M91k41L76J18k42l93J83k71O02J56j060
7174e56R24N3j141K23M50M03j062n1J363j092M33L34k67n97N78j6N56r23K36L32
7194A80m18L64R2l22ll7K67m7p5r2K29k50n0J59j92J95l3pJ72J8k23j16J35J13
7218E9l57q8K69K21J42l27j06QK40q5M8k51L13r9k44K06K82k86k9JO8R2n4K28
7242B51n35K60j26K95q1o3j0p6k48M33j87J82k96Q7j8j03J95o9M5N1J02m6Qj01
7266e0J08j40J07Mo1p5J11J68j83l57K35Q9j21J27J67rj14J97l00LK87k10r2J70
7290F1l9M7K9O3k76J38j33J88k14J39R6k02K73k60K25R3j63j50k3J03O9M0j18
$$ plain form
7134 -278 185 -128 94 -132 28 -128 314 91 -224 29 204 -108 -371 28 376 163 382 61 108 -273
7154 -273 -424 -305 371 249 -65 -246 -14 249 -275 216 -25 351 469 227 -166 17 -254 348 504 -556
7174 -556 368 421 -720 -497 -47 356 -706 -757 606 -486 -53 281 14 -583 -5 -21 535 -388 -152 180
7194 180 -238 126 218 -104 -107 -144 123 76 1 -91 138 -112 -162 -3 -195 0 -33 -40 132 150 -73 -189 -54 59
7218 59 -298 -386 -117 104 246 -81 -187 -179 61 -24 24 -227 86 -13 -257 -51 231 -55 -84 -83 -15 77 23 251
7242 251 -284 -24 -150 145 64 1 -9 -85 -333 100 -87 95 -201 -114 -132 -235 -40 -109 -64 -13 89 43 51 -50
7266 -50 58 -82 25 29 -32 -107 4 172 -11 -368 -133 -44 -165 -38 129 120 6 203 -97 -94 193 -17 -109 61
7290 61 22 69 98 161 -115 23 -110 78 -136 3 99 -103 170 -90 135 228 65 -85 -108 -5 64 104 -14
7313a4P7j5o2j88J02j27K13Q1M6k15K07p6J17m88N48j61L1K29l40q2l5P5J04o
7337B1k00J84j03L3O6J07l68M40L8l00J2o3N5K19K85k47j3k52j70L48J02o7j37
7360a0J32j28J90m2l18J30M4Q2j16M4N1J20k22m7J92l01K27R8m8K6j07R1N0j11
7384B7Or6J43j08j42J15k4J83o1J35m16K33P1j14L5m8M9j07K30K1m01L31j7j28
7408h3K47o0l3J15j01j3k47J37m6o5Q7Mj21K10o5J19j10J31k32M07k99m5L3P0
7432D0j12J58M2j82J44r4J70p3j24J71l35J01K08k01J58n5r7k0k0K93k80J05L8
7455C5k5J07j47N5R1Q6Rm62K15M1o4J29r7K73j77N1J0k38q4N13l37M3q8j19J53
7480b7M8j04J64J41j87J9J22k04K8J3P9m0O1ok33M30l91o9K1N4K21M9k07k8K0
$$ plain form
7313 -14 63 48 -14 -202 -100 -227 -14 67 113 -102 105 29 146 -342 206 45 76 305 -35 -117 -152 -77 27 21
7337 21 -179 5 -98 -65 1 108 -260 180 218 -82 -70 -133 -78 141 426 179 166 -86 -256 92 194 127 -10
7360 -10 122 -6 184 142 -176 -46 -2 80 -36 8 59 179 -43 -90 102 -199 28 126 78 104 -3 88 138 27
7384 27 33 -63 80 -28 -170 -55 -79 104 43 178 -238 -5 66 -48 -13 -61 -12 -119 111 132 -269 62 45 -83
7408 -83 164 104 71 186 85 72 -175 -38 -84 -149 -62 -58 -179 31 -34 85 -25 106 -126 281 -18 -63 -30 40
7432 40 -72 86 128 -54 90 -4 166 93 -31 140 -195 -94 114 -87 71 16 -81 -101 -121 172 -108 -3 35
7455 35 10 117 -30 25 116 202 211 -251 -36 5 -59 70 -27 246 69 120 130 -108 -192 321 -16 27 -61 -180 -27
7480 -27 21 -83 81 222 35 54 176 -28 0 13 92 52 113 107 -126 304 -87 -156 -135 -81 140 189 -18 -46 -26
7505b6J63k35J30o3K1j03O7L44l6k79j5n5j22L58J14l61K09k5j90J1L34k53J9
7528GM0qLj58P4L12l37M57k43j15j31Q3L8L7j79K70m2l23K00K4p7l0J50J58O3
7553B73k68R2p7m1k57L49k48N4P3M6j38Q7M1j10J00J71k51J72J67m1m86K78n0
7576f4j31K28j27O3o3N2o9K36J06k18p5k42M27j61K4jk9j65K08J28n1m7k93R9
7600a65K53Q2k2N0j10J11k33J33N0l24l1L59j12m2J13j28k05J41M2J00j44j66
7622b48K06k22J06K49R6j40j29j83J52K67n6K39l86j75J64J03k60J83J82o2J46
7643B32j66l37K89j2j22J16j55K37K6k79J64N8j55N0M3J86j09J77m14R2r7N7l7
7666a56M39l51q5J19j39J62m9Qk05R4N5n2J49N4R2J27j80J13j28J8J43l02k51
$$ plain form
7505 -26 137 -98 32 -31 -10 -113 -46 298 262 -17 -32 -87 -209 149 263 -98 111 86 -104 -93 241 -12 7
7528 7 47 39 42 -116 -42 270 -67 390 147 32 -99 -16 22 59 -120 150 108 -215 -15 9 -68 -98 52 210 273
7553 273 5 97 20 -21 -278 71 -177 -123 -50 -4 -142 -55 -14 -124 -24 147 -104 68 235 194 -292 -14 -64
7576 -64 -195 33 -94 -31 -94 -42 -111 125 231 13 -62 -304 123 -38 -14 -15 -44 -209 -1 127 76 29 -264 -165
7600 -165 88 170 148 198 88 199 -34 99 149 -175 -206 153 41 -1 112 -16 -221 -80 -38 62 -82 -248
7622 -248 -42 -264 -158 91 187 47 -82 -265 -113 154 98 337 -49 -224 -60 43 -217 -34 148 86 232
7643 232 66 -271 18 6 -116 0 -155 82 108 -171 -7 51 -104 -54 -11 175 66 243 -171 -79 -176 -119 -156
7666 -156 283 -68 -153 -34 -173 -11 -60 -52 -257 -163 -108 -160 -11 43 135 262 82 195 67 85 228 -74 -325
7689c25K01K20L7J4j73m2q7L8M6J57j9M7l02K94k12J20L4R0k4k0q7nq3l3L27m09
7715a96J39K09k41L4J45l22K75L12j27k21J07k1j41O1mj01J07Q1J50m27L6m2M38
7738B51j28O9m39K32j45L62O2l84K53l14o3M24k31Q2n0j18J97J85kl82J63m1r3
7761a10j1Q4O1JmO7l2j89N7K18j10K6K0j29K46j74R5k16M9P3j63P1j60L6L31q4
7787E3o6J85k12j1M8J2O2q1J1j2k36J53J27j72M2J34K04k78n5J22j6l5RP2P3j08
7813B5JR8p9j15J85l5nj15Op9K18N4j56Q6k79L11j96j09Q4Kj0J21J22l8j17n5
7839g5J30j04J59j99J90l61J28J30j75K22p2J74j08N0m35N42p5k44K20J2r1o3
7861d5J74L32n08n9J56q7K29k87N4J41n3l46L15r5M9L14k80L8p8L2JK94j87j94
$$ plain form
7689 -325 -124 96 133 147 -26 -68 -155 -117 -71 86 67 114 -188 106 -106 14 48 138 114 94 7 2 -81 -114 213 -196
7715 -196 -57 152 -89 -55 90 -232 43 355 228 7 114 93 -48 13 9 -92 15 96 246 -181 -145 -187 251
7738 251 123 192 -247 -15 -160 202 264 -120 133 -181 -244 180 -51 31 -19 -137 60 245 243 -139 24 -17 -110
7761 -110 -121 -37 24 25 21 88 56 -133 -76 142 32 58 78 -51 195 21 116 -100 -51 22 -141 -70 -230 -194 137 53
7787 53 -13 172 -40 -51 -3 9 71 -10 1 -11 -247 -94 33 -139 -97 37 241 -37 -92 30 14 -21 -12 60 133 25
7813 25 26 124 45 -70 115 80 75 -40 -34 -113 105 159 3 89 -190 121 -75 -184 -100 -98 -108 13 135 97 -20 -75
7839 -75 55 -49 110 -89 101 -260 -132 -2 -177 45 -27 147 39 89 -346 196 121 -123 97 109 18 -45
7861 -45 129 461 -47 -106 50 -37 192 -95 -41 100 47 -299 16 -79 -30 284 4 42 -36 -4 -3 291 104 -90
7885i0K10M5m4k40L56L5k13J48j44M7R3m36J96j43J37N3j84P6K58J36k82j32J6
7908a02J11j18K35k62L54n29K66J09J3j56NK75j31j92k29L46q4P1j58L59k20K20
7930A83J31j77j79j78J50nK27k67J66R9l12K61J30n31j7L68n3k07L70m11L34l2
7952E0m1k41J62J48J73j48p9j88K18j80J33J30l44r5J42K3K19%o6j78P1K98j45
7975F2p8K46k38J50n9j39Q1l9r2L03j46J38j94n9N5P5j91K39k38K98j53J06j43
7998a6k4J22m3j24Jj2pQ4J9J83k45k09K54R7r4j44L65%k16r1J48j7j70L93l43
8023h9L2J18j62J74j80K50j39N2j01J39j92k12K51j09J22r5J53KJ09r3M3j90O0
8046e7R7K87l66j49J36J28k37j49L60J67k31k56M49j36n7K11j98p7j9j06J37r2
$$ plain form
7885 -90 120 165 121 -119 237 272 59 207 63 110 203 -233 -37 -180 -43 10 -174 -98 160 296 14 -118 -102
7908 -102 9 -109 126 -136 218 -311 -45 64 77 -79 -74 201 70 -122 -351 -5 -89 -18 -176 183 -37 183
7930 183 314 137 -42 -220 -70 -75 152 -115 51 150 -162 99 229 -302 -319 49 -4 -211 159 -252 82 50
7952 50 9 -232 -70 78 251 103 24 -164 54 -126 7 137 -207 -302 -160 -137 82 82 16 -162 -91 207 62
7975 62 -16 230 -8 142 83 -56 25 -14 -106 197 51 189 -5 -64 -9 66 -125 114 -124 174 21 127 -16
7998 -16 -40 82 39 -85 -84 -96 -103 -19 0 183 -62 -271 -17 80 -14 -158 207 207 -9 -100 48 31 -139 254 -89
8023 -89 -57 61 -101 73 -107 143 4 56 -45 94 -98 -310 -59 -168 -46 -141 12 14 123 30 73 -117 -57
8046 -57 40 327 -39 -188 -52 76 -161 -310 50 217 -14 -270 179 43 -14 197 -1 -78 -97 -203 -66 -158
8068a58K45l08M21k16j87J64M7K64m06K92k92L57l85K57K7l89L26n9J02o7p7J8
8090b4J20m1k41J2J56j1k36K80j63J72j02J64k39J82j85mJ27J88J0p6pQp6j69
8114a55K27l13K38J67p9k60P5J99J76l29n4L78j60j48M6J66k75P0K84j90K1Q8
8136A72k27K64J2k44k93K53J07jJ7m5K2n3j12K31k67j46L59j65oL6J19o3M5j94
8160a79L42j06k94L01p3M7j41k7NP1J16o3o6P3Oj39J2J60M3m1k23K13J70k58N5
8185DK1J00j85K06j23K2
$$ plain form
8068 -158 87 -221 200 -16 -203 -39 8 272 -134 158 -134 223 -162 95 122 -267 59 0 102 35 -42 -24
8090 -24 96 55 -186 -174 -18 -29 -265 15 -148 24 -78 86 -153 29 -156 -160 -33 155 165 89 82 90 14 -155
8114 -155 72 -241 -3 164 85 -175 -100 99 275 -54 -108 270 110 -38 8 174 -101 -31 253 63 84 172
8136 172 -55 209 221 -23 -316 -63 44 43 60 15 37 -16 -128 103 -164 -310 49 -116 -122 -86 33 -30 15 -179
8160 -179 163 57 -237 64 -9 38 -103 -130 -125 -54 62 -1 -67 6 12 -127 -115 45 88 47 -176 37 207 -51 4
8185 4 25 125 -60 146 23 45
8191D5
$$ Imaginary data points
##PAGE= N=2
##DATA TABLE= (X++(I..I)), XYDATA
0@%%%%%%%%%%%%qJ6j6J6j8K6l2M0m8N6o6P4q8J04j20J43j67J91k19K48k83L21
34A70l61M06m57N13n74O40p13P93q78R72j076J189j312J446j594J755j933K130
52A116k347K589k860L165l512L909m368M907n551O338p321Q594j0309J2750j6524
67i424K3164l8133J31061m364k02776J81644j5952n5562m430j1509Q3075m1983
79C4811q5312J17036l4613n6104M5710k1457K2955K971n4527O6008j1064o0067
91c3653L4597N259j3589r104l801M3575l9837k8096N3857k7295k0115L0582r962
104a7582J8473n363k0426L4989j0190k0912J8340M046J3132j4504q064L5408k6069
117A278k0431K9489q899m034L724r95J4858k2336o425K3923j8153l249J3757k219
$$ plain form
0 0 0 0 0 0 0 0 0 0 0 0 0 0 -8 8 -8 8 -10 16 -16 24 -24 32 -34 40 -48 56 -64 79 -88 103 -116 132 -151 170
34 170 -191 215 -242 271 -303 337 -376 417 -461 511 -565 624 -688 758 -836 919 -1014 1116
52 1116 -1231 1358 -1502 1663 -1849 2060 -2308 2599 -2952 3386 -3935 4659 -5650 7100 -9424
67 -9424 13740 -24393 106668 102304 -100472 81172 65220 9658 5228 -6281 76794 34811
79 34811 -50501 66535 31922 -24182 21528 71 23026 25997 -28530 37478 26414 -33653
91 -33653 944 6203 -7386 -16490 -20291 23284 -16553 -44649 9208 -18087 -38202 -7620 -17582
104 -17582 891 -4472 -24898 10091 -99 -21011 -2671 1375 14507 3 -8061 27347 1278
117 1278 -19153 10336 1437 -2597 1127 132 14990 -7346 -13771 10152 -8001 -11250 2507 288
131B88R696j5177r283K6609j6064k3470K3479J2152j6633r116J1726Q048j8887
144a6632j0287J7289J1200j2440p934K0489O679k3474n00J7506J712q874j762
157g028J9701J979k5442R166J3433j8509J917J0835l395p6k353J230l541o904
171h987Q686K91m760R136r30l494j68m896L232j174j279P074l881Q73K315j0375
187h337K698L254p068O782M770l729K547o51k69o44k126O289L256j761L077P36
203H824j913k397l022L423J194j031J365R31J036o306m291P126k502m538P918
218E817J495k748j073k673J091r50j864L565J295J760j422o688L101R29p356L062
234b659N282M7j855j289K968j944n557M369K980q2K757j546K36J044o514l48N200
$$ plain form
131 288 9984 -5193 -14476 12133 -3931 -27401 -3922 8230 -8403 -17519 -5793 2255 -16632
144 -16632 -26919 -9630 1570 -10870 -18804 1685 8364 -15110 -15610 1896 3608 -5266 -7028
157 -7028 12673 14652 -10790 -1624 11809 -6700 -4783 6052 2657 2581 228 1458 -2083 -8987
171 -8987 -301 -10 -4770 4366 3436 -58 -226 -5122 -1890 -3064 -4343 2731 -1150 -277 2038 -8337
187 -8337 -5639 -2385 -9453 -2671 2099 -1630 917 266 -3 -647 -2773 3516 6772 5011 8088 8824
203 8824 6911 4514 1492 4915 6109 5078 6443 7374 8410 2104 -2187 4939 2437 -2101 5817
218 5817 7312 4564 3491 818 1909 959 -905 2660 3955 5715 4293 -2395 706 1635 -5721 -2659
234 -2659 2623 2670 815 -474 2494 550 -5007 -638 2342 2260 5017 3471 3707 4751 -1763 -2111 3089
251C089j602j313K362J250l120n416J050J229l255K433L216j268m88j193j981
266e007j78k64J137K000J125Q64k172n59j00l434J106M231j038N73K420j324k084
283b704p20J072J758p48L753L732l471m48J563k872K78L68J120M446l071k388
299A668L581m457l496K875j27K087M2j881M181l937n172N884j653j942N404j466
315A591K11Q94n756J809J81l005M100K73m51K754m968K0K347m622K712L915j864
332A41K133j006j321J064m199P50M091k490J297J916k932l99j929j450K567q93
348b660k36L345j385j829l85q29Q99j031L65M753j073k512K199l55l038N89K288
365h95J675j133P96J859k424j682J605j45J00K610J73R23m17j827M02n57k59K618
$$ plain form
251 3089 1487 174 2536 3786 666 -4750 -3700 -2471 -5726 -3293 -77 -1345 -1833 -3026 -5007
266 -5007 -5185 -5449 -4312 -2312 -1187 -323 -2495 -3054 -3154 -6588 -5482 -1251 -2289 -1716 704 -620 -2704
283 -2704 -3424 -2352 -594 -1342 2411 6143 2672 2224 3787 915 1193 1561 2681 7127 4056 1668
299 1668 5249 792 -2704 171 44 2131 2173 292 4473 536 -4636 1248 -405 -2347 3057 1591
315 1591 1802 2696 -3060 -1251 -1070 -4075 25 298 -153 2601 -2367 -2347 0 -4622 -1910 2005 141
332 141 2274 1268 -53 1011 -3188 -2438 1653 -837 460 2376 -556 -955 -2884 -4334 -1767 -2660
348 -2660 -2896 449 -936 -2765 -3150 -3979 -3080 -4111 -3746 1007 -66 -2578 -379 -734 -3772 -3183 -895
365 -895 780 -353 443 2302 -122 -1804 -199 -344 -244 2366 2539 3462 3045 1218 1620 1063 804 3422
383C422p11Q7J487j988j466j013q66J429r65J12K581k866r22L34k957J758J486
400a058k856M233J35k170O13j915L63J764l303M387J989m457K583l57k459K957
416D49j878J631L760k670K207J98l524L642j210k208N129j223qN11k808K591k751
433A838l265O095k329j857M292l274p30j14k445L413k004j474N478k947k261J839
449B55k014J271j482r44O181k318k776L516j798k40l54j023M686q92j170J759
465B657j358J430j222l552N572N89l638L063q66j014J79l397K529J50j170K139
481B091l732R70K100o804P50L592k892R46n06K42J248m431N67J299j530L478k520
498e132p74N257l971k098K913j133K186p03q08N049k106k039K317q83K111J60
$$ plain form
383 3422 2711 2798 4285 2297 831 -182 -1048 381 -584 -472 2109 -757 -1679 -1345 -4302 -2544 -1058
400 -1058 -3914 319 454 -1716 -1103 -3018 -2655 -891 -4194 193 2182 -2275 308 -49 -2508 449
416 449 -1429 202 3962 1292 3499 3697 173 3815 2605 397 5526 4303 4295 4806 1998 4589 1838
433 1838 -1427 4668 2339 482 4774 1500 770 656 -1789 1624 -380 -1854 3624 677 -1584 255
449 255 -1759 -488 -1970 -2914 3267 949 -1827 1689 -109 -349 -703 -1726 2960 2068 898 2657
465 2657 1299 2729 1507 -2045 3527 4116 478 3541 2675 1661 1840 -1557 972 1122 -48 2091
481 2091 -1641 -671 1429 -5375 -4625 -1033 -3925 -2979 -3485 -3243 -1995 -6426 -5859 -4560 -6090 -2612 -5132
498 -5132 -5906 -649 -4620 -6718 -3805 -4938 -2752 -3455 -4263 786 -1320 -3359 -1042 -1925 186 346
514C46j631N257k286j236L235l858Q54J960j480K448j434k41K930n851N75M047
530C635l380J573p02q02M889n916k490O141k986p16J010j255M924m454k900N324
546A895l261k4J730l261N382m84n567M412n84j355K340l632M012K244n548K603
562I02M0j827L071l813J540M414m303M23P65k194L104k823j153M418j613q30o1
579F0n43K578k624j608M512l36j851L10K14J750k617j101L787j217j22J239r38
596A493N53r06l33J271j817J979J257k880J634j67j645J256j723K43K311k022
612E04M01j070j86K583m953l45N626l637k102K510O8k68l353O76M329l952k97
629c466L299k246M56N5j715K174j057Q08J591l196K712R89m136K294J379o32N42
$$ plain form
514 346 -1285 3972 1686 450 3685 -173 681 2641 1161 3609 2175 1934 4864 -987 -412 3635
530 3635 255 1828 1126 324 5213 -703 -3193 2948 -38 -754 256 -999 3925 -529 -3429 1895
546 1895 -1366 -1390 340 -2921 2461 1977 -3590 822 238 -1117 1223 -2409 1603 3847 -1701 902
562 902 942 -885 2186 -1627 -87 4327 24 447 1212 -982 2122 -701 -1854 2564 951 121 60
579 60 -483 2095 -529 -2137 2375 2039 188 498 712 2462 -155 -1256 2531 1314 1192 2431 1493
596 1493 2046 1140 807 2078 261 2240 3497 617 2251 2084 439 1695 -28 215 2526 504
612 504 905 -165 -351 2232 -2721 -3066 2560 -1077 -3179 -669 -601 -869 -4222 -3546 783 -3169 -3466
629 -3466 -167 -2413 -1957 -1902 -3617 -1443 -2500 -1692 -101 -3297 -585 404 -3732 -1438 -59 -691 -149
646a49j691K391O74l628K140Q31j740K001j097r2K234k355L37J68r22K385j615
663a28j252L730j426j949J242m82J298j000o48K928j559j732K830j853m83J294
679H10j079Q80J75m65Q78j51q03Q74j457J262j85j169K265J35l376K132O71j176
697B21r48J087J450j440j980K433J39k453O57J170J69j054q55J555j28k279J514
714g42R32j261J78R77p13l40q2Q22l89l46J006J94q74Q29k41o18N29j01o9Q00
734D91k42l93M16q6M01o59k83J821p10j600J716K76j259j72O27R64q72p03K098
753A831m62k404J594M79j016M13j12P94k39j833J430O07j767O69N95K12n26r72
771g07J380L29k281J192J050j474L21l1j38P38j508N08J103j831K98J007n19r0
$$ plain form
646 -149 -1840 551 1225 -2403 -263 568 -1172 829 -268 -360 1874 -481 -144 24 -898 1487 -128
663 -128 -1380 2350 924 -1025 217 -265 1033 33 -615 2313 754 -978 1852 -1 -484 810
679 810 -269 611 786 321 1199 1048 245 1119 -338 924 739 -430 1835 1970 -1406 726 1397 221
697 221 -727 360 1810 370 -1610 823 962 -1491 -834 336 505 -549 -1404 151 23 -2256 -742
714 -742 190 -1071 -893 84 -629 -969 -1051 -229 -618 -964 42 236 -638 191 -50 -668 -139 -240 -309 491
734 491 249 -144 272 186 587 -72 -355 1466 756 -844 872 1148 -111 -283 344 1308 436 -267 1831
753 1831 1369 -1035 559 1038 22 435 323 1117 878 -955 475 1082 -685 -16 579 791 265 -707
771 -707 673 1002 -1279 -87 963 -511 -190 -221 -359 379 -1129 -621 482 -1349 -1051 -44 -563 -653
789f53p59Q86P64k070O75K032j813k02J120m92M6o42J031L67j162M40P48k26m78
808c88K92O17N84j892R82J747j936R5J042l46k41n8N36L03j218R51M22r85L79
827H86p22mJ825k220O13R09l88j061O01O09n77j039J068M73j765L69J249j546
845g20J73K92q5p6o9j91K46j78l99k1K92j60n80N25O72j139J27O76r2n62k9O86
867f12j91n51J245k41o16J30J42L94J03q11J095Pn56N47j62J19O15r15J42R08
887G92j015O22k03m19N95o11L97K71m64Q44j67q99P71l42M8L03o15P15J20n76
907A67O44l41j94K29l95M23P64j362K4Q78p40M09p60Q43O48j396M99N42q30J02
927A54k69O54J30r44N91k26p86Q52l59o07P27J03J87j077q2J132p59p78J013j37
$$ plain form
789 -653 -1412 -526 238 -1832 -1157 875 -938 -1140 -20 -512 -466 -1108 -77 290 -872 -432 316 90 -388
808 -388 -96 521 1105 -787 195 1942 6 101 1143 797 556 498 1034 1337 119 1070 1492 507 886
827 886 164 160 1985 -235 378 1287 899 -162 439 1048 471 -568 500 973 -792 -423 826 -720
845 -720 -547 -255 -340 -416 -485 -676 -430 -608 -1007 -1028 -736 -896 -1476 -951 -279 -1418 -1291 -615 -707 -1269 -1298 -612
867 -612 -803 -1354 -109 -350 -966 -836 -694 -300 -197 -1008 87 94 -462 85 -77 42 657 -258 -116 792
887 792 -223 399 196 -223 372 -239 158 429 -35 809 642 -257 514 172 220 523 -92 623 743 167
907 167 811 470 276 505 110 533 1297 -65 -41 837 97 506 -254 589 1237 -159 340 882 52 154
927 154 -115 539 669 -275 316 90 -696 156 -203 -810 -83 20 207 -870 -952 180 -579 -1357 -344 -481
947d81L51j42q99J365N7j386R29k52Q64k50j266J471R7j145J090p18J042N63j627
966c37Q92P02j210N80o52K64J604j884M41J111p47M24j383j03K459k088l33J796
984A536j732Q96m17j171K087p16r94J497j996J498O37l383J892J120j546Q69j359
1001a282J777O23l419J754J309k164J039n45L33J255k310N96J126j768K273j068
1017d71j501L031j733m20J375j746J731m35k093L175r42j040J038j480J355J059
1033I03l027K942rj297J259j824J265J702l220J321J641j522J079j403J73J978
1049A961k187O87J213j627J758r14j368K273r20q90J084l57P98q06j632K190r93
1066B70n45R19r03R31L61j617N39K04o05O31j678R29J507k127M50K53p6j6j474
$$ plain form
947 -481 -130 -272 -1171 194 251 -1135 -206 -458 406 156 -1110 361 458 -687 403 -315 727 1290 -337
966 -337 555 1257 47 627 -25 239 1843 -41 400 1511 764 1188 -195 -298 2161 73 -260 1536
984 1536 -196 700 283 -888 1199 483 -511 986 -1010 488 1125 -2258 -366 754 -792 77 -1282
1001 -1282 495 1118 -2301 -547 762 -1402 -363 -908 -575 680 -1630 -1034 92 -1676 597 -471
1017 -471 -1972 1059 -674 -1094 281 -1465 266 -169 -2262 913 -29 -1069 -31 -1511 -156 903
1033 903 -2124 818 809 -488 771 -1053 212 1914 -1306 15 1656 134 1213 -190 -17 1961
1049 1961 -226 461 1674 47 1805 891 -477 1796 876 -14 1070 713 1511 705 -927 1263 270
1066 270 -275 644 -259 672 1033 -584 -45 159 -446 185 -1493 -564 943 -1184 -734 -481 -557 -573 -2047
1085b047J228J157j471M20L75l83J94o55K27P88r01J042k60j00J253j412k92J269
1103D32j35j55o0q49K139j390p85J451o35R73J02j433J665l45j176R17p26P58
1121G48j39l92M16M18j726J534r26M1J392j789P35M01m92m1p30O72M35o56K59
1140A60L95n28M91p12j34P32n14k7M94n02P12o34o33O76o26N82N5p72J023K05
1160D43j278M27l1N1j41J08M79K51j144L93j95j31Q08q23K19P67m83m1L17o32
1180f36L01k75P42M18p73O80j95m84Q80o38k33Q30j22L45j81p28O54m11J13O00
1200H87k99N94k69p55N08r7o89O99j93Q8M57o95n3j45m57M35n71O91M98j217N75
1221hL6o92L00L3L7K88l23L31k97m58K90j72m03Q29q8k91O80n59j12J83n63O53
$$ plain form
1085 -2047 -819 338 -1133 -713 -338 -721 -527 -1182 -955 -167 -1068 -26 -286 -386 867 -545 -837 432
1103 432 297 142 82 -767 1372 -18 -803 648 13 986 1088 -345 1320 975 -201 716 -10 748
1121 748 609 217 633 1051 -675 859 -67 -26 1366 -423 312 713 221 180 -550 122 557 -99 160
1140 160 555 27 518 -194 -328 404 -110 -137 357 -145 567 -67 -700 -24 -650 -68 -13 -785 238 443
1160 443 -835 -408 -439 -388 -529 -421 58 309 -835 -442 -637 -768 40 -783 -564 203 -280 -321 -4 -636
1180 -636 -335 -610 132 550 -223 457 262 -222 658 20 -213 617 495 840 659 -69 585 174 287 887
1200 887 588 1182 913 158 666 569 -120 579 386 474 931 236 183 38 -419 16 -555 136 634 -583 -8
1221 -8 28 -664 -364 -331 -294 -6 -329 2 -295 -753 -463 -635 -1038 -209 -297 -588 92 -467 -579 -396 -959 -306
1243c06J75l75Q01n87l70O64p94L20K51k43O57k85j51M82q11R9Q97m89o5O64n93
1264e9M4J23l80K80k50M79N86l57J97J38o62K01oj39O54j47J4J00l77k75J82j62
1286A84K39K91k91K12l83Q9N0p09M04K78l17L97j32o04K41m39K1L25m17N46P3
1307E8m45k15j30k25M18l68P01K80n28M13m00l26L40j51Q7L47j03K59K60p15K9
1328d14K89j59M50k3K54j50k46K02j62r6L25K73r6J39q6j95k21j89J08J98o0R2
1350B33K64mk67k30j28N37k33P4N82n65m63O60n67q1L08p0L79J24l75J93n46j25
1372c00M62l42K11J83n93N56k20o96N29n2k73K84l19M70k9q16N09o0l22L64k24
1393f78J82O20j260N15L95o10N75k06J62N56n62L60J4o92P52k70r6Q64n48J93
$$ plain form
1243 -306 -131 -506 295 -292 -662 2 -792 -472 -221 -464 193 -92 -243 239 -572 -473 424 -65 -130 534 -59
1264 -59 -15 108 -272 8 -242 237 823 466 663 801 139 340 334 195 849 702 716 816 439 164 346 184
1286 184 423 714 423 635 252 341 391 -318 86 364 47 444 312 -292 -51 -490 -469 -144 -561 -15 58
1307 58 -387 -602 -732 -957 -539 -907 -206 74 -454 -41 -441 -767 -427 -578 -491 -144 -247 12 272 -443 -414
1328 -414 -125 -284 166 143 397 247 1 203 41 -55 270 543 447 586 500 305 84 -105 3 201 141 233
1350 233 497 493 226 -4 -132 405 172 246 828 263 -200 460 -107 -188 120 50 429 553 178 371 -175 -300
1372 -300 162 -180 31 214 -379 177 -43 -739 -210 -262 -535 -251 -570 -100 -129 -945 -436 -496 -818 -454 -678
1393 -678 -496 124 -1136 -621 -226 -836 -261 -467 -305 251 -311 49 63 -629 123 -147 -243 621 73 266
1413B66J30m45N30j33k82J049k76m4l1p66P54l01o99J013j8j04L93j182P80J4
1433F48j164Q35K24k24N13j212L99M75j307N19L18k15N90p56MQ30j298K86J69
1452c66m16J457q97l16N80o67K11K65p55J456m44r38J217o84j2J82p85J088J60
1471C36j423J324j38l74N34j244J023O32j213P47J54l14N29j441J10J623j514
1488f49P50J85j20O44j155n0J081r41N64j63m98J549q89q05J233p91N78k73o46
1507c96J462k92j309J097n96M05M55j544J286O83j476K39k06K8O72j337Q00R21
1525H92r65K96q67J38J026j301R0J024n56K31k98p05J124q08k27O75m83Q37k61
1544a38q88R99k3o76L64j15J022m17j247J157P5o08K84k35Q45R7q97N37N6m07
$$ plain form
1413 266 396 -49 481 348 66 1115 839 795 764 -2 752 451 -248 765 747 643 1036 -146 634 648
1433 648 -516 319 543 319 832 -380 19 494 -813 -294 24 -191 399 -357 -353 477 -821 -535 -366
1452 -366 -782 675 -222 -538 42 -625 -414 -149 -904 552 108 -830 387 -297 -309 -127 -912 176 336
1471 336 -1087 237 99 -275 259 -985 38 670 -543 204 358 44 573 -868 -758 865 -649
1488 -649 101 286 166 810 -345 -395 686 -255 309 146 -352 1197 308 -497 736 -55 523 250 -396
1507 -396 1066 774 -535 562 -34 371 826 -718 568 1251 -225 14 -192 -164 508 -829 -29 892
1525 892 -73 223 -644 -506 520 -781 -691 333 -223 8 -290 -995 129 -679 -906 -231 -714 123 -138
1544 -138 -1026 -27 -50 -726 -362 -477 545 128 -1119 38 113 -495 -211 -446 399 496 -401 136 192 -215
1564b15L70q14Q93O31o18L70l71k89Q44j185L01J096p37K9J42l44M44r65J97R76
1584G55q30M59O0n22N52m22o50J041k80j8L09r88O75Q2q04M21k68J47Q43j334
1604g72O81J92r14N84l47J7N92p60K69N62q92K94M3l17J024q82M60M79r33L67
1624b53%k49O93k79k11M09J9J02j05m85P92K5o06O37j26k94L96q15N01K69o16
1645a96P34k27Q5L45p98K48K4k93P14l75q8M25m70K02N2n78K36J07O1K95l89k96
1667a82N58n89K46r2n7M29o4l12J07m10J27J41k56K13o0K71o1j13k24J90n12K58
1689c92l5J35Qj73Q8Ko17N04L72k77J11M2j11K45m03k5M20l80N01r2J42o6M0r
1713C0J70j59M66l01J9K40p6r6R8k38J71Q6N9K72j43k98N4j03j6L18k77l0K28
$$ plain form
1564 -215 155 -659 234 865 247 617 246 -43 801 -384 -83 1013 276 305 447 103 547 -418 -221 755
1584 755 -75 384 444 -78 474 52 -598 443 163 145 454 -534 141 223 -581 -160 -428 -281 562 -772
1604 -772 -91 101 -813 -229 -576 -559 33 -727 -458 104 -788 -494 -451 -768 256 -626 -166 313 -620 -253
1624 -253 -253 -502 191 -88 -299 110 129 231 126 -359 433 458 -148 489 363 69 465 -350 151 420 -196
1645 -196 538 311 396 741 -57 191 215 -78 636 261 173 598 128 330 382 -196 40 147 208 503 114 -182
1667 -182 376 -213 33 -59 -116 313 249 -63 44 -366 -239 -98 -354 -141 -201 70 9 -104 -328 -138 -650 -392
1689 -392 -427 -292 -284 -457 -369 -367 -984 -480 -108 -385 -274 -232 -343 -98 -501 -526 -106 -486 15 -77 65 -1 39 30
1713 30 200 41 507 206 225 465 389 293 391 153 324 410 469 741 598 300 354 251 235 553 276 246 474
1736D74m66N0p5j66M48o9k64J07K50k94j07n23L44j2j19L35Q4j11k12j6K8j28
1758d42m1L48l30J20K54R9j54K13m30M28K59m33J96k06j35M98m12K15k4MR8Q1
1780B06k57Q8j0P6m3J74J36j16j2j04J15k03L67j84P0j22l35K75L08n94J40J79
1802A54K38j05k79K82p1j62MJ98j93M3L6k8J20j9j62j28K27M9R5k90P9j43J40
1825H5j45K7j69J60J32j14k18R7j98J56j34N0j39J3L67k05k55p6J16o6L04k41
1847d53j89K99m1j54J32j34L80k12J77J73j36J22K8j30L08p7r6L08j69p5K50n8
1869B53k1K66k49J05J67RQ2m19M42j12j54J6J27J33R8n10j20L78m82R7o0j80N27
1892C93l98k54M06n81L84k07j22J45P2m53L42m88O31k84m56O84p3l09L01k54M35
$$ plain form
1736 474 8 58 -17 -183 265 196 -68 39 289 -5 -112 -635 -291 -303 -422 -87 -3 -114 -326 -342 -314 -442
1758 -442 -483 -135 -465 -345 -91 8 -146 67 -363 65 324 -109 87 -119 -254 244 -168 47 23 27 125 206
1780 206 -51 37 27 103 60 234 370 254 242 138 253 50 417 233 303 181 -154 121 429 -165 -25 154
1802 154 392 287 8 290 219 57 61 259 66 109 145 117 237 218 56 -72 155 204 299 9 88 -55 85
1825 85 -60 -33 -202 -42 90 -24 -242 -145 -343 -187 -321 -271 -410 -397 -30 -235 -490 -566 -450 -516 -212 -453
1847 -453 -642 -343 -384 -538 -406 -540 -160 -372 -195 -22 -158 -36 -8 -138 170 93 -3 305 136 61 311 253
1869 253 232 498 249 354 521 530 612 193 635 523 369 385 512 645 743 233 113 491 9 106 46 -134 393
1892 393 -5 -259 147 -434 -50 -257 -379 -234 -162 -615 -273 -761 -130 -414 -870 -186 -259 -568 -267 -521 -86
1913h6L8o34O46j20P1P9k28K60K07p04L35L66k01L12m03M8N73q59J53O65j81J70
1935E07k52l07N75j45l48J85m04N46J6o90P98m62k3L18n48M38J98p94P94k36k91
1956a25O54o64L92K91p95K86L20m89O05q67L87Q07j045K47o2p1O99p23k04R00
1976E43o35O1o9rL41l13p03R57n03l74N10m67R54l42q29O37k15J43J97n99O48
1997f7K10n81L58j9j98N44p73O5R08o24J8m4L14N26q22Q3P56k67k88J5j54Q25
2019G85n32l66O16j94P6m0m80O48k80n78O76j78R7o1p27O80J70o38P13n43M35
2040B79J10j066O24o9j17K63l83L64M63p28j86N97m94J31j7k10O87n85J43J89
2060ej65J02l47o5R17n30o9N25m01J53q7m03O56k87J23jl89N36j45l84N05k75
$$ plain form
1913 -86 -48 -682 -36 -156 -85 -6 -234 26 233 -471 -136 230 29 341 -62 -14 559 -300 -147 518 337 507
1935 507 255 -52 523 378 30 215 -189 357 373 -317 481 19 -4 314 -234 204 402 -392 402 166 -125
1956 -125 529 -135 257 548 -247 39 359 -130 475 -392 -5 802 -243 4 -58 -129 570 -153 -357 543
1976 543 -92 -31 -100 -109 232 -81 -784 173 -330 -704 -194 -661 293 -49 -878 -241 -456 -313 -116 -715 -67
1997 -67 143 -438 -80 -99 -297 247 -526 -461 447 -177 -159 -203 111 637 -185 -102 654 387 99 114 -40 785
2019 785 253 -113 503 309 385 345 -135 513 233 -345 331 153 250 189 -538 142 312 -326 387 -156 279
2040 279 389 -677 -53 -122 -239 24 -359 5 468 -260 -446 151 -343 -212 -229 -439 248 -337 -194 -5
2060 -5 -170 -68 -415 -480 437 -93 -162 363 -38 115 28 -375 281 -6 117 116 -273 263 118 -266 239 -36
2082c6o2M43p92J73N30j81j35j37K96L02n88J8N34l58J01J49m05O70m93k19O04
2103D14l72p7L34l95O75m90l39P93j91k84M31o23P51j41l37k6J5j1K19m99N05
2124C52rn64L58j14j16j7m21M70Ll47N71o07J59Q7l81KK44k79M94k68l48L46P5
2147c10J0L60k01m08N21l89L83K35o08N93M5n40K55j57K30j70k78P21k92N68l89
2168A79r2N65n36K55o3r7N15k97m50Q38l27r52J291J23j131Q93K5j39m5J77k48
2189D84p81K69L83n69j1J53L12m73N03k56k81j03J79p8j46%L24l83L69j32j82
2210d19J57P2k98N25k96J17j98n2J43J80N5m7j9O9k67r09N55R1J72R00n09l41
2232c19J362j358M40k04M17l71Pk4o6L66o11L51J54l2L0j5J1N9k13Q2J88m86J92
$$ plain form
2082 -36 -98 345 -447 -274 256 75 -60 -197 99 401 -187 -169 365 7 108 257 -148 522 29 -190 414
2103 414 42 -35 299 -96 579 89 -250 543 352 68 499 -124 627 486 149 123 138 127 346 -153 352
2124 352 343 -221 137 23 -93 -110 -531 -61 -58 -405 166 -441 -282 -195 -576 -574 -330 -609 -115 -383 -731 -385 -310
2147 -310 -300 60 -141 -549 -28 -417 -34 201 -407 186 231 -309 -54 -211 19 -151 -429 292 0 568 179
2168 179 87 652 116 371 308 211 726 429 -21 817 490 -462 829 952 -179 714 739 600 555 732 484
2189 484 -297 -28 355 -214 -225 -72 240 -233 270 14 -267 -370 -191 -269 -415 -415 -91 -474 -105 -237 -419
2210 -419 -262 -190 -488 37 -259 -142 -340 -392 -249 -69 -14 -61 -80 -11 -278 -1187 -632 -541 -369 531 22 -319
2232 -319 1043 -315 125 -79 338 -33 -26 -50 -116 250 -361 -10 144 112 142 127 138 197 -16 66 254 -232 -40
2255d0R4j19N19k55J23m5Kk76J08r6J87j16Q9j51p8J99j7k25J88q1L03j37l91
2278b15L59k02l86L62J04J4l66Q3J18J34J13m74J66k0Mr0j46LK01Q9j24Ql8Q1
2302b22j62M31q3Kk39K98J21l96J52L19j2N4j99K00j91K78r4L4J03J17k70K37
2324D78j32o4K11k25M1L77n59Q0j08J58n2j55j4K35l03J35k1j99J46o8m64K56
2346b47O7J37p5k88M6R8l23L53p4R4K71n24M49J47m98K54R8k34o6J05k34N80l29
2369a93j40K16k05L82J5l59M89m66J07J12l18N55k12k37K79l91M45K04o31M45
2389I7q8j35J13J29k48M62n28L12kl68O68o1r2J0m03L03K85l85K25l04K13J25
2411C28o9j78J18O6L1k93o9N70l92l65K09P6k42P5m43N89J84m66Q1j04J75mm94
$$ plain form
2255 -40 54 -65 454 199 322 277 279 3 111 15 202 86 175 24 -54 145 128 -97 91 10 313 176 -215
2278 -215 144 -58 -444 -82 22 36 -330 -247 -129 5 118 -356 -190 -210 -206 -296 -442 -439 -238 -149 -273 -265 -303 -222
2302 -222 -384 47 -36 -34 -273 25 146 -250 -98 221 209 263 64 264 73 351 257 291 394 511 241 478
2324 478 346 282 493 268 309 686 127 207 99 257 205 50 36 271 -32 103 82 -117 29 -39 -503 -247
2346 -247 -180 -43 -118 -406 -360 -262 -585 -232 -306 -212 59 -465 -16 131 -367 -113 -15 -249 -315 -210 -444 136 -193
2369 -193 -333 -117 -322 60 75 -284 205 -261 -154 -42 -360 195 -17 -254 25 -366 79 283 -348 97
2389 97 9 -126 -13 116 -132 330 -198 114 112 -256 412 351 259 269 -134 169 454 69 294 -10 203 328
2411 328 259 81 199 265 296 3 -66 504 112 -253 -44 32 -210 -135 -578 11 195 -271 -190 -294 -119 -123 -617
2434f17N41J93o18M32j21K95Q2q49K28P47n28L84m34N0M94k74%L24l62M16n31
2455a48j88Q24j31l03J26k11K04p7n05J041k06o13N4K3N34J17n60K10j41j44L28
2476B34m02K23K97n16M23K0m06L39m70L49L43p89M73J07j86J54j98l13P31p82
2496c69J88N1n76R94m05j16K37j09J21k51k08N38j29k64K77j42l2J05l42N73j49
2517hl09K65J64l32L09o21N11J02l37P9K46j16J27m35M12R9J33n64K22o2M90n90
2539b15K69O22p14J18L7p4P70l96o29L20J01J31j11k89M8o30M73K51m4L18j58
2560A98j50k48M87p28P68m02kL96k53nL41m50M24p80P9M08r6J41J07l00K7n0j59
2583b47K96r3k11K69J35m25J07l11M42l1l06L18k74L34o5j68K01q4K8m2j03N9
$$ plain form
2434 -617 -76 117 -501 -69 -190 105 187 -662 -434 313 -215 169 -265 -215 279 5 5 329 -33 383 -148
2455 -148 -336 488 357 54 180 -31 173 96 -409 632 426 -187 -133 -110 424 541 -19 191 50 -94 234
2476 234 -168 55 352 -164 259 279 -127 212 -258 91 434 -355 118 225 39 193 -5 -318 413 -369
2496 -369 -181 -130 -706 288 -117 -233 4 -105 16 -235 -443 95 -34 -298 -21 -163 -195 -90 -432 141 -8
2517 -8 -317 -52 112 -220 89 -532 -21 81 -256 -177 69 -47 80 -355 57 156 289 -275 -53 -115 375 -215
2539 -215 54 676 -38 80 117 43 813 417 -212 108 209 340 229 -60 -12 -642 -169 82 38 356 198
2560 198 48 -200 287 -441 327 -75 -77 319 66 61 402 -48 376 -404 -325 83 -13 128 235 -65 -38 -88 -247
2583 -247 49 -44 -255 14 149 -276 -169 -480 -38 -69 -375 -57 -331 3 -62 -230 -29 -113 -85 -127 -230 -171
2605a71K68k10K4M4o2J8K9M8J35j51J94O6k29L48k40j48J42L2L00n3m31K96L0
2628B79l91J22J23k13K09j66J43P5l21J49K42j64J00j70j83K10O2O7j26j50Q8
2649a5l64L15L04o46r4O56m46J32k13N1L62l21R6k17k36O27j27j23Q8k12o5L63
2671h5N2J96p66Q4O22o62M61M26j27k85J31k7K22K1m65J87K23q0N0k11L55j39
2693A83j01r9R3K33j03j00R8L3p7Jm0R0P7j70M3Q1J86n55K13q8J40j20J17J7j64
2718a2J45rj63j15L46n4j69J69j86rq8qQ9j74j42M26k60mO2l34L30mJ01r6k55
2743d14L16J7m6l31L85j44Q0R8j32M25l27j22J01n7r4J02L07j48p3K10q9J50M9
2766B63j27Q9k20L46l55O2K18k68Q3J33L0j28l3J44k6K9j19R9j19O5r1J8K9J40
$$ plain form
2605 -171 97 -113 -89 -45 -107 -89 -60 -12 123 -28 166 232 3 351 111 -37 105 137 437 384 -47 249 279
2628 279 -112 10 133 -80 129 -37 106 181 -140 9 251 87 187 17 -166 44 106 173 47 -103 -15
2649 -15 -379 -64 240 -406 -500 156 -290 -158 -371 -320 42 -279 -183 -400 -636 -9 -136 -259 -171 -383 -448 -85
2671 -85 -33 163 -603 -519 103 -559 -98 328 201 -84 47 20 242 263 -202 -15 208 128 178 -33 322 183
2693 183 82 -17 76 309 206 106 204 237 160 161 121 211 288 118 161 242 428 -127 86 -2 138 18 135 152 -12
2718 -12 133 124 -39 -154 192 138 -31 138 -48 -57 -145 -153 -64 -238 -380 46 -214 -218 -156 -490 -160 -164 -63 -159 -414
2743 -414 -98 -81 -127 -458 -73 -217 -137 -39 -171 254 -73 -195 -94 -151 -245 -143 164 16 -57 153 64 214 263
2766 263 136 225 5 351 -4 58 276 8 91 224 254 126 93 237 211 240 121 220 101 166 75 93 122 262
2790B62j52K08l54K6J58k46J18J86l10r9M7K1p2R0K96Q0m46L64n02O3j11L15k10
2813b68L39m42M54n12K62M63n75J24J73n98P66R6o56N48l65K84l37Q19n93k61
2833b79R6N36m30Oj30J39J40Q8l37K97O8n9J37j4o0O5j13j6K31k43K39j19k34
2856HM55k08k39M42n11K40R3m77J96J1j74J58k98J1K37k64P5K72k42J10k29j8
2878c52L92l09J56Q0l00L95n51L7M90k56L3K49l85L84k45K9K68k26Q1j01j05K35
2900aL0k79L57J02k76J87l08j3L55m90P97k17j34J60m49N26j17m38K65K50o8j7
2922B22m18M88l1j39O2p6l4K98l85k9K96j51O1k58M05k0j48k36K01K37l06o2J1
2945a2J61l8k20J69j28l9J38l40PK63k88J86k17N66m35m7J11K73k17J13l96K63
$$ plain form
2790 262 110 318 -36 -10 148 -98 20 206 -104 -203 -156 -135 -207 -117 179 259 -187 177 -325 -262 -373 -58 -268
2813 -268 71 -371 83 -429 -167 296 -279 -155 18 -580 186 282 -374 174 -191 93 -244 575 -18 -279
2833 -279 -183 353 -77 -71 -201 -62 78 166 -171 126 194 135 272 258 198 263 150 134 365 122 361 242 8
2856 8 463 255 16 458 -53 187 280 -197 -1 10 -164 -6 -304 -293 -56 -320 -245 27 -215 -105 -334 -352
2878 -352 40 -269 -113 -33 -333 62 -489 -452 38 -218 -185 64 -321 63 -182 -153 115 -111 -30 -131 -236 -1
2900 -1 29 -250 107 209 -67 120 -188 -201 154 -336 461 244 110 270 -179 347 230 -208 57 307 239 222
2922 222 -196 292 261 122 184 108 74 372 -13 -42 254 103 164 -94 311 291 143 -93 108 345 39 -23 -12
2945 -12 149 111 -109 60 -68 -107 31 -309 -302 -39 -327 -141 -358 208 -227 -274 -163 110 -107 6 -390 -127
2967a27J02l29J60N27n05K62m84J86N08n17R8R9m9J25j08l97Q34j94j63Lk17K88
2989A02Jm36M16j17K03j34k42M64k32m68L27L28l35K35l03N96j4n54L09k53J91
3010H4K01l99J62K01j51r9l50M18K66o98K88L28m91K94P4k75L64l71rO8j38O7
3032a66L02k95Q0K45l35L47l48k5K18l38K29L48o02O1K68j53L6o2O2K23l35J73
3054f7m4J77K23q0k73L28j19Q8m7k36L46j25N9M9j90K10r5k39K16l5j18P8J3k10
3078i1P7%K17k4k68L46m91K59k2o3K45k74m9J76p2K12J28j87P3l34j63L57J2q8
3102b4k7l4P6j61J42j85J43j03P7k6J72k2k74J88M5j96n8K14j06J07q8o9J26j1
3126i4p6L80l70j18K23p0J11r8J72j5k02K11r1K06J0k75J39K32o0l4j71K34j57
$$ plain form
2967 -127 -25 -354 -194 333 -172 90 -394 -208 300 -217 -119 -20 -69 56 -52 -449 385 191 28 31 -186 102
2989 102 103 -333 83 -34 169 35 -207 257 25 -443 -116 212 -123 112 -191 405 391 -163 146 -107 84
3010 84 285 -114 48 249 98 -1 -351 67 333 -365 -77 251 -240 54 128 -147 217 -154 -163 -95 -233 -166
3032 -166 136 -159 -79 166 -169 178 -170 -195 23 -315 -86 262 -340 -279 -11 -164 -128 -190 -128 95 -240 -67
3054 -67 -111 66 289 209 -64 264 145 233 186 -50 296 171 230 279 89 299 204 -35 181 146 28 106 119 -91
3078 -91 -14 -14 203 179 -89 257 -234 25 3 -60 185 -89 -138 38 -34 178 306 119 192 -142 -305 52 64 -24
3102 -24 -51 -85 -9 -170 -28 -213 -70 -173 -96 -122 50 28 -246 -58 -13 -209 -267 -53 -159 -52 -140 -209 -83 -94
3126 -94 -170 210 -160 -278 -55 -125 -14 -112 60 45 -157 54 -37 169 179 -96 43 275 215 181 10 244 87
3149H7O7O2l17N0n2J71L28k70O3j41K04n2j23j25n7L43k27j80J30K27l51J11j73
3172b25M18j28k30J62O3l00L8J57k06K6j39K55Q3p0K6j67K00j06r8m9L55q7l6
3195e8m1P0K13m83K86J33k00K41l88M8K18q3R3j06P7o4m8J85k0J45K1l72L09L6
3219B12m53L09o0j02J79j2J28j88j64K33J44j28o5J22r5r2M6k1J14R2j26q5J51
3242A39o0k04K9O5LL7M2k83J73p5j82M2K14J29j31k35L82k08k15M43l26J25j27
3265b23K31m3l07J23O8J25j46P2J37k85M9P0K67m71K64lP7k62M13o7K7n0J02j39
3289B9r0J26n9J72l93M27k2r3N0O8k14P1J09Q0J7j14q2K2j41MK25k93J33J48k88
3314a08L00j99L41n89J63J12j84K02P8k39p1J50M6j01j17J63k40K69k08K2J28
$$ plain form
3149 87 154 216 -101 -51 -103 68 396 126 189 48 252 200 77 -48 -105 238 11 -169 -39 188 -163 -52 -225
3172 -225 193 65 -165 -3 60 -240 -202 -45 -251 -225 -364 -109 -26 -96 -70 -237 -37 -143 -241 -290 65 -22 -58
3195 -58 -99 -29 184 -299 -13 120 -80 161 -227 -179 39 -44 49 -57 20 -44 -92 93 73 218 239 -133 176 212
3219 212 -241 68 8 -94 85 73 201 13 -151 82 226 98 33 155 60 -32 14 -7 107 199 73 -12 139
3242 139 79 -125 -96 -31 -28 9 51 -232 -59 -134 -316 -274 -60 69 -62 -297 85 -123 -338 105 -221 -96 -223
3265 -223 8 -35 -342 -219 -151 -26 -172 -100 37 -248 -199 -129 138 -333 -69 -72 5 -257 156 89 116 66 168 29
3289 29 -61 65 6 178 -215 212 190 97 147 215 1 72 181 261 278 164 82 104 -37 -33 192 -101 32 180 -108
3314 -108 192 -7 334 -255 -92 20 -164 38 116 -123 -194 -44 2 -99 -216 -53 -293 -24 -232 -210 -82
3335h2n6K88l58J3J30l05L35q8N8k98M92j03q5k54J89J06l29K45p1K6N4L83j86
3358A04p1J06j8J14j54j85K29m98J00L16K3j54J39J21K88p83J60P10q23P1j3k02
3380d20qJ677j248q48R36N0Q5r25L15M64j52KN1J97o1m84J95L93n47K55J58k06
3402a21r2q5M2K70P3n48M55j11N74n10J3l10k52N72p26R55J17l36j72J73O7J96
3424B44k45r8J60J97m72M0M74k36L17m63K92q9j96J42P6l05M41l23j98K94J69
3445B21j65J89k41J86K9j93m8Q0n5RL4J69j90Q4K3k36J52M1j69O9J06k11J50n2
3469a8K10k53NJ97o7k11RK12M6j98m27M57J27k63K11l36J52J74m36J96J65k70
3491c18L09Kj08J1p0j24M80m33K11j16k45M74m8n1R9k24K83j77q0L15l06k9M24
$$ plain form
3335 -82 -138 150 -208 -195 -65 -370 -35 -123 -65 -363 129 26 -59 -313 -124 -18 -347 -102 -173 -147 -93 290 104
3358 104 33 139 121 235 81 -104 125 -373 -273 43 66 -88 51 172 460 -323 -163 547 -276 -205 -218 -420
3380 -420 -428 1249 1 -847 89 139 224 -701 -386 78 -74 -72 -21 176 115 -369 -174 219 -328 -73 85 -121
3402 -121 -213 -298 -256 14 87 -461 -6 -117 457 -53 -40 -350 -602 -30 -756 199 316 -20 -192 -19 48 244
3424 244 -1 -99 61 258 -214 -174 300 64 381 -82 210 121 -75 67 143 -162 279 -44 -242 52 221
3445 221 56 245 4 190 219 26 -22 58 3 12 46 215 25 109 132 -104 48 89 -80 -11 95 -116 34 -18
3469 -18 192 -61 -56 141 74 -137 -128 84 130 -68 -495 -38 89 -174 37 -299 -147 27 -409 -213 -48 -318
3491 -318 -9 -7 -115 -104 -174 -298 182 -251 -40 -156 -401 73 25 -26 73 -151 132 -45 -125 190 -116 -145 279
3514B79k98K87l2m98M70j87K04J23p6l84M50k18k2j44j74J88J4L6L55o19K4K45
3536B3j15L41J37p01O37n45j23J07J66J18l11J27R10p26o20k7K18n4J260q55P31
3557F98p49n18J013k74Lj84k38J05J73j27J24k81L12J69k57J7Pj20o8N6Q4O9K8
3580D2L4k28N6J55K58l40K22k58J4l0q4J37L3K85m75J32o7M16k79K16l37m0L62
3603B24k02Q9r9j00K93k51J72j18k3L1l2mJ04L6l1J77j26j13O9l09L49K6j46k62
3627b46L26n66M12J22o6J5j20J59o9k07R1j37l4J26J05p2k4K09p6K28k50K9J1
3650c4J25k87Q3J20j0J50j13k18J60JJ41k33P6J23j96j1J65L99k64L8l15N34m48
3673a4o8k4L65m06M83k0k54o6j96M27m25K32k80k3L36o3l5j8n4j02K4K86J82j38
$$ plain form
3514 279 -19 268 236 -262 208 21 225 348 272 -112 338 120 98 -46 -220 -32 -18 18 373 -246 -222 23
3536 23 -92 249 386 -315 322 -223 -346 -239 -73 45 -266 -139 771 45 -575 -602 -384 -438 822 -33 698
3557 698 -51 -569 444 170 173 -11 -249 -144 29 -98 26 -255 57 226 -31 -14 -7 -127 -195 -139 -55 14 42
3580 42 76 -152 -96 59 317 -23 199 -59 -45 -75 -159 -22 11 296 -179 -47 -114 302 23 239 -98 -138 224
3603 224 22 111 12 -88 205 -46 126 8 -15 16 -16 -20 84 120 89 266 140 27 96 -213 136 162 16 -246
3627 -246 80 -486 -74 48 -18 -3 -123 36 -33 -240 -149 -286 -320 -194 -89 -161 -185 24 -52 176 -74 -45 -34
3650 -34 91 -196 -113 7 -3 147 34 -184 -24 -23 118 -115 -39 84 -112 -123 42 441 177 215 -100 434 -14
3673 -14 -82 -106 259 -147 336 316 62 -4 -200 227 -198 34 -246 -269 67 4 -31 -49 -103 -205 -181 105 287 149
3697A49k03o1q3l11K23L17k58J87Q4k63K93J9l59J4J66Q7j66O1jJ36j14J51j29
3720f1k8J64k21K98j2k47j8n2L05j72J55j01j45K14j28J69l01O2J12K07n4j1m07
3743b72L28j47K20j19m3j24J17J36j12N6qm6K42l3M5k50K31l05j08M59k64J09
3765A12k72J12kL88l49L64k03jj88J18p3N6j69J61p2K61m56K90N2l96M4K43j2
$$ plain form
3697 149 -54 -115 -198 -509 -286 31 -227 -40 44 -219 74 93 -266 -252 -86 1 -165 -104 -105 31 -83 68 -61
3720 -61 -89 75 -146 152 140 -107 -125 -177 128 -44 111 10 -135 79 -49 120 -181 -119 -7 200 146 135 -272
3743 -272 56 -91 129 10 -33 -157 -40 96 -16 40 32 -14 228 195 240 -10 221 -84 -192 267 3 112
3765 112 -160 -48 -50 338 -11 353 150 149 -39 79 6 62 -107 54 -18 243 -213 77 129 -267 -223 20 8
$$ [...]
8191f3
##END NTUPLES=NMR FID
##END=
