##TITLE=1H_SAV76(from SAY77-Yb)
 CDCl3, 8 sc, 
 25.11.2020
##JCAMPDX= 6.0         $$ Bruker NMR JCAMP-DX V2.0
##DATA TYPE= NMR FID
##DATA CLASS= NTUPLES
##ORIGIN= UXNMR, Bruker Analytische Messtechnik GmbH
##OWNER= root
$$ XWIN-NMR		Version 3.5
$$ Wed Nov 25 11:39:01 2020 Russian Standard Time (UT+4h)  she@DPX200
##.OBSERVE FREQUENCY= 200.1315066352
##.OBSERVE NUCLEUS= ^1H
##.DELAY= (6, 6)
##.ACQUISITION MODE= SIMULTANEOUS
##.ACQUISITION SCHEME= undefined
##.AVERAGES= 8
##.DIGITISER RES= 18
##SPECTROMETER/DATA SYSTEM= spect
##.PULSE SEQUENCE= zg30
##.SOLVENT NAME= CDCl3
##.SHIFT REFERENCE= (INTERNAL, CDCl3, 0, 15.7039)
##AUDIT TRAIL= $$ (NUMBER, WHEN, WHO, WHERE, WHAT)
$$ ##TITLE= Audit trail, XWIN-NMR		Version 3.5
$$ ##JCAMPDX= 5.01
$$ ##ORIGIN= Bruker BioSpin GmbH
$$ ##OWNER= she
$$ F:/spectra/data/she/nmr/H-F/1/audita.txt
$$ ##AUDIT TRAIL=  $$ (NUMBER, WHEN, WHO, WHERE, WHAT)
(   1,<2020-11-25 11:37:50.40 +0400>,<she>,<DPX200>,
      <created by zg, POWCHK disabled, PULCHK disabled
       configuration hash MD5:
       00 E9 B6 7A A2 85 ED C7 34 08 36 98 17 FE 4E 26
       data hash MD5: 16K
       C9 38 75 48 AD 1E 56 2E D1 F1 FE 8B 19 CD 0A B0>)
$$ ##END=
$$ 
$$ hash MD5
$$ 92 98 C7 29 C6 BC E2 EC 5D 3B 27 5F CC 81 2C 4E
##$RELAX= 
##$RELAX= 
##$RELAX= 
##$RELAX= 
##$RELAX= 
##$RELAX= 
$$ Bruker specific parameters
$$ --------------------------
##$DU= <F:/spectra>
##$EXPNO= 1
##$NAME= <H-F>
##$PROCNO= 1
##$TYPE= <nmr>
##$USER= <she>
##$AMP= (0..31)
100 100 100 100 100 100 100 100 100 100 100 100 100 100 100 100 100 100 
100 100 100 100 100 100 100 100 100 100 100 100 100 100 
##$AQSEQ= 0
##$AQ_mod= 1
##$AUNM= <au_zg>
##$AUTOPOS= <>
##$BF1= 200.13
##$BF2= 200.13
##$BF3= 200.13
##$BF4= 200.13
##$BF5= 200.13
##$BF6= 200.13
##$BF7= 200.13
##$BF8= 200.13
##$BYTORDA= 1
##$CFDGTYP= 0
##$CFRGTYP= 5
##$CHEMSTR= <none>
##$CNST= (0..31)
1 1 145 1 1 1 1 1 1 1 1 1 1 1 1 1 1 1 1 1 1 1 1 1 1 1 1 1 1 1 1 1 
##$CPDPRG= <>
##$CPDPRG1= <>
##$CPDPRG2= <>
##$CPDPRG3= <>
##$CPDPRG4= <mlev>
##$CPDPRG5= <mlev>
##$CPDPRG6= <mlev>
##$CPDPRG7= <mlev>
##$CPDPRG8= <mlev>
##$CPDPRGB= <>
##$CPDPRGT= <>
##$D= (0..31)
0 1.2 0 0 0 0 0 0 0 0.06 0 0.03 0 0 0 0 0.0002 0 0 0 0 0 0 0 0 0 0 0 0 
0 0 0 
##$DATE= 1606289869
##$DBL= (0..7)
120 120 120 120 120 120 120 120 
##$DBP= (0..7)
150 150 150 150 150 150 150 150 
##$DBP07= 0
##$DBPNAM0= <>
##$DBPNAM1= <>
##$DBPNAM2= <>
##$DBPNAM3= <>
##$DBPNAM4= <>
##$DBPNAM5= <>
##$DBPNAM6= <>
##$DBPNAM7= <>
##$DBPOAL= (0..7)
0.5 0.5 0.5 0.5 0.5 0.5 0.5 0.5 
##$DBPOFFS= (0..7)
0 0 0 0 0 0 0 0 
##$DE= 6
##$DECBNUC= <off>
##$DECIM= 32
##$DECNUC= <off>
##$DECSTAT= 4
##$DIGMOD= 1
##$DIGTYP= 9
##$DL= (0..7)
0 120 120 120 120 120 120 120 
##$DP= (0..7)
150 150 150 150 150 150 150 150 
##$DP07= 0
##$DPNAME0= <>
##$DPNAME1= <>
##$DPNAME2= <>
##$DPNAME3= <>
##$DPNAME4= <>
##$DPNAME5= <>
##$DPNAME6= <>
##$DPNAME7= <>
##$DPOAL= (0..7)
0.5 0.5 0.5 0.5 0.5 0.5 0.5 0.5 
##$DPOFFS= (0..7)
0 0 0 0 0 0 0 0 
##$DQDMODE= 0
##$DR= 18
##$DS= 0
$$ [...]
##$SUBNAM2= <"">
##$SUBNAM3= <"">
##$SUBNAM4= <"">
##$SUBNAM5= <"">
##$SUBNAM6= <"">
##$SUBNAM7= <"">
##$SUBNAM8= <"">
##$SUBNAM9= <"">
##$SW= 16.9725356469052
##$SWIBOX= (0..15)
0 0 2 0 0 0 0 0 0 0 0 0 0 0 0 0 
##$SW_h= 3396.73913043478
##$TD= 16384
##$TD0= 1
##$TE= 0
##$TE2= 300
##$TE3= 300
##$TEG= 300
##$TL= (0..7)
0 120 120 120 120 120 120 120 
##$TP= (0..7)
150 150 150 150 150 150 150 150 
##$TP07= 0
##$TPNAME0= <>
##$TPNAME1= <>
##$TPNAME2= <>
##$TPNAME3= <>
##$TPNAME4= <>
##$TPNAME5= <>
##$TPNAME6= <>
##$TPNAME7= <>
##$TPOAL= (0..7)
0.5 0.5 0.5 0.5 0.5 0.5 0.5 0.5 
##$TPOFFS= (0..7)
0 0 0 0 0 0 0 0 
##$TUNHIN= 0
##$TUNHOUT= 0
##$TUNXOUT= 0
##$USERA1= <user>
##$USERA2= <user>
##$USERA3= <user>
##$USERA4= <user>
##$USERA5= <user>
##$V9= 5
##$VALIST= <valist>
##$VCLIST= <CCCCCCCCCCCCCCC>
##$VD= 0
##$VDLIST= <DDDDDDDDDDDDDDD>
##$VPLIST= <PPPPPPPPPPPPPPP>
##$VTLIST= <TTTTTTTTTTTTTTT>
##$WBST= 1024
##$WBSW= 4
##$XGAIN= (0..3)
0 0 0 0 
##$XL= 0
##$YL= 0
##$YMAX_a= 194087
##$YMIN_a= -166627
##$ZGOPTNS= <>
##$ZL1= 120
##$ZL2= 120
##$ZL3= 120
##$ZL4= 120
##$ABSF1= 10
##$ABSF2= 0
##$ABSG= 5
##$ABSL= 3
##$ALPHA= 0
##$AQORDER= 0
##$ASSFAC= 0
##$ASSFACI= 0
##$ASSFACX= 0
##$ASSWID= 0
##$AUNMP= <proc_1d>
##$AZFE= 0.1
##$AZFW= 0.1
##$BCFW= 1
##$BC_mod= 2
##$BYTORDP= 1
##$COROFFS= 0
##$CY= 11.3945322036743
##$DATMOD= 1
##$DC= 2
##$DFILT= <>
##$DTYPP= 0
##$F1P= 15.9154993809931
##$F2P= -4.1035820241983
##$FCOR= 0.5
##$FTSIZE= 0
##$FT_mod= 4
##$GAMMA= 1
##$GB= 0.15
##$INTBC= 1
##$INTSCL= 1
##$ISEN= 128
##$LB= 0.24
##$LEV0= 0
##$LPBIN= 0
##$MAXI= 10000
##$MC2= 0
##$MEAN= 0
##$ME_mod= 0
##$MI= 1.114404
##$NCOEF= 0
##$NC_proc= 0
##$NLEV= 6
##$NOISF1= 3.799351
##$NOISF2= 2.8
##$NSP= 1
##$NTH_PI= 0
##$NZP= 0
##$OFFSET= 15.70392
##$PC= 1
##$PHC0= -11052.51
##$PHC1= 14.20089
##$PH_mod= 1
##$PKNL= yes
##$PPARMOD= 0
##$PSCAL= 0
##$PSIGN= 0
##$REVERSE= no
##$SF= 200.130013532006
##$SI= 16384
##$SIGF1= 3
##$SIGF2= 2
##$SINO= 400
##$SIOLD= 16384
##$SREGLST= <1H.CDCl3>
##$SSB= 0
##$STSI= 0
##$STSR= 0
##$SW_p= 3612.71676300578
##$SYMM= 0
##$S_DEV= 0
##$TDeff= 0
##$TDoff= 0
##$TI= <>
##$TILT= no
##$TM1= 0
##$TM2= 0
##$TOPLEV= 0
##$USERP1= <user>
##$USERP2= <user>
##$USERP3= <user>
##$USERP4= <user>
##$USERP5= <user>
##$WDW= 1
##$XDIM= 8192
##$YMAX_p= 0
##$YMIN_p= 0
$$ End of Bruker specific parameters
$$ ---------------------------------
##NTUPLES= NMR FID
##VAR_NAME=  TIME,          FID/REAL,        FID/IMAG
##SYMBOL=    X,             R,               I
##VAR_TYPE=  INDEPENDENT,   DEPENDENT,       DEPENDENT
##VAR_FORM=  AFFN,          ASDF,            ASDF
##VAR_DIM=   8192,          8192,            8192
##UNITS=     SECONDS,       ARBITRARY UNITS, ARBITRARY UNITS
##FACTOR=    0.0002944,     1,               1
##FIRST=     0,             0,               0
##LAST=      2.4114304,     0,               0
##MIN=       0,             -166627,         0
##MAX=       2.4114304,     194087,          0
$$ Real data points
##PAGE= N=1
##DATA TABLE= (X++(R..R)), XYDATA
0@%%%%%%%%%%%%%lJ1j6J6j6K4l2L2m0N1n9P2q7J01j17J35j54J77k03K31k64K99
35A58l37L81m28M81n40O03o71P47q30R18j016J124j240J368j509J662j830K015
53A056k221K449k703K987l306L673m095M587n171N873o737P828r257J1217j4067
68g887J8620l9592K22946k11958q6642K76049j92511J4155J00583j49333O0513
79D943N2253j05301R0104m4813q9326J07083k3102p1137R5689n558j2950Q1716
91G9601n7837o1379R9156k1971q4267N9335J9747m2012K4981k2285k2300J6044
103a3187k5762M6029J8259p8804Q7070N3658j30102K0641N8235n2208J1844L405
115i22N654K1681m2363L0742o567p6869Q4194J7149q4044P4383M657o9493O7820
$$ plain form
0 0 0 0 0 0 0 0 0 0 0 0 0 0 0 -3 8 -8 8 -8 16 -16 16 -24 27 -32 40 -47 54 -63 72 -82 95 -108 123 -141 158
35 158 -179 202 -226 255 -285 318 -353 394 -436 482 -534 590 -650 718 -791 871 -959 1056
53 1056 -1165 1284 -1419 1568 -1738 1935 -2160 2427 -2744 3129 -3608 4220 -5037 6180 -7887
68 -7887 10733 -28859 194087 -17871 -104513 171536 -20975 -6820 93763 -55570 4943
79 4943 57196 -48105 41999 -2814 -92140 14943 -8159 -79296 16393 10835 -2115 79601
91 79601 21764 -39615 59541 37570 -46697 12638 32385 -9627 15354 -6931 -29231 -13187
103 -13187 -38949 7080 25339 -53465 33605 87263 -42839 -22198 36037 -16171 -4327 -922
115 -922 4732 26413 -15950 14792 8225 -68644 15550 32699 -51345 23038 27695 -41798 26022
128B6022k2962p8627Q1205L0916o3550K8351L0078k6313L387j3323j3576K6643
140H251j2003M499K4899n5324M095N6396o6531k0676P3211j2434o35K7861l2409
153h00J7153J2787m5785K3157L516k9971N0340j6265n6977M2656l138l2816L6598
166D55r015l632N7089j7109l9732K8798N248k3211N45K115N320N181j5902k965
180f815m889k1088K5778J7010l1823K5190L4821k9906m069L615j8758J7577K693
193I336k0044J4668N490j3012q51j5393n729K3287K811o305J1829L899k295j043
207F648j6203m913J7015M189o556l1L616j388j1083o964L686K208J1021J2202
221A3447j0704n063J2211q708j2361M615K794J0815R010j4321k137N247j1406
$$ plain form
128 26022 3060 -75567 5638 36554 -26996 1355 31433 5120 8507 -4816 -18392 8251
140 8251 -3752 747 25646 -29678 -25583 30813 -35718 -56394 16817 4383 3748 31609 -800
153 -800 16353 29140 -16645 6512 10028 -19943 30397 14132 -42845 -189 -3327 -36143 455
166 455 -8560 -12192 44897 27788 -11944 16854 22102 -1109 -564 1551 6871 12052 -3850 -6815
180 -6815 -11704 -32792 -7014 9996 -21827 3363 38184 8278 4209 7824 -10934 6643 9336
193 9336 -10708 3960 9450 -3562 -4413 -19806 -25535 -2248 563 -5742 6087 9986 7691 6648
207 6648 -9555 -14468 2547 6736 180 149 3765 2377 -8706 -15670 -11984 -9776 1245 13447
221 13447 2743 -2320 9891 1183 -11178 -6563 -3769 7046 16056 1735 -402 4845 -6561
234f561j09p38k658K1441M760j6160L452J350r746K451L29j178J3157N681j0173
249E298m646k406o326M655K442m471J1293R430q250q246m734J226N168l763J570
264a760J1682L51p481l613p762l055Q794J136l395J0418M581r563k243l714p334
279a2958J1350O781q844Q802O709j4429k801J927j0159N416J2059k111j8J053
293B777l010j026p634l846J3428Q475o483K442N656q889p941J831r21P42P675
308C276K679l661j416k585l938L3J714L759Q465M704k809m236m153L42l548o741
324h115J1107N329j2465P887J367k2287R335J2375j5854J1365J7599j1189J983
337H437O04j3267N799j655q553J4727r68j1813Q939o885j3069J1043n73j160J7353
$$ plain form
234 -6561 -6670 -7408 -10066 11375 16135 -25 3427 4777 -4969 -2518 -2189 -3367 9790 15471 5298
249 5298 652 -1754 -8080 -3425 -983 -5454 5839 15269 7019 -1227 -5961 -4735 433 -3330 -1760
264 -1760 9922 10273 2792 -821 -8583 -11638 -2844 -1708 -5103 5315 9896 333 -1910 -5624 -12958
279 -12958 -1608 5173 -3671 5131 11840 -2589 -5390 -3463 -13622 -8206 3853 1742 1724 2777
293 2777 -233 -1259 -8893 -12739 689 9164 2681 5123 10779 1890 -6051 -4220 -5141 -4399 3276
308 3276 5955 2294 878 -1707 -5645 -5612 -3898 -139 8326 13030 10221 5985 1832 2174 -1374 -8115
324 -8115 2992 8321 -4144 3743 5110 -17177 -7842 4533 -11321 44 17643 6454 8437
337 8437 9041 -4226 1573 -82 -8635 6092 5124 -6689 2250 -4635 -17704 -6661 -7234 -8394 8959
352H959l782l128J2438j3731q446J1788o980J244R211j0615M227N02k0210Q942
366i581O388j3948J6745J1876j4712Q442N993j6631K945Q543n520K848O370m301
380E457m961l625m714j723K359J479N189O262k165j414J843m870N49O403k337
395C732O110N099j1632j456J666j3635k11Q798l260K758O306n676J230M76q107
410g802R031P347p191J0404L874j6830M000lj7618Q368Q045j1596Q169O733j3343
425h412K275M713q376P987Q588m508Q208M45j2039L344m138r107J0406j217n112
440f943J2619o312j1232J0007l516o502J4001K223k158R070n491o868M953o090
454b239k839R390j757q72M181p123m583K428m916m15J1937L12l873J0319k866
$$ plain form
352 8959 5177 2049 14487 756 -7690 4098 -2882 -1638 7573 -3042 1185 1687 -18523 -9581
366 -9581 -3193 -17141 -396 11480 -3232 5210 11203 -5428 -2483 6060 540 3388 9758 5457
380 5457 496 -3129 -7843 -9566 -7207 -5728 -539 5723 3558 2144 3987 -883 -334 6069 3732
395 3732 9842 14941 3309 1853 3519 -10116 -10327 -1529 -4789 -2031 4275 -1401 -171 305 -7802
410 -7802 1229 8576 1385 11789 15663 -1167 2833 2830 -14788 -6420 1625 -9971 -1802 4931 -8412
425 -8412 -6137 -1424 -9800 -1813 6775 2267 10475 10920 -1119 2225 -1913 -11020 -614 -1831 -6943
440 -6943 5676 -636 -11868 -1861 -5377 -11879 2122 4345 2187 11257 5766 -1102 3851 -2239
454 -2239 -5078 4312 2555 1683 5864 -1259 -5842 -3414 -8330 -8745 3192 3504 -369 9950 7084
469G084j0822P313p16m422J0789k050l971O014j0184p577M951n051O46Q149j214
484a061K763M281q249O61O727o194K694J0505n987j972J705j0699l477K580n641
499a1364L362Q100k835Q24M073n405n34N466j392M362N121m990j48j338j0095
514f793j500K709l575L931O229l889R73M732p906M87Q882l447M477N908q689K022
530D551n60j1926L475K223k360O592m76j292K817n011j240L167K45K102M025K174
546H506m498l285J312m693j516M195n87M096K859q193P48K128p134K865L572m62
562h7O219k062n145L391m681k667O129j665J529M599l656k454j692l565M81K275
578c051J496K26L488J646n706j779J701m16K700O39N27L816l330l586k407k408
$$ plain form
469 7084 -3738 3575 2859 -1563 9226 7176 3205 9219 -965 -8542 -3591 -8642 -7996 153 -1061
484 -1061 1702 5983 -2266 -1605 5122 -1072 1622 12127 6140 4168 5873 -4826 -8303 -5723 -11364
499 -11364 -8002 98 -2737 -1913 2160 -3245 -3779 1687 295 4657 9778 4788 4640 3302 -6793
514 -6793 -8293 -5584 -9159 -5228 1001 -2888 -1915 2817 -5089 -4602 4280 833 5310 11218 2529 4551
530 4551 3991 -7935 -4460 -2237 -4597 1995 1519 227 3044 -1967 -3207 -40 205 2307 6332 8506
546 8506 4008 723 2035 -2658 -4174 21 -566 3530 6389 -1804 -1056 1072 -6062 -3197 375 -87
562 -87 6132 4070 -1075 2316 -2365 -5032 1097 -568 961 5560 1904 -550 -2242 -5807 -5326 -3051
578 -3051 -1555 -1329 2159 3805 -1901 -3680 -1979 -2395 305 944 1471 5287 1957 -1629 -4036 -6444
594f444K677J628N99L215M7J36j472l913R85K027L196K464l290J972K67o546j134
611c586K54j075N799K294k369O83l15n25j614l437M476N026r88jk309k343N07
628D77l961j419L734K156K277m00k422j7k661P59K448k181L161N032k732o061
644a810j090J313k793o50L533j19L486J450o052J05R32q28M776k899J212Q210
660H776p320n398K952n989J385N329m311L157N951n354p04J482l682L761M572
675D607j497K81M22j192j140o812l909R069J276n883N049M660n517N78J482m039
691b565N169M258j962P11k959j655N88o920j049N024J083K303q79j801K097j097
707C46o57p85J867N997k126k397J348p591N61N506q877O79J0568j620l689j032
$$ plain form
594 -6444 -3767 -2139 -1540 1675 1722 1858 386 -3527 -2542 -515 2681 5145 1855 3827 4094 -2452 -3586
611 -3586 -3332 -4407 1392 3686 1317 2000 1685 1160 -454 -3891 585 5611 4623 4622 2313 -30 477
628 477 -3484 -4903 -1169 987 3264 2864 442 425 -2236 -1477 971 -1210 1951 6983 4251 -1810
644 -1810 -2900 -1587 -4380 -5030 -1497 -1616 1870 3320 -2732 -2627 -1695 -2523 2253 -646 566 8776
660 8776 1456 -3942 -990 -6979 -5594 -265 -4576 -1419 4532 -822 -1526 -44 -3726 35 4607
675 4607 3110 3391 3813 2621 1481 -5331 -9240 -171 1105 -4778 271 4931 -586 -8 1474 -2565
691 -2565 2604 6862 4900 5611 2652 997 1585 -5335 -6384 -1360 -277 2026 1147 -654 1443 346
707 346 -311 -1096 771 6768 4642 2245 3593 -3998 -3437 2069 -6808 -6129 4439 2819 -870 -1902
723a902n17L358l419k340P785j75l614N443l623q274N550L245n726L710L782k730
739E53K392l420p680N486K917n549M768K082j244M154n973k823P357l029J314
754A305O659p658L14O609r610o838O246K601l530K184L485k49k57K56k78P42K99
771B280M175L003p460j792M467p292n482M080j274L347N005n525L64P110l162
786A844m250N418K839k024J865q74n927j843j65j655j110r34N910M714p917K78
802c831Q382o807l21Q897n746N63P455p532m840J657k793J895O1k483O262J746
818B565m822J498j198j514O761j933l306P668k86p274K415o06n214M587L560l023
834a22j34K375L76l958l497L504L235j807J324K599k322l74J740m293q51O127
$$ plain form
723 -1902 -2419 939 -2480 -4820 2965 2790 -824 4619 996 -7278 -1728 1517 -4209 -499 3283 553
739 553 2945 -475 -8155 -2669 248 -5301 -533 1549 305 4459 -1514 -4337 3020 -9 1305
754 1305 7964 306 620 7229 -2381 -9219 -2973 -372 -3902 -1718 1767 1518 1261 1517 1239 1981 2280
771 2280 6455 9458 1998 206 4673 -2619 -8101 -4021 -5295 -1948 3057 -2468 -2104 5006 1844
786 1844 -2406 3012 5851 3827 5692 4818 -1109 -2952 -3117 -4772 -5882 -6816 -906 3808 -4109 -3831
802 -3831 4551 -2256 -2577 6320 574 1137 8592 1060 -3780 -2123 -4916 -3021 -2960 -5443 819 2565
818 2565 -2257 -759 -1957 -3471 3290 1357 -1949 5719 5433 -1841 574 -32 -5246 -659 2901 -122
834 -122 -256 2119 2495 -1463 -4960 -1456 1779 -28 1296 3895 1573 1199 2939 -1354 -2205 3922
850C922N98l400J239Q7l347j788o84m77J630L348R41k047O04J819k608L1J436
867A304M55J649P7k545k153l066K004n25n073N651M428m461K133J743m652L584
883E53R07l106M311J371k507N34n154j668L402l740o40P823k760j223N697m722
899i22k988O580j267j627N063k741n03K642p411q73M638l268J607L461m179M357
915B569L9p315N429J651m880O813R14n589L634o88m994J352K4M21L137k425j5
932G7K323l882j244L274k199P79M855k133q79K34k367J481j578k369N239N70l184
949a003J224j682l97P63l224L567L491m153K229K608n809J39K252k167K534p58
965c86r9M253m926k856M497k560r99L707l98J169J554l955P37O59l261K913K500
$$ plain form
850 3922 4520 1120 2359 2446 -901 -2689 -3373 -3850 -2220 1128 2069 22 626 2445 -163 -132 1304
867 1304 1759 3408 3485 940 -1213 -4279 -2275 -2800 -7873 -2222 2206 -2255 -122 1621 -3031 553
883 553 1460 -1646 2665 4036 1529 2063 -3091 -4759 -1357 -5097 -5737 2086 -674 -1897 3800 -922
899 -922 -3910 2670 1403 -224 4839 2098 1595 4237 -3174 -4047 591 -2677 -1070 2391 -1788 2569
915 2569 2608 -4707 722 2373 -2507 4306 5220 -369 3265 2577 -2417 -1065 -1041 -620 2517 92 77
932 77 2400 -1482 -2726 548 -1651 -872 3983 1850 971 1205 -1162 319 -1259 -3628 1611 2181 -1003
949 -1003 221 -1461 -1858 -1095 -4319 -752 2739 -1414 815 3423 -2386 -2247 5 -2162 372 -386
965 -386 -485 3768 -1158 -4014 483 -2077 -3076 631 233 1402 2956 -999 -262 397 -2864 49 2549
982B549l213K130J733m220l19R09r52J597j88J285K639l765j49J914l346N82K006
999A192m9J399j370j287J468k969j206L159J61M09P17o29P31j811k097K148R04
1016H70j710J511J979k208k251P52N5j608Q53K561L9o05L53j56j593j121J935
1033c44Q13j800K402M58k930L34j018q29K168j120J105L086j819j357Q90o45j61
1050g67j40J477K494j314k423J704J56m451O39L793j407j13K270p01j033k89o00
1067g05J502J56R7K060p64j464l86p98j230R51M69M9J027K94j664l62J431j625
1085i62J27L476j421m43K870l320k728K850j734m54J758j209J637j94l622K458
1101i11J84k701L713J657j826J604N48k598n14L08j085L41K155k117m19J835l056
$$ plain form
982 2549 -664 1466 3199 -1021 -1340 -431 -1383 214 26 1311 3950 185 36 1950 -1396 -814 1192
999 1192 1143 2542 1172 -115 1353 -1616 -2822 337 498 907 1624 995 1726 -85 -2182 -34 870
1016 870 -840 671 2650 442 -1809 -1057 -1002 -2610 -1757 804 843 238 591 435 -1158 -2279 -344
1033 -344 469 -1331 1071 1529 -1401 -1067 -2085 -2914 -746 -1866 -761 2325 506 -851 39 -606 -767
1050 -767 -907 570 3064 1750 -673 1031 1187 -3264 -2625 1168 -239 -352 1918 1217 184 -105 -705
1067 -705 797 953 1050 3110 2346 882 496 -302 -1532 -581 -112 -63 964 1258 -406 -768 663 -962
1085 -962 -835 2641 1220 777 3647 327 -2401 449 -1285 -1739 19 -1190 447 253 -3369 -911
1101 -911 -727 -3428 285 1942 116 1720 2268 -330 -844 -536 -1621 -1280 875 -1242 -1661 174 -2882
1118b882J5K113j345L024J356k414K627j10l935K373l52k835L703L67l642K212
1134B75Q7l231J681R95j036K369J209n84M29j019j163J771r94j691L168k97l029
1151a060K181j511k169K997j334m60L638q26j089J119j392n76O4K99J150q2J00
1168A049o95o41l00j642R65P86j244K280K6k258J676r53j617K793J33r65K290
1185A683jj526L8j562k37J233q69m2J147j84j607O73p5l23K290L94m90K645j277
1204A910k292K413k023j779K823j591RJ643k645M78J075j827J441J780l43J586
1220B658m1j066J97n35j288j54N73Q5j015R09o89j260J250r04O24K580j343N90
1238A171J630k597j12O31j789J227J99j547J397j21k241P67O41q66J175P12k3
$$ plain form
1118 -2882 -2867 -754 -2099 925 2281 -133 2494 2384 -1551 822 470 -2365 1338 1705 -1937 275
1134 275 362 -2869 -1188 -193 -1229 1140 2349 1765 2194 1175 12 1783 789 -902 2266 1969 -1060
1151 -1060 1121 -390 -2559 438 -896 -1356 2282 1456 367 1486 94 -482 -418 -119 1031 949 1049
1168 1049 354 -287 -587 -2229 -1264 -478 -1722 558 584 -1674 2 -951 -2568 225 358 -607 1683
1185 1683 1682 156 194 -1368 -1605 -372 -1241 -1283 -136 -320 -1927 -1254 -1329 -1652 638 1032 542 3187 1910
1204 1910 -382 2031 8 -1771 1052 -539 -530 1113 -1532 -1054 21 -1806 -365 1415 1072 2658
1220 2658 2617 1551 1748 1213 -75 -229 344 429 -586 323 -366 -1626 -376 -1280 -656 1924 581 1171
1238 1171 2801 204 92 723 -1066 161 360 -1187 210 89 -2152 -1385 -744 -1610 -435 277 254
1255B54Q86o80j361L82K44j411J737N06j071J023p22j440J339r46n27K588r41
1272a40j54J433j628K97J28j320J810O22o65J048p28l69k24r28P13L11K3N32k49
1291E12k08j72r94O82Q99j70O65M37m65j19r34l84N96m87P4O09Qk72j030K05J12
1312d36l23P69P8R17N04j446J90L38k226J025K39l82J355j048l38P95j266j8O49
1331f24k8J127J63m96L42q24n78K02K88L19J13j61p9k28l52l71J21J114Q4J95
1351C27P51n04k94o76j24Q91m67m20J620m36o08l37k60P65l21k23J653J02q84
1370E55M44p36m00M56n69L52J011o38k72M65o00n54M79K08L27L85k00n9J53j260
1390d53l52O94m40N81K94q06K12K32j380K74J153p91J118L04m25l36K26j316K49
$$ plain form
1255 254 1140 460 -901 -519 -275 -1686 51 557 -514 509 -213 -1653 -314 -1260 -1787 801 -140
1272 -140 -294 1139 -489 -192 -64 -1384 426 1048 383 1431 703 334 110 -818 -105 206 229 761 512
1291 512 304 132 -862 -180 719 549 1214 1651 1186 1067 133 -251 345 -142 -68 541 549 277 -753 -548 -436
1312 -436 -759 10 88 1005 1509 63 253 591 -1635 -610 -371 -753 602 -446 -784 11 -1255 -1273 -624
1331 -624 -652 475 638 142 484 -340 -918 -716 -428 -109 4 -157 -236 -464 -816 -1187 -1066 48 132 327
1351 327 1078 574 280 -396 -520 371 -96 -516 1104 668 60 -277 -537 228 -93 -316 1337 1439 555
1370 555 999 263 -137 319 -250 102 1113 475 203 668 68 -486 -7 201 528 913 713 654 807 -453
1390 -453 -805 -111 -551 30 324 -482 -270 -38 -1418 -1144 9 -782 336 640 215 -121 105 -1211 -962
1409i62N98n32R81K52j076O1j48p79J200l0m29J579L34j739J111l16j058J034
1427H1n03J3J424q62m34P49j051J55Q20o08J417J26j120J00N64q45RM74j3K22
1447G18j92O30m36p41k85J85L02L18o69M49O89q45o32L18j4P90k71n6Q97n08j120
1468d73L92j5o82L94N61m38k59j5l22J5J61N2M62J037m83j44J13j118M05j94q34
1489a385J536j68j518J517l22j455J778m37n79K634j030m29J229j496p5P36j464
1506i28R96P50j559Q85M01j405N74L41l80Q65O31o13K43M73j445L62N40j062O30
1525B99M36p36O34p71o03O93j32k31R79K21m72K92k61p30N47k24j86Q28r0n55
1545f2j55Q7j78q44N49M13J44K0m42Q00l34r83N23Q9Q0Q47n61k34L34o47l29M90
$$ plain form
1409 -962 -364 -896 85 337 -739 -678 -826 -1605 -405 -435 -864 715 1049 -690 421 105 -953 81
1427 81 -422 -409 1015 153 -281 468 -583 -428 392 -216 1201 1327 207 307 871 26 35 509 496 718
1447 718 526 1156 720 -21 -306 -121 181 499 -170 279 968 123 -509 -191 -205 585 314 258 1155 647 -473
1468 -473 -81 -96 -778 -384 177 -261 -520 -535 -857 -842 -681 -629 -167 870 387 243 356 -762 -357 -551 -1385
1489 -1385 151 -17 -1535 -18 -340 -1795 -17 -454 -1033 1601 571 142 1371 -125 -200 536 -928
1506 -928 68 818 -741 144 545 -860 -286 55 -325 540 1171 558 801 1274 -171 191 731 -331 299
1525 299 735 -1 633 -138 -741 -48 -180 -411 568 789 317 609 348 -382 165 -59 -245 583 493 -62
1545 -62 -217 -130 -308 -1152 -603 -190 -46 -26 -468 332 -2 -985 -462 -373 -293 554 -7 -241 93 -554 -883 -393
1567c93j55R9q2P16J7r55P24l29R7O34k67P41n1j048R42m30r02Q21k90m19J400
1588H70j128L86j73R9M30P09j412J345n9l93j61p3K26m04j430J367Q17q66k37
1607h7j38L24m28J86O41Oo42J002o35k2k17m13N53j91l64Q20n39m02L45q05N77
1628d29K23k55N64j98L02n9r06O52r3l05O75l45L7K25p01J71N0l53N16O4j3O69
1650D91o63J41M11m10j43N13O6j72k72L65R2o98LP47k41K88m76M42L42j010L55
1671A71J16l24Q75j12l31K01n22p3J83n29N68J46l41L35n57K90K36o28L91j05
1691a0k70P97o81k78N52p23O99j34p25Q68j3o78N17l00L9n0n11R09J22o87L03
1712b54N05o80K0j91K76L93k42K37r3k00L2m99R41l18J06L77l11q5K36q99P56
$$ plain form
1567 -393 -548 -449 -531 185 202 -753 -29 -358 -261 373 106 847 796 -252 690 260 -642 179 -111 -530 870
1588 870 -258 128 -45 54 484 1193 -219 1126 1067 674 513 440 666 262 -1168 199 1016 150 -87
1607 -87 -225 99 -329 -143 498 504 -138 864 229 207 -10 -423 130 -61 -425 395 -144 -546 -201 -1006 -429
1628 -429 -206 -461 103 -95 207 148 -758 -106 -199 -504 171 -174 -137 88 -613 -442 -392 -745 -229 -165 -178 491
1650 491 -172 -31 380 -30 -173 340 406 234 -38 327 419 -279 -276 471 230 518 42 484 826 -184 171
1671 171 287 -37 838 726 395 596 74 1 184 -345 223 369 28 363 -194 96 332 -296 95 -10
1691 -10 -280 517 -164 -442 110 -613 86 -48 -773 95 82 -596 -79 -379 -340 -390 -901 8 130 -557 -254
1712 -254 251 -429 -409 -600 -324 69 -173 64 -29 -229 -197 -696 245 -73 33 410 99 14 250 -649 107
1733A07J89o33R13l72j29O06q87L63L50n90O57r5o58P16J60j012Q81m13L1P34
1753I18o99m6N14J09m55l78o26J002k78M38q08N63J69p27J24Qr0N17l27k85M65
1774A08n75j76J003q45L94p7m32J042p87l77O84l24R2n7j28K03J21o06J25K30
1794c82K61K03p02J025n30r0M01n95P73m32l00Q61m94k94P71p11N1M74n77N40
1814B53K3j08K73n0j40M16n98L9P35n99j9J98n67M10j47l28O90k81p1J26Kk1k09
1837B7lJ30n4O9l02K69K29q96K48Q3l47M20K03o86R42p48k63R82p37j49O94m43
1859c32M00k42p64Q80M1p33L74M04j29L47m82nM08k63k41P45l22k7J58l18j39
1880b40M72l64K69O63q29K94K82k76M5J05o94Q51r4q41Q17O7l71J40l60L08K79
$$ plain form
1733 107 296 -337 576 204 75 681 -206 157 507 -83 574 479 -179 537 697 -315 566 153 184 918
1753 918 219 173 687 796 341 -37 -663 339 61 499 -309 254 423 -304 -180 -172 -262 255 -72 -357 108
1774 108 -467 -643 360 -485 -91 -168 -600 442 -345 -722 -38 -362 -270 -327 -455 -252 -131 -737 -612 -382
1794 -382 -121 82 -620 405 -125 -215 186 -409 364 -68 -368 493 -1 -295 476 -235 -184 290 -287 253
1814 253 276 168 441 391 251 667 69 108 843 244 225 423 -144 266 119 -209 481 200 129 255 257 236 27
1837 27 24 154 100 169 -133 136 365 -531 -283 -200 -547 -127 76 -610 332 -416 -679 303 -434 -583 111 -332
1859 -332 68 -174 -938 -58 -17 -750 -376 28 -101 246 -236 -241 167 -96 -337 408 86 59 217 -101 -240
1880 -240 232 -132 137 800 -29 265 547 271 316 421 -273 578 484 -357 460 527 156 296 -64 244 523
1901E23l40J55L40m53J5k20j27K21l91M34J79K8l44k07K57j44l52M14L0j1j01
1922i4l19K28L56p55M12kl39Q1K53k03M24m72p5N58m13L74j15l74M60k04m89O47
1944f1R8l58M29j65k2K49o43M34N10o55K23N2k19L01j0k24L00J03l22O83l1n95
1966G7M26l16p9L10m11J77J23j50m4J35o1J44k02j27J7K91n4J13j45k70K14k47
1988g9K56k33K87m29J76j69N4k85J79K68j32j96L69l14J09k64J00J27l05K46L24
2009H9k42k25Rj9J65j94K24K58j26R2j24q2J05n9LK67q7j87J45j59L2K55L8Q7
2033B65J20m92j4N69j71j76J2j94P01l47n34J057m22k24n6k15L23J34k08N5R2
2054B75l89L80mj59M02n24K16L31m68j16p9k4O5j43K83N7j41l0o7Q3J15n87M58
$$ plain form
1901 523 183 338 678 225 240 20 -107 114 -277 157 336 364 20 -187 70 -74 -426 -12 18 7 -94
1922 -94 -413 -185 171 -584 -172 -174 -513 -432 -179 -382 42 -430 -505 53 -360 14 -101 -475 -15 -219 -708 -61
1944 -61 37 -321 108 -57 -79 170 -473 -39 471 -184 39 91 -128 173 163 -61 239 342 20 703 672 77
1966 77 503 187 108 418 7 184 307 157 113 248 187 331 129 2 19 310 256 369 224 -46 168 -79
1988 -79 177 -56 231 -198 -22 -191 -137 -422 -243 25 -107 -303 66 -248 -139 -403 -303 -176 -481 -235 89
2009 89 -153 -378 -369 -388 -223 -417 -193 65 -61 31 -93 -175 -70 -129 -126 141 54 -133 12 -147 -115 140 178 265
2033 265 385 -107 -121 448 277 101 113 -81 620 273 -261 796 374 150 94 -121 202 336 128 183 275
2054 275 -114 266 262 103 505 -19 197 528 60 -56 -135 -159 -94 -237 46 103 -38 -68 -135 -52 63 -524 -66
2077f6j5j43j27l05N04J61o07K62P5m8M41o65L0O98m90n5L23j37L29j91p4K51
2099A51m44J37J37j7J79k07N0K92k74j36M39k77J86J3j38L70m20N3J52o2j1l8
2121A35R2N7R5m58L48q0j13J62k20L40j75k22L68j49j6k39j68J26L44m43K94L1
2143A09n1K0m29K8N48l93J33m9j18k49j78L95K16m31J58J51J06k10j4o1kk68K70
2166c19M17m62K83l85N39R3o87N89k1j25M29p55N43K06l26L67k47o4K70l75m8
2187g8M63n01J38M00m59m1M79n43L55j92n5L36j57L74k07p6L81j78m58R0Q5j85
2209b9J25l52N98o1m42M1p9K20j62k74O85j19m8R9k30p8J62l29K18K16q05J19
2231e25L39k37K03m02N39J4l86M42Q8l18N39o77K84M69p87M3O29m93K08j08j01
$$ plain form
2077 -66 -81 -224 -351 -656 -152 9 -598 -336 -261 -309 132 -533 -503 195 -295 -350 -27 -164 165 -26 -100 151
2099 151 -293 -156 -19 -36 143 -64 -14 278 4 -132 307 30 216 229 91 461 41 94 246 184 173 135
2121 135 227 284 379 -79 269 189 76 238 18 358 183 -39 329 180 164 -75 -243 -117 227 -216 78 109
2143 109 58 78 -351 -323 225 -168 -35 -84 -202 -451 -629 -234 -18 -449 -291 -140 -34 -244 -258 -319 -321 -589 -319
2166 -319 98 -364 -81 -466 73 166 -521 68 47 -78 351 -404 139 345 19 386 139 75 345 -30 -78
2187 -78 385 -116 22 422 -37 -78 401 -142 213 21 -34 302 145 519 312 236 617 439 -19 71 156 -29
2209 -29 96 -256 342 281 -161 -120 -199 21 -141 -415 270 151 103 202 -28 -106 56 -273 -55 161 -644 -525
2231 -525 -186 -423 -220 -622 -83 -69 -455 -13 75 -243 296 -381 -97 372 -415 -372 257 -236 -28 -136 -237
2252b37M95l83K09L31k74K09k87J77J85m21L2L05l0j82j28J81K74o03K80J3n2
2273I4M31k84l24N65l61Q8K57l24J46j45l54Q92n73j91K70j63j48J92m96L66k44
2294c06Q2L49m39J85J90j84L90k03m13L48n52J94J02j46N3P8k79N80k27n2M21
2315A71n70L06M82o55L67j08j78M20n70O06m07l08L81O4k46M57k36L26l4k97N4
2336B5L39j13L55p97N41K66m77l1K5j49J34o3j06M03l00J27K18n0l2q1j71K48
2358C11l47j73J27M11r9n39l0J79j31K48j73k7K15l07R5L87m36K87K44o04N42
2379A80m78l06P25m13k23M29k46j9KpO2K48r5J29j15j61L01l9J52j67m4k9j27
2402b41J18J06m00K89K35j08J66k19K73J31l31J45m1l42L75k04J01L75n31J10
$$ plain form
2252 -237 258 -125 84 415 141 350 63 240 425 4 36 341 311 129 1 182 456 -147 133 146 94
2273 94 525 241 -83 482 121 209 466 142 288 143 -211 681 108 -83 187 24 -124 68 -428 -62 -306
2294 -306 -224 125 -314 -129 61 -123 267 64 -349 -1 -553 -359 -257 -403 -350 -272 -551 29 -198 -250 171
2315 171 -399 -93 389 -266 101 -7 -185 235 -335 271 -136 -444 -63 1 -245 212 -24 302 268 -29 25
2336 25 364 251 606 -191 350 616 139 108 133 -16 118 55 -51 352 52 179 397 347 315 234 63 311
2358 311 -36 -209 -82 329 230 -309 -339 -160 -291 -43 -216 -243 -28 -335 -240 147 -289 -2 242 -362 180
2379 180 -298 -604 121 -292 -515 -86 -332 -351 -349 -356 -294 -46 -141 -12 -127 -288 13 -26 126 -41 -85 -114 -241
2402 -241 -123 -17 -417 -128 107 -1 165 -54 219 350 19 164 123 -219 156 -48 53 428 -103 7
2422GM05m56K34j81J01M52m97K1K93j92n03O67l14L3j40P8K83n64O6L47j42q1
2444h3o6k6K69l24n5L28j52J95k16l72O84k71l8K2l1j46l1M1L43k19m5L28m66
2467c31M73j67j68M27l57J17Nj64M28m31M8M08j41p9Q1j8J67q4l46L67j54Q9j58
2490A2J49O1L6k37k4K95k44J03K5K26j88K15m05M72k39j12Q0j62J44j60J18p1
2512I4l9q9k03J25J10jk50Q4P0j44L4J70M6l56J71m9J17j01J6j09J08j40LK05
2536a28J01K6k66N19k72j55K44k05K62k6k00p2J04K7r2K84o7o3lJ6J68m9o1J60
2560B52L7J57n35J67L7Qn2l3J68k97M19j98J23L55o55L08l8J28k51Q6j5J06l97
2583a20L00k16r6kK65q3k60M82j86m0j59j00L49Prk62J93j48J12k00N4l34M32
$$ plain form
2422 7 412 -44 190 9 110 562 65 86 379 187 -316 351 37 70 -70 8 291 -273 -207 140 -2 -83
2444 -83 -149 -175 94 -230 -285 43 -109 86 -130 -502 182 -89 -127 -105 -136 -282 -313 -272 71 -148 -193 135 -331
2467 -331 142 -25 -193 234 -123 -6 -1 -165 263 -168 -120 288 147 68 149 131 298 214 -132 235 81 170 12
2490 12 161 222 258 21 -3 292 48 151 176 402 214 429 24 496 257 145 225 63 207 47 165 94
2512 94 55 -34 -237 -112 -2 -3 -253 -169 -99 -243 -209 -39 7 -349 -178 -227 -110 -211 -195 -304 -196 -336 -333 -128
2536 -128 -27 -1 -267 252 -20 -175 69 -136 126 100 -100 -172 -68 -41 -133 151 84 21 18 34 202 153 92 252
2560 252 289 446 -89 78 115 123 71 38 206 -91 328 130 253 608 -47 261 223 351 100 186 171 277 -120
2583 -120 180 -36 -132 -134 131 48 -212 270 84 44 -115 -215 134 141 132 -130 63 -85 27 -173 -119 -453 -21
2606b1k44m6J52j57KJ36m4L3K33k47J69J54J31j54k99J26l31L28j69K56r8l81
2628d71L84m9M5J57K1LK30l57N37o2k37j66K44p2k85j56K72l3P3J5l01M40k07
2651B5J78N8q2k4R0k37j86K02k42K65r4j60J5P3r3J87j59K05j37R8J57p8N4j08
2675Gk72N64l83n9j0Mj09K90l55J26O5p5K08m10K36K8j29J97K38J69l45o0j47
2698b22J66O5j56Q1P5j36m6M0K01J09l27O51j77l71K91j13O0Jk39J38j18J16q3
2721Fm3Q3K93m18M36j58k52K56j96L46J05n73K16P1k5k04j92L64k16n4L03l63
2743b15j27K52N9L6J63m22J02J24lm2O2L2j10k57J81j70L03j72m28M94M0j33M55
2766B24l61L4L5k99M78p8l89L49J39m38N29m47l8L26J4j96N62l49o7J35m24P69
$$ plain form
2606 -21 -265 -311 -159 -316 -314 -178 -222 -189 44 -203 -34 120 251 97 -202 -76 -407 -79 -248 8 -90 -471
2628 -471 -87 -136 -91 66 87 90 320 -37 500 438 201 35 279 207 -78 -234 38 5 78 93 -208 232 25
2651 25 203 261 179 155 245 8 -178 24 -218 47 -47 -207 -192 -119 -212 -25 -184 21 -116 -18 139 61 115 7
2675 7 -265 299 -84 -143 -153 -149 -258 32 -323 -197 -132 -207 1 -409 -173 -145 -274 -77 161 330 -15 -75 -222
2698 -222 -56 9 -147 -66 9 -127 -173 -133 68 177 -150 501 324 -47 244 131 191 192 -47 91 -27 89 6
2721 6 -37 46 339 -79 357 199 -53 203 7 353 458 -115 101 172 147 -57 -249 115 -101 -155 148 -215
2743 -215 -342 -90 -31 5 168 -254 -152 -28 -31 -73 -11 21 -89 -346 -165 -335 -32 -204 -632 -138 -98 -231 224
2766 224 -137 -103 -68 -367 111 33 -356 -7 132 -306 223 -224 -262 64 78 -118 444 95 28 163 -261 508
2788E08k02o1J70q8j06L0m89L61O1j89M57j33k33R3j6L8k00q9K55q1L41l04k30
2811a07M63k53k21J42q7Q3J09k06J17J22m02J07J7j46K85l02K55N9l74K60Q1k75
2833b73J85km4r8r7K92J21l71L52l35O1L18Km04O53o02K54J02j91J6j72J86J97
2856A50j56J53k87K94K59n28M58o6l94K55k55K54M92p25K43J39m06K24Nj98N16
2877D27l01k41N14k19k28O6p6L23m35L9M13l84J61j72q6R0p5K5K24J02j84j8j99
2900b34n3M27m95M73j61l69K28j57K40K20m48K58m0r2J9K32J2n2k02J53l8M20
2922C41k92k91L29j11j89L10j92r2J10Q8M25j13l93M05r2K1J29k60K36j0m34K52
2944A77m9m50L40j6K31R4o29N09J82L2j03k61O7J14m83L26J69n35K38M7l20M66
$$ plain form
2788 508 306 245 415 327 221 251 -238 123 184 -5 452 319 86 179 163 201 1 -88 167 86 427 123 -107
2811 -107 356 103 -118 24 -63 20 129 -77 40 162 -240 -133 -116 -262 23 -279 -24 35 -339 -79 2 -273
2833 -273 -88 -90 -134 -232 -329 -37 84 -287 65 -270 -209 109 111 -293 360 -242 12 114 -77 -61 -233 -47 150
2856 150 -6 147 -140 154 413 -115 343 277 -117 138 -117 137 629 -96 147 286 -120 104 109 -89 427
2877 427 126 -115 399 180 -48 18 -58 265 -170 -131 282 -102 59 -113 -199 -109 -184 -159 65 167 -17 -35 -234
2900 -234 -287 140 -355 118 -43 -412 -184 -341 -101 119 -329 -71 -111 -203 -184 48 60 8 -194 -41 -79 341
2922 341 49 -242 87 -24 -213 97 -95 -187 -77 11 436 323 -70 335 243 264 393 133 369 359 -75 177
2944 177 128 -322 18 2 233 327 -302 207 389 421 318 57 124 238 -245 81 250 -285 -47 0 -320 146
2966A46j4p4j76j35K03K17k25J83j9j74K06j44o2j78k13N07l14k28L90rl33N01
2988E5l89O95j69k58J78k12j87J5J86m23J036o56r0N08J57l34m84P3N29L8j53
3009A15L96O3j82L17j63k73n95N67j04j45Mj24M20M3k78Q6J77Mk91J01L7J14j70
3032A19q5j01L58l72k37K55l4r8K07M8k21P8O2j34J83k2k72L63r3j26J42l45K12
3055a13Ml60K55J50o2l5n0j19J81n5q4R5K03K92l21J29J25k63p5k0J32L8j80J35
3079Bp9r5O3K72l3k55J1M58j95L9k40j9K63j25l10L41J36k75QK45j57K15l57L07
3103B20J56l06J82K30j53j23k47n8K28k17k12Q1Q0K23l89K06P1J03j61J77o4k90
3125b63J84P0j77j00j13K14J46n5l02J66K14k18K4J46j48Q9J57k98J00K46j5Q
$$ plain form
2966 146 132 58 -118 -253 -50 167 -58 125 106 -68 138 -6 -68 -246 -459 48 -266 -494 -104 -113 -446 55
2988 55 -334 361 192 -66 112 -100 -287 -272 -86 -509 527 -129 -219 289 446 112 -372 -299 230 268 115
3009 115 511 574 392 709 546 273 -322 245 141 -4 0 -124 296 339 61 147 324 328 37 138 175 289 119
3032 119 34 -67 291 -81 -318 -63 -97 -195 12 60 -161 -83 -21 -155 28 6 -266 97 4 -122 20 -325 -113
3055 -113 -109 -469 -214 -64 -126 -161 -211 -330 -149 -204 -288 -193 10 302 -19 110 235 -28 -103 -123 9 47 -133 2
3079 2 -77 -172 -109 163 130 -125 -114 344 149 188 -52 -71 192 67 -243 98 234 -41 -33 212 55 270 -87 220
3103 220 376 70 252 482 329 206 -41 -99 129 -88 -300 -219 -139 84 -305 -99 -28 75 -86 91 27 -263
3125 -263 -79 -9 -186 -286 -399 -185 -39 -94 -396 -230 -16 -234 -210 -64 -212 -123 34 -264 -164 82 67 75
3147G5k07q5J83k65M27k78J49k87M33l9j64J00Q4J39j66j63j4K05P1J40m01N06
3169D43j70l21J23J87j53N8l07M3M6K75M3k77K06j85J0N1J40k91O7r9K24j88j5
3192i0r1M39k97j10K54j70Pk23L22j2j4k03J4J5O2k06L48j7m93L57L29l19j30
3215b28M8O8J18j46k1J31l09M82k72K30K26m29J08p6L68k08J76j46K96l28J0K34
3237C32k99l9j9J13j15loL10n3q4j7j76K97R9l20J37Q1k97L47n21K36om39L43
3261i9J34j14J04k27L5Q9j87N45j11n58M44n8lJj65r7L37j41j38J77l98L94p3
3284a09n1P8P4qp2r9OK09k86M32l03Q9j92K89k36m6J99J93k96KJ21k6J31k70J83
3309A2K23O6j37k24J25K00l41j34K33J95k5k14K65j37l0j09K46r2J1k23OM35l61
$$ plain form
3147 75 -132 -217 -34 -299 128 -150 -1 -288 145 106 -58 42 126 265 99 -64 -78 127 198 338 -63 443
3169 443 273 -48 75 262 109 167 -140 -97 -51 224 267 -10 196 11 21 72 212 -79 -12 -111 113 -75 -90
3192 -90 -181 258 -39 -149 105 -65 -58 -281 41 29 15 -188 -174 -159 -97 -303 45 28 -465 -108 221 -98 -228
3215 -228 -180 -112 6 -140 -161 -30 -339 143 -129 101 327 -102 6 -70 298 90 266 120 416 88 98 332
3237 332 33 -6 -25 88 -27 -30 -36 274 221 137 120 -56 241 340 20 157 238 -59 288 -233 3 -3 -442 -99
3261 -99 35 -79 25 -202 -167 -78 -265 280 169 -389 55 -3 -6 -5 -170 -267 70 -71 -209 -32 -430 -36 -109
3284 -109 -160 -82 -8 -16 -88 -187 -181 28 -258 174 -129 -40 -232 57 -179 -225 -26 167 -129 -127 -6 -32 99 -171 12
3309 12 235 301 164 -60 65 265 -76 -210 23 218 193 -21 244 107 77 -32 214 122 133 -90 -84 351 -10
3332a0L5J77q5l06K99m36J45L97l57k7K22l51L28k62O3J67j66J18J47k84R2l13
3354d07K15K49k92P9q7j23J80l0n1J41j24J35K28k13K33l7j12Q3R5m38L45%K8
3377I7j96K03J17o4j89L52l81LK33k88N36j37j07J0j3o0J57l90N8J62rO1q1K59
3401C33j71p2J97j37m5j53J5J82j04K9K9n5k26J87j30j54K56k41K54K11l01J71
3423G5j78j30M85m59K52k14j12M01j23o1o7J96j21K27l83o9j3K01r0J88k5j70
3445a90j22K14J29j79K82j65j92M66k57n9K48l42L28R7k23N0k4o9j57J57O9R6
3467A57J48n35j6J75L70l97K6J51k97O37k04r4O7l12K95k97J9J36j84J57j00q
3489a06L32Nl18J0N0j7R4j52p7Q6r1K27j26k62K30K65k69L5Q0k01J11k02J95j93
$$ plain form
3332 -10 25 202 117 -189 110 -326 -181 216 -141 -168 54 -297 31 -231 -168 -1 -167 -49 98 -186 -94 -407
3354 -407 -192 57 -235 -156 -243 -366 -186 -216 -267 -126 -250 -115 113 -100 133 96 -16 67 162 -276 69 69 97
3377 97 -99 104 221 157 -32 320 -61 -58 175 -113 423 286 179 189 176 116 273 -117 -59 103 94 155 74 333
3401 333 162 90 287 150 105 -48 -33 149 45 74 103 48 -178 9 -121 -275 -19 -260 -6 205 -96 75
3423 75 -103 -233 252 -207 45 -169 -281 120 -3 -64 -131 65 -56 171 -212 -281 -294 -93 -183 5 -20 -190
3445 -190 -312 -98 31 -148 134 -31 -223 243 -14 -73 175 -167 161 258 35 85 61 -8 -165 -8 61 157
3467 157 305 -230 -246 -71 299 -98 -72 79 -218 419 215 121 188 -124 171 -126 -107 29 -155 2 -98 -106
3489 -106 226 231 -87 -77 -27 -44 50 -102 -179 -93 -184 43 -83 -345 -115 150 -119 -84 -4 -205 -94 -296 -101 -294
3513b94L61k65k2K58j93rJ85j41NJ03j62J26M5O8l9j3k97K95j23M9P0J17j10j32
3537a18M9N1j6J38n8m9L69k45k35K54k46m9J70L37m79J60m9J09J10m57M61k80
3559g3L0J15k16J45j72K48L8l18K95j22k3n3j07K4K85k51K2J19j65KK24k94Q7
3582a60J9o2Q7j92K35j20K5J84q7j73n9N02k0l04j46M48jk05N2p4R0m6k2K51n9
3607A63j75R5kM4j84J50q4K40l32J86J32k00k7QK96k8k45K42k64J04j48K14j28
3630E7L12k85p6J09lK30k28m41M92j22k03mj7N2J68N8n7K0k44J32P8j86p9J99
3654c8%%J8r1O4K24k13k55K53l29L61M2L5p1l9k5M0j53K50k54r0L76k43J55n4
3679c7j05K66k47M37j77j24J78J6P9n15M23j8j22O0k77K30m9M3N5K5J12j52O2
$$ plain form
3513 -294 67 -198 -220 38 -155 -164 21 -120 -115 -12 -174 -48 -3 65 26 13 -284 11 -112 -63 7 124 14 -118
3537 -118 -69 -18 -34 104 46 -3 366 121 -114 140 -106 -155 15 352 -127 33 -16 93 203 -254 207 -73
3559 -73 -43 72 -144 1 -171 77 115 -203 92 -30 -53 -106 -213 -189 96 -155 -133 -14 -179 -177 47 -247 -160
3582 -160 -141 -203 -116 -308 -73 -193 -168 16 -71 -244 -303 199 179 -125 -271 177 176 -29 23 -51 39 -7 -29 222 163
3607 163 -12 83 81 125 -59 91 7 247 -85 101 233 33 6 14 310 282 37 279 15 119 -29 185 57
3630 57 369 84 8 117 114 344 116 -325 167 45 -158 -162 -179 -127 41 99 42 62 -182 -50 28 -158 -237 -38
3654 -38 -38 -38 -20 -111 -47 177 -36 -291 -38 -367 -6 36 71 0 -39 -64 -24 -177 73 -181 -271 105 -138 17 -37
3679 -37 -142 124 -123 314 137 13 191 207 286 -229 194 176 54 114 -163 67 18 61 116 141 253 101 163
3702A63j16J17m3R4N5j68p0j12K06l20K19j7J32k88J01l8Q0j52L7J8j8j4n5L29
3726A40k17Q5p4j62o8q8rR3K36j08j0j95M8K57k01K72K44l00J25P7j86K38k43
3749d6j75K88k96L35J4l20K06J51n6l1P1j2n3m5O6l9lK85j94j92N2P9qJ57n17
3774b83L68j9j7J04l65J27PK84r2l12L14Ml21M72k74j99J45j32LK46Nk53K55k07
3798a40J79l7k36N21m00n2N6k10L77j60j4L15m66J24N7q2J63k2J83j60j32J8L40
3821B22j67j54J67p6N9k00m6K11K2n0J22N4j44P1l27L82j40Q8J27j64J90lj92
3844E2m1J29M8k64L90k34J74m29N3L27j42J19j17O4p8J5J8n9o6k2J53j2P4k93
3868a41K29q4n5Nm4Q4j19j32J42l2j94L18K4P1j24k59J4K4J08J30l7J06k60K50
$$ plain form
3702 163 47 164 121 215 270 102 32 -80 126 -194 25 8 140 -148 -47 -85 -5 -157 -120 -102 -120 -134 -189 140
3726 140 -77 8 -66 -228 -296 -384 -393 -300 -64 -172 -182 -377 -329 -72 -273 -1 243 -57 68 145 -41 197 -46
3749 -46 -221 67 -229 106 120 -200 6 157 101 70 141 129 76 31 97 58 55 340 146 -46 6 85 77 234 -283
3774 -283 85 66 49 153 -212 -85 -78 206 114 -198 116 120 -201 271 -3 -202 -57 -189 -186 60 65 -188 67 -140
3798 -140 39 2 -234 287 -113 -165 -109 -319 58 -102 -116 199 -267 -143 -86 -168 -5 -27 156 -4 -136 -118 222
3821 222 55 -99 68 -8 51 -149 -195 16 38 -12 110 164 20 91 -236 146 6 94 221 57 247 244 52
3844 52 11 140 188 -76 314 80 254 -175 -122 205 63 182 65 129 51 66 84 25 -41 -63 90 78 152 -141
3868 -141 88 4 -51 -46 -90 -6 -125 -257 -115 -147 -341 -23 1 72 -52 -311 -297 -273 -165 -35 -72 34 -226 24
3892B4j15J76J42l37k72K08L29j48n9J41Q9l06M9J33j44P7n6K25k54J22J32m5
3914A11j38J71q7J36J30k84q3oL10k20j78M00j61O6l3J6j32j50K31j02j07K5%
3937h5L6J54%k96J97Mo8j02J05l4K58j47j36R6o8J05k21O1P0p8j41K42l28J37
3961b39K94o0m4j65J42j0j06j09J66j02N13k90M4K28k64J23p7o9K7k26K10J56
3983A42k42J40J56k94K76N8l70K22j57J58L4Q6o2m8j88J86j77K17k33N6P4N9m4
4006D9q2J99j90J11m42M01k65J58O5k3j13J86j96J36L0o2k4j72p9J73j64K38J40
4029G4k87K1p2M00j65J49m62J27K34N8j31l9L3k8q7K66k73L1R0l7J42j28j04L55
4053A67l87K68n8j5m9m6L52k57L49j80j05j22L98l69J29J80m40N99m47L02k72
$$ plain form
3892 24 -91 85 227 -110 -382 -174 155 7 -52 89 178 -128 -79 54 -90 -13 -69 156 -98 24 156 111
3914 111 -27 144 57 193 323 39 -44 -50 260 40 -138 262 101 167 134 150 18 -132 99 -3 -110 -85 -85
3937 -85 -49 105 105 -191 6 10 -58 -160 -55 -89 169 22 -114 -18 -86 19 -202 -141 -71 -149 -290 -48 -376 -239
3961 -239 55 -5 -49 -214 -72 -82 -188 -297 -131 -233 280 -10 34 262 -2 121 44 -25 2 -224 -14 142
3983 142 -100 40 196 -98 178 236 -134 88 -69 89 123 209 147 99 -89 97 -80 137 -96 -40 34 93 49
4006 49 -33 166 -24 87 -355 46 -219 -61 4 -19 -132 54 -142 -6 24 -38 -62 -234 -313 -140 -304 -66 74
4029 74 -213 -192 -264 136 -29 120 -342 -215 19 77 -54 -93 -60 -88 -175 91 -182 -151 -61 -98 44 -84 -188 167
4053 167 -220 48 -10 -25 -74 -120 232 -25 324 144 39 -83 315 -54 75 255 -185 414 -33 269 -3
4074cJ91l08M22m1m45M75k70j9J08K1J21m31P8J54j8K6p7q3M8K87l05l0Q5Q4J68
4099B38l52L9L6j67KN2o8oK09l13K37L7p0J04l09N14m19k8K50l00L03j41J18O6
4123C2oL2Q9mk04k5J49r8N3j62L59o19M96K2j33K64pl94L54n9n4n0j21M60k80
4148I4L1k64J23k6j9j33K10Q6M3J8r6j50M3M56j84m55K9L46k21N5L6k3m7J01j60
4173a07k7K93m5r3j36N8l39K06J16J12r8J49L3k73l6R5L00k14j34J83l4j77K07
4196C9q4j00K12M6p2Q1J16j37J2m89M61O1R0k97M98m04K36l20J48q4O6l2J95l10
4220f8R6K21k75J12L4k53K59j18J57j33o0O5j00n5J29o0M7Qp0K53k23P4k51L84
4244A73j69nn5k68M93j05k72L12j38k8P9r4p1J14k9P8j63L10j05K1p6k60L48p7
$$ plain form
4074 -3 188 -120 302 261 -184 291 21 2 110 131 252 -179 -101 53 35 61 -16 -99 -51 236 -69 -99 -14 70 238
4099 238 -114 -75 -39 -206 -204 -152 -220 -226 -17 -330 -93 -56 -126 -22 -331 183 -236 -264 -14 -314 -11 -152 -34 32
4123 32 26 58 147 143 -61 -86 63 -35 18 -144 215 -404 92 114 -19 245 238 -156 198 139 85 35 -86 374 94
4148 94 125 -139 -16 -42 -61 -194 16 102 145 163 67 -83 -40 416 232 -223 -194 152 -69 -14 22 -1 -48 53 -107
4173 -107 -134 159 114 21 -115 -57 -396 -190 -74 38 -60 89 122 -151 -187 -92 208 -6 -140 43 9 -168 39
4196 39 -45 -145 67 113 41 122 238 101 113 -376 85 146 236 -61 437 33 269 -51 97 13 79 47 242 -68
4220 -68 28 249 -26 86 120 -133 126 8 165 32 -28 37 -63 -118 11 -49 -2 6 -64 189 -34 40 -211 173
4244 173 4 -1 -56 -324 169 64 -208 104 -34 -62 17 -77 -148 -34 -63 15 -148 162 57 78 2 -258 90 13
4268A3j58K4j25J08J18L3J65n1l10J25K02n4K24k06j22J59O9k38jJ88j21n3K37
4291B26l27J27m1K66l99K65J06k15P2j89J95j71J40k4l81K52K73l16K76n5k28
4312a48J27L06m22P6K52k57J53k44M3J22l8j40J44J37k56M2K39j12m6j03j51L30
4334E4j09J8j87J88p3r5K49m5k54L1L00k97J99j2J8J38k49K63M7M8l55K38k18
4357a03O5J18j66J44J33j73r2o1J49K29k34J10k22O4L55k83q8K29PR2k61j64L26
4380A74J48m91L80j00k66L02k36om1J23J00j60J08J40l53J64j6L4J49k88q8K20
4402ck01J08k17KL47J1k31J01L15l30J7k7R8q2m9J11j9J12j95J38qJ28M2j80j3
4427b5N4J03j27J7R8j34j13N9l2J96k70J88L5k26L79l3j38j4M2k51K45o0j00L13
$$ plain form
4268 13 -145 -121 -246 -138 -20 13 178 127 -183 -58 144 90 314 108 -14 145 214 -24 -25 163 42 -11 226
4291 226 -101 26 -15 251 -148 117 223 8 80 -109 86 -85 55 31 -350 -98 175 -141 135 80 -148
4312 -148 -21 285 -137 -61 191 -66 87 -157 -114 8 -30 -170 -26 111 -145 -103 136 24 -22 -125 -276 54
4334 54 -55 -37 -224 -36 -109 -204 45 0 -254 -223 77 -220 -21 -33 -15 123 -126 137 184 232 -123 115 -103
4357 -103 -38 80 -86 58 191 18 -74 -135 14 243 9 119 -103 -39 316 33 -55 174 181 273 12 -152 174
4380 174 322 -169 211 111 -155 147 -89 -95 -136 -13 87 -73 35 175 -178 -14 -30 4 153 -135 -223 -3
4402 -3 -204 -96 -313 -311 36 47 -184 -83 232 -98 -81 -108 -10 -92 -141 -30 -49 63 -132 6 -2 126 168 -12 -25
4427 -25 29 132 5 22 120 -14 -127 -68 -100 96 -174 14 49 -177 202 169 31 17 59 -192 53 -7 -107 206
4451B06l32J83J4J44j86j62J06L42l10M3R3j19J66n60K23J36J36k25J21j24K41
4472A36k13q0K43l73L31jj04k9j4l75O58l47j39R5K48Q7L9k51rJ49O4o4l34K29
4496e4J42l08L71k13J54j26R0k9j12K22j38k44L53m0R6k32q1o4J46L16l44J88
4518I3k50r2L19o8K30r5j74o2R8J9J26k31L24K63q4n54O28j061N68m41Q89n99
4540a54N36o43o7R58p99J03k23O04n81M00J1l18J92k1j12J01o4O2j22k5K48j15
4562b9j47J06p9M96l52k06K45K0r2m2Q6J89k94J98p7q3J52q4jJ8J82l1j69O2l29
4587b61M37kk45L43k17j06L06l12K67k32k9K12p9L00l89Q1j7j6k16K78M1m43L27
4610B8j41R5o1P3k11L47P4l23P9J90o8j2l36m5P8R8Q5r1J02r1j55J55q9L12j74
$$ plain form
4451 206 -126 57 71 215 29 -133 -27 315 5 48 141 22 188 -372 -149 -13 123 -102 19 -105 136
4472 136 -77 -157 86 -287 44 43 -61 -90 -104 -479 179 -168 -307 -212 36 123 162 -89 -98 51 115 51 -283 -54
4496 -54 88 -220 151 -62 92 -34 56 27 -85 137 -1 -245 108 68 164 -68 -149 -213 -67 249 -95 93
4518 93 -157 -249 70 2 232 137 -37 -99 -1 18 144 -87 237 500 416 -138 490 -571 -3 -444 445 -154
4540 -154 382 -261 -328 630 -169 -66 -289 315 -266 134 145 -173 19 -2 -114 -13 -77 -15 -137 -162 86 -29
4562 -29 -176 -70 -149 347 -5 -211 34 54 -38 -80 6 195 -99 99 22 -61 91 7 6 24 206 175 6 68 -261
4587 -261 176 174 -71 272 55 -51 255 -57 210 -22 -51 161 82 382 -7 74 57 41 -175 103 144 -299 28
4610 28 -113 -18 -79 -6 -217 130 204 -119 -40 150 82 70 -266 -311 -233 -135 -50 -141 -39 -130 -285 -130 -219 93 -81
4635h1K96l86L0K01K15m03R6J46k47J50k4R1l00J37m1K15r6K44k16J09l1r4O9
4658H0n3j34K84K37m19o2j24L47j82K6L78k27o9o0M3Q5q6p3m7J76k14M8K14L0
4682A98j01Q2L6k59K7p7J01J17j57q6L3P6L6j15Q8M9r7j80Q7J97Jj93K10P3j21
4707B5j80K05n1k19J78l9K21j49j18K94j32k46Q8p7L53j56n0J84k4l27L22j65
4729f3k8K59k20R6j94M01r8j04J28O5l17K35k33J80Q1k08K51j02k98K21R0m6j51
4752e5R1j82L26j79N7R3k22j70K59P3J49n5k25n0J79k56K11J08l46L38O2q4J03
4775B25k32j10l3m1J75k1P2m6J13kj97ll5p6L12l15M6L86k16j28RM8j74L2L43
4800A32j47J03oO2n1j10P5o7O1lJ02j1K97o17J91K05q8j30L00j61j70J86N5Ol4
$$ plain form
4635 -81 215 -171 -141 60 275 -128 -32 114 -133 17 -7 84 -216 -79 -120 95 -1 243 27 136 105 11 80
4658 80 27 -107 177 414 -5 -67 -191 156 -26 0 378 151 82 22 65 150 64 -9 -56 120 -94 -46 168 198
4682 198 97 179 215 -44 -17 -94 7 124 -33 -119 -86 -10 26 -89 -1 48 -49 -229 -142 55 56 -137 73 146 25
4707 25 -155 50 -1 -220 -42 -81 140 -9 -127 167 35 -211 -123 -200 153 -3 -53 131 107 -220 102 -63
4729 -63 -91 168 -52 44 -150 251 153 49 177 242 -75 160 -73 107 188 -20 231 129 -169 52 142 96 -55
4752 -55 36 -146 180 1 58 151 -71 -241 18 91 240 185 -40 -90 89 -167 44 152 -194 144 206 122 225
4775 225 -7 -117 -150 -191 -16 -37 35 -11 102 100 -97 -100 -135 -211 101 -214 -168 218 2 -126 -117 -69 -243 -211 132
4800 132 -15 88 82 144 93 -17 58 -9 52 49 151 140 437 -180 11 216 128 -2 298 137 -33 153 208 214 180
4825A80p8R6R7k13ok04L75p4j6l39K11R5qq5k93J72o4K52p2j24J60L3j81P0M0
4850B4l10J61J97O2k71J17J60j40j24Q7n2l11K65j13K84k3o6p4pJ05O6j78K06
4873F5p9r7K34K5r9j86QP3p7R6J56k60J15J5K81k41k41J41K02q2m9j70K66j21
4897b5R5J32O2M3j84k98K31O1J13k2j81j17J37k8J12J34m52J57K14p6j21j2K63
4920B38J35l26q5R1l80K72j48K3P9J1m3Q9j10r7K23m1M6K16n41L27j43N4J92p1
4944A1J69j97k00J80J11r8K08k97Q9N7j58K39O5l37J26O0j73L54j22J20j04q8
4966A5N7Q6j47Q4j82L37j83N8n8k9om2j4Q6K48m41L82l0n53M85K74n31M74n13
4990a43L3J25m33L70j4k7K19q5M7j60jK31j87j11J38Mq7O6j65J0l34K97r3J56
$$ plain form
4825 180 102 198 295 82 76 -128 247 173 157 -182 29 124 116 31 -262 -90 -154 98 26 -98 62 95 -86 -16 24
4850 24 -286 -125 72 134 -137 -20 140 0 -124 -37 -89 -400 -135 -248 36 13 -53 -127 -134 -29 37 -141 65
4873 65 -14 -111 123 148 49 -137 -129 -56 -133 -37 119 -141 -26 -11 270 29 -212 -71 131 49 0 -170 96 -25
4897 -25 70 202 264 307 123 -175 56 117 230 208 27 -90 47 19 131 265 -187 -30 184 108 -13 -25 238
4920 238 373 47 -38 53 -327 -55 -203 -180 -101 -90 -133 -44 -154 -251 -28 -69 -23 193 -348 -21 -164 -110 82 11
4944 11 180 -17 -217 -37 74 -24 184 -113 -24 33 -125 114 179 -158 -32 28 -145 209 87 207 103 15
4966 15 72 158 11 95 -87 250 67 125 67 38 32 -10 -24 62 310 -131 251 221 -332 153 427 -104 370 -143
4990 -143 -110 15 -418 -48 -62 -89 130 45 92 -68 -69 162 -25 -136 2 6 -81 -15 -180 -170 -504 -207 -300 -144
5014a44P3J28l32J40J59J17j42k4M7k11pK05L04l60J87k92L5J86n1o1j28nJ94
5037A8j13J05L73l11j07P9k6O5J29q5j27L16j31J53n13K47J12k81L49j23j21K27
5059B35l00M38l36r1K00k56q4K87j73p6R2j56J71K15j49J21k19J45O3j82j11r2
5081b58K69k04K53j77K70o6j76J18j32P5J12j13J57l13J93k34o1K93N6j57O5K63
5103B33l70N4J67K09j84o6J47j14j07J4J49j16L3j07j64M16j91K15k08J86l15
5124a19k2K21N1l2P9j35j03P5m1L2R3j28K80k32j12Rn3L6J52Pok15K06J08m3j25
5150a7k7j10K69l17j01J55K08l94N89m20p3k0m1J99k6R8P4m89L49K44k43Q8Q6
5173H1j38J92R4k72O5k86N38l04J72O2j46j08N3P4k6O9j67K81j14N0k19L0J08
$$ plain form
5014 -144 -71 57 -275 -135 24 141 -1 -25 22 -189 -196 9 313 -47 140 -152 -117 69 18 -43 -171 -176 18
5037 18 -95 10 383 72 -35 44 18 83 212 127 0 316 185 338 -175 72 184 -97 252 129 8 235
5059 235 -65 373 37 -54 146 -110 -194 93 -80 -156 -64 -220 -49 166 17 138 -81 64 127 -55 -166 -258
5081 -258 11 -193 60 -117 153 87 -89 29 -103 -28 84 -29 128 -185 8 -226 -287 6 62 -95 -30 233
5103 233 -137 -83 84 293 109 43 190 76 -31 -17 132 16 49 -58 -222 194 3 218 10 196 -119
5124 -119 -141 80 131 99 178 43 -60 15 -26 6 99 -29 251 19 -93 -84 -137 -101 51 58 52 -163 43 151 108 -17
5150 -17 -44 -154 115 -202 -303 -148 60 -334 255 -165 -238 -258 -299 -100 -126 -28 46 -443 -94 150 -93 -5 81
5173 81 -57 135 229 -43 22 -264 274 -30 142 204 58 -50 3 77 51 120 -47 234 120 170 -49 -19 89
5196H9P1n5J09r9j27k4j5J13K9r9J75j89J85j51k9q2K32r1J83j49j49K54j78P2
5220G5j8P3j18P3k87L77j79j27R7l4p1J39k71L12k81K83j68p1K74o3J09k24J20
5243B0N6J17k4j49Kj64J86J06k52K30j16r3r3J23J99j99m4J68j01j38K19k47J23
5266g1M30k50K8k16J44J91l54J87k23J18J41k07o8L82j68Pn2k83L40k7P2J87O6
5289C74k35k80K02j12L08q7j63k3J43k04k22K95L0m25J10M31j03j99J07K38k68
5310h3r3J98j66qO7l2q0J35K91l99J32q3l7J23J20l11L07N2q5j47l0J86J24R6
5334B77l05J43J14n7k38j03J55L29k81J51r2j24J76k03j6J8L19k08M4L2k31M10
5356C10k59J46p9O7P2k63K41k10p0J63o4J30l1j81n0P9Q0L6N0l53J69Q3k42n1
$$ plain form
5196 89 160 105 214 115 -12 -36 -51 62 91 -8 167 -22 163 12 -17 -99 133 42 225 76 -73 181 3 75
5220 75 57 130 12 85 -202 175 -4 -131 -34 -68 -139 0 -271 41 -240 43 -125 -196 78 15 124 -100 20
5243 20 76 193 169 20 22 -142 44 150 -102 128 12 -81 -174 -51 148 -51 -95 73 -28 -166 53 -194 -71
5266 -71 359 109 137 -79 65 256 -98 89 -134 -16 125 -82 -150 232 64 71 19 -264 76 49 121 308 374
5289 374 139 -141 61 -51 257 170 7 -16 127 -77 -299 -4 26 -399 -289 142 39 -160 -53 185 -83
5310 -83 -176 22 -144 -152 -85 -117 -197 -62 229 -170 -38 -121 -158 -35 85 -226 81 133 48 -99 -129 57 181 277
5334 277 -28 115 229 172 -66 -169 -14 315 34 185 93 -31 145 -58 -74 -56 263 55 99 131 -100 310
5356 310 51 197 118 185 257 -6 235 25 -45 118 54 184 153 -28 -78 1 81 117 167 -186 -17 66 -176 -227
5380b27K46rl4j13l3M1K82n8oj45j49L16l38K36L9o9p2o7Q7J89p1L4j2k5N5k09
5406a12k6J59P6lj34J5L61m74K78j59j8j5Nk9M0k0P3j14K42Q4Lk05r6K86k87O9
5432aK87l06r1jJ00M8j38K96K4P4j82j04n4kj26K49l2o4p1M9M3R3k32m5K81k2
5458G3l17J74j07L13j27r7Q6rj28J71k36K66j14r5O5J70j63J06K1l40J43K03J49
5481B07l35J28J98k71J83J34j80K29k89pq2J80j71J89k87K37l5j28M5l11M11K14
5503B59l19J69K7Q5j77P3k59J66j32j51J63Q5r1k1rj8L1J09Jj26J77L1P1qj96
5528f0J66j27p1J29l1k3r6N2o7J22QR3q7K8m4l06L73m7J%m0j39L06j70k2K42l56
5555a66J68J13j90o8J22pk28K20J96j6k39o6L31j4L0m9l4Q0j30r2L25n65O27m86
$$ plain form
5380 -227 19 10 -24 -137 -170 -129 153 95 89 -56 -205 111 -227 9 48 -21 -93 -160 -73 116 45 79 67 42 97 -112
5406 -112 -138 21 97 94 -40 -25 336 -138 140 -19 -37 -52 -47 -76 -36 -56 17 -97 145 229 232 27 -69 217 -70 -1
5432 -1 286 -20 -111 -112 -12 36 -102 194 218 292 110 6 -48 -50 -176 73 41 -23 -94 -45 -2 91 -141 -186 95 73
5458 73 -244 -70 -177 136 9 -88 -2 -11 -139 32 -204 62 -52 -147 -82 88 -75 31 52 -288 -145 58 207
5481 207 -128 0 198 -73 110 244 64 293 4 -3 -85 95 -76 113 -174 63 28 -100 -55 -366 45 259
5503 259 -60 109 136 221 44 117 -142 24 -108 -259 -96 -11 -102 -123 -132 -150 -119 -10 -9 -135 42 73 144 136 -60
5528 -60 106 -21 -92 37 6 -17 -113 -61 -128 -6 2 95 8 36 -8 -314 59 12 13 13 -27 -166 140 -30 -52 190 -166
5555 -166 2 115 -75 -143 -21 -28 -256 -36 160 144 -95 -161 170 156 186 137 103 183 53 -39 286 -279 348 -138
5579a38L8J26L15l82J4O6r3K2J24J88m03J37m2r2J46p1J70k87J11n6P0J8J02N3
5603A36k67K91k45o5K00j85J0N7J81k7j03l3J24j53J46j08K26j13r9J5q1J10p0
5626e3r8J57o2K06k65R5J35j12K43l76K58p5M2n6J05k49L01m44J88K43J47k57
5648G3p4j57M8K56r4K46k06k9k36R4K58n8l66k6J56K11j65n8KL3J90o3k15J93
5672A3q9M0J90j64o3K36l84K72j79N3K24l99K67n4J35L0J20l11o6L53l02n2K05
5695G5o2k16J40J40j03P1O8l11K88j33K79l27j63K84k36K41J62k95J90M3jk06
5717g2K11Jm6oo7joj36K09j22P6k2l9K17j20n0K31j41j82L1K02l43P8J26K22k68
5743a7n1J3J06Q7l17K46m1J10k03j78K70k29J69l48N95l31K23m01L08k40K32j16
$$ plain form
5579 -138 -100 26 341 -41 -27 39 -54 -32 92 280 -123 14 -28 -120 26 -45 125 -162 -51 -107 -37 -19 83 136
5603 136 -131 160 -85 -150 50 -135 -125 -68 113 86 -17 -50 74 -79 67 -41 185 72 -27 -12 -93 17 -53
5626 -53 -151 6 -56 150 -115 -20 115 3 246 -130 128 53 95 39 144 -105 196 -248 -60 183 330 73
5648 73 -1 -158 -110 146 52 298 92 63 -173 -79 179 121 -245 -271 -115 96 -69 -127 -125 -92 98 35 -180 13
5672 13 -76 -36 154 -10 -73 163 -221 51 -128 -75 149 -250 17 -37 98 128 248 -63 -129 224 -78 -130 75
5695 75 13 -203 -63 77 -26 45 113 -198 90 -43 236 -91 -254 30 -206 35 197 -98 92 135 134 -72
5717 -72 139 140 94 88 21 20 14 -122 87 -35 41 19 -20 197 77 27 258 117 -65 -34 168 -175 -97 29 251 -17
5743 -17 -68 -55 51 138 -179 67 26 136 -67 -245 25 -204 -35 -383 212 -119 104 -297 11 -229 3 -113
5765a13K17m5k17N3K9j62K71Q6q8K5k74M77j27j61J54j06j99Q4J76j66L01k03
5787A2J86Q6l36J54j8l9j53K39L5j62J16l57K53L4m0Q8j14K09j64K4N5j76K31
5810A63j45J18Rj03J34k10J01J39k64K73j52j2r0P8n9k42J46p9K48J98l75J13
5832a1N9o8P9k67K10L4K7N1k31M9J37k40J91n9j7K15n27L22j25J17K98j30j67
5855e3j3O9J37j69P6J58l25J0K49l12J97J08k47J34p7J03j33L80k96K1Q2j08L5
5878B6q3K11j35P2j81MK57j44lR1ol3M9j28J23k39P0j9J04q4%j05M3j46J95Q8
5904B7q5n8p7J03rj60L10p8j79L19k79k1K94k8j54J32l4K00j79l1J64j83J74o9
5928I9J3k4j15k51K93J21j94O0J55j89J4J43J06N7j76k3J48j41J8K01k57R1QJ4
$$ plain form
5765 -113 104 59 -158 -105 -76 -238 33 119 31 56 -218 259 132 -29 125 19 -180 -96 80 -86 215 12
5787 12 198 284 -52 102 84 45 -108 131 166 4 120 -237 16 50 10 98 -16 193 29 53 108 -68 163
5810 163 18 136 145 42 176 -34 67 206 -58 215 63 51 -39 39 -20 -262 -116 -195 53 251 -124 -11
5832 -11 48 -20 59 -208 2 36 63 114 -117 -68 69 -171 20 -39 -56 159 -368 -46 -171 -54 244 114 -53
5855 -53 -66 3 140 -29 47 205 -120 -110 139 -173 24 132 -115 19 -58 45 -88 292 -4 17 99 -9 26
5878 26 -57 154 19 91 -90 -86 171 27 24 115 109 76 125 -3 120 -119 -49 -68 36 -48 -48 -153 -110 -256 -61 27
5904 27 -58 -116 -193 -90 -99 -259 51 -27 -206 113 -166 -187 107 79 -75 57 23 223 44 13 177 -6 168 99
5928 99 112 88 -27 -278 15 136 -58 2 157 -32 -18 125 231 288 112 89 237 96 114 315 58 149 157 171
5952A71p9J89ql00K90n0kj53P1j06j03J22k03K08o2j02J63j31l4J19q0K26k31
5975h5K5K46m7j36Rq8q1J29J02l15J74o8J61j45J80j79r9K43k27O5j27Q0O6k4
5999a41M9p4J17J72lm5J39l44l2M09j25j18L00k68P2M3jj35r2K24P1k60j66R4
6023a14J70j75L6J59J67m22L32n7k44J99Lr8O0Q8Pq7M9Q4l74R5J79m6k4q9P6J5
6049a1l26K91K89j51M4L6k69J86k23Q8j70M06j05l13o5L41o7p7L17l07r0j19M26
6072A31j61j76QJ18J57k96J18P5M0j84lM63j80j82J13l6J09K43n02J59K31j52
6094I3K3J1J21j47j06Q6k27J76Q7k12j2J11jm3J49O4k30m4J8m1K6J00j67J26J74
6119A35q3J8K5k33RL82k27k81J08K22k3l58L95m8j99L14j75q1j2k52K87L9k6K26
$$ plain form
5952 171 92 281 273 -27 263 213 211 58 129 23 -80 42 -161 47 -15 -117 46 -85 -119 0 -80 146 -85
5975 -85 -60 186 139 3 12 -76 -157 -28 74 -241 -67 -135 26 -119 61 -118 -217 26 -201 -136 -263 -183 -117 -141
5999 -141 -92 -166 -49 123 120 75 214 -130 -162 247 122 4 304 36 108 151 150 15 -77 147 218 -42 -208 -114
6023 -114 56 -119 -83 76 243 -179 153 96 -148 51 54 -44 16 104 111 24 73 157 -217 -122 57 11 -13 -102 -26 -11
6049 -11 -337 -46 243 92 136 172 -97 89 -134 -46 -216 190 85 -228 -293 48 -19 -96 221 -86 -176 -295 131
6072 131 -30 -206 -198 -80 77 -219 -101 -26 14 -170 -173 290 110 -72 41 5 114 357 -145 14 245 93
6094 93 116 127 248 101 -5 81 -146 30 117 -95 -107 4 3 -40 109 173 -57 -101 -83 -124 -98 2 -165 -39 135
6119 135 52 70 95 -138 -129 253 26 -255 -147 75 52 -306 89 41 -158 156 -19 -100 -112 -364 -77 -38 -64 162
6143A62j00k19J86q0J13j3J5r9j19N7M8JK61j07j2K27l48J37k51J62j60J86j8
6166B9J6N7k49K98k04l04L38K15j39q6J6L2J43q1m7M9k22L56Q4j96j16P3O4m4
6190H2j23%k62j03L34O1K2O3r6J57p1m98L48J04k03J81l7K43j70k42P8p3J47R1
6214C3k00K25l92m3L71J6j04P1J54q9p5J37l35L7L09l7j33R1m5j19J48N0k54J17
6238f7n2J1J4j30L13n3J58k29L12m91K16J81m29L52j15K9O5o4m3j49M01k00j84
6261a54J97k90J5K69m29N43j70J21M1j76l8J23n4J10m05K58L1m23O0K12L06l5
6283A12m3n8j52k4Q1oj79O7K58NK0J10q2j01m0O9J28l08J43oJ63k39KJ40j67J15
6309Hj65RM3J05J36N1j92m9L50l29k10K36q2j36J49J5j25K26M3P8k15J63K0k65
$$ plain form
6143 162 62 -157 29 -51 62 49 64 -35 -154 -97 -49 -48 213 106 94 321 -27 110 -141 21 -139 47 29
6166 29 45 102 -147 151 -53 -357 -19 196 57 -29 -13 19 162 81 34 83 -139 217 301 105 -11 62 126 82
6190 82 -41 -41 -303 -406 -72 -11 11 74 -22 135 64 -434 -86 18 -185 -4 -41 202 32 -210 -132 -205 -58 33
6214 33 -167 58 -334 -377 -6 10 -94 -23 131 42 -33 104 -231 -194 115 78 -55 36 -9 -128 20 70 -184 -67
6238 -67 -119 -108 -94 -224 89 36 194 -35 277 -214 2 183 -246 106 -9 20 85 21 -22 -171 230 30 -154
6261 -154 43 -247 -232 37 -392 151 -19 102 143 -33 -71 52 -2 108 -297 -39 -8 -431 -371 -159 147 112
6283 112 69 11 -141 -165 -84 -90 -269 -202 56 61 81 191 109 8 -32 37 165 -143 0 -6 157 -82 -80 60 -107 8
6309 8 -157 -148 -105 0 136 187 -5 -54 296 -33 -243 -7 -89 -225 -76 -61 -186 40 83 161 -54 109 129 -136
6333a36L37l20L3K1L6j36j52L78j26J53k24K45j53K7R2l3K4j30Q0r9O7m3j34J80
6357a3k37J24lK78k13L27l63j14j5J61k9Q9j41n7K31J03l26P7J04K0q4R3n1M3
6381DJ81j30P3o7j38n0J46J39n24L53J65o2J04k15L3r7J23k10M33j70o5O5j63
6404g2K03m9J56k16J02j95J44J6r2o0K40l31k4J67j24J00j11o8K49o5P1j89J26
6427b2qJ7j87oJ64j00k4J87j48J65L7O3j64Mkl3m9J06N5p4j09R3m2l51N96o7l
6454I8j63K15k89J31L1N6k75K35P7j03J03k51K48r2R0m8Pk8q9j37K18o9R1K4J4
6479I4k69K65k18RK20j08p9L75p8m39K13R8o9J00m0m0k0J70j10j64Q4k33J70J00
6503C1j53J87k34q4R2K02j92J22R0j44M3n8K17j02O2k25qK9o9N3O1J26o0J98j89
$$ plain form
6333 -136 201 -119 -86 -65 -29 -165 -317 61 -65 88 -136 109 -44 -17 75 42 66 -64 16 -83 -16 -59 -193 -13
6357 -13 -250 -126 -129 149 -64 263 -100 -214 -229 -68 -97 -8 -149 -206 25 128 -198 -121 -17 3 -81 12 -39 4
6381 4 185 55 128 61 -77 -127 19 158 -366 -13 152 90 194 -21 12 -85 38 -172 261 91 26 91 -72
6404 -72 131 82 238 22 124 -71 73 89 -3 -63 177 -154 -178 -11 -135 -35 -146 -214 35 -30 41 -148 -22
6427 -22 -30 -13 -200 -206 -42 -142 -166 21 -127 38 75 138 -26 -22 -24 -57 -106 0 55 -19 -128 -35 -77 -428 168 101 98
6454 98 -65 150 -139 -8 23 79 -196 39 116 13 116 -135 113 21 111 63 70 42 -47 -184 34 -35 56 80 94
6479 94 -175 90 -128 -119 101 -7 -86 289 211 -228 -15 83 14 114 74 34 14 184 74 -90 -6 -239 -69 31
6503 31 -122 65 -169 -253 -161 41 -151 -29 61 -83 -40 -98 119 17 79 -146 -154 -125 -194 -141 -80 46 -14 184 -5
6528eq8K21j60K2J68j90j39L76j16j80L00l9o0j93J97J74j84l81N80l60q2J86
6550D7jL30n87K17L5j20J95n34N59j01K4n5o0P8j06J16j54RK53l10M8J73j18P
6574e5K60j59j74P4l4J09k27K06j10n3K15k07K35k50L49j78K0n1N6k58M01p4j3
6597H2k33M0J45k43L59P0k88j95L64j56J25L8k96M34j86k28J87r5L10L9j69J36
6619B40m74K13K31j36Q0l2r0l3k5j1o7J28N1J66p7J5j04j40l1L90l5l73j23L13
6643G6j24l2jn2KL02m23k15N28K0J53k52J19n93M33J00l59k3M16j49q9J84l0p0
6667g9k8P3lj15J42L6N4j28J41L3l7J17r0l4j79J13M5j07L58l11L8k7Lm4J68J18
6693B57m54K36r2K20k18j29K17l4L5N1L7k07M8J25P5L7k42J04j45K3LL5p8oJ16
$$ plain form
6528 -5 -93 128 -32 -10 158 -32 -171 205 89 -91 209 170 110 -83 114 288 104 -277 303 -57 -139 47
6550 47 46 376 -211 6 41 -79 116 -418 141 40 64 9 -51 27 -79 37 -117 -108 145 -165 -117 56 -62 -55
6574 -55 205 46 -128 -54 -88 21 -206 0 -110 -163 52 -155 80 -170 179 1 21 -30 26 -232 169 95 82
6597 82 -151 -111 34 -209 150 220 -68 -263 101 -55 70 108 -188 246 60 -168 19 -76 234 273 104 240
6619 240 -234 -21 210 74 154 122 32 -1 -26 -37 -104 24 75 241 164 179 75 -65 -96 294 259 -114 -237 76
6643 76 -48 -80 -81 -133 -131 171 -252 -467 61 81 234 -18 101 -492 -59 41 -318 -341 75 -74 -163 21 -9 -79
6667 -79 -107 -34 -37 -152 -10 26 80 -48 93 126 89 206 116 82 -97 16 61 -46 312 1 39 12 15 -29 139 257
6693 257 -197 39 -53 167 -51 -180 37 3 38 89 126 -81 -33 92 167 204 -38 66 -79 -56 -53 -18 -96 -102 14
6718A4l19L24J28j89q6K79k15n1Q6K53k89Q5K3j85Op7J79m1K4L0m9n5J42N5k08
6743a36J98N6k17J86l08M26J7l59K40Kn4n9J07j40J8l7J05j11R5j63L08j85R3
6766H2k3n8l0N2n8j41K33j82R4m5J58j76J54j99M97m03J27k1O1k27K48l33K50
6789F0q0J3j7p6M4jq0J15j31N7J83l2k03K40Pj67j84K11q5J03n4j04J69m7j81
6814b40J73J90L8j76n2n7J39LR0Oj63J68j05L19j71o1l15K98Q4l44K51j21K9k03
6838b20J98P9O2k93K74j94R5q3K22l12J28l1K36l39M08o2l20L63j10Q7k49m2K71
6861A68j31n3K19k56M1J40p9Q0r5N6M8j34j47J4P0l6K03j63M9J26k6k10J05q5
6885i6L6k3p4J65J22j89p8K36j88j18J12J98Pl79J27P6J53r1j53L1J87L3k41n7
$$ plain form
6718 14 -305 19 147 -42 -128 151 -64 -115 -29 224 -65 20 43 -142 -136 -213 -34 -75 -51 -21 -70 -125 17 72 -136
6743 -136 62 118 -99 87 -221 205 222 -137 103 105 51 -8 99 -41 -23 -60 45 -66 29 -134 174 -11 82
6766 82 59 1 -29 23 -35 -176 57 -125 -31 -76 82 -94 60 -139 358 -45 82 61 122 -105 143 -190 60
6789 60 -20 -7 -24 -100 -56 -57 -137 -22 -153 -96 87 55 -148 92 99 -68 -252 -41 -126 -23 -77 -181 -12 -59 -240
6814 -240 -67 123 161 -15 -67 -124 15 18 108 114 -49 119 14 333 162 101 -214 84 168 -176 75 -46 -17 -220
6838 -220 -22 57 119 -174 100 -94 1 -82 140 -172 -44 -75 161 -178 230 168 -152 211 101 188 -61 -103 168
6861 168 37 -16 203 -53 -12 128 49 129 34 90 138 4 -143 -129 -59 -95 108 -55 -6 120 94 -116 -11 -96
6885 -96 -60 -83 -157 8 130 -59 -137 99 -89 -207 -95 103 110 -269 -142 -66 87 -4 -157 -126 61 94 -147 -204
6909b04J83J13J6p8j31K22p9K1k12J29N1p6J70k60O7j25L44O6j01J14k00J49P8
6932B57k98M7J02k63L49l43M06m6k11J42k39L09k44o3LJ75j41MJ13k82J77LR6
6955E3K11j59j78N7r0j6P8M7L6mJ64k85J34o1R8j47O9j93K63J5q1k19L62j85p4
6980a05J72j52J89j80L5K27N7l23J68k91M65j59p3M4j8J52k33J37j48K75l17K46
7002A68j47P7m5o1N3r4K35j5n1Q3J97m10k5J04k6l24K84J70j62J7mj98J73o9k2
7027i2L44n05K05J53L4j43j79J72O0l90R9J40J53j85J10m06N52j77p0L84k82m3
7049f6J68j62J70n8l6k01J82m0N5rP9j66J25J22j43L2nj32P9Rj54K37J64j70j31
7074e1K56j16j12Q8j02j15M20m88M64k22L37p0l32O9j02O1n7L5J4J05L2K7l62
$$ plain form
6909 -204 -21 92 108 30 -101 121 42 63 -149 -20 31 -45 125 -135 -68 -193 151 217 116 230 30 179 257
6932 257 -41 6 108 -155 194 -149 257 211 0 142 -97 212 -32 -95 -92 83 -58 -54 59 -223 -46 -43 53
6955 53 264 105 -73 -16 -106 -122 -44 3 39 35 199 -86 48 -13 85 -62 7 -186 77 92 11 -208 154 -31 -105
6980 -105 67 -85 104 -76 -41 186 243 -80 88 -203 262 103 30 74 56 208 -25 112 -36 239 -78 168
7002 168 21 98 53 -8 45 -49 186 171 120 203 400 -10 -35 69 43 -281 3 173 11 28 24 -174 -1 -70 -92
7027 -92 252 -253 -48 105 139 -4 -183 -11 49 -341 -242 -102 51 -134 -24 -430 122 -55 -125 259 -23 -66
7049 -66 102 -60 110 52 16 -185 -3 -43 12 3 82 -84 41 163 20 52 47 -85 -6 3 -151 86 250 80 -51
7074 -51 205 89 -23 65 -37 -152 268 -220 244 22 359 289 -43 26 -76 -15 -72 -37 -23 82 114 141 -221
7097b21K89J14o0j31J68j79R6R0N6Ln63K79O4m6J39j27O7o1q6J10j94L40k28Q5
7121DP1j05r6M08k46p0J70l04K34k92P3P5K25k87L91q4n0k03K30J63k20j08J01
7144H0j62M0J34o8J00p2o8J39k7k1k2j91L45k31P2rk60J94MJ66q5nl66L75k09
7169a47p8J67m8J72k0N0j25m8n6M8k51L08n5J26n1rj55O7k22K05k27J28R4q7J86
7194b8J86q5j01j02K56j8mk42J88k90M18q4k16K23J2l24K45Jk22K54J50r8j01
7217A8j17J05J76l23N5o0K09j13J74r2P1O2j28L5k22M01j93K7L0j50Q7n0j95K89
7241I6l2l14K84j28J32o0J94k30j00M40j81k40L57l51L43o4k72R0J15m2Q9j21
7263Ek36J6K86K02j59j68K49m41P0K00j07k84M79n60Q86o13J96N08k81p05L97
$$ plain form
7097 -221 68 182 122 -9 159 -20 76 166 222 225 -338 -59 5 -41 98 -29 38 -23 -109 1 -193 147 -81 4
7121 4 75 -30 -126 282 36 -34 136 -168 66 -226 -153 -78 147 -140 251 167 117 -86 144 307 87 -21 80
7144 80 -82 -42 92 24 124 52 -16 123 96 75 53 -138 207 -24 48 39 -221 -27 -23 143 58 53 -313 62 -147
7169 -147 -225 -58 -106 66 46 96 -29 -77 -133 -85 -336 -28 -83 43 -8 -17 -172 -105 -327 -122 -349 -221 -127 -214 -28
7194 -28 158 73 -28 -130 126 108 104 -138 50 -240 178 94 -122 101 113 -211 34 35 -187 67 217 119 18
7217 18 -99 6 182 -141 -86 -146 63 -50 124 32 103 165 37 72 -150 251 58 85 115 -35 52 2 -193 96
7241 96 64 -250 34 -94 38 -22 172 -58 -158 282 101 -139 218 -133 210 146 -126 -36 79 37 126 5
7263 5 -231 -215 71 273 114 -54 195 -246 -176 24 -83 -367 112 -448 438 -175 21 529 248 -457 -60
7284f0j53L25p4Mj89K06pj14P0R3qj17J4j08n8K88j62p7L85l55L1K48p4jq7r2
7310g2L5r9jK54K5j41J21k98J41p7J43l3K7n7p6j22K39J43J11k8k35J10k39j39
7334b68J99M1M6o3J72j63m2K53l13K52k95J74L9p0N7L11k71N9k2n2O9k2o8k54
7358b31K47j18q4J30j35P9K57j92J58j84K85r3N6j36j02N6J35n6j64O7q5J08J02
7381A00q2j02J91l40J68N3J80k60r9K32R6k51J24O7p8K00j7l36P9pm7K34j9L9
7405A25j57j97K31j61J60Q7j29J55k57mJ55o5J87j2j77J63j98l4J80J72j65m0
7427A9%k36K52j20P0%J17jl0k29M78k01j17j65J55q6J70j09j94K71j13K14j24
7450B1p2J07Ln6r7L74j91j21L79l17m3M8o8J08Q8pk39J38k09K53l88J92J30j94
$$ plain form
7284 -60 -213 112 38 42 -147 59 52 -62 8 101 93 -24 -10 -118 -176 112 -50 -127 258 -97 -66 182 108 107 20 -72
7310 -72 -37 -136 -137 117 142 1 122 -176 -35 -112 31 -2 25 -32 -108 -230 9 152 263 235 0 110 -129 -268
7334 -268 -69 -28 18 -45 127 -36 -78 175 -138 114 -181 -7 32 -38 19 330 59 118 96 44 113 91 23 -231
7358 -231 16 -102 -186 -56 -191 -112 145 -47 111 -73 212 119 175 39 -63 -7 128 72 -92 -25 -110 -2 100
7381 100 18 -84 107 -233 -65 -12 168 -92 -191 41 137 -114 10 77 -1 199 182 -154 -75 -82 -129 105 86 125
7405 125 -32 -229 2 -159 1 88 -41 114 -143 -147 8 -57 130 118 -59 104 -94 -128 52 224 59 19
7427 19 19 -217 35 -85 -15 -15 102 101 71 -158 320 119 2 -163 -8 -94 76 -33 -227 44 -69 145 21
7450 21 -51 56 59 3 -94 280 89 -32 347 30 -13 35 -33 75 163 156 -83 55 -154 99 -289 -97 33 -161
7474a61l8LQ2J74J70q5j25l5l9p7J48j7k75J95K17j85j5m7j2rJ44n8n7k1K3J88
7500H8n4N5l63L00M4R1m2m0l44J00L51k90P6OJ4mK17k54J91l00J89j36J68K05
7524B68k59M9j67J7r4J11L16j78j44K18j27j25N3L38k96N8MN9j78m6J91L40m01
7547Gm3J6j62L00k36K45m07K71j44O4QK54r7j19Q5r8K8L3Q4j13K6j45K23l5P8
7572A23J15j95j30L2O9n6J43k90J85k1N3j05k16J30K55k6M5J3J0J56k35j19J88
7595A24K3j00J87j89m9k04L63k27j9J35R7j59R8q6J97j66n2r2O1m6Q5o9J34j23
7619g7Q1k4j06K55k22K50k48Q5K77j77J04j94k60K51j57J80k87M87m04K69m1q9
7641d7J4Q1l96N56n06Q8K15k29J49L6j9R0q2K88q6k64K35J27n26L64L6l44J32
$$ plain form
7474 -161 -199 -196 -114 60 230 145 20 -15 -54 -131 17 0 -275 -80 137 -48 -63 -110 -122 -131 13 -45 -102 -123 -100 88
7500 88 34 89 -274 26 70 161 119 79 -265 -165 186 -104 -28 -22 -8 -12 205 -49 142 -158 31 -105 63 268
7524 268 9 58 -109 -92 -186 -75 241 63 -81 137 10 -115 -62 276 -20 38 42 101 -77 -123 68 408 7
7547 7 -36 -20 -182 118 -118 127 -280 -9 -153 -89 -81 173 76 -43 42 -56 -28 5 89 -24 2 -143 80 45 123
7572 123 238 43 -87 -55 14 -42 101 -189 -4 -25 28 -77 -293 -163 92 66 111 124 134 290 55 -64 124
7595 124 147 47 234 45 -4 -208 155 -72 -91 44 141 -18 80 -6 191 25 -27 -119 -58 -104 -19 -88 46 -77
7619 -77 4 -20 -126 129 -93 157 -91 -6 271 94 198 4 -256 -5 -162 18 -269 218 -186 83 42 -47
7641 -47 -33 48 -348 208 -298 -210 5 -224 -75 -39 -58 32 -50 238 152 -112 123 250 -276 88 124 -220 -88
7664h8R6L7k08J09j02K27kQ6j90m1N4K04n9j99M06j34j20j25o5k4K2N5n2K04k92
7689b01L30KJ6j42j04J96R7l64R8L16m96K54Q3L2j94J23J23n9j22N3j02o0K3j03
7713b01l3K15J40l19J39r5L62o6o8j02j45J26Q4P3j06j88J45J71l85M68o5j16
7735C4K07k05n7Q5k48K36K6L1j21n4pQ7p4K30j40lJ75k01n5O9J55j46j96L68l47
7760a51J89m3K37l52J21R5k24m3Q1o4J23L3r3k34K51J72m7j48N0NM0j06J02M7
7784D1l65M21l07K99m7J67k23J29j38q9K45j10l26N03j78O3j75J49J83j65k4j52
7806i9j11P5mP9J46j33L06j52J04l64K9K98k82L62k61K0k8l6j11K70j72J08R6
7829A40k5J07k77L72k67K19j49k39P6J38KJ60k19k39O0N5R9J15j66J47q2P2m6
$$ plain form
7664 -88 8 45 -163 -54 -156 71 69 155 -35 -76 -22 182 123 -76 330 196 76 -49 -114 -138 -116 -61 -113 91 -201
7689 -201 129 131 147 5 -99 97 194 -170 -72 244 -252 2 85 117 -77 46 169 110 -12 41 -61 -121 -98 -201
7713 -201 -234 -19 121 -198 -59 -154 208 142 74 -28 -173 -47 37 110 4 -184 -39 132 -253 215 150 34
7735 34 241 36 -21 64 -184 52 78 109 -12 -66 -73 14 -60 170 30 27 202 1 -54 15 170 24 -172 196 -151
7760 -151 38 -5 232 -120 1 96 -128 -171 -90 -154 -31 2 -91 -325 -74 98 51 -97 -47 -42 -2 -108 -6 41
7784 41 -324 97 -210 89 42 209 -14 115 -23 -112 133 23 -303 200 22 85 -90 59 242 77 53 -99
7806 -99 -210 -135 -139 -60 86 -47 259 107 211 -153 -124 174 -108 254 -7 13 -15 -51 -162 108 -64 44 140
7829 140 115 222 -55 317 50 269 120 -119 -43 95 97 257 38 -201 -141 -86 13 128 -38 109 27 99 53
7852E3k29L06l97J24k0J71K71l25j09J85k0J67j79m24O62l21J27o0j82K16Q8p4
7874C0k49J44k0P0L42j99p2j6k93L40M9l7J47l35P6J75l57L49l22M27r0k74K26
7897A11POk05Q4N0L9q2n2N9l15M93o3k91J28l7J15J6l3k8J04J01k91q1J39n9J16
7923C1j83J51K2N7o2l16J67j56J96J15j30l2K13N8j49j06J21J12j08l9jp6m3j65
7947c23K53J58j15k6j30P9N3r2q0N35j32m62M91k13N4jk18K61Q0q5K20l36K33
7970B04l4l4k51jm2M21l61R4K5k77L64j90K0q0K93q7j31J70k15K15j86r7J38j19
7994a61M09m30J87K20p7M1j49n2P5j48J25j06P2j22J72j25O8O8j6K9j82k6O9J06
8018D7r7J35l4R5k14j41J21O8k53M90k78J78k23LR9Q6j98L48k89P8j8P4j24j8
$$ plain form
7852 53 -176 130 -267 -143 -163 8 279 -46 -155 30 10 177 -2 -426 236 -85 42 -18 -200 16 104 30
7874 30 -219 -75 -95 -25 317 118 46 30 -263 77 126 89 236 -99 -23 152 -205 144 -178 249 159 -115 111
7897 111 118 124 -81 3 53 92 10 -42 17 -298 195 132 -159 -31 -68 47 63 30 2 106 207 -84 -165 -26 -85 31
7923 31 -152 -1 21 78 16 -300 -133 -289 -93 22 -108 -140 73 131 -18 -124 -3 109 1 -38 -39 -115 -158 -323
7947 -323 -70 88 -27 -53 -183 -104 -51 -143 -223 312 180 -282 209 -4 50 49 -169 92 172 87 307 -29 204
7970 204 170 136 -115 -116 -158 263 -98 -4 21 -256 108 -82 -62 -142 151 64 -67 103 -112 103 -83 -180 -42 -161
7994 -161 248 -182 5 225 148 189 40 -12 63 -85 40 -66 6 -116 56 -69 -1 67 51 80 -102 -128 -59 47
8018 47 -50 85 51 146 -68 -209 -88 -20 -273 217 -61 117 -106 -103 -4 82 -116 232 -57 21 3 77 -47 -65
8042f5J37j52Q6k7O6p8J81q5q2j46L54l76K95P6k68L6j18J76j69M17l42J85j75
8065g4j33K93l71K70J47j88R3O3N1l15L10k02KR1O9l00J14J52J9k09K89l71K2
8088a78L9J02q2J93K36k76m9L6P6j25O2j3L58l80P9m6k60J33Q7N7m4K07m7l16
8112a51M08k55J87l18KQJ8K10Q2M0l27o6J9J65J16J50m39N4K23N3k42Pm4J65o5
8137@P1L6m8M1j04J8K88j77k5k69PM24k94n8O1K84m39M7R0N3k26J91j7q1K57k23
8163i3N1L7J19m12M29k9k15K1K23k48K75l66J81j59K15rJ91j53J73j50J09J10
8185C00k77Pj03J62j34Q9
$$ plain form
8042 -65 72 -80 6 -21 45 -33 148 63 -19 -165 189 -187 108 184 -84 -48 -166 10 -159 258 -84 101 -74
8065 -74 -207 86 -285 -15 132 -56 37 100 151 -164 146 -56 -54 37 106 -194 -80 72 91 -118 171 -200 -178
8088 -178 -139 -37 -119 74 310 34 -15 21 97 -28 34 21 379 -1 78 32 -228 -95 -8 49 5 212 165 -151
8112 -151 257 2 189 -129 -127 -119 -101 109 191 231 -96 -162 -143 22 138 288 -151 -97 126 179 -63 -56 -100 65 0
8137 0 71 107 59 100 -4 14 302 125 100 -169 -162 262 -32 -90 -29 255 -184 -137 -47 6 -220 -29 -46 -127 130 -93
8163 -93 -42 -5 114 -298 131 102 -113 -92 131 -117 158 -208 -27 -186 29 20 211 58 231 81 190 300
8185 300 23 30 -73 89 -45 44
8191D4
$$ Imaginary data points
##PAGE= N=2
##DATA TABLE= (X++(I..I)), XYDATA
0@%%%%%%%%%%%Qj6J6j6K4l2M0m8N6p2Q8j04J20j36J59j84K10k44K82l23L68m19
33b23M75n36O04o78P59q48R46j055J171j299J440j591J757j940K141k358K596
50A361k860L151l472L831m232M682n195N781o461P260q215R384j0845J2730j5269
65h369J8889k4485L4302n6288J88196k6219k92653L24992j19220j27471J60081
76G1755j06511k7131J30429j20523L6797L1557j02549R0836M6286r9445Q3754
87C5255L3777o0992M6339k7094q9674Q3028J5868j00508M5494N4263o0781R019
99a6006P621k9678L1518J022J3892L8397o9566L1184P3926j25234j9026J03271
111D1321m8683j4209L2141j3263J8388l0846k710K8978o3217N0044O0054r6867
$$ plain form
0 0 0 0 0 0 0 0 0 0 0 0 0 8 -8 8 -8 16 -16 24 -24 32 -40 48 -56 64 -72 87 -97 113 -131 151 -172 196 -223
33 -223 252 -284 320 -358 401 -447 499 -556 615 -684 756 -835 922 -1018 1123 -1235 1361
50 1361 -1499 1652 -1820 2011 -2221 2461 -2734 3047 -3414 3846 -4369 5015 -5830 6900 -8369
65 -8369 10520 -13965 20337 -35951 152245 126026 -166627 158365 39145 -88326 71755
76 71755 -34756 -61887 68542 -51981 -15184 16373 -86176 4660 50946 -48499 35255
87 35255 69032 8040 54379 27285 -62389 20639 36507 -64001 -18507 35756 -25025 -16006
99 -16006 -8385 -38063 -6545 -5523 8369 46766 -22800 8384 82310 -42924 -61950 41321
111 41321 -7362 -21571 10570 -2693 15695 -15151 -17861 11117 -52100 -2056 57998 -38869
123c8869L4602M9866q7920L7994K7684q1328O2747O0858p8322K782M6727l6425
135C96j2739N822j3679K4865L147j6672K2391l1318j6503O4052l4772l8621Q3204
148C9573L656l9000K6000k5534j1139K6133m0836M721L0656l4596K6155R384o2462
161d7289L5300L1467m0903L0706J6632k3410L8245j0601n6894K2912J8841k9287
173a4281q60J1635L27K955j2759o483R548p546J8144K6744k8396M345L5997l4605
187D765k2754J6849j2516Q009J3638k2103P318J2785j7888j416L0j651K4879P363
201A7308j4419N814L232j0580l459q321k739J9100N319j2255k311L166j840p372
215i357k074R722Q017N149O430j2007j1652J0914l351j2991Q880R029L008M380
$$ plain form
123 -38869 -4267 45599 -42321 -4327 23357 -57971 4776 65634 -12688 -9906 36821 396
135 396 -12343 -6521 -20200 4665 7812 -8860 13531 -17787 -34290 29762 -5010 -43631 39573
148 39573 43229 4229 30229 4695 -6444 19689 -21147 -16426 14230 -20366 5789 15173 -47289
161 -47289 -11989 19478 -21425 9281 25913 2503 40748 30147 -26747 -3835 15006 -14281
173 -14281 -15141 -3506 -3179 -224 -12983 -19466 -9918 -17464 680 27424 -972 3373 39370 4765
187 4765 -17989 -1140 -13656 -5647 7991 -14112 -6794 5991 -11897 -13313 -13283 -14934 9945 17308
201 17308 2889 8703 11935 1355 -2104 -10425 -13164 5936 11255 -1000 -3311 -145 -1985 -9357
215 -9357 -11431 -1709 6308 11457 17887 5880 -5772 5142 1791 -11200 -2320 6709 9717 14097
229A4097j5244p976J0325o671j801R025r77J2738M393k1759j887P840q299J836
243d360O938j250P186K864j4238p473L289r20N059P085l729M907O822j2900j0002
258a0722J145M351O904q44j681Q307k029j2231l166n03R66J0474M549n337M637
273D820L778j2172m871L211k101R225R247j0596M03P619j4910n756R270l170L921
288b082J3680m345o169J350l368j759j401R2J2205P588j0417m511M419p999p628
303a0345N697M329J208N565R77o937k297p09j238K991N063K698L911J97q141o725
319c756k868J382P41l377Q127P800j3107q1P977j5913M833K0945j2346J061J8675
334B0093j5022r854N658j1479K349P291q156R155M697j5432N347L296j1945J2167
$$ plain form
229 14097 -1147 -9123 1202 -5469 -7270 1755 778 13516 17909 -3850 -5737 2103 -6196 -4360
243 -4360 2578 1328 8514 11378 -2860 -10333 -7044 -7964 -2905 4180 451 5358 12180 -720 -10722
258 -10722 -9577 -5226 1678 834 -847 7460 5431 -6800 -9966 -10469 -9503 971 5520 183 4820
273 4820 8598 -3574 -8445 -5234 -7335 1890 11137 541 944 8563 -6347 -12103 -2833 -6003 -2082
288 -2082 11598 7253 1084 2434 -934 -2693 -4094 -4002 8203 15791 5374 863 5282 -2717 -10345
303 -10345 -4648 -319 889 6454 7431 494 -1803 -2512 -3750 -759 4304 7002 10913 11110 2969 -3756
319 -3756 -6624 -5242 -4501 -7878 249 8049 -5058 -5139 2838 -13075 -8242 12703 357 1418 20093
334 20093 5071 -4783 875 -10604 -8255 -964 -9120 35 4732 -10700 -5353 -2057 -14002 -1835
348a835R440n989J1451j311j2985P762p182j3423J4485N10o596J0816q273m026
362g156P532j4024N339J7843j1428P825J5571j8413j995R756j5198j468J3466
375G650m776l014N252n337p033p12K97K491N307M209L128K905m017n368K110k428
391F64r58O425j413j936L094j1794n623O783o803j13J4453o27k217O327n265k886
407a889M076m851N086R191r746O07M715j7490j899Q838j2218N800J5875j0310
421d215J778J0191j1942j885J1289n546K928J0672p807j617J671j3618J49M066
435c886p080R374N805q715Q352m46j3647J0211M971q023J1226N801r689L285l382
450D157j0986N903m02m165R710n8o085L003m108n244N984R87j85J0435J555q667
$$ plain form
348 -1835 7605 1616 13067 11756 -1229 6533 -649 -14072 413 923 -5673 5143 -3130 -7156
362 -7156 376 -13648 -8309 9534 -1894 5931 21502 3089 1094 10850 -4348 -5816 7650
375 7650 2874 -140 5112 -225 -7258 -7970 -7673 -5182 125 4334 7462 10367 6350 982 3092 664
391 664 -294 6131 4718 2782 5876 -5918 -11541 -4758 -11561 -11674 2779 2152 -65 6262 997 -1889
407 -1889 2187 -2664 2422 11613 1867 2474 7189 -10301 -12200 -3362 -15580 -9780 6095 -4215
421 -4215 -2437 7754 -4188 -6073 5216 -330 2598 13270 5463 3846 5517 -8101 -7952 -3886
435 -3886 -10966 -1592 4213 -4502 3850 3404 -10243 -32 4939 -3084 8142 13943 4254 7539 4157
450 4157 -6829 -926 -1328 -5493 4217 4159 -1926 1077 -3031 -8275 -2291 -1304 -1489 8946 10501 1834
466A834M627l5j2991N457N385p169O358J080j0260L773m322q534R417K711p75
481c444R437m18k973L253o607k421Q157l869j968Q354o578q443L171n992l162
496a3503Q886J97J751R397k541l906M659l718k661O975q71j297L090o770m761
511e073J053o263K02Q212K26K525O609l845l203N220m833j978R735k282k882M672
527H095r326l783M098q748L112R158k928L998J285n063K231k639j979N160Q18
542C489J13J582j303n164m247K372m48j783O245Q47m29K933q465j690O113m448
558d283J639O786k383J890j085p551L195l84l697P132Q63k619L781m154m662J076
574d456r89K407L932J452O3K47O31n197k432M155R88J390J237k127J407l098m963
$$ plain form
466 1834 6461 6426 -6565 -1108 4277 -2892 3466 4546 -5714 -1941 -6263 -14797 -5380 -2669 -3444
481 -3444 5993 5575 2602 5855 -752 -3173 4984 1115 -853 7501 923 -7520 -4349 -10341 -13503
496 -13503 -4617 -4420 -2669 6728 4187 281 4940 1222 -1439 5536 4665 3368 6458 -312 -5073
511 -5073 -4020 -10283 -10081 -1869 -1643 882 7491 3646 443 5663 830 -1148 8587 6305 3423 8095
527 8095 -1231 -5014 -916 -9664 -6552 2606 -322 3676 4961 -102 2129 -510 -2489 2671 3489
542 3489 3602 5184 3881 -1283 -5530 -3158 -3606 -5389 856 1703 1274 4207 -4258 -5948 165 -4283
558 -4283 -2644 4142 1759 3649 2564 -4987 -1792 -2176 -5873 1259 2122 -497 3284 -870 -5532 -4456
574 -4456 -5445 -3038 894 2346 2409 2656 3287 -1910 -4342 -187 801 2191 3428 1301 2708 -390 -5353
591e353R74N19L911L484p52J308n44k240n55k963J924L356J167Q34m258j472J305
608F45n144p67M537L56L815K588m671j311M58q62p63j114L822M497l541l287j361
625b103k303J083m41l49N381K283o65j437l531n8K08j45L472r43K36L290m217
642b39o166L59L334k7k88M929O08n27J182n609j122M592r68K868n69l117N516
659D756n128q593N882j92m85P921k520m66N757m920l946M039k032J566M814l485
675B968k808N40k479j320k833q55R385L950p231K324N713o375k155L977k880K319
691B240M671n141k943j094k716J916k860k5P754J689j179m88k806J661q7j421
707h29R23O65L590k230o280J714l458r36P816m425j516J1324k051p389Q22N35
$$ plain form
591 -5353 -4379 -3860 51 3535 2783 4091 3547 1307 752 -2211 -287 3069 4236 5070 812 -660 645
608 645 -4499 -5266 -729 -373 3442 6030 1359 48 506 -356 -1119 -2233 1589 6086 2545 -742 -2103
625 -2103 -4406 -3323 -3764 -4113 1268 3551 2886 1449 -2082 -2140 -1932 -2077 1395 452 688 3978 -239
642 -239 -6405 -6046 -2712 -2739 -3027 1902 2510 1983 3165 -2444 -3566 1026 58 2926 2357 -760 4756
659 4756 -372 -8965 -3083 -3275 -3760 4161 1641 1175 6932 2012 -1934 2105 73 1639 6453 2968
675 2968 160 700 -1779 -3099 -5932 -6787 2598 6548 -683 1641 7354 979 -1176 2801 -79 2240
691 2240 6911 1770 -1173 -2267 -4983 -3067 -5927 -5952 1802 3491 2312 1824 -982 679 592 -829
707 -829 94 759 4349 2119 -4161 -2447 -5905 -6841 975 -3450 -4966 6358 4307 -3082 -2260 -1725
723a725K381o55k968O601J145o949K831l89p792N297O800n899J083N183m352j331
739g39l41n817N074O657n328J820M603l931J249k436m838P957j24l538N525n744
755D9m930P144n694p173R255N967l936J001L530j291k371M20n32L96M49O80P01
772C665p160m134N801l251m758P678K751N37M521m439k769P082k049n928M115
787A662L416m538j890o71n138q11L291M50Q93K077L865M009o809l128R260m039
803A899m584Q540l372n346O721n568p114N086P97J168L183k122L569K940o320
818e23l5J895j678M797K37n940M869J128r081J431L238l714L286M744l810j620
834g76K239j71l227j866M391L715k360p20K059k540j919J987k102j408N629O82
$$ plain form
723 -1725 656 1 -2967 3634 4779 -2170 661 272 -7520 -2223 4577 -1322 -239 4944 592 -739
739 -739 -1080 -6897 -1823 4834 -494 1326 5929 1998 3247 811 -4027 3930 3806 268 5793 49
755 49 -4881 2263 -3431 -10604 -1349 4618 682 1683 5213 3922 1551 1971 1439 1835 2284 2964 3665
772 3665 -3495 -7629 -1828 -5079 -9837 -2159 592 1129 5650 1211 -1558 5524 3475 -2453 1662
787 1662 5078 540 -1350 -2021 -7159 -7970 -4679 -4229 -3336 -1259 2606 6615 -194 -3322 5938 1899
803 1899 -2685 5855 2483 -2863 3858 -1710 -8824 -3738 -2941 -1773 1410 -712 2857 5797 -523
818 -523 -558 1337 -341 4456 4693 -1247 3622 4750 -4331 -2900 338 -3376 -90 4654 844 -776
834 -776 1463 1292 -1935 -3801 590 4305 1945 1225 3284 744 -1175 812 -1290 -2698 2931 3613
850C613n819Q0J082k696o50J535J417K349J830J23k688q26J901j661j307K642
866I25J60m43q05l074j386o73K120K198k618L928N855n682p63L085m112J675K729
883C119l653J722J283l598q83j905j832N412m69q93O836j840k947L726k119n078
899c119O622Q39m788L968j615l968K656m251k089P469j232j321N147l851K92K682
915C441o623K629N186n718L233K687p784J541K297n507J704K985m73K245j567
930B76k164K673k338j841M256j18j401M034k011l258R92j532M47J202j810L554
946I61J755m714O56L75j331K052j335J624M515m470r55L694n061q95M340j465
962b54O59J378k232K339k189m451N466L64k419M273k7j664J198l315m62K531k394
$$ plain form
850 3613 -2206 -2126 -1044 -3740 -4390 -2855 -1438 911 2741 2864 176 -650 1251 -410 -1717 925
866 925 1085 642 -163 -3237 -4623 -5296 -3176 -978 -3596 332 6187 505 -258 2827 -1285 390 3119
883 3119 -534 1188 2471 -1127 -2010 -3915 -5747 -335 -804 -1697 5139 3299 352 4078 1959 -3119
899 -3119 3503 4342 -446 3522 1907 -2061 595 -3656 -5745 1724 492 -829 4318 467 759 3441
915 3441 -3182 -553 4633 -1085 2148 4835 -2949 -1408 889 -4618 -2914 71 -402 1843 276
930 276 -1888 785 -1553 -3394 862 744 -657 3377 1366 -1892 -900 -2432 -1985 -783 -2593 961
946 961 2716 -1998 -1342 -967 -2298 -246 -1581 43 4558 88 -867 2827 -2234 -3129 1211 -254
962 -254 405 1783 -449 1890 -299 -4750 716 1080 -1339 2934 2907 1243 2441 -874 -1336 1195 -1199
979a199J756L240l678j30K304l927q58K790k95J198O54n70J535l033k185L238
995H40j813l95L063j063kq69k124J818r77j444L724J006j187N02j235m35o13j632
1013b836K293J660j764J88J857k305k262J700Q61r46J187K371k65j726Q2l10r89
1030a204o72K196J342j857P49P42l112j22J224n96K655J29r59K599j556k756J547
1047C49L14l86K56O68J335j226l145J029J355k595K58M719r44k043K085n66k273
1064h10P97l7O89R58j023R31p92k542R3M78q78J388J179j40J65O7j341o14J535
1083A03j41m51K602o15k706K028j823l458L257M42j586K596m88j4P33l193J810
1100i04K590l081K659K513l406R7M15k438n64J509k12K6J895j300j570K632j479
$$ plain form
979 -1199 557 3797 119 -11 2293 -1634 -2492 298 3 1201 1855 1285 2820 -213 -2398 840
995 840 -973 -1368 1695 632 630 -239 -2363 -545 -1522 -2966 758 1764 577 1079 -156 -591 -1204 -2836
1013 -2836 -543 1117 -647 -459 1398 -907 -3169 -1469 -608 -1554 -367 2004 1739 13 95 -215 -1204
1030 -1204 -1876 320 1662 -195 554 1296 -1816 -1938 -714 -1310 1345 1474 515 3114 1558 -1198 349
1047 349 663 277 533 1201 2536 1310 -1835 -806 549 -2046 -1788 2931 1987 -56 2029 1463 -810
1064 -810 -13 -50 639 1597 574 1505 713 -1829 -1736 -1258 -2136 -748 431 291 456 523 -818 -1432 103
1083 103 -38 -489 2113 1498 -1208 820 -1003 -4461 -1204 -762 -2348 248 -240 -254 479 -2714 -904
1100 -904 1686 -1395 1264 3777 371 468 883 -1555 -2119 -610 -822 -796 1099 -201 -1771 861 -618
1117f18q19L355o46J089J718l146K48R54m451J330K329l210K435J353l977J204
1133h52J728k883J755K369j174J126Q15j787m78o34j616J556L79k008K107Q67
1149A270l794J121J196k762K969J199j822K788m88k625R30p55o60P26L43R56m23
1166A69n88l52r47J0M5M10J721p64P07P73k514R19R93k070K610J277k554J382
1184A227J15k395j5l24J44J250q9n18J331J04j396P15O83O6J450P31k056J048
1202B071n22l335J733Q6k550K826L18j573J909j547k86K386j656Q17K646j260
1218B063k56l89k073j4m3q43rJ402R3j225O56J42j462K026N56k89J731j048j114
1237i6J256k361j055J628j008L90J280j589P13Q67k058Q68J436m17N65J083o83
$$ plain form
1117 -618 -1437 1918 1272 2361 4079 933 1181 2135 -2316 -986 1343 -1867 568 1921 -2056 -852
1133 -852 876 -2007 -252 2117 943 2069 2884 1097 619 -15 -1631 -75 304 -1704 403 1270
1149 1270 -2524 -1403 -207 -2969 0 1199 -623 2165 1677 -948 -18 -773 -1433 -707 -364 592 169
1166 169 -419 -771 -1718 -1708 -1663 -1253 468 -296 411 1184 -1330 -411 582 -1488 1122 2399 -155 1227
1184 1227 1342 -1053 -1068 -1392 -1248 2 -87 -605 726 830 -566 149 832 898 2348 3079 1023 2071
1202 2071 1549 -1786 -53 33 -2517 309 627 -946 963 -584 -870 1516 -140 677 3323 2063
1218 2063 1807 1418 -655 -669 -712 -1555 -1564 -162 -69 -1294 -638 -496 -1958 68 624 335 2066 1018 -96
1237 -96 1160 -1201 -2256 -628 -1636 -1246 34 -1555 -842 25 -2033 -1165 271 -146 419 1502 819
1254H19j63o60r71L07Q20r35N93J605j540rM41j681J357Q52j541K331j06j705
1272a86J491j509n47J704j135J084J209j554L59m24j081L45o01P66R14o74M70
1289F31l41l62M01q81K77J627n31M7K46j260l32n35j30M20J92J40K03L0m75o13
1309a246M32N06J67P24J84k40l2j517l4N70j117N18J187l31Q9J53j208Q43N8l71
1329f65J147L1K37L24j371n5p5n37N51N05M29l02Q9j6m80r5O01j6J128l53k90
1350G87K98o41n64p6l01R42J08p35R11j80j175N98k43O78M88n71N93K08j282Q8
1370f9l44o18J100l87j15J038q29q47J253n62o44R86M25n8J86m71o48L04o82o99
1390a681J384j15r8N75o32m56P51p95J67J705m22l45R45r77p12N63q80K53J197
$$ plain form
1254 819 656 -4 -975 -668 152 -783 -190 1415 -125 -134 307 -1374 -17 835 -706 1625 1519 -186
1272 -186 1305 -204 -751 953 -182 902 2111 557 916 492 -589 -244 -845 -79 835 161 631
1289 631 290 -72 329 -552 -275 1352 821 868 1114 -146 -478 -1013 -1143 -723 -531 -391 -188 -158 -633 -1246
1309 -1246 -814 -308 -141 583 767 527 495 -1022 -1056 -486 -1603 -1085 102 -229 -140 13 -1195 -352 -294 -665
1329 -665 482 513 750 1074 -297 -352 -427 -964 -413 92 521 219 308 292 -188 -283 318 302 1430 1077 787
1350 787 1085 444 -120 -196 -497 445 553 -182 729 549 -626 -28 -271 407 895 324 917 1125 -157 -69
1370 -69 -413 -1031 69 -318 -433 605 -224 -1071 182 -380 -1024 -38 387 329 515 44 -604 -300 -982 -1681
1390 -1681 -297 -412 -510 65 -567 -1023 -272 -1067 -900 805 383 38 983 6 -706 -143 -1023 -770 427
1409D27o77L78M31j029R7N90r63J257M39q08R19L01j740J44P23r68O23L20k92
1428A72J009n99j162J128l92l61J088l05M35N68j878K61L72n82j97R47P5l80l64
1447a65K56j41q97K88M47j66Q55l42l92M69o92o13Q23K64J82R3n60K08k72j138
1467a493N41O46o64M93M24j63j52j4j82J95N88j26K15O56p18n85N62j182M08K52
1487b99o05R60O88j460R37N59j522J397P79j399J985m32j996J280p77r64J271
1504D02q16L03J214j230O8Q84j029l0J413p58K34O57r21o0q6j018j09R89l53q7
1524c33L79j98o7j17m22P15J79p15O72O60j207J49p7m07K15L78k41L13J39q23
1544h08J88J7J81m18O52L27m7J04l21j17M95j049P18P53o36L12k11n77O18o10
$$ plain form
1409 427 -250 128 559 -470 -373 217 -746 511 950 142 1061 1362 -378 -234 489 -479 144 464 172
1428 172 1181 582 -580 548 156 -205 883 578 1013 1581 -297 -36 336 -246 -443 504 579 199 -165
1447 -165 91 -50 -947 -659 -212 -378 477 135 -257 212 -480 -1093 -270 -6 176 269 -291 -83 -355 -1493
1467 -1493 -952 -306 -970 -477 -53 -216 -368 -382 -564 -369 219 93 308 964 246 -339 223 -959 -551 -299
1487 -299 -904 56 744 -716 221 780 -742 655 1434 35 2020 1588 -408 872 95 -869 402
1504 402 -414 -111 1103 -127 -59 825 -204 -234 1179 421 655 1312 391 331 245 -773 -882 107 -246 -333
1524 -333 46 -152 -219 -336 -758 -43 136 -579 93 753 -454 -305 -382 -789 -574 -196 -437 -124 15 -808
1544 -808 -620 -603 -422 -840 -188 139 92 196 -125 -242 253 -796 -78 675 39 351 140 -437 181 -429
1564d29k09Q02J69M8j89L13j57n22L39L89o5N07l29k63N30j045j22O82r52N76
1584G3N56j258J043Q0r68J285r53P18L44m80K55m37k42n0M24j476J177o4K1m6
1604BK30l73o8m48N72m91J253o8r21K89L48j070J94q3K77K58o15N03K50p45M58
1625b48m43N58K56o1M13on10O6l45m6O17m81O05R2n43K03m52mQ85o07M99K89l96
1648C41L49m07l93M61k60M9M27L8k24m22r3N90p83K91N07q7J44k31L7K73r94k3
1670d10P80l59J51j29l67M39n03j00N82l23J53k3j91K29r0l99K50l27M40J84m72
1691d85Q33m70o50N72m77M12M56j014J002J06r49N65k24l1M32p08P98K06n57o5
1711b48M53k99K3R7O19k05l85Q4L33k09m16P6O56N2l84M93l28l86M29n77L11N74
$$ plain form
1564 -429 -638 164 333 381 192 505 348 -174 165 554 489 996 667 404 934 -111 -233 449 -503 73
1584 73 629 -629 414 494 -474 811 -142 576 920 440 695 258 16 -34 390 -1086 91 27 48 2
1604 2 232 -141 -209 -657 -85 -576 677 609 -312 -23 325 -745 -551 -634 -357 -99 -714 -211 39 -706 -248
1625 -248 -691 -133 123 62 475 469 -41 25 -320 -366 251 -230 375 467 -76 127 -325 -329 556 -51 448 737 341
1648 341 690 283 -110 351 91 140 567 605 381 -41 -134 456 -327 -36 471 384 528 297 334 607 -387 -410
1670 -410 370 11 162 33 -334 105 -398 -498 84 -239 -86 -109 -300 -71 -161 -560 -310 -637 -197 -13 -485
1691 -485 348 -122 -772 -200 -677 -265 191 -823 179 285 -664 -99 -323 -354 78 -630 168 374 -183 -248
1711 -248 205 -94 -71 26 645 440 55 139 472 263 -153 -77 579 631 247 740 412 26 455 -122 189 763
1733G63q36P49Q7r50P21q60k48J082p11K9P34r21O83j21q21Q73k16n30M39q9M12
1754B69o85O13Qj028P93l26O23m17j22j61MN1K93j2j48j3J42n03N51j19m93O88
1776HO9m81P17o70K04K65j27lK49l02J12M00l73L76l90k7J87L4k29L6O13j32k42
1799B94O3m67N31P2o76R95o9r24R18p36k95Q84n71K0O89o23J61L06p68M74m71
1820a93M25K89o79m12P05n70K48l1l16O75j87j06O6M0o8m46L6M10j2n5k83J7L93
1843e4n62K14L65o1j36O83r11O22k58n87R67m26l17Q54m11q2K96m19M3O70q14
1864c24P00J40n27L04N1l32K99K1n28O62J79q05O03o2k38J82o4q4O10o59j5L79
1886D92m88j86L59l26K20M23o19M34L2o85O06K5o19M68m49K20J73m07l03L39K59
$$ plain form
1733 763 -73 676 763 -187 534 -326 -574 508 -203 -174 560 -361 322 201 -620 253 37 -493 -54 -143 269
1754 269 -416 197 205 -823 -30 -356 267 -150 -272 -433 -429 -378 -85 -97 -245 -258 -116 -619 -68 -187 -680 8
1776 8 77 -404 313 -357 -153 112 -15 -18 231 -71 41 441 68 444 54 27 214 248 19 55 668 536 294
1799 294 357 -110 421 493 -183 812 743 -181 737 1 -294 590 19 39 728 105 266 572 -196 278 -193
1820 -193 232 521 -158 -570 135 -435 -187 -218 -534 141 -46 -152 -86 -46 -114 -560 -524 -114 -126 -181 -464 -447 -54
1843 -54 -616 -402 -37 -98 -234 449 -462 160 -98 -685 282 -144 -461 393 -18 -100 196 -223 -180 490 -324
1864 -324 376 516 -11 293 344 12 311 332 -196 466 645 -160 443 381 143 325 261 177 787 128 113 492
1886 492 4 -182 177 -149 71 494 -125 309 341 -344 262 287 -332 136 -313 -93 80 -327 -630 -291 -32
1907c2kj17k73M95l91j74K44q3K74l63K8L24n4O5m86L17J38j21j00M86l26J31
1929b0K70n15L00k19oL91o4k48J09j45J28K96m38L67L65n58l8N30l59J6l47K58
1951G3N49o34J67L85m71j96J62K19L39j25p06M37J06k13L7j10r5K88l75K51J91
1972B79l85L3N5J41j36j47k10M37j97l43J87j00k8J47J02j28K13k78j00K36m1
1993b63Q1mj17M63l60jN1j77M98m52J68K19M7j87K29l32J40J03P3J15K3l64M12
2016C65q5k90L5Q2J44M9k27J15L10j08K9k41K87k37P6J2L4j99mJ1N3K7k11p3J64
2041A18K30n93K97j18kJ21j70k36N23j82j80L85m74j22K91k3np5L2J85k43n4J42
2064a53j92j2K45Q0R5j66j53J1L17r1l03N1L69l44%m7K75K13l05J09J15j03m7
$$ plain form
1907 -32 -34 -151 -424 71 -320 -494 -250 -333 -59 -422 -394 -70 -124 -59 -545 -228 -90 -211 -311 175 -151 -20
1929 -20 250 -265 35 -184 -190 201 137 -111 -2 -147 -19 277 -161 206 571 13 -25 505 146 162 -185 73
1951 73 622 -12 155 540 69 -127 35 254 593 468 -238 199 305 92 129 19 -76 212 -163 88 279
1972 279 -106 -73 -18 123 -13 -160 -370 67 -130 -473 -286 -386 -414 -267 -165 -293 -80 -358 -458 -222 -263
1993 -263 -182 -186 -303 160 -200 -201 -150 -327 171 -281 -113 106 153 -34 195 -137 3 106 179 294 317 -47 365
2016 365 280 -10 25 107 251 300 73 188 498 390 419 178 465 228 304 316 350 151 147 158 211 238 27 -46 118
2041 118 348 -245 52 -66 -68 53 -117 -353 170 -12 -192 193 -281 -403 -112 -135 -140 -215 -183 2 -241 -295 -153
2064 -153 -345 -357 -112 -32 63 -103 -256 -245 72 -19 -322 -271 98 -246 -246 -293 -18 195 -110 -1 114 11 -36
2087c6K40j71L39l88K0J24L34m21j09K03K71j47j65K83j83j93K36l4K12o4m53
2108a02K14J87l2q4k20P9J49n26L82j36k80L88oK37k76j24P7K01k38K20j79J7
2130e2J41m49K08m4o9J02j08q7L79l85J53j10m6J71K0qM8m74L12K68k55K33n8
2153a10J2N2k31K25L35k95k7j07N3L80j72k05L46j07k65M27l02K21l64R8N18m20
2175F2M09j11j50K99l08L2J42k85J68K2n44N34J58p02M65k12J72m1m22L94R6k24
2197d6K20n6j31J75l30L82l20k50P7K91j67p0k76M31p2m00M59j83J47J54l22J89
2219i8J30m96M54j38j24L76o87M30K68o77N65J22l78M46j42L6K91l17oN82n58
2240G9K32r5l14N23o54jM74k73J83K13l53N01m86P2M74k46M5n4j04K37j53r9N3
$$ plain form
2087 -36 204 33 372 -16 4 128 462 41 -68 135 406 259 94 377 194 1 237 203 415 351 -102
2108 -102 112 299 267 183 -37 42 191 -335 47 -89 -369 19 13 250 -26 -150 -73 128 -110 110 -69 -52
2130 -52 89 -360 -152 -196 -265 -163 -271 -358 21 -364 -211 -321 -367 -196 -176 -184 -136 -610 -298 -30 -285 -52 -110
2153 -110 -98 -46 -277 -52 283 -12 -39 -146 -93 287 115 -90 256 149 -116 311 9 230 -134 -36 482 62
2175 62 471 360 210 509 201 233 375 90 258 280 -264 270 428 -274 191 -21 151 110 -312 82 178 -46
2197 -46 174 118 -13 162 -168 214 -106 -356 -279 12 -155 -225 -501 -70 -142 -542 -83 -266 -119 35 -287 -98
2219 -98 32 -464 -10 -148 -272 104 -583 -153 115 -562 3 125 -253 193 51 87 378 61 55 637 79
2240 79 311 216 -98 425 -229 -230 244 -29 154 367 14 515 29 101 575 329 374 320 216 453 300 201 254
2263B54j83n6k49j21M74l86J63N8J05L9J04l77K19K15m82L73m24J0O6j49J13j9
2285b53j98L75k66j31K44j54N07N3n73K67j62K23J77n75O47k71l41K88k68r6N61
2306E4l59OQ93r16M94L71l84K74k15j91L50l88J8M64m48l4j9j38N57m10j00L22
2328B01K27k71j50K55K23k40n2K83l40j35j5R4N62q32O4J07q5q8K0n8J27P0pK56
2352B16j49j66M8k28K99m12J29K32l48J84k44J38J03k45N1L80l27M88k17k34L54
2373E2n2n99P19k11j57L29q67Q32R1n54Q30m43Q5L2k8J83J90p50O05R5j69N7j45
2396A25K07k3m33K58K08k41J66m39K40L71l15L8R4j00L38o71K82L68p13L88p9
2417F9r8L67m56j40L97k83J07L18l53N8p6m38O24j62Mk3j84m7j5K0J87O5k99J26
$$ plain form
2263 254 71 15 -234 -355 119 -267 -104 -46 59 98 202 -175 44 259 -223 150 -274 -264 -198 -347 -234 -253
2285 -253 -451 -76 -342 -473 -229 -383 124 177 -396 -129 -291 -68 109 -466 181 -90 -431 -143 -411 -507 54
2306 54 -305 -299 594 -322 172 543 159 433 218 27 377 -11 7 471 23 -11 -30 -168 389 -21 -121 201
2328 201 428 157 7 262 485 245 193 476 136 1 -14 80 642 -190 -126 -19 -104 -192 -172 -230 -103 -33 -40 216
2352 216 67 -99 -51 -279 20 -392 -263 -31 -379 -195 -439 -301 -198 -443 -392 -12 -339 149 -68 -302 52
2373 52 0 -599 120 -91 -248 81 -786 46 137 -417 413 -30 55 87 59 242 432 -318 287 382 213 270 125
2396 125 332 309 -124 134 342 101 267 -172 68 439 124 162 256 156 494 -177 105 473 -240 148 69
2417 69 -29 338 -118 -258 139 -144 -37 281 -72 -14 -90 -528 96 -66 -62 -85 -269 -316 -331 -311 -124 -59 -358 -232
2441b32J50j93j56N11J64k87j66J71j01J16j60J23J69j78L7j53J18J43k02k02
2461c28M64q9R8o6PM21m85k50L48L56m85J84Mq7L84m01K49j08R8k9Q8m2p7j83
2485G1p8J17K65k37J07k82M5k46j4L27j47q2J84r8mq8j39J88K54m39J74n9K27
2508D6j20J65m79J44Q0J17j23J75l11J46K81l26k08N36l11o0j18J22J3K52j41
2529a20j06J29m3J42J99L0K05k07k93K47j65k98K32K37K81k50l14J8K16k8P2J69
2551C53j38K87k82L3L99m77Q6j88J60k08p8L46l39N9k67K57l21M07O0m58M68q2
2573G7l9q3J82J56n05L39k61k16O4nR0k22O3O2M12l99R2J10p3J19j54o6J50K43
2597A36l55N4M11o57J55k51K37J61j72R4K16R4p7L00k28J3J18r7O1J72n70J67
$$ plain form
2441 -232 -82 -275 -431 80 244 -43 -209 -38 -139 -23 -183 -60 109 -69 -32 -185 -67 76 -126 -328
2461 -328 136 47 145 79 86 507 22 -228 120 476 -9 175 179 92 476 75 324 216 314 285 373 331 254 71
2485 71 -7 110 375 138 245 -37 8 -238 -252 75 -72 -154 30 -68 -72 -160 -299 -111 143 -296 -122 -181 46
2508 46 -74 91 -388 -244 -164 -47 -170 5 -306 -160 121 -205 -413 123 -188 -248 -366 -244 -231 21 -120
2529 -120 -226 -97 -140 2 201 231 436 229 -64 183 18 -280 -48 189 470 220 -94 -76 140 112 184 353
2551 353 215 502 220 253 652 175 261 73 233 25 -53 293 -46 13 -254 3 -318 89 149 -309 159 77
2573 77 38 -45 137 293 -212 127 -134 -350 -286 -291 -201 -423 -360 -298 114 -285 -193 -83 -156 -37 -191 -257 -107 136
2597 136 -219 -165 246 -411 -256 -507 -270 -109 -281 -187 29 123 46 346 118 131 249 152 213 385 -185 -18
2619a8J0l0J34J89k00m8L11n39N01j55j14J22J44l77R1K85l08R2M19n25J56j02
2641C8k19n5J41m3K84%j32j4L59l26P2l1k29Oj48J21q8j34K7L69k01k44K73j55
2665c29K26k76L91P8j47J37K7l64K19j27j96J66o1j68J92J54k4r6j40O86n45K76
2687G9K04J9k03n2K12J1l59K81o9k53K89j90O0P3nr2K88k04L98j08k21J46K04
2710E08k44J04o08K67K53o08K53r1K58k54K3J29J89j52J32k04j13R7J30j33L00
2731B36n57K32K97o31J3M80l18K0o1m3K60j47Q5J6m0K11j40O3Q3M0r4N3j64R5
2755a1k53j3J60J03J54j70R9K72l33J16K05m69L59k85R7L59l31l1K62m72J37R0
2777D5Q3K61j82j21K03l30j29N40l56O9J05m03L67m5oj09q6J19K95n58K35J36
$$ plain form
2619 -18 -8 -38 96 285 85 37 348 -191 310 155 41 163 307 -70 21 306 -2 90 509 -16 140 38
2641 38 -181 -236 -95 -138 146 146 14 0 359 33 105 74 -155 -149 -297 -176 -264 -398 -371 -2 -203 -447 -174 -329
2665 -329 -103 -379 12 90 -57 80 107 -257 -38 -165 -361 -195 -256 -424 -232 -78 -102 -198 -338 348 -197 79
2687 79 283 302 99 47 259 270 -89 192 123 -130 159 -31 29 102 97 5 293 89 487 379 158 304 508
2710 508 264 368 -240 27 280 -328 -75 -166 92 -162 -139 -10 179 27 159 -45 -158 -61 69 -64 236
2731 236 -321 -89 208 -423 -410 70 -248 -228 -289 -332 -72 -219 -134 -118 -158 53 -87 -24 59 99 5 58 -106 -11
2755 -11 -264 -277 -117 -14 140 -30 69 341 8 124 329 -140 219 -66 31 390 59 28 290 -182 -45 45
2777 45 128 389 207 86 289 -41 -170 370 14 83 188 -215 152 107 101 -8 -94 25 320 -238 -3 133
2799A33j93J58k19k8J57J4Nk29j68J89k16M37J83n77J65k1l2L48j58kK46m93K27
2822g4Lj63J59Nk26L39l18QK34l0L8O3Q1J10k18J51o7l05L69J73l52L93k06l9
2846A28J56l46J11P3J48K09n97K98J43o1k4j20K5L32o30K12J83l46N41k89k20
2867g4L37m54L7N83o52K72J19m34L42q7j35L61l67k51J58j08M01j70n08N52N2
2888b6j11K14k76j00L51m11M05j06n4J22j35j54J86n2L1J74m4Mm2j31L55l09m6
2911a55J77j23J19l8K86j59l23L90j1j31K87m01J79R9l08M83j59k28M57k11k77
2932d7M59l17l17L43k19Q8l4J04R8j67j05O5j32J63Q5j05J31r6J6L15n38L29k08
2955h9j70P0Ok55N00n01q0M62k85J84L97m68J26P9j20J62j65K66j17j72K86k91
$$ plain form
2799 133 -60 98 -121 -149 8 22 27 -202 -370 -181 -397 40 223 -354 -189 -210 -242 106 -52 -54 192 -301 -74
2822 -74 -71 -234 -75 -70 -296 43 -275 -267 -33 -63 -25 38 119 229 11 162 95 -210 159 332 -20 373 167 128
2846 128 284 -62 49 122 270 479 -118 180 323 262 238 118 143 475 -155 57 240 -106 435 146 -74
2867 -74 263 -191 -154 429 -223 49 168 -266 76 -11 -146 215 -152 -403 -245 -353 48 -122 -630 -78 -26
2888 -26 -137 77 -199 -299 52 -359 46 -60 -114 8 -127 -281 -95 -147 -116 58 14 18 -24 -155 200 -109 -155
2911 -155 22 -101 18 -20 266 107 -216 174 163 32 319 -82 97 196 -112 371 212 -16 441 230 -47
2932 -47 412 95 -222 121 -98 -10 -44 60 158 -9 -114 -49 -181 -18 67 -38 93 -3 13 328 -210 119 -89
2955 -89 -259 -189 -183 -438 62 -439 -519 -57 -342 -158 239 -229 -103 -24 -144 18 -147 119 2 -170 116 -175
2977a75J15j58L9M03m87J3L53k08J18J41kk10L09n51M61K50k17r3N75r03O75p16
2999b68K56K91O43q42q45J395r52K91M72N96o90Jj049J54Q59l07j45J58j28L48
3019B38j78j41L83k24k48M42L5j15l77K54k19j84J25N5M0j38nK02r6Q3J10k59
3041b17L15j93k9J03k13L2Q6O4r5n1J20j45J48K22k70M6q9J11J86p5J43R9j63
3064A35m4j80M71j57j91J46q8k30K0J55m8J41J02q0M6k62L20m4J40p3j73p7L1
3087F0L9l5k94K13L6j68L31j75p1p7J11L95k14k36Omj49L30k66J25j62j35O0J18
3111a62j9j46p3N30j08k69K43q8J07j45O5J9RJ15j58j12K58k7l8j13K41l07K36
3134E8J94j60KL4K3k31J23J23J72j13j11m8O0L5J3k02K26k33J8J67L46k35n2o8
$$ plain form
2977 -175 -60 -218 -179 224 -263 -250 103 -105 13 154 152 -58 251 -300 161 411 194 101 676 -227 448 -268
2999 -268 -12 279 922 80 -765 630 -322 -31 441 1037 347 348 -701 -547 312 5 -140 18 -110 238
3019 238 60 -81 302 78 -170 272 307 192 -185 69 -150 -334 -209 -154 -114 -252 -257 -55 -151 -68 42 -217
3041 -217 98 -95 -124 -21 -234 -202 -116 -52 -147 -198 -78 -223 -75 147 -123 -77 -166 -55 131 56 199 298 135
3064 135 91 -89 382 225 34 180 92 -138 -118 37 -11 130 232 152 198 -64 256 212 352 279 106 29 60
3087 60 99 64 -230 -17 19 -149 182 7 -64 -141 -30 365 151 -85 -79 -83 -232 98 -168 -43 -205 -340 -280 -162
3111 -162 -181 -327 -400 130 22 -247 -4 -92 15 -130 -65 -46 -37 78 -80 -192 66 39 1 -112 129 -178 58
3134 58 252 92 94 128 151 -80 43 166 338 225 114 66 126 161 174 -28 198 -35 -17 150 496 261 209 141
3158A41j15J53j30Q8j30r7j73N9o0J32J86j91M16o4l33J24j18q8J95Jj92J70K10
3181A84j48k77L7p6Q1o1K90M1l40J0L43j78L8q8J64l7k65J80j53L55n3m5p8J27
3205E1O6r5J7M6j13K7L01l09j45K16J3o2P4J0J47j53l7R7p1K1K1l85N87j87j69
3230c2L54j42j12R1r8J14l2j11K19k31Q1J10o18M96Jp0n9l8k92L97l69M22J53
3253B34l73J42M0j06O4j39p9J60l55N64k43rK34l19RQ3k08K86j29k5J42O0k94
3276b61M45k95l1J66l39L03qk5j43L17o0N6%N7o0j6l15K87Q4M1l99K73Lj01L27
3301C06l31K75p5N2j7q2p7P8p7j65K4J80j86N9k80J38J87P8K49l92M9r5N2M7L3
3326C0l4P6k83K6K15m51K68Jn4K8k60K14J86r1o7K45l38K73q0l8J93k65K51J14
$$ plain form
3158 141 26 179 49 137 7 -90 -263 -204 -264 -132 54 -137 279 215 -118 6 -112 -200 -5 -4 -196 -26 184
3181 184 36 -241 -204 -280 -199 -260 30 71 -269 -259 84 -94 -56 -144 20 -17 -282 -102 -255 100 47 2 -76 51
3205 51 117 22 39 85 -28 -1 300 -9 -154 62 75 13 87 97 244 91 54 151 80 101 122 -263 324 137 -32
3230 -32 322 180 68 159 61 175 143 32 251 20 101 211 -407 89 90 20 -39 -77 -369 28 -341 81 234
3253 234 -139 3 43 -63 1 -138 -217 -57 -412 152 -91 -100 134 -185 -176 -93 -301 -15 -144 -169 -27 33 -261
3276 -261 184 -111 -142 24 -315 -12 -20 -45 -188 129 69 125 125 182 122 106 -209 78 162 203 -196 77 80 -21 306
3301 306 -25 250 175 227 210 128 51 129 52 -113 -89 91 -95 -36 -316 -178 9 87 336 -56 -7 -102 -50 -3 30
3326 30 -4 72 -211 -185 30 -421 -153 -152 -206 -178 -438 -224 -38 -129 -196 49 -289 -16 -96 -134 59 -206 45 159
3350A59j18r2k78J48L40m60K27J63k1R4J0j98L17l05J35J15j25j56K62k30jq8
3372a02j1M56m52j07K12r0P7M9j52N4L13Nl8k86K47J31k32p5j81K02R2J68n37
3395b57J72oR6J38j44L0K8j49J57k92K11j64J91j55j89J07k0N4K66j97Q0J89n06
3418c60L59j63k33J81L18l30K98j25j42K14k45j3K79l51L41j5r6M1j8j3M12l27
3440A2J62n4k6J04k43k6J49o1K99j20n0J94m75M16r8n2O6k4l90N10l07J39J55
3463B80m57K69q7J11rM1l97K73l21M25j4k10K09l85j5L50%l61K17J3p3R7j42J04
$$ plain form
3350 159 41 -51 -329 -181 159 -301 -74 89 68 162 172 -26 291 -14 121 236 111 -45 217 -13 -14 -102
3372 -102 -113 343 -109 -216 -4 -94 -17 32 -120 -66 247 252 214 -72 175 306 74 -1 -182 20 112 280 -257
3395 -257 -85 -91 5 143 -1 29 57 -92 65 -227 -16 -180 11 -144 -333 -226 -246 -192 74 -123 -43 146 -360
3418 -360 -1 -164 -397 -216 102 -228 70 -55 -197 17 -228 -241 38 -313 28 13 -83 -42 -60 -73 339 12
3440 12 174 120 94 198 -45 -71 78 17 316 196 146 340 -135 281 183 131 197 173 -217 293 -14 125 280
3463 280 -177 92 5 116 107 148 -249 24 -297 128 114 -96 113 -272 -287 63 63 -298 -81 -68 -141 -44 -186 -82
$$ [...]
8191A55
##END NTUPLES=NMR FID
##END=
