##TITLE=1H_SAV32-singlet-bat36
 CDCl3
 8 sc, 
 20.11.2023
##JCAMPDX= 6.0         $$ Bruker NMR JCAMP-DX V2.0
##DATA TYPE= NMR FID
##DATA CLASS= NTUPLES
##ORIGIN= UXNMR, Bruker Analytische Messtechnik GmbH
##OWNER= root
$$ XWIN-NMR		Version 3.5
$$ Mon Nov 20 14:10:45 2023 Russian Standard Time (UT+4h)  she@DPX200
##.OBSERVE FREQUENCY= 200.1313
##.OBSERVE NUCLEUS= ^1H
##.DELAY= (6, 6)
##.ACQUISITION MODE= SIMULTANEOUS
##.ACQUISITION SCHEME= undefined
##.AVERAGES= 8
##.DIGITISER RES= 18
##SPECTROMETER/DATA SYSTEM= spect
##.PULSE SEQUENCE= zg30
##.SOLVENT NAME= D2O
##.SHIFT REFERENCE= (INTERNAL, D2O, 0, 15.7039)
##AUDIT TRAIL= $$ (NUMBER, WHEN, WHO, WHERE, WHAT)
$$ ##TITLE= Audit trail, XWIN-NMR		Version 3.5
$$ ##JCAMPDX= 5.01
$$ ##ORIGIN= Bruker BioSpin GmbH
$$ ##OWNER= she
$$ F:/spectra/data/she/nmr/H-F/1/audita.txt
$$ ##AUDIT TRAIL=  $$ (NUMBER, WHEN, WHO, WHERE, WHAT)
(   1,<2023-11-20 14:09:15.87 +0400>,<she>,<DPX200>,
      <created by zg, POWCHK disabled, PULCHK disabled
       configuration hash MD5:
       00 E9 B6 7A A2 85 ED C7 34 08 36 98 17 FE 4E 26
       data hash MD5: 16K
       03 35 CF 7D 1C 8D 3E BA E6 0F 8F E5 19 25 25 A9>)
$$ ##END=
$$ 
$$ hash MD5
$$ 30 40 84 0A 70 1F 40 9B 2E 67 9A 0B 60 64 01 8F
##$RELAX= 
##$RELAX= 
##$RELAX= 
##$RELAX= 
##$RELAX= 
##$RELAX= 
$$ Bruker specific parameters
$$ --------------------------
##$DU= <F:/spectra>
##$EXPNO= 1
##$NAME= <H-F>
##$PROCNO= 1
##$TYPE= <nmr>
##$USER= <she>
##$AMP= (0..31)
100 100 100 100 100 100 100 100 100 100 100 100 100 100 100 100 100 100 
100 100 100 100 100 100 100 100 100 100 100 100 100 100 
##$AQSEQ= 0
##$AQ_mod= 1
##$AUNM= <au_zg>
##$AUTOPOS= <>
##$BF1= 200.13
##$BF2= 200.13
##$BF3= 200.13
##$BF4= 200.13
##$BF5= 200.13
##$BF6= 200.13
##$BF7= 200.13
##$BF8= 200.13
##$BYTORDA= 1
##$CFDGTYP= 0
##$CFRGTYP= 5
##$CHEMSTR= <none>
##$CNST= (0..31)
1 1 145 1 1 1 1 1 1 1 1 1 1 1 1 1 1 1 1 1 1 1 1 1 1 1 1 1 1 1 1 1 
##$CPDPRG= <>
##$CPDPRG1= <>
##$CPDPRG2= <>
##$CPDPRG3= <>
##$CPDPRG4= <mlev>
##$CPDPRG5= <mlev>
##$CPDPRG6= <mlev>
##$CPDPRG7= <mlev>
##$CPDPRG8= <mlev>
##$CPDPRGB= <>
##$CPDPRGT= <>
##$D= (0..31)
0 1.2 0 0 0 0 0 0 0 0.06 0 0.03 0 0 0 0 0.0002 0 0 0 0 0 0 0 0 0 0 0 0 
0 0 0 
##$DATE= 1700474955
##$DBL= (0..7)
120 120 120 120 120 120 120 120 
##$DBP= (0..7)
150 150 150 150 150 150 150 150 
##$DBP07= 0
##$DBPNAM0= <>
##$DBPNAM1= <>
##$DBPNAM2= <>
##$DBPNAM3= <>
##$DBPNAM4= <>
##$DBPNAM5= <>
##$DBPNAM6= <>
##$DBPNAM7= <>
##$DBPOAL= (0..7)
0.5 0.5 0.5 0.5 0.5 0.5 0.5 0.5 
##$DBPOFFS= (0..7)
0 0 0 0 0 0 0 0 
##$DE= 6
##$DECBNUC= <off>
##$DECIM= 32
##$DECNUC= <off>
##$DECSTAT= 4
##$DIGMOD= 1
##$DIGTYP= 9
##$DL= (0..7)
0 120 120 120 120 120 120 120 
##$DP= (0..7)
150 150 150 150 150 150 150 150 
##$DP07= 0
##$DPNAME0= <>
##$DPNAME1= <>
##$DPNAME2= <>
##$DPNAME3= <>
##$DPNAME4= <>
##$DPNAME5= <>
##$DPNAME6= <>
##$DPNAME7= <>
##$DPOAL= (0..7)
0.5 0.5 0.5 0.5 0.5 0.5 0.5 0.5 
##$DPOFFS= (0..7)
0 0 0 0 0 0 0 0 
##$DQDMODE= 0
##$DR= 18
##$DS= 0
##$DSLIST= <SSSSSSSSSSSSSSS>
$$ [...]
##$SUBNAM2= <"">
##$SUBNAM3= <"">
##$SUBNAM4= <"">
##$SUBNAM5= <"">
##$SUBNAM6= <"">
##$SUBNAM7= <"">
##$SUBNAM8= <"">
##$SUBNAM9= <"">
##$SW= 18.0517328524113
##$SWIBOX= (0..15)
0 0 2 0 0 0 0 0 0 0 0 0 0 0 0 0 
##$SW_h= 3612.71676300578
##$TD= 16384
##$TD0= 1
##$TE= 0
##$TE2= 300
##$TE3= 300
##$TEG= 300
##$TL= (0..7)
0 120 120 120 120 120 120 120 
##$TP= (0..7)
150 150 150 150 150 150 150 150 
##$TP07= 0
##$TPNAME0= <>
##$TPNAME1= <>
##$TPNAME2= <>
##$TPNAME3= <>
##$TPNAME4= <>
##$TPNAME5= <>
##$TPNAME6= <>
##$TPNAME7= <>
##$TPOAL= (0..7)
0.5 0.5 0.5 0.5 0.5 0.5 0.5 0.5 
##$TPOFFS= (0..7)
0 0 0 0 0 0 0 0 
##$TUNHIN= 0
##$TUNHOUT= 0
##$TUNXOUT= 0
##$USERA1= <user>
##$USERA2= <user>
##$USERA3= <user>
##$USERA4= <user>
##$USERA5= <user>
##$V9= 5
##$VALIST= <valist>
##$VCLIST= <CCCCCCCCCCCCCCC>
##$VD= 0
##$VDLIST= <DDDDDDDDDDDDDDD>
##$VPLIST= <PPPPPPPPPPPPPPP>
##$VTLIST= <TTTTTTTTTTTTTTT>
##$WBST= 1024
##$WBSW= 4
##$XGAIN= (0..3)
0 0 0 0 
##$XL= 0
##$YL= 0
##$YMAX_a= 433148
##$YMIN_a= -504793
##$ZGOPTNS= <>
##$ZL1= 120
##$ZL2= 120
##$ZL3= 120
##$ZL4= 120
##$ABSF1= 10
##$ABSF2= 0
##$ABSG= 5
##$ABSL= 3
##$ALPHA= 0
##$AQORDER= 0
##$ASSFAC= 0
##$ASSFACI= 0
##$ASSFACX= 0
##$ASSWID= 0
##$AUNMP= <proc_1d>
##$AZFE= 0.1
##$AZFW= 0.1
##$BCFW= 1
##$BC_mod= 2
##$BYTORDP= 1
##$COROFFS= 0
##$CY= 11.3945322036743
##$DATMOD= 1
##$DC= 2
##$DFILT= <>
##$DTYPP= 0
##$F1P= 15.7292609196834
##$F2P= 12.9074282941183
##$FCOR= 0.5
##$FTSIZE= 0
##$FT_mod= 4
##$GAMMA= 1
##$GB= 0.15
##$INTBC= 1
##$INTSCL= 1
##$ISEN= 128
##$LB= 0.24
##$LEV0= 0
##$LPBIN= 0
##$MAXI= 10000
##$MC2= 0
##$MEAN= 0
##$ME_mod= 0
##$MI= 1.114404
##$NCOEF= 0
##$NC_proc= 0
##$NLEV= 6
##$NOISF1= 3.799351
##$NOISF2= 2.8
##$NSP= 1
##$NTH_PI= 0
##$NZP= 0
##$OFFSET= 15.70392
##$PC= 1
##$PHC0= -23876.04
##$PHC1= 18.85269
##$PH_mod= 1
##$PKNL= yes
##$PPARMOD= 0
##$PSCAL= 0
##$PSIGN= 0
##$REVERSE= no
##$SF= 200.130013532006
##$SI= 16384
##$SIGF1= 3
##$SIGF2= 2
##$SINO= 400
##$SIOLD= 16384
##$SREGLST= <1H.CDCl3>
##$SSB= 0
##$STSI= 0
##$STSR= 0
##$SW_p= 3612.71676300578
##$SYMM= 0
##$S_DEV= 0
##$TDeff= 0
##$TDoff= 0
##$TI= <>
##$TILT= no
##$TM1= 0
##$TM2= 0
##$TOPLEV= 0
##$USERP1= <user>
##$USERP2= <user>
##$USERP3= <user>
##$USERP4= <user>
##$USERP5= <user>
##$WDW= 1
##$XDIM= 8192
##$YMAX_p= 0
##$YMIN_p= 0
$$ End of Bruker specific parameters
$$ ---------------------------------
##NTUPLES= NMR FID
##VAR_NAME=  TIME,          FID/REAL,        FID/IMAG
##SYMBOL=    X,             R,               I
##VAR_TYPE=  INDEPENDENT,   DEPENDENT,       DEPENDENT
##VAR_FORM=  AFFN,          ASDF,            ASDF
##VAR_DIM=   8192,          8192,            8192
##UNITS=     SECONDS,       ARBITRARY UNITS, ARBITRARY UNITS
##FACTOR=    0.0002768,     1,               1
##FIRST=     0,             0,               0
##LAST=      2.2672688,     0,               0
##MIN=       0,             -504793,         0
##MAX=       2.2672688,     433148,          0
$$ Real data points
##PAGE= N=1
##DATA TABLE= (X++(R..R)), XYDATA
0 0 0 0 0 0 0 0 0 0 0 0 0 0 0 0 8 -8 8 -8 8 -12 16 -16 20 -24 27 -32 36 -40 47 -52 60 -68 76 -85 98 -108 120
37 120 -136 152 -168 186 -204 227 -250 276 -304 335 -369 406 -446 492 -543 598 -663 735 -818
56 -818 915 -1029 1165 -1330 1536 -1799 2149 -2636 3350 -4483 6498 -10778 23322 -129885
70 -129885 -504793 89083 296260 -224784 -149021 256856 -3291 -238387 84008 161582
80 161582 -94014 -27732 81243 -91319 -73717 135905 53293 -99794 -1284 55748 -40700
91 -40700 -20954 62670 10512 -62574 -8937 56472 18322 -35043 -9348 15827 -9054 3269
103 3269 35994 -20652 -66246 17447 52826 -30505 -14148 50988 -42124 -78936 72941 81357
115 81357 -64577 -37218 42201 -23814 -12760 84903 14130 -76344 8002 33173 -37309 29819
127 29819 73707 -66429 -77381 68647 26526 -73060 24770 54177 -73731 -39487 80869
138 80869 10533 -56974 36111 39681 -51425 4351 66753 -31750 -50043 63132 31390 -73853
150 -73853 -15668 49888 -21372 -33530 48211 20643 -63248 -21225 42300 3653 -10757 26341
162 26341 -14654 -55873 20928 66576 -4828 -30664 19950 125 -46240 13770 63947 -19009
174 -19009 -67820 7742 32391 -20441 -834 36725 -15383 -41207 19037 26333 -22026 510
186 510 29175 -22473 -24594 45088 18878 -48407 -1 43023 -17847 -32730 17361 -1192 -29893
199 -29893 15720 26145 -23826 -13208 16431 -14535 -2521 48575 -591 -57977 3601 38705
211 38705 -14744 -3818 39136 -13756 -52108 14997 41153 -9795 -8301 11424 -30631 -26479
223 -26479 40924 26100 -34429 -9341 20395 -22011 -21510 38927 25701 -39075 -21084 30251
235 30251 5330 -22529 12707 16222 -22259 -6753 23338 -7210 -22171 17694 15410 -25585
247 -25585 -4153 25033 -20413 -29335 39318 31791 -38834 -17677 29938 -4433 -15190 33107
259 33107 14167 -42151 -13152 26285 -3574 -4810 28501 -11049 -47198 13648 41186 -15730
271 -15730 -19306 21589 -7711 -35121 17203 40204 -10698 -21039 13574 2607 -12485 16288
283 16288 12819 -22772 -6414 17249 -11647 -16887 21479 12943 -24129 -714 27411 -10932 -27388
296 -27388 19707 25071 -14831 -6534 13412 -8493 -5425 26899 10449 -22105 -6319 2755 -20151
309 -20151 435 34279 -6097 -43639 1704 26006 -8929 -1423 27686 -4829 -30323 9779
321 9779 26636 -2769 844 15418 -15521 -20427 24816 18360 -24000 -4228 21360 -15768 -25863
334 -25863 20624 20187 -22887 -11720 19900 -1232 -18110 9687 13479 -7155 5892 12128 -14738
347 -14738 -7734 22717 6205 -16836 5395 9774 -23977 -13758 28331 12069 -24059 -7833
359 -7833 4661 -10921 4902 24832 -3417 -19161 5676 5820 -8527 15963 24092 -21501 -28941
372 -28941 17499 14556 -19370 1986 18913 -18000 -22210 17998 13898 -13209 1226 9792 -16189
385 -16189 -9216 21459 2501 -18922 13464 18964 -21991 -13667 22915 2671 -21556 7380 14738
398 14738 -23051 -18550 19235 11668 -8688 5677 1426 -20859 3267 27816 -710 -14745 9219
411 9219 501 -20589 9176 32061 -6525 -27686 2408 7054 -13818 3050 15751 -12775 -17931
424 -17931 7441 4029 -7896 10455 12416 -16782 -12363 18702 6640 -15661 8379 18232 -15318
437 -15318 -14452 16960 7193 -13220 4113 10372 -14168 -11511 9868 -1470 -8433 14375 3713
450 3713 -26898 -4237 24891 640 -10767 13879 3569 -21845 1290 24659 1093 -11991
462 -11991 3534 -5141 -15252 10520 16272 -12449 -10254 8516 -7490 -14163 15060 16600 -14800
475 -14800 -12602 13448 4020 -10545 9564 16008 -9390 -10467 8602 1525 -6439 8237 5713
488 5713 -14120 -4181 12353 -6800 -13402 16469 13701 -20683 -11063 14801 -781 -5240 18269
501 18269 7184 -20017 -3952 14155 -533 667 13140 -11172 -26159 8569 19615 -9698
513 -9698 -5383 12160 -11112 -18261 16057 19830 -7629 -6584 6132 -4596 -3550 16856 9334
526 9334 -11072 -1192 5704 -11190 -5305 16202 2427 -20533 -6116 11440 -4072 -10720 9207
539 9207 9506 -10407 -4037 9839 -1876 -3306 13553 5336 -12050 -18 6735 -9200 -2801 18075
553 18075 -283 -23549 -2219 12775 -6931 -3065 14268 -3527 -16562 4915 10991 -2658
565 -2658 5850 10989 -11730 -11733 14028 7049 -12708 4197 10802 -18431 -17215 13970 9629 -10307
579 -10307 -2370 3433 -9392 -4540 11953 5908 -3900 3825 -78 -10014 5718 17372 -1517 -9221
593 -9221 4499 -333 -12165 1533 14289 -911 -12752 -3678 -901 -3351 6612 8873 -7739
606 -7739 -9561 2762 1218 -1959 10200 10832 -9612 -12333 9230 11244 -5862 -1236 8589 -8189
620 -8189 -15498 4820 8974 -5717 -2942 3966 -7733 -7851 10633 5615 -10219 3527 11044 -10919
634 -10919 -9158 15699 7122 -10301 3757 9114 -9200 -7522 9197 4749 -3784 914 -4422 -11654
648 -11654 2899 10526 -2523 -3314 2120 -7805 -7710 10033 11536 -1677 -4803 -2646 -1552 3751 7940
663 7940 2612 -3949 -3931 -4024 -2648 4860 7035 -1562 -7944 -5059 2853 4917 621 3577 6653 -5392
679 -5392 -8652 6825 9615 -2019 -257 3494 -7041 -6783 6951 3619 -5677 2750 1059 -14333
693 -14333 -2900 14437 -857 -8933 7235 2681 -11857 3053 16260 1886 -4722 3503 -3297
706 -3297 -6950 7713 8251 -7845 -3601 3805 -9044 -7904 11173 8012 -9847 -6251 5013 512
720 512 -2475 7166 8360 -3487 -4839 2634 1805 585 5706 2199 -8264 -6619 2749 559 -4445
735 -4445 4026 5758 -10056 -9747 8210 6929 -4656 1893 6046 -5556 -5498 6462 6908 1082 2576
750 2576 -1642 -9310 347 9476 -1169 -4981 2435 -5491 -11730 3967 12108 -1418 -5940 746
764 746 -1663 -2598 8133 6801 -5853 -2482 3593 -6429 -4699 11372 4033 -12652 -3314 6374
778 6374 -4336 -6100 8344 6037 -8819 -5514 4052 -387 222 8372 1724 -7209 -313 4072 -1243
793 -1243 1966 8197 -927 -10820 -2885 6502 144 -3087 3036 -1394 -9632 -3754 5526 4022 214
808 214 -1584 -4864 -3644 4839 7042 -447 -33 4126 -4399 -6803 6977 8684 -4668 -5290 2003
823 2003 -2602 -5845 3866 5526 -3894 -3696 -257 -5291 -569 10142 2438 -7816 387 4156 -4128
838 -4128 45 10198 2304 -8453 -3416 2317 -1574 -110 4264 -2405 -5835 -1616 -1828 -613 6837
853 6837 4602 -6300 -5319 3276 3978 523 4222 4153 -4977 -6070 3083 4792 1440 982 -2481 -7141
869 -7141 -2173 4748 1366 -2213 2244 1816 -7356 -2739 10810 5959 -5122 480 4189 -4704 -3219
884 -3219 7527 4554 -5359 -3466 -327 -4823 -1168 6484 132 -6879 -353 357 -4559 2665 10477
899 10477 1727 -6424 -1037 4876 2715 2638 4401 -727 -5343 -2693 -99 1429 3504 -1393 -7908
914 -7908 -4359 2106 500 -1018 2885 2487 -5470 -4541 4621 4521 733 2863 620 -4526 -468 4906
930 4906 1173 -391 2638 -2491 -9786 -607 8879 -60 -6436 2166 280 -7959 -263 10143 3020
945 3020 -4583 -1566 191 -1552 3576 6878 -866 -4267 -32 -1803 -3557 4906 6290 -4437 -7399
960 -7399 524 2057 -1122 2130 4897 -2423 -6324 403 3443 1502 3085 658 -5370 -2867 3321
975 3321 1143 -885 3064 685 -7813 -4104 6076 2538 -3535 1439 2211 -4552 -1513 4690 3289
990 3289 1030 1285 -2667 -4543 1410 4787 -767 -2397 1325 -3286 -6657 1021 5641 -99 -3456
1005 -3456 -2435 -2507 -354 3295 3254 210 -117 -1220 -3147 2252 8826 2947 -5076 -793 1441 -2860
1021 -2860 68 5981 424 -7286 -3908 787 -1203 1077 4870 -1927 -6367 904 2528 -1128 4264
1036 4264 6808 -3762 -8413 1696 6583 479 -1016 2159 -2714 -6210 579 5213 1297 -1108
1050 -1108 -2168 -3404 -570 3466 3162 67 -496 704 -1455 -1604 4309 4421 -1596 -2611 33 -1015
1066 -1015 -1220 1512 1313 -1526 -2072 -2211 -2752 1172 5248 -172 -3225 2225 1280 -3700 2473 7550
1082 7550 214 -4217 -44 63 -1373 2897 3871 -3020 -4373 -789 -2322 -840 5729 2156 -6296
1097 -6296 -3430 2344 1677 1664 4367 1965 -3252 -3361 1672 4990 3617 -1 -3590 -3628 -1555 520
1113 520 2292 1106 -2994 -4305 -3607 4 5200 3645 -2811 -2577 1078 297 697 4383 2823 -2249
1129 -2249 -2684 -47 742 1453 2507 -1039 -3792 -1155 -934 -2248 2665 3905 -2075 -4233 303 2079
1145 2079 773 1279 1923 -324 -2675 -1664 471 2188 2456 -1101 -3428 -1682 -694 -14 1670 1684 -679
1162 -679 -2637 -2905 291 4073 3275 -57 -1242 -1172 -328 696 2566 3280 -274 -4282 -3499 468 3344
1179 3344 1214 -1830 -1431 -2031 -3480 420 5536 2821 -3248 -3171 -226 1186 2687 3581 616 -3563
1195 -3563 -1612 199 -86 2323 3121 -2731 -5566 -808 1760 -478 126 2008 -1958 -5039 -170 3834
1211 3834 2281 1342 724 -1875 -1366 1839 2012 1835 1890 -1086 -3654 -1781 2070 1558 -999 -1407 -1870
1228 -1870 -2897 -965 994 1811 1763 -1221 -3434 -536 2528 2428 1649 1143 -265 -2113 -1612 2388 3850
1245 3850 545 -2840 -2579 -1844 -840 1544 2894 387 -3274 -2169 364 1599 3855 2932 -2902 -2457
1261 -2457 2012 300 -988 3893 2553 -4867 -4362 1858 1838 -1160 1183 -189 -4718 -1743 2157 850
1277 850 1343 3509 -535 -4096 449 4878 1941 -586 917 -437 -3952 -1449 3598 2182 -2092
1292 -2092 -2975 -2270 -1493 117 2537 2153 -1241 -1979 -516 154 2253 4533 460 -3280 -1005 921
1308 921 403 271 1909 -202 -3816 -3350 -331 1614 1069 -170 -2102 -1708 -603 -91 2733 4583 314
1325 314 -3217 -803 1809 1232 1959 2016 -1500 -3413 -733 733 -27 1090 446 -3882 -3878 989 2313
1342 2313 95 753 1292 -1947 -3322 1854 4717 1019 -968 -175 -1579 -1690 2207 2960 189 -1244
1358 -1244 -1648 -2384 -1237 3067 2487 -2405 -2038 418 -901 -285 3893 3192 -1869 -2654 -303 1068 1458
1375 1458 2111 358 -2298 -1806 -449 -224 1224 2208 -1392 -3722 -1490 931 905 1352 1779 121 -2667
1392 -2667 -1465 2362 3218 1461 -204 -2396 -2055 536 1722 1022 472 -1214 -2993 -2380 1187 2399
1408 2399 -206 -631 -463 -1610 72 2748 1986 941 943 -1638 -2556 1618 4147 -312 -1854 -185 -1446
1425 -1446 -3750 882 4408 -1025 -3509 -713 -247 -1070 2513 3395 -412 -1757 290 223 168 3319 3258
1442 3258 -2456 -3334 664 861 -854 980 1087 -2531 -4152 -453 2219 954 525 478 -1828 -1686 1566
1459 1566 2383 1719 1533 -530 -2965 -1071 2454 2431 -134 -1139 -2231 -2660 -616 1750 1091 -267 -1325
1476 -1325 -2721 -631 3537 2575 295 632 206 -1610 -656 2999 2489 -1305 -1735 -886 -1658 -142 1913
1493 1913 295 -1676 -1903 -1775 -1102 1443 2607 140 -1886 -267 1053 234 1421 2776 668 -1957
1509 -1957 -1045 455 1096 1391 390 -1351 -1943 -1190 -456 -168 1382 958 -2496 -2210 858 1437 824 1858
1527 1858 928 -2158 -2101 863 2352 1383 225 -1551 -3019 -1236 1544 1470 486 -490 -2285 -2472 552
1544 552 2412 2445 -150 -2075 -1608 233 1795 2237 1540 -91 -2317 -2342 1116 3002 225 -1305 -1529
1561 -1529 -1670 -1316 934 2365 843 -1470 -830 -492 528 2211 2257 -278 -1594 -381 -390 -395 1035 1753
1579 1753 -960 -2964 -1001 769 -94 58 401 -668 -1628 -739 1059 2148 1392 7 146 -220 -620
1596 -620 645 2006 1383 -412 -1884 -1496 -754 1249 1876 -812 -2767 -1674 -507 -219 1636 2302 -479
1613 -479 -3015 -760 2175 2316 1026 888 -434 -2686 -979 2332 2015 463 -1049 -2555 -2227 183
1629 183 2280 652 -846 -1259 -1844 -989 2384 3189 418 -1108 -1027 -761 1254 2439 1307 -536 -1035
1646 -1035 -1823 -1727 1413 2327 -656 -2870 -916 13 -676 1102 2167 -480 -1645 -47 858 645 1188
1663 1188 1371 -205 -1249 -222 14 -127 791 904 -1563 -2601 -797 358 187 688 660 -1135 -1868
1680 -1868 270 1999 1579 1359 -322 -2074 -414 1568 585 240 983 -1076 -3457 -939 1971 639
1696 639 -821 -345 -2003 -2528 1261 2983 1121 541 187 -1721 -860 2927 2667 -516 -1189 -794 -1351
1713 -1351 -561 2068 1815 -1026 -2627 -2154 -237 1202 1023 299 -478 -1211 -1037 654 2293 1914 -156
1730 -156 -1851 -880 554 632 909 648 -1031 -1881 -1083 -211 523 1292 624 -1830 -1856 870 1265 99 2157
1749 2157 1671 -2290 -2247 1889 2066 -197 334 350 -2259 -1311 1447 715 -549 67 -988 -2921 -79
1766 -79 2581 858 -111 253 -559 -1367 825 2904 1632 -306 -969 -1086 -436 1426 1091 17 -698 -1893
1784 -1893 -2165 -36 1929 1145 -1245 -1529 -391 82 709 2347 1380 -813 -1360 -460 496 1459 1106 -271
1802 -271 -1814 -1675 -242 99 505 755 -934 -3043 -1407 1053 1290 464 350 -213 -1085 -380 1662 2199
1820 2199 764 -505 -1231 -1189 568 1398 65 -29 -726 -2342 -1398 938 1258 3 -593 -615 -662 116 2004
1839 2004 1606 225 -134 -884 -1238 773 2117 527 -1317 -1076 -594 -1034 404 1966 343 -1573 -1372
1856 -1372 -344 1004 1960 1114 81 -420 -385 72 1478 1579 341 -1100 -1411 -860 520 820 469 -769
1874 -769 -986 -1120 -717 1059 2061 790 -915 -799 -176 905 1327 1432 660 -977 -1919 -438 1456
1891 1456 1157 -146 -1036 -1677 -1535 -135 1335 450 -652 -516 -1101 -957 2017 2319 115 -601 235 -637
1909 -637 -701 1587 1797 -310 -1519 -1080 -350 157 910 230 -1255 -1453 -1155 -471 1436 1598 -83 -1352
1927 -1352 -596 9 775 1338 1255 1 -950 -1002 -17 1449 1135 -147 -1435 -1376 -369 481 876 536 -339
1946 -339 -757 -1029 245 1642 1148 174 -386 -599 -639 139 1226 1466 -471 -1628 -1528 -59 917 531
1964 531 20 -481 -1659 -1164 671 1899 1194 93 -764 -1044 339 1340 1352 512 -352 -1148 -1283 -240
1982 -240 1530 667 -1080 -1671 -1093 -822 409 1312 1060 -680 -1308 -480 929 1569 1165 -23 -972 -472
2000 -472 -205 612 1645 696 -1164 -1806 -1028 255 672 479 -504 -1254 -726 54 188 1379 1576 -596
2018 -596 -1478 294 807 200 728 703 -478 -1643 -453 716 375 175 -174 -1752 -1479 535 847 519
2036 519 833 -44 -1055 -720 752 1882 439 -309 -435 -1244 -895 788 1327 382 -1232 -1572 -988 -95
2054 -95 766 821 -151 -856 -839 -390 1303 2070 686 -1008 -1315 -41 705 1186 1063 -200 -1495 -1312 -730
2073 -730 889 1490 326 -1531 -1392 105 436 813 1528 57 -1369 -281 490 936 1372 807 -898
2090 -898 -1127 -87 431 -31 473 549 -1705 -1875 486 824 119 220 426 -812 -672 595 1585 552
2108 552 360 58 -835 -714 1079 1060 -29 41 -332 -1464 -1302 739 931 -692 -1100 -281 -545 -43 1804
2127 1804 1423 -59 -525 -913 -287 1209 1685 636 -763 -1091 -781 -252 1391 1189 -715 -1969 -1299
2144 -1299 -427 1092 1724 10 -1558 -722 335 261 1026 1618 -106 -1798 -637 893 243 442 650
2161 650 -998 -2114 -680 757 481 250 291 -1129 -1262 475 1508 468 26 482 -692 -800 832
2178 832 1446 59 -765 -473 -681 -1123 382 857 -185 -609 -526 -1074 -399 1113 895 -16 -146 140 -469
2197 -469 106 1337 1443 -571 -901 -315 -304 218 1197 -81 -1163 -1151 -1009 -234 1013 1167 -150 -1334
2215 -1334 -708 708 874 1338 582 -771 -802 -85 566 845 760 -621 -1566 -747 146 -137 220 947 -714
2234 -714 -2137 -269 1092 482 978 850 -825 -1116 782 1139 560 78 -231 -1067 -1113 1051 1199 -539
2252 -539 -739 -338 -1061 -766 599 1141 403 -719 -561 -211 137 993 1353 266 -777 -508 -30 502 646
2271 646 672 -776 -1260 -698 160 114 503 400 -945 -1024 81 651 1044 1093 -448 -1000 -249 152 573 1265
2291 1265 509 -1342 -1506 -215 460 240 471 -613 -1476 -718 257 738 757 611 -488 -1253 238 947
2309 947 1143 771 50 -749 -911 -51 945 916 112 -1021 -1414 -247 610 626 506 -36 -942 -782 355 939
2329 939 1113 399 -485 -731 -190 205 931 957 -42 -1114 -939 -488 348 619 232 -627 -1334 -475 334 781
2349 781 1021 326 -855 -860 231 952 1106 182 -27 -621 -761 242 882 520 -518 -1409 -503 -413 -39 649
2369 649 491 -764 -692 -177 199 1032 1177 399 -701 -621 -81 666 383 185 -452 -959 -1114 -6 776 406
2389 406 -332 -691 -730 -557 605 1559 905 -309 -693 -434 339 727 945 307 -820 -897 -308 205 637 316
2409 316 -314 -1373 -722 -255 269 582 463 -127 -418 -763 831 1236 643 -47 -529 -631 -238 578 750
2428 750 214 -865 -1140 -731 387 717 123 -196 -755 -688 -143 670 1017 549 -254 -575 -355 592 827 888
2448 888 52 -829 -529 -419 108 641 235 -1010 -878 -791 326 730 647 414 -342 -858 49 685 954 547
2468 547 -321 -953 -475 -167 583 574 -394 -855 -898 -463 43 680 472 -277 -793 -320 121 555 1278 792 -533
2489 -533 -890 143 844 581 380 -270 -1082 -1010 25 608 571 29 -938 -1017 -11 812 699 673 144 -830
2509 -830 -476 219 399 948 471 -282 -1079 -514 319 590 92 28 -833 -1229 -20 1187 492 32 -391 -310
2529 -310 -170 386 1268 448 -67 -172 -144 -454 571 430 78 -561 -666 -708 -270 281 471 -227 -562 -466 -127
2550 -127 332 775 818 -149 -491 -120 -102 637 1198 381 -767 -845 -232 -321 242 705 -158 -1468 -966 379
2570 379 494 696 629 -373 -1002 26 819 652 612 117 -684 -1035 224 1129 597 -352 -673 -1241 -985 325
2590 325 908 143 -439 -1351 -551 448 1041 709 104 -314 -329 -518 848 1125 -165 -521 -290 -615 -77 500
2610 500 288 -478 -562 -246 -548 6 964 581 -368 -193 447 59 124 716 542 -196 -1054 -290 -138 67 516
2631 516 -25 -911 -910 99 6 660 876 244 -890 -651 314 866 607 490 62 -838 -147 619 505 457 -118
2652 -118 -793 -977 -172 813 258 -49 -348 -764 -473 1058 1350 236 131 -453 -474 274 1214 787 -346
2671 -346 -596 -703 -647 837 953 19 -1012 -606 -534 -275 620 871 -220 -478 -126 -25 758 1110 582 -468
2691 -468 -288 245 213 155 681 -166 -1126 -801 67 44 277 551 175 -826 -502 240 671 461 744 88 -688
2712 -688 -75 598 371 317 573 -340 -930 -292 486 259 83 -376 -622 -824 -75 709 605 230 -418 -510 -175
2733 -175 1057 965 411 -409 -671 -691 -123 777 665 -136 -473 -790 -271 646 386 346 -135 -508 -560 105 1113
2754 1113 836 -74 -528 -53 142 128 624 388 -439 -851 -690 26 29 391 61 -718 -496 -98 113 387 869
2775 869 253 -701 -349 468 725 555 356 -343 -716 -363 162 246 155 65 -513 -782 -32 558 335 210 -90
2796 -90 -468 -327 120 897 822 -174 -491 -168 -285 375 638 376 -499 -781 -712 125 64 126 -101 -840 -775 252
2818 252 208 731 525 127 -256 -465 394 851 614 -96 -494 -545 -298 470 556 81 -621 -673 -501 -120 511
2839 511 543 13 -587 -657 -82 572 669 494 95 -619 -775 175 341 422 -335 -584 -943 -613 114 625 4
2860 4 -432 -460 -645 -179 836 868 333 -88 -201 -248 367 791 198 -226 -748 -661 -266 38 461 -191 -653 -506
2882 -506 -507 239 665 641 -339 -428 -299 9 706 878 304 -259 -727 -454 218 446 275 -246 -582 -621 -442 554
2904 554 647 -76 -298 -507 -283 245 813 726 -204 -476 -305 65 657 447 190 -261 -769 -360 47 455 189
2925 189 -161 -461 -724 -548 709 553 -29 -25 -177 -186 26 964 603 -108 -543 -485 -204 127 114 340 -316 -677
2947 -677 -598 -326 419 391 420 -387 -520 108 553 548 511 197 -650 -313 -96 464 691 -165 -570 -508 -328 143
2969 143 354 179 -232 -552 -520 -33 591 675 373 -220 -316 -153 401 577 566 -270 -622 -703 91 439 281 -30
2991 -30 -255 -981 -645 371 439 240 -216 -336 -415 -273 570 809 506 171 -468 -595 -95 522 263 -125 -485
3012 -485 -627 -604 419 415 67 -368 -407 -217 7 878 674 -22 -471 -139 -187 266 497 140 -322 -553 -358
3033 -358 -71 424 654 -200 -676 -364 58 181 516 392 -391 -665 82 281 173 552 217 -161 -678 -112
3053 -112 146 42 222 -264 -1052 -594 172 276 -39 259 -76 -527 -73 645 396 223 43 -174 -499 -192
3073 -192 699 293 -52 -245 -216 -600 -85 479 336 8 -426 -224 -490 585 975 301 -273 -240 -317 123 776
3094 776 668 -133 -622 -544 -508 249 558 190 -709 -509 -272 8 651 707 24 -721 -316 44 675 755 554
3115 554 -449 -642 -11 294 84 564 227 -969 -710 37 387 -186 97 218 -489 -412 387 439 323 49
3135 49 -35 -248 -13 617 246 -138 -9 -261 -409 -260 478 215 109 -157 -278 -208 9 639 367 -117 -26
3156 -26 -484 -329 465 729 336 -335 -244 -193 -120 636 696 -388 -671 -656 -68 191 570 213 -218 -474 -221 55
3178 55 773 642 -47 -664 -409 142 515 465 380 -590 -720 -150 -78 380 343 122 -693 -526 177 457 384 360
3200 360 171 -519 -36 855 502 77 112 -174 -529 -176 502 107 -133 -99 -265 -542 221 439 113 -75 -171
3221 -171 32 -262 135 613 348 -74 -245 -354 -112 475 517 35 -451 -446 -362 -216 386 363 71 -122 -7 -239
3243 -239 334 838 112 -391 -343 134 177 197 761 100 -934 -549 -33 223 263 102 -208 -757 -177 370 462
3264 462 226 7 -153 -406 246 211 446 207 -590 -659 -440 122 381 200 10 -489 -556 -120 515 307 129
3285 129 0 -605 -142 430 420 546 198 -386 -470 -79 326 489 323 -276 -219 -157 -146 132 330 129 -191 -416
3307 -416 -245 2 379 340 -198 -370 -144 201 383 308 166 -503 -339 -390 -238 194 129 -15 -447 -287 23
3328 23 496 388 312 -374 -530 -72 329 305 481 237 -308 -575 -41 440 322 -2 -413 -504 -347 19 171
3349 171 323 -310 -175 -360 141 517 520 486 25 -149 -33 209 542 414 -73 -258 -403 -39 268 369 18
3370 18 -196 -261 -407 183 588 276 314 -209 -107 172 311 538 37 -17 -476 -578 13 213 411 -459 -507 -526
3392 -526 -169 33 51 296 -51 -284 -428 289 300 496 137 -118 -531 -156 393 463 235 -168 -820 -390 93
3413 93 394 255 -62 -293 -581 -221 345 631 399 158 -375 -222 239 434 438 50 -19 -600 -348 -15 339
3434 339 166 -384 -414 -495 -185 116 350 215 -262 -160 -105 459 567 199 47 -207 -318 -75 89 489 -120
3455 -120 -295 -522 -441 80 175 305 -103 -613 -245 -158 366 435 330 235 -401 -377 64 530 417 -19 -650 -507
3477 -507 -329 221 334 -109 -148 -472 -275 235 237 356 -110 -73 -341 -124 346 498 263 -343 -82 -178 139 544
3499 544 469 -330 -446 -448 -479 135 306 12 -157 -393 -415 -115 303 637 155 -226 -42 -149 52 653 468 129
3521 129 -629 -430 -105 169 576 20 -689 -639 54 197 3 388 289 -186 -52 353 322 522 387 0 -460
3542 -460 -122 226 200 127 -52 -647 -563 8 362 287 -48 -156 -376 101 277 846 525 228 31 -292 76
3563 76 192 244 -306 -219 -208 -551 89 114 298 99 -547 -325 -121 218 589 -17 -366 -37 -60 48 320 635
3585 635 282 -238 -310 17 -544 377 348 -223 -316 -354 -109 200 460 227 -25 -266 6 14 114 187 92 -495 -365
3608 -365 131 102 108 384 -249 -700 -223 239 78 178 -4 -104 -472 68 574 498 -12 179 -404 -308 214 402
3630 402 176 -516 -386 -270 -220 22 263 -214 -441 -303 -240 44 479 200 -197 54 -44 -53 476 527 204 -376
3652 -376 -182 -179 -161 57 236 -84 -259 -308 -159 -257 461 343 -46 -375 85 148 205 393 571 -63 -326 212
3674 212 160 187 608 126 -322 -17 -109 -44 252 23 -100 -228 -247 325 272 20 271 -424 -309 88 563 491
3696 491 184 -207 -352 -56 128 210 -2 -283 -454 -371 -39 352 425 -165 -166 -85 -106 431 728 655 186 -99 -390
3719 -390 57 312 210 162 -418 -511 -145 116 360 241 -312 -284 -177 -207 259 186 296 1 -335 -41 54 100
3741 100 336 250 -461 -274 -166 213 163 99 88 -545 -180 135 314 291 71 -174 -316 -156 263 293 166 152
3763 152 10 -339 -184 515 -101 103 -314 -482 -390 166 312 -165 -256 -507 -158 108 430 474 -14 -104 -162 -622
3785 -622 238 308 393 -197 -308 -281 -124 442 435 -134 -329 -283 -86 218 140 242 -184 -298 -73 52 285 312 151
3808 151 -63 -187 -271 -66 28 114 -49 -571 -512 -87 15 177 94 8 -140 -142 48 431 220 -32 -164 -550 18
3831 18 90 364 203 -114 -242 -304 -30 200 266 200 -331 -252 -338 182 466 410 49 -384 -53 63 302 304 87
3854 87 -43 -305 -250 1 98 238 -175 -400 -234 7 299 649 176 105 -127 -89 511 438 185 -68 -305 -37
3876 -37 243 335 407 200 -302 -374 165 71 153 324 -33 -328 -305 -122 278 414 30 25 -386 -262 121 263 110
3899 110 155 -194 -326 -204 110 196 -152 -195 -213 -76 95 168 222 -102 -202 -2 -365 229 130 70 337 -154 -112
3922 -112 40 57 472 -238 -91 -257 -140 136 248 -62 -327 -144 -133 341 683 433 122 -89 -366 -157 350
3943 350 197 125 84 -689 -313 -65 193 200 -164 -252 -62 86 37 353 18 -68 63 68 24 522 136 255 -335
3966 -335 -255 -145 -55 192 -15 220 -141 -411 -221 323 86 -140 -27 -184 -171 -109 584 504 -87 -82 -352 67
3988 67 189 347 106 -325 -111 -288 -169 133 307 103 -385 -491 -148 -15 197 370 -153 -228 -53 84 337
4009 337 136 -11 -273 -143 -220 28 324 75 -89 -300 -242 86 317 310 158 -212 -193 -182 168 339 73 -85
4031 -85 4 -105 132 296 129 -139 -352 -277 -195 40 247 186 123 -153 -370 108 322 293 243 -184 -341 -339 312
4054 312 307 129 -142 -300 -357 -64 288 363 -361 -374 -279 -304 71 192 130 -168 -302 129 -50 239 366 313 -96
4077 -96 -224 -270 30 -116 64 -324 -374 -54 -60 26 -3 239 -239 148 -138 -3 341 89 126 -114 -198 -83 230
4100 230 104 129 -100 -403 -91 260 89 218 111 -137 -213 -292 139 106 255 69 107 -198 252 507 275 175
4122 175 -322 -187 -236 -26 282 60 -6 -250 -308 -332 241 157 120 111 -76 161 232 22 241 -361 -180 -17 -152
4145 -152 291 334 58 -503 -439 -65 49 142 267 -384 -29 -343 108 49 93 359 -295 -363 -113 350 258 16
4167 16 -183 -76 -94 79 -90 158 155 -127 -205 -203 99 135 101 17 -12 -178 -66 258 358 38 116 15 -202 -86
4191 -86 315 306 14 -193 -170 -315 -56 216 160 -218 -182 -103 41 308 469 206 70 -87 -152 164 452 351 -212
4214 -212 -457 -222 24 17 202 188 -135 -401 133 125 387 244 236 -325 -298 248 419 302 71 -163 -311 -29 103
4237 103 212 129 -85 -78 -304 16 196 103 -60 149 -24 -276 65 -69 -322 -170 -40 -283 -315 -17 206 -28
4259 -28 -152 -390 -289 -68 50 169 -69 23 67 -47 -59 374 137 -78 -76 -30 77 412 494 -19 -473 -221 -10
4282 -10 12 -94 211 111 -433 -80 -257 -93 362 -61 -301 -307 -144 -169 73 211 -40 -245 -295 146 60 113 -12
4305 -12 -57 -480 -318 -67 107 -14 66 -304 -346 -214 -27 138 116 44 -23 -227 37 284 243 3 -194 -249 -8
4328 -8 106 30 -18 -311 -391 -255 354 393 103 33 -219 235 114 -79 123 153 -196 -115 -68 -30 194 119 143 -326
4352 -326 -248 -120 183 -19 -4 -256 -264 -260 105 456 227 142 -132 -283 -30 -41 -158 18 110 -272 -198 20 84 -3
4376 -3 -223 -21 -201 -41 36 481 163 143 74 -113 36 43 414 -15 -217 -164 -71 -8 -96 62 -286 -319 -275 307
4400 307 210 461 18 -52 -286 -208 359 276 163 -188 -57 -285 -20 -3 -19 59 -64 -359 -229 251 -86 300
4422 300 45 -348 -281 60 315 319 91 -68 19 -221 -139 81 89 106 -181 -238 -179 -119 -76 -1 -111 -104 -187 134 488
4447 488 565 110 163 -13 -56 112 177 -10 20 -337 -227 98 284 282 101 -17 -60 -24 -49 197 162 -48 -364 5
4471 5 453 329 181 -62 -154 -103 -52 -40 193 139 67 -433 -224 -87 210 203 115 -231 -295 -308 415 131 37 90 -178
4496 -178 -251 184 74 -84 97 -29 -151 -365 -72 172 23 -280 -46 -655 -226 160 -83 146 13 -29 27
4517 27 -256 96 120 -99 -384 -146 -115 -151 -1 -63 -141 7 -268 238 255 75 -169 27 -21 159 283 330 65
4540 65 8 -58 -188 -114 271 260 135 -184 -109 -197 25 337 -123 116 -275 -109 -174 -25 269 57 44 -4 -65 350
4564 350 338 224 41 -212 -272 -134 69 195 144 -110 -205 -267 6 12 222 119 -361 119 22 93 437 163 267
4587 267 -129 -64 225 -196 145 159 -288 -306 -218 115 29 -66 -56 -254 -87 203 392 415 -46 -312 -129 -137 -73 46
4611 46 -30 -6 -133 -56 132 -9 62 -163 -173 -166 -140 -187 151 320 -196 -101 -34 -189 295 160 277 -33 16 -117
4635 -117 -220 97 228 -208 -438 -505 -137 -134 48 193 -98 -55 -128 126 470 30 21 -101 -232 199 311 348 75
4658 75 -63 -456 -207 176 58 94 -325 139 -234 -263 85 348 -50 -114 -22 -66 68 206 284 12 -171 50
4680 50 56 235 -266 -152 -265 -340 -1 -77 178 -70 2 -88 67 35 -143 23 114 -33 17 4 51 197 125 -39
4704 -39 -199 -14 72 -4 89 112 -82 -156 -100 -17 287 211 193 -35 -185 -99 231 460 124 134 -63 -166 107 59
4728 59 193 65 -204 -77 -223 26 -140 184 201 -85 -282 79 355 142 363 22 -284 -164 -98 291 -186
4749 -186 -211 -174 109 -188 -53 67 -168 -461 -314 -157 69 165 158 -5 -159 188 -245 263 51 201 31 -314
4771 -314 43 -16 -289 226 224 -538 -158 15 45 -24 464 25 -162 -138 128 125 161 0 -154 -456 -159 180 292
4794 292 151 -49 -211 -148 -5 235 15 302 97 -176 -125 -56 152 151 98 23 -286 30 70 111 -181 -50 -172
4817 -172 -63 92 -185 -34 -87 -129 -268 -8 220 213 -42 -14 -130 147 202 231 382 -154 -73 -103 252 58 31
4840 31 254 -40 -266 -68 -113 91 65 125 -186 -210 242 -114 87 214 38 0 -212 -83 240 166 -159 -372
4862 -372 -171 -99 280 -174 33 -106 -8 -213 168 137 43 -20 44 -89 -72 206 113 231 109 -22 -264 64 123
4885 123 120 9 6 -222 -41 -77 274 167 43 -81 -78 79 -19 301 169 192 34 197 -197 -81 26 -191 -122
4908 -122 -358 76 73 8 201 -88 -118 46 15 100 433 97 -90 -3 127 199 174 -9 83 -176 -230 117 121 244
4932 244 185 -101 -168 -259 209 146 114 -120 -330 -192 45 187 -88 9 -18 118 261 274 29 -237 -258 -140 58
4955 58 36 -27 93 8 -57 -69 -261 151 160 159 -231 -26 -34 -37 328 173 -152 -254 -492 -124 57 -233 56 -93 -135
4980 -135 195 111 167 7 19 -113 -23 98 137 4 15 239 -410 -311 -86 118 -140 -78 -76 55 -204 177 93 310
5004 310 -150 156 112 24 225 31 -21 -378 -181 -164 155 -4 31 44 -218 -84 248 83 58 49 -74 -137 162
5027 162 321 -51 89 105 -119 -96 3 89 428 210 8 -229 -90 -149 204 -184 -70 -286 90 -145 -34 238
5049 238 493 74 -115 -41 -67 181 33 -157 26 -49 -33 42 132 133 85 -355 -11 -170 -175 249 333 -81 -144 -4
5073 -4 71 251 23 158 -54 -245 -202 -55 132 37 26 -170 -1 34 14 -336 -10 -67 -198 122 0 214 -19
5096 -19 -134 -165 192 243 224 14 -21 -116 68 -109 133 260 16 -37 -138 -443 69 -145 52 44 89 276 242 75
5120 75 155 307 -95 -129 -44 -23 111 -202 38 -164 -214 18 -160 88 10 -163 15 -148 -218 117 68 277 -63
5143 -63 33 -177 131 146 179 -78 -251 -249 -28 132 14 333 -56 -253 -96 259 214 114 60 -9 190 -65 -157
5166 -157 216 22 -154 -201 -393 -84 94 74 -144 -310 -96 -76 54 142 -43 -88 -219 -24 -146 188 -113 -166
5188 -166 -247 27 71 158 12 -40 10 -107 -70 3 -267 -157 77 -122 -331 55 392 -28 11 -110 64 -91 56
5211 56 208 40 14 -89 -218 -130 -184 48 250 -86 25 -76 -212 134 105 44 105 -262 -109 -189 249 118 -102
5234 -102 -127 -31 -445 123 269 -126 184 -264 -293 30 291 179 -13 -209 35 -178 66 37 57 -249 -114 -295
5256 -295 -60 358 -101 -60 -27 199 -97 222 201 201 5 -326 50 -250 186 226 242 365 -91 25 -11 8 130
5279 130 73 -177 -100 90 70 36 11 -80 -149 -228 186 -43 -182 -181 -22 61 26 -71 369 89 -130 -101 -339 80 136
5304 136 62 -266 66 -56 173 88 69 -396 -3 -68 -298 -63 266 59 -331 6 75 109 49 -103 12 25 -441
5327 -441 -54 -458 140 275 -93 43 -208 -92 250 97 -135 -111 -81 -169 -172 238 385 189 -55 -168 -57 128
5349 128 43 342 -231 109 -325 242 77 -166 216 -103 -91 -100 130 -10 38 -67 -25 -51 117 -29 96 68 -125
5372 -125 -165 -9 84 189 193 -57 -153 -150 321 28 130 22 -186 -106 -30 -147 291 -43 -32 -127 60 60 117 191 31
5397 31 -276 124 -30 71 113 -16 259 -12 -177 190 -3 60 63 40 -320 -37 190 236 229 -204 -197 -168 5 149
5421 149 80 -74 136 -92 -343 149 301 166 233 15 -94 258 347 309 312 -131 -160 191 115 169 75 -108 -167 184
5445 184 -36 54 26 -76 -259 5 72 -23 93 113 132 27 -181 -188 184 -97 330 -285 -155 -6 -151 -29 -32
5468 -32 7 -142 -350 78 2 -89 144 -124 -21 -132 -191 121 -111 176 -20 -44 90 127 305 -78 140 -15
5490 -15 134 -315 15 -19 283 -98 22 47 -88 -12 201 -75 -139 220 -299 37 26 -263 -151 -83 -216 59
5512 59 -168 317 120 -148 34 73 81 204 152 222 -11 88 -4 187 -110 191 -231 -356 67 -79 139 24 -14
5535 -14 41 -70 -373 -53 198 -141 -39 -114 -139 120 266 169 -10 18 71 354 -95 -23 63 -224 -119 -25 43 210
5559 210 91 -252 32 -99 122 43 279 -5 -50 163 -185 -66 73 13 209 27 147 215 -114 365 -119
5580 -119 -223 -318 -125 -35 208 281 26 119 -90 -91 176 -57 187 -73 208 -214 76 428 34 132 16 58 -262
5603 -262 -77 54 137 -275 -30 48 -91 120 218 216 -174 -226 70 245 -17 -97 -9 -119 87 37 97 -39 355
5626 355 -43 -89 -109 10 142 250 441 -184 -59 -25 259 59 38 -8 -134 27 -53 -8 -150 -177 135 -68 -32
5649 -32 295 -56 -205 112 -71 130 -237 252 264 -245 228 -100 17 357 -49 -103 0 -43 -220 118 186 185
5671 185 138 45 -31 31 35 28 339 49 -185 283 -51 173 -4 57 -68 -111 104 89 135 -179 -284 116 -107 -177
5695 -177 161 125 -198 -136 -142 5 -4 192 42 -128 -45 72 201 -114 198 -44 -115 -106 111 -156 343 -22 -24 -43
5719 -43 -113 -14 157 83 88 -45 23 -78 79 101 84 -96 -130 78 41 79 177 -109 -126 47 -151 20 21 244 -242
5744 -242 -98 -32 49 -57 -28 57 -359 51 -110 -59 -96 52 165 -219 -189 6 0 202 294 -137 -199 -122 66 28
5768 28 -105 36 -86 -136 -73 -15 461 -102 248 24 47 246 -35 -15 282 -121 -253 -312 145 -23 2 -28 -192
5791 -192 -146 117 -198 255 59 71 -160 -128 -117 190 175 -110 -244 -141 101 65 355 154 159 -256 168 -131 109
5814 109 163 44 -265 -61 233 30 193 -88 -146 -84 -5 220 32 70 13 -108 -88 -76 142 57 150 43 110 237
5838 237 -297 201 54 -63 113 -174 87 64 50 128 27 67 -57 95 106 -162 8 -19 -2 44 -60 190 -80
5861 -80 46 -42 -25 -172 -61 84 -85 26 -32 148 183 259 100 -293 -42 -62 103 181 -103 12 -279 228 27
5884 27 54 341 115 40 -211 -125 -114 281 -163 -166 -268 -238 -6 95 23 123 79 -233 -131 235 97 13 16 -6 -307
5909 -307 -333 7 86 -8 -166 -255 8 41 34 71 62 155 -62 180 139 336 293 249 -25 -221 140 42 42 163 -14 -11
5935 -11 -333 103 56 40 -50 -139 -347 -78 186 7 56 -166 15 4 158 104 12 11 -47 -80 -158 -104 95 193 68
5960 68 39 89 63 -152 162 -62 -161 -5 24 180 0 -89 -26 -139 11 134 67 199 -252 13 128 -155 -13
5983 -13 114 36 130 120 78 -143 -151 -61 242 34 -53 -73 122 316 194 -223 -189 5 74 70 208 157 -35 47 -222
6008 -222 61 235 103 -88 0 17 -37 -30 56 51 14 40 -62 -177 97 140 137 -117 50 94 -36 -75 65 -67 -119
6033 -119 -121 -111 -51 51 -168 -164 -181 74 384 74 -3 131 65 -25 182 48 -147 -165 -15 29 -105 72 -33 22
6057 22 93 82 11 -383 -12 -66 -154 90 -152 -157 17 57 151 -144 -184 -171 136 91 166 -235 -93 138 -146 53 186
6082 186 94 -137 -187 7 272 86 167 284 25 -254 -194 -148 139 -100 -185 -64 92 -391 86 95 -58 -23 -169
6105 -169 -149 -39 37 8 39 3 -110 409 -63 289 -139 -21 -220 -138 84 -17 -147 24 141 73 198 12
6127 12 229 18 49 -192 120 -119 89 -189 131 -64 -105 -192 269 189 91 -55 4 219 -85 -18 -110 -331 -225
6150 -225 -214 -64 -54 -165 -18 28 -195 20 139 123 172 -85 -137 101 -140 -24 10 -74 -140 206 75 -266 -35
6173 -35 223 65 240 18 216 63 2 -84 119 -246 -130 88 4 19 -266 52 73 17 66 278 -4 1 -100
6196 -100 -186 -40 -123 76 45 -226 -170 71 255 185 -435 -117 -154 -106 78 -91 104 -133 11 58 61 -16 64 361
6220 361 226 58 -112 91 306 24 36 32 -203 19 195 -135 222 -60 -215 -35 -32 -34 -66 -57 -3 -200 -174 -76
6244 -76 30 -99 -17 -180 -126 41 -73 133 -191 -255 -22 -4 111 -76 -28 -52 34 36 76 276 -152 -224 23 -256
6268 -256 96 142 269 308 274 -57 111 -58 121 26 -139 182 -19 -129 127 57 142 -127 44 -105 -249 -149
6290 -149 -43 3 -70 -52 -108 -43 237 -214 235 65 -201 147 -27 85 -60 -26 -223 -267 250 -22 70 -54 -32
6313 -32 -125 -161 118 278 273 73 70 -95 49 147 -62 175 11 93 160 71 -16 139 80 -45 -4 -130 226 154 239
6338 239 -257 105 -87 35 55 133 -45 -81 -239 96 230 174 40 -15 -11 -173 269 47 196 300 53 -164
6360 -164 174 -129 125 129 249 30 -332 -21 13 291 42 3 -75 -50 141 60 244 77 153 -256 43 130 -112
6383 -112 105 -39 -309 -30 146 -304 -52 -15 -273 -221 -163 12 8 74 -36 -10 -143 6 233 92 176 -74 -91
6406 -91 148 -77 33 39 22 -414 -433 83 43 31 -102 38 -83 165 218 45 145 -129 -108 -72 -116 28 284 257
6430 257 -105 -158 223 -105 35 -56 111 -95 -39 -199 185 9 -86 -89 22 27 135 -179 -344 -110 110 -296 -31
6453 -31 -96 158 -135 -172 40 178 80 -54 74 125 -183 71 72 41 -222 -6 -49 42 -167 -150 9 -106 -199 -272
6477 -272 210 171 27 139 -51 -232 -339 -80 -107 72 80 115 -189 -19 48 12 92 140 -150 46 39 -44 19 83 15
6502 15 -186 101 205 97 -6 76 -110 39 -66 -61 245 -318 -30 119 99 11 417 213 -160 37 19 75 -56
6525 -56 -132 49 176 128 -103 143 49 -143 -215 2 207 -233 156 12 -161 283 -59 40 -150 88 -27 -261
6547 -261 120 81 105 -73 208 -47 -327 59 -70 -148 -86 -187 99 9 -60 84 44 -116 -70 -118 -275 -200 89
6570 89 32 118 35 -49 -179 66 8 162 153 -229 214 -67 276 -16 202 200 -133 -36 -137 108 -197 141 -154 -38
6594 -38 74 150 -183 -11 8 -243 -3 -106 -127 127 183 151 12 -190 -86 99 3 324 0 -100 291 383 -76
6617 -76 68 5 -166 -175 -178 -52 84 -89 -102 -32 -144 -127 -65 -66 34 167 -162 98 52 -14 -262 -76 49 98 86
6642 86 -42 -44 -123 131 168 134 280 -1 56 136 33 -172 -185 -252 60 210 -14 -140 -147 -110 -133 101 -133 -177 -23
6667 -23 183 40 -180 -209 -23 -171 -195 109 128 213 -101 0 158 102 381 -18 -24 -45 -298 38 -42 60 -36 60
6691 60 117 145 -84 165 148 -69 -73 79 -175 -214 -66 342 195 -222 -93 -215 -187 -114 87 -85 199 -176 -35
6714 -35 -21 -51 -131 181 -6 -48 142 -106 263 93 234 -211 -137 185 84 -113 48 -35 -32 168 29 170 -16
6737 -16 32 -146 2 -122 30 -73 215 -50 -24 422 385 98 -45 103 171 -105 93 165 -152 -15 68 -10 -182
6760 -182 -158 -175 99 230 119 152 143 5 23 -30 -135 361 33 130 170 28 312 -137 -101 130 169 -176 -37 -17
6784 -17 -46 90 -51 39 360 192 79 105 103 28 173 137 -74 -7 94 189 152 52 71 114 65 -45 -104 189 -145
6809 -145 307 -41 -289 185 -41 126 37 103 -83 -108 43 151 -83 -48 352 154 -92 97 -113 201 -211
6830 -211 14 -104 -88 -93 -199 -39 148 68 189 181 -66 231 42 -154 182 263 71 83 -129 111 34 -183 -2
6853 -2 -8 20 45 -104 101 -108 36 -176 -172 -123 244 105 173 -255 -12 262 -59 121 162 -56 118 143 229 7
6877 7 -19 403 181 -149 -205 -388 2 194 -51 -210 -44 406 -34 39 -61 26 -36 1 -77 19 218 291 31 -153
6901 -153 -180 -280 24 80 24 195 -20 72 117 -250 -8 -121 145 85 129 -78 85 46 -47 -125 -166 -94 398 -86
6925 -86 -49 68 -195 -253 58 82 -96 -158 78 49 177 -40 -102 9 108 -33 172 -184 -104 194 46 -170 -148
6948 -148 -7 -116 12 155 105 89 27 57 -208 174 -48 -224 -314 -16 2 24 -78 61 -57 95 -66 281
6970 281 240 77 -115 -188 187 78 51 106 120 43 -59 -308 -62 48 -183 -225 -113 -108 27 30 -30 130 -334 44
6994 44 87 196 -143 -121 -111 -86 22 246 -19 -129 185 -56 -279 98 192 -92 -217 -53 -13 -374 -170 -5
7016 -5 86 345 144 -56 103 -56 93 23 -147 -199 -202 167 -2 -178 78 -140 -196 -8 -46 157 20 49 -110
7039 -110 -50 38 -128 230 -179 237 27 -146 115 -250 4 -28 -52 -116 7 -47 45 -123 -155 139 16 -107 13
7062 13 -66 -304 -33 -186 -71 -248 100 66 -157 -188 -236 -10 65 125 -120 -157 -98 44 44 89 139 -40 -11 -138 75
7087 75 -8 -107 113 -245 11 147 -174 58 92 -35 -434 247 8 259 35 46 -4 -68 8 213 199 -98 129
7110 129 -225 106 41 -158 -242 105 -73 166 133 -117 -7 -93 268 197 196 -205 -180 -332 187 -116 -145 46 181
7133 181 51 -74 -46 20 142 -20 -139 -44 -5 -34 -207 -99 99 -250 -33 25 -125 171 47 43 52 77 26 61
7157 61 -96 -81 85 -115 -176 107 128 76 -95 29 4 -5 -156 -172 112 -58 212 135 0 -56 -355 96 -49 109
7181 109 74 -243 118 -190 231 -125 -195 -200 40 -136 -37 -185 -95 -127 170 145 78 175 -200 67 -71 -155 -162 2
7205 2 -196 -39 -172 -133 -175 7 37 -61 -163 2 -61 194 -224 -263 78 -65 6 -211 -141 135 -66 -28 56 153
7229 153 -272 -27 146 -93 50 256 66 84 145 -116 252 4 100 -164 -70 -168 116 178 -148 -34 -132 -69 71
7252 71 -183 72 45 175 69 81 -88 161 -74 -33 77 97 32 -57 112 -62 -68 102 -56 -163 100 146 -32
7275 -32 117 62 -224 77 58 26 -265 173 93 -67 -90 -11 140 85 108 206 157 -24 -95 -127 -144 -11 -72 347 103
7300 103 84 -68 -120 25 -12 40 -36 -56 -94 15 312 -125 -94 -41 -65 -255 148 257 22 -213 -187 107 150 11
7324 11 15 -373 31 88 -100 86 192 -264 10 204 -17 -1 126 68 -111 -100 20 -211 -33 150 174 -11 206
7347 206 307 -86 -28 154 93 -91 91 -87 -19 35 -144 -182 197 -127 31 -22 -55 -124 -107 -37 -126 232 158 -240
7371 -240 -10 -47 51 152 16 -265 38 77 -164 -4 -93 -181 85 63 66 49 176 155 -55 74 -53 154 145 151 294
7396 294 24 161 -54 -1 96 144 -73 17 -2 -50 -155 10 174 28 63 89 210 -169 10 -126 249 -5 105
7419 105 -90 -136 336 221 -82 -103 116 -15 26 107 -56 96 -117 18 281 245 -31 201 9 95 -67 40
7441 40 -173 151 -211 -63 -167 -170 -193 185 -178 -119 63 160 175 182 149 -157 -81 130 -104 134 -124 -430 -122 58
7465 58 136 -83 144 128 15 444 151 -41 -37 302 150 -318 -128 158 -43 -91 166 66 -82 363 186 -161
7487 -161 -103 -303 264 109 52 48 62 -76 77 123 18 -48 -182 33 -27 86 -24 -24 102 13 20 59 52 185 -113
7512 -113 214 44 -158 14 103 -135 56 -79 -28 -99 -58 -197 -337 -27 6 29 69 -164 -145 -77 202 19 54
7535 54 -135 145 58 -40 -1 6 251 1 -46 -53 -67 82 93 84 -30 93 207 41 -35 -340 52 -139 -137 227 84
7560 84 30 173 -99 -14 -40 180 -213 -202 51 119 42 -131 177 -191 -160 60 48 -64 197 -56 -300 -185 -288
7583 -288 -7 118 8 33 -175 -167 -48 96 -19 -159 158 0 -126 0 -172 -6 316 -177 201 205 -256 -128
7605 -128 19 -166 13 146 286 123 -199 80 48 -21 -104 -56 56 34 -11 255 -278 167 -62 -112 -113 21 -31
7628 -31 54 67 -126 -67 -82 -6 215 40 -167 -16 114 18 -94 -39 55 -6 -24 70 -218 -20 -182 -86 227 -129
7652 -129 12 -15 -78 -186 48 -67 238 201 -230 281 215 -8 -15 -67 -105 105 -12 -3 -286 -84 -32 -156 66 100
7676 100 386 193 -92 -68 -72 106 -63 -265 49 -133 -92 -9 124 38 -84 -105 225 -95 41 -30 86 132 -79
7699 -79 -34 -32 -104 -250 255 -55 269 52 -45 239 -109 27 -132 77 -122 157 191 -251 -315 -114 -178 135 -34
7722 -34 83 69 -63 58 23 30 -48 -28 -319 99 -143 114 296 217 -45 156 151 -24 137 32 -46 91 -21 115
7746 115 -15 -117 -11 43 -128 61 271 -88 -139 71 -166 230 72 -199 258 -149 17 -50 106 -6 31
7767 31 92 -91 -81 129 120 56 127 -120 181 256 236 26 48 189 58 111 -36 138 -22 201 -114 -92 30 -19
7791 -19 122 109 -145 -124 46 -90 -58 61 -1 -118 -97 -22 2 7 119 -237 -3 -48 -2 294 175 -27 63 170
7815 170 -137 88 89 -205 129 -195 -105 -52 255 97 36 -233 -128 -158 70 -43 -56 60 -206 129 167 -312 122
7838 122 27 73 -52 -90 87 -238 4 -57 49 -176 -29 275 -213 43 170 -7 10 -188 138 135 206 -1 71
7861 71 168 39 -15 163 -136 -5 11 -33 4 24 -5 109 27 18 94 68 263 -236 -61 81 -90 -86 50 -58 107
7886 107 186 16 -164 -59 -14 164 150 -93 -123 -1 33 148 -56 175 96 -29 131 -94 46 -135 81 35
7908 35 208 -22 174 -124 -169 150 -24 -85 24 22 112 -100 -160 123 -5 214 -42 -58 -201 -300 181 -272 27
7931 27 -140 6 -79 73 -301 -46 148 140 -136 -108 136 45 -29 -121 81 164 -82 -144 30 108 -81 -456 66 9
7955 9 -149 80 -146 -62 2 11 115 19 184 -95 -37 49 -112 -60 135 -68 96 81 -300 -24 70 -54 -68 152
7979 152 -187 8 299 -16 96 15 -66 -90 -348 -4 108 -120 35 -29 31 86 79 -238 -51 -60 -70 -146 160 -117
8003 -117 -168 -85 -87 144 28 31 50 95 80 78 -122 83 49 -193 33 -233 157 38 74 -146 -47 180 -133 -287 51
8028 51 73 464 -93 114 -118 -251 73 -120 273 2 -78 153 -35 167 195 -140 27 -48 49 32 -109 -177 230
8051 230 27 90 302 -7 165 -240 -159 -112 88 106 118 39 -109 -114 56 -118 70 283 -133 18 -40 -82 36
8074 36 189 -181 -214 -72 -113 -138 329 -142 55 147 -184 97 30 -129 2 -105 58 213 -121 201 240 3
8096 3 -164 -217 -110 -11 -29 -103 130 -298 -64 -80 -348 30 238 -212 -180 45 -68 354 -103 -249 118 -59 111
8119 111 -208 110 -42 -170 115 0 -127 32 -114 -78 122 -202 109 105 235 45 -26 -202 61 111 48 219
8141 219 174 -68 -100 -85 5 -215 47 -177 -355 83 -23 -172 -92 -72 -112 24 -89 -13 -253 244 82 -94 -405
8164 -405 43 -27 -195 -203 -52 -29 -23 -121 61 -187 -76 58 14 92 168 -97 75 81 41 -12 -163 17 -320 -129 -130
8189 -130 35 3
8191C
$$ Imaginary data points
##PAGE= N=2
##DATA TABLE= (X++(I..I)), XYDATA
0 0 0 0 0 0 0 0 0 0 0 -8 8 -8 16 -16 16 -24 32 -40 48 -56 64 -80 96 -112 129 -152 177 -206 237 -272 311
31 311 -353 401 -455 515 -579 651 -729 815 -910 1012 -1126 1248 -1383 1528 -1689 1864 -2057
48 -2057 2264 -2496 2748 -3029 3338 -3684 4070 -4506 5000 -5566 6226 -7005 7936 -9074
62 -9074 10509 -12372 14907 -18566 24333 -34809 59867 -249714 -21181 433148 -184834 -199834
74 -199834 232607 80593 -256945 76569 210230 -84791 -103239 100757 -29133 -59345
84 -59345 126794 70650 -127756 -25363 72061 -28454 -51274 45176 5552 -66255 -16490
95 -16490 52660 5448 -47932 -15547 27286 348 -3516 27287 -3840 -46526 23864 66551
107 66551 -18673 -33860 40120 -17456 -69415 59572 83056 -77608 -71681 46923 4649 -26114
119 -26114 59648 11890 -87665 -1692 64689 -16123 919 57685 -50022 -77320 73370 55905
131 55905 -73861 -1545 64377 -54265 -52556 75193 22791 -70344 14627 47592 -49558 -20130
143 -20130 63832 -14034 -58124 47531 40340 -67843 -16530 70224 -432 -42438 35597 26883
155 26883 -59308 -25310 49633 9223 -28452 10345 -5517 -45888 18853 67487 -7902 -48133
167 -48133 11026 16111 -28531 15066 62438 -15131 -68212 14981 55364 -9855 -15155 27098
179 27098 -12331 -44663 14171 32056 -24037 -16594 24624 -12082 -27012 36982 25615 -45335
191 -45335 -7534 49241 -6850 -35225 22645 19665 -22042 10991 30296 -21115 -23008 17426
203 17426 -4108 -12566 30726 -1981 -60195 -1250 51522 -4382 -17138 29256 -5835 -44530
215 -44530 22045 55783 -8771 -26993 7945 -12059 -17881 37639 23604 -45732 -24107 24628
227 24628 -8497 -23621 27668 21404 -39361 -21908 37670 15164 -24132 9100 26212 -13225
239 -13225 -9959 24195 1317 -21342 13831 17369 -26921 -15581 22515 -10185 -30625 26634
251 26634 28040 -42698 -25677 36243 8036 -21038 21823 16966 -37099 -11857 38321 8747
263 8747 -13472 17513 -5057 -42293 9887 43570 -18530 -35877 12652 748 -30870 13202
275 13202 39184 -14302 -31346 13543 14500 -10848 10581 16742 -17361 -8194 22060 -1703 -16429
288 -16429 17267 14296 -25678 -11283 21928 -8750 -30846 13523 24335 -20594 -16941 15318
300 15318 -23 -8372 20321 9839 -24136 -7664 13642 -5680 889 30518 -1730 -41559
312 -41559 1813 34668 -4600 -13024 17131 -6775 -34319 6717 32084 -3631 -13087 7498
324 7498 -8168 -15191 25454 23487 -24516 -12481 23830 -4055 -23097 17421 20593 -24387 -17410
337 -17410 20394 2244 -22970 3900 17008 -7046 -3389 9520 -10770 -7505 24035 11486
349 11486 -18698 -605 14027 -12461 -9523 27857 11820 -29836 -12895 12915 -3021 -1132
361 -1132 17328 -6335 -24980 3497 13661 -5596 7273 18293 -18467 -26302 22535 26426 -15064
374 -15064 -4145 20516 -10407 -20813 19075 17459 -18316 -9649 8432 -12680 -13315 17535 6207
387 6207 -19984 6243 19074 -18000 -15307 26676 12745 -20216 3587 19812 -12659 -12965 24469
400 24469 15603 -16406 -4969 3812 -15880 -2320 21565 -4843 -23483 3652 5988 -16677 5409
413 5409 30118 -5360 -29955 3843 18969 -5144 2228 17229 -9194 -19664 9809 12220 -7506
426 -7506 809 5590 -18206 -14755 17809 9250 -18088 612 17917 -10771 -14995 18775 13334
439 13334 -13098 496 12412 -10291 -11681 12542 4772 -11432 4579 2751 -24381 -6586 24991
452 24991 832 -19073 5980 6580 -18428 191 26773 3022 -16898 1628 3143 -8261 11176
465 11176 18654 -13375 -17650 7372 -372 -11820 9993 12406 -19491 -17193 14679 9571 -12365
478 -12365 2425 14725 -6970 -10668 11079 6982 -5841 7241 9108 -11921 -7817 11002 -981
491 -981 -13135 9639 9139 -24510 -15531 18280 6415 -11145 7909 5775 -17890 -2838 20334
504 20334 3232 -5996 9134 -3759 -19147 10764 24903 -8340 -12695 9069 -6417 -17898
516 -17898 13207 19153 -13556 -16256 4728 512 -3302 13492 7852 -13987 -4752 10117 -3326
529 -3326 -4172 15378 4844 -18561 -4585 15287 559 -11354 6270 8532 -13090 -9545 9507
542 9507 1390 -6178 7725 3977 -12079 -275 12565 -2597 -3078 16048 3583 -20038 -402
555 -402 18530 -1834 -7394 11172 -2481 -19523 2208 13750 -3206 -3648 4638 -11385 -12302 15321
569 15321 12420 -12704 -1836 12595 -8963 -10667 19381 14830 -11869 -5283 7405 -4360 -5440
582 -5440 9940 4494 -9115 -2794 1 -8871 2762 15740 -2443 -13358 3341 5123 -6629
595 -6629 3942 15959 -300 -13995 -1736 6152 53 3736 5081 -10253 -12926 3396 5133
608 5133 -2513 4531 5281 -11312 -11657 11068 14343 -6054 -5769 7953 -2469 -10630 7836 12927
622 12927 -5482 -6370 4515 -3949 -8587 7172 5530 -11461 -2446 9168 -8859 -10237 15767
635 15767 10909 -11923 -805 10884 -5009 -5841 11602 6362 -7842 -2754 -1132 -8255 1986
648 1986 9551 -4914 -9687 219 -4445 -6481 9238 10693 -4942 -7684 239 2999 5987 8546
662 8546 1923 -5314 -3530 -285 990 5288 4704 -5746 -10575 -4442 4076 4725 -1640 -2392 1250 -5683
678 -5683 -8006 7533 11334 -3674 -4610 3763 -2488 -3461 8700 6263 -6413 -944 2829 -10190
692 -10190 -3792 13193 -12 -13528 2653 4429 -11060 593 16249 628 -10202 892
704 892 1189 -3940 8075 10278 -7400 -6667 6057 -2326 -5368 10860 7075 -12587 -8954 6220
718 6220 2452 -4468 2793 4628 -6028 -6887 3754 4637 450 3884 2390 -6133 -3972 6540 5017
733 5017 -2384 2274 4680 -8655 -9726 8116 8247 -7264 -3984 3048 -5235 -5598 8070 8269 -2019
748 -2019 -2195 -701 -4294 3676 11988 60 -7541 1842 630 -7230 4359 11380 -3751 -10737 -891
763 -891 -343 -3886 3876 4954 -7277 -5402 4183 -1166 -1787 12500 6937 -11374 -2975 10978 1659
778 1659 -4229 7171 5003 -10591 -7509 5558 1324 -3343 3227 -681 -9281 -1643 6274 537
792 537 329 5924 -702 -8894 160 10555 2771 -4333 1158 -174 -7516 -2017 6703 2996 -4184
807 -4184 -4752 -4423 -2438 4694 6463 -1974 -3439 2357 -1514 -3901 8312 10256 -5266 -7435 3450
822 3450 1952 -3307 2644 3955 -6580 -6816 595 -2219 -2119 6369 1347 -9339 -1067 6138 -2036
837 -2036 -226 9833 2817 -8948 -2790 6293 2417 346 3276 -3140 -7229 -622 1890 -474 2804
852 2804 395 -9015 -5898 5224 5202 -659 906 2772 -3543 -3885 6079 7396 522 -1100 -1836 -4482
868 -4482 100 5426 1200 -4647 -1449 87 -6394 -3596 8432 4158 -8574 -3207 4310 -2204 -2537
883 -2537 8072 5743 -5841 -3807 3138 463 1014 6267 -123 -8725 -1233 3817 -2013 588 6016
898 6016 -1754 -8911 -1833 5640 1829 -874 2025 -600 -4618 -539 3380 3880 3406 -840 -6676 -2563
914 -2563 4449 2831 -1580 -79 -155 -6250 -4020 5732 5222 -2221 -703 754 -2557 1013 6762 2739
930 2739 -1154 1953 -212 -6052 843 9371 156 -8743 -484 1547 -6493 -1133 8858 951 -7796
945 -7796 -2389 2523 712 3431 6213 -617 -4799 1358 2573 -274 5468 5669 -5916 -8581 1340
960 1340 4148 -1497 -1580 693 -4718 -6898 1245 4962 478 -13 523 -3018 -69 6222 3767 -571
976 -571 2852 2208 -5453 -2906 7128 3405 -5388 -1862 687 -5422 -3199 4743 1810 -3008 -1910
991 -1910 -2493 -3087 3339 6180 -329 -2735 2093 787 -2798 3296 6815 -916 -5340 -1942 -943 -133
1007 -133 2366 1253 -2510 -3026 -1461 -1460 2260 7096 1618 -6508 -1562 3946 -11 656 5830 467
1023 467 -7853 -3443 3367 1408 281 1892 -3599 -8190 587 4683 -1398 634 3237 -4329 -7102
1038 -7102 4521 9291 676 -2734 2015 -199 -3763 2021 5853 385 -3965 -2769 -3123 -838 2580
1053 2580 1540 -2338 -3141 -941 -1090 -435 4217 3984 -2555 -3094 1534 2033 797 2268 1520 -1689 -2386
1070 -2386 -803 -783 836 3068 -1480 -5452 -3 1630 -3378 700 5984 -880 -5990 134 2928
1085 2928 993 3149 4028 -2592 -4146 1340 1162 195 4492 699 -8027 -4547 3732 2623 -18 787
1101 787 -1460 -4752 -2452 3762 5618 1647 -2549 -3151 -772 2180 3328 2079 -61 -2932 -3411 -1429
1117 -1429 997 3827 1389 -4455 -4284 803 936 373 3513 1775 -3470 -2640 2193 3261 2558 1859
1133 1859 -1461 -3236 339 1758 -641 1344 2205 -3881 -5729 173 1936 -418 -861 117 -1122 -2063
1149 -2063 41 2880 3578 2241 -728 -1793 673 2281 1459 1438 630 -2311 -3059 -2250 556 2699 712
1166 712 -3235 -3944 -1662 447 1769 2574 1779 -1265 -2937 119 4239 4704 573 -2506 -1250 7
1182 7 -1451 555 3700 122 -5344 -4292 141 1532 1216 1832 -744 -4076 -1720 2715 2827 2953 2907
1199 2907 -2476 -4569 1561 4713 810 -1173 -304 -2103 -4415 434 3769 372 -2311 -1706 -1945 -909
1215 -909 2509 2410 653 450 -1174 -2274 421 3752 2534 -1612 -1924 -1225 -1597 -639 1315 864 -483
1232 -483 -2353 -3556 -375 3448 2487 405 -117 -918 -798 782 3839 4245 -535 -3660 -1418 609
1248 609 858 1107 886 -1994 -4578 -2281 1089 963 1295 758 -3672 -2916 2237 2214 -70 3302 2770 -4009
1266 -4009 -3388 4124 4549 -659 -697 -548 -4384 -1469 3508 1193 -1583 386 -2094 -4608 847 4896
1282 4896 938 -2664 -151 405 -1848 518 4924 2420 -2363 -2455 -353 548 1196 1703 793 -3040 -3445
1299 -3445 -502 452 1298 2368 -828 -4156 -1154 2464 2074 1216 2133 291 -2819 -1021 2777 3432
1315 3432 819 -1362 -2821 -1610 374 352 944 1849 -1988 -4344 -522 2767 1356 1026 1473 -801
1331 -801 -2483 558 2804 1383 955 100 -3779 -3193 2273 2889 -727 -1852 -723 -2880 -3057 1806
1347 1806 4336 -362 -2608 -160 237 101 3146 3580 -64 -1671 -514 -190 204 2207 1526 -3650
1363 -3650 -3765 188 -311 -980 1886 1128 -3457 -3436 853 2537 2141 1804 289 -1774 -627 1906 1982
1380 1982 1552 1298 -2360 -4489 -579 1949 617 -668 -1057 -1652 -2481 -585 2763 2506 -150 -1333
1396 -1333 -1354 -319 2103 2725 1063 381 -1370 -2201 -779 2181 2079 -1173 -2893 -1565 -1613 -40 2448
1413 2448 1114 -1240 -809 -1225 -900 2874 4386 -215 -2594 80 908 -1593 1507 3806 -1394 -4492
1429 -4492 -502 859 -861 1251 1536 -2119 -3352 131 967 32 2197 2210 -2170 -2966 1843 2959
1445 2959 329 548 743 -2667 -3565 812 3223 433 -1830 -1548 -2222 -1763 1773 2038 -352 -689 -901
1462 -901 -1500 481 3677 2510 -430 -1066 -633 -1029 1160 2400 980 -1353 -1832 -2476 -456 3393 1520
1479 1520 -2298 -1783 -870 -1476 205 3298 2078 -1840 -1955 485 733 1180 2352 419 -2229 -1571 -761
1496 -761 -353 1295 1017 -1574 -3201 -957 1113 346 612 1464 -418 -1964 35 2012 1838 1323 377
1513 377 -1222 -1610 -85 677 625 823 -530 -3721 -2854 1488 1713 -227 -337 -406 -1990 -801 2306 2992
1531 2992 965 -550 -808 -1027 831 2737 1259 -756 -1288 -2344 -1928 603 2138 553 -1878 -3221
1547 -3221 -1397 760 2256 1671 51 -1050 -1695 -163 2934 3801 271 -2050 -1217 -508 23 1342
1563 1342 1606 -872 -3169 -2017 -223 426 902 813 -1613 -1909 274 1318 722 1290 1602 -553 -1804
1580 -1804 435 1886 449 -543 -320 -824 -1558 -796 742 1368 -85 -1676 -1633 -402 -32 1378 1614
1597 1614 353 -1233 -812 136 916 1647 1274 -1053 -2390 -314 606 142 794 998 -1561 -3330 -610
1614 -610 2497 2205 103 -493 -680 -1981 675 3721 2335 -568 -1215 -1655 -598 1686 2446 -318 -2276
1631 -2276 -2169 -1088 -205 2065 2097 -1135 -2777 -915 392 1716 2171 497 -1153 -623 -11 265 1822
1648 1822 2278 -1029 -2902 -422 767 -575 341 1333 -1279 -2645 -518 739 765 860 619 -352 -1072
1665 -1072 404 1924 1123 913 848 -1712 -1603 272 1319 407 -316 -357 -1213 -2080 72 1781 483 -59
1683 -59 -961 -1842 -68 2574 1527 406 400 -805 -2177 812 3607 1094 -1643 -1217 -1259 -1365 1279 2679
1701 2679 -731 -1877 -1321 -1497 -232 2916 2183 -1151 -1809 104 645 849 2437 1737 -1281 -2225 -785
1718 -785 846 1094 123 -1070 -1501 -1422 -972 648 1484 996 -832 -1980 -96 1545 1712 1425 516 -929
1736 -929 -1042 466 1522 1235 508 -744 -1959 -1917 687 892 -1150 59 310 -2514 -2018 2378 2452 -501
1754 -501 -102 548 -1053 -561 2833 1964 -848 -708 -778 -2039 169 2561 62 -2150 -1066 -811 -1128
1771 -1128 625 2339 756 -1464 -1140 149 921 2229 1592 -678 -1208 -1032 -812 1032 2029 117 -2265
1788 -2265 -1597 145 583 234 945 -126 -1875 -1619 223 1382 1708 1095 -397 -1695 -693 1476 1608
1805 1608 622 -52 -988 -2756 -866 1757 1069 -764 -1160 -763 -789 38 1694 1631 -32 -967 -687 -264
1823 -264 1550 1630 395 -223 -535 -1263 -656 1824 1567 -947 -2116 -1041 -422 -27 1606 877 -1535 -983
1841 -983 -86 171 1535 2531 598 -1338 -318 824 619 799 1370 -491 -2556 -1603 129 884 800 -500
1859 -500 -1317 -1428 -369 88 1350 1487 -194 -932 -540 690 1497 1614 372 -1112 -1090 -731 -174 936
1877 936 1596 -619 -2405 -1595 202 803 958 336 -460 -1140 -846 1049 2169 903 -158 -638 -337 -335
1895 -335 612 1301 454 -1540 -1233 -1199 -577 1452 1613 -852 -1882 -469 73 255 1209 1543 -616 -1827
1913 -1827 -283 918 1429 897 113 -1410 -951 -243 62 990 740 -1299 -1841 -669 380 1099 670 368
1931 368 -565 -623 -120 1256 2064 1122 -527 -1442 -473 110 539 700 -590 -1467 -1688 -1256 523 1283 289
1950 289 -932 -1402 -332 420 985 1476 942 -297 -1189 -163 1140 1470 673 -509 -774 -1081 -919 666
1968 666 1169 -18 -914 -1557 -810 762 1315 1206 230 -844 -361 -142 1043 1885 1004 -1246 -1624 -372
1986 -372 381 776 401 -505 -1384 -1808 -209 1137 1260 -40 -841 -840 111 793 1108 1462 632 -1178 -1086 68
2006 68 808 1048 278 -859 -1671 -809 206 237 621 256 -1364 -1989 676 1527 400 310 522 -415 -964
2025 -964 379 1469 689 -324 -328 -1042 -1249 420 792 -231 -28 -652 -1215 -568 1013 1562 62 -727
2043 -727 -377 -480 336 1513 1681 40 -1289 -945 163 974 1260 44 -1209 -1520 -701 -204 974 1433
2061 1433 -460 -2101 -992 498 1346 1474 891 -497 -1108 -27 908 1339 1285 -59 -1989 -1277 273
2078 273 761 273 397 -952 -1984 -566 641 884 861 45 -1107 -1215 1012 1472 415 -127 470 -1322
2096 -1322 -1163 1072 1040 -773 -691 17 -942 -901 554 878 147 -544 -482 -664 -72 1695 1390 148 -351
2115 -351 -144 -551 -254 1221 959 -1148 -1600 -732 -350 -77 1001 292 -1200 -1036 -296 525 1588 1413
2133 1413 100 -1307 -426 431 570 1252 752 -1330 -2089 -496 191 486 598 -852 -2182 -891 550
2150 550 540 1118 782 -730 -1816 -27 1930 1452 402 412 -898 -1441 504 1585 311 -585 -602 -1214
2168 -1214 -992 814 789 -152 -892 -251 -582 -721 1213 1639 -120 -513 165 20 32 865 1143 -87 -895
2187 -895 -321 -395 -64 959 442 -1053 -1027 -274 -139 286 1446 779 -993 -1053 340 1073 639 970 74
2206 74 -1020 -827 -24 787 1099 483 -1045 -1662 -504 665 859 608 -227 -1024 -1145 523 1399 1283 847
2225 847 -835 -1416 62 1237 746 39 263 -1292 -1727 318 1635 252 -969 -76 -783 -1108 866
2242 866 1594 254 -531 16 -622 -238 1641 1422 -263 -1056 -311 -368 -363 683 833 -766 -1770 -926 16
2261 16 532 434 396 -373 -1022 -108 574 1172 924 521 -566 -804 359 858 444 161 -457 -1267 -1129 13
2281 13 619 511 -134 -953 -1151 106 960 575 790 87 -1031 -829 860 1299 589 27 -547 -1287 -742
2300 -742 859 593 194 -425 -1392 -1010 236 771 717 -202 -682 -469 -206 666 1196 835 -246 -820 -896 165
2320 165 884 309 -91 -506 -782 -734 286 613 704 -487 -1034 -227 150 658 1221 531 -321 -793 -82 754
2340 754 986 523 -67 -1038 -1005 165 561 344 -51 -442 -1105 -628 555 977 594 -291 -213 -300 -162 812
2360 812 1256 723 -525 -1014 -326 391 240 838 54 -1260 -1241 -192 451 843 517 -401 -736 -546 434
2379 434 673 676 185 -156 -538 -350 934 1100 440 -817 -1066 -372 -130 319 784 98 -1062 -833 215
2398 215 732 1084 683 -42 -829 -409 604 876 813 453 -633 -1173 -491 377 495 286 -416 -817 -504 -100
2418 -100 749 1050 -217 -747 -413 -90 550 873 1029 93 -607 -397 325 547 607 15 -693 -1160 -452 -144
2438 -144 720 510 -233 -848 -729 -52 864 842 319 -272 -456 139 850 694 727 17 -680 -945 -220 780
2458 780 648 -159 -353 -717 -775 326 970 725 -45 -484 -363 404 758 944 744 -193 -773 -443 156 686
2478 686 562 -314 -993 -1035 -162 360 299 189 -162 -973 -856 847 1226 773 39 -252 -306 -108 500 921 528
2499 528 -453 -784 -919 -119 412 311 -139 -786 -1014 -325 757 740 549 -134 -575 -787 550 1260 740 -47
2519 -47 -247 -631 -998 284 903 -75 -682 -535 -631 -301 610 467 -43 -439 -471 -26 578 881 881 160 -330
2540 -330 -304 98 385 927 255 -409 -978 -560 -23 395 67 -67 -862 -784 71 258 811 613 -192 -802 -343
2561 -343 608 537 452 263 -51 -1185 -696 593 596 -72 135 -879 -1321 130 1136 499 188 -395 -632 -145
2581 -145 978 1182 218 -252 -444 -454 380 957 733 -328 -965 -1208 -609 555 788 49 -750 -693 -256 -222
2601 -222 742 1151 -104 -469 -323 -140 272 653 370 -646 -706 -134 -92 106 451 238 -1069 -903 247
2620 247 313 107 798 168 -725 -731 531 980 292 412 15 -832 -558 490 208 111 -32 -496 -1163 -481 270
2641 270 700 137 -183 -481 -1023 35 1124 1120 21 -368 -670 -467 414 1131 364 -671 -716 -932 -335 696
2661 696 652 -575 -916 -280 -148 281 1156 653 -326 -609 -253 412 790 881 -177 -866 -519 -364 -50 553
2681 553 439 -727 -685 -120 143 264 503 261 -566 -230 159 528 572 736 -51 -890 -238 416 536 149
2701 149 32 -398 -892 -548 179 425 58 -57 -374 -768 -162 1029 564 174 138 -265 -784 264 1167 621
2721 621 -330 -225 -436 -619 216 623 56 -803 -798 -490 49 901 571 -102 -546 -205 314 578 1057 465 -502
2742 -502 -787 -611 -100 608 632 -344 -823 -482 -265 219 597 501 -451 -698 -378 203 537 784 272 -256 -502
2763 -502 234 360 558 222 36 -629 -927 179 492 -37 -256 -311 -723 -544 612 900 146 21 -344 -244
2783 -244 193 602 800 -176 -403 -457 -597 296 762 279 -384 -622 -228 -227 315 639 223 -672 -238 36 289
2804 289 699 709 7 -692 -393 101 640 546 13 -446 -723 -450 119 440 543 -237 -331 -776 9 715 934
2825 934 380 -387 -579 -1 278 598 302 -185 -518 -542 118 202 453 18 -357 -549 -370 -87 135 389 -12
2846 -12 -401 -261 -129 491 681 110 -212 -379 -550 118 349 517 101 -639 -761 -89 145 544 615 -151 -658
2867 -658 -235 383 605 841 228 -448 -466 18 217 525 569 -278 -844 -421 155 48 564 -200 -689 -547 -214
2888 -214 315 689 120 -124 -229 -383 353 381 548 328 -128 -409 -461 144 557 360 -293 -657 -565 -176 377
2909 377 465 75 -198 -306 84 298 673 452 -50 -287 -366 136 421 410 142 -371 -705 -522 -61 382 558
2930 558 -318 -545 -309 -58 513 735 591 -369 -621 168 530 759 671 133 -765 -742 -311 147 471 161 -328
2951 -328 -1026 -507 -70 556 323 90 -227 -363 -8 693 778 549 -386 -644 -125 310 375 287 186 -739 -664
2972 -664 -206 74 366 232 -230 -469 -278 80 559 453 405 117 -194 -71 223 821 224 -68 -263 -577
2992 -577 -370 398 610 249 -455 -784 -420 126 778 323 185 -514 -470 -79 885 710 327 -469 -547 -423 135
3013 135 450 228 -217 -498 -653 53 125 527 215 -291 -393 -171 349 648 689 271 -419 -260 55 470 672
3034 672 39 -280 -603 -462 348 282 224 -286 -788 -603 70 484 241 447 253 -66 -628 181 794 347 172
3055 172 173 -693 -200 425 326 -325 -84 -286 -618 -64 513 152 30 17 -304 -325 103 857 654 -44 -405 -312
3077 -312 0 226 658 262 -627 -686 -447 116 383 446 -20 -850 -418 251 279 643 648 -210 -497 -5 290 518
3099 518 602 -99 -586 -681 93 268 149 263 -426 -1249 -112 260 284 226 308 -309 -566 108 544 359 -14
3120 -14 395 -342 -516 588 887 26 -378 -219 -591 -276 177 266 -118 -502 -155 -235 112 800 311 73 -342
3141 -342 73 -233 236 552 233 -186 -265 -21 -263 -170 611 67 -613 -337 -145 -96 436 517 -258 -661 -40
3162 -40 -38 390 631 352 -84 -708 65 314 435 398 58 -928 -528 76 302 280 263 -172 -519 -178 484 560
3184 560 345 39 -359 -638 240 615 282 -51 -448 -779 -442 355 259 -73 -427 -55 -530 -322 411 496 140
3205 140 46 -111 -267 -85 542 300 57 -272 -91 -286 -13 552 -57 -444 -375 -189 -171 60 419 30 -337
3226 -337 -145 161 30 410 511 191 -239 -224 79 393 569 428 -324 -505 -109 90 105 275 -94 -706 -305
3247 -305 364 591 368 374 -253 -613 -345 389 663 442 -67 -469 -987 -459 289 182 -293 21 -533 -469 300
3268 300 583 233 5 -233 -316 35 493 497 31 -245 -278 -23 309 312 249 -131 -499 -678 -119 458 579 110
3290 110 -437 -399 95 319 372 734 93 -237 -419 139 139 290 92 -222 -675 -313 180 254 116 -134 -561 -463
3312 -463 -172 282 505 341 -60 -391 -78 46 621 525 -58 -246 -295 -158 379 180 21 -126 -686 -600 183
3333 183 427 72 -75 -230 -240 -239 318 724 137 -159 -427 -280 146 519 410 -229 -547 -670 -384 -8 410
3354 410 434 -198 -418 -463 379 312 614 213 -489 -302 -110 686 584 350 11 -420 -578 -13 8 255 -204
3375 -204 -563 -690 -228 417 74 454 3 -381 -216 75 361 342 250 -252 -696 -230 319 202 142 -106 -447
3396 -447 -357 82 33 371 63 1 -180 -296 183 297 521 150 -155 -357 190 404 290 156 -105 -452 -474
3417 -474 30 242 347 147 -583 -595 -248 231 398 184 171 -295 -128 265 451 213 126 -192 -368 -169 45
3438 45 461 212 -419 -715 -536 -271 180 306 -14 -149 -150 -279 89 449 504 184 -280 -23 102 183 57 2
3460 2 -524 -357 -338 10 296 517 231 -359 -410 -80 592 621 219 -249 -66 -226 409 128 541 27 -76 -209
3482 -209 -427 -122 381 -93 -223 -402 -243 -135 284 401 78 -230 -326 -125 374 331 343 -98 -382 -185 118
3503 118 502 115 -100 -453 -358 -55 179 63 345 -216 -427 -16 -40 208 287 416 -155 -309 -21 369 510
3524 510 354 68 -158 -396 -117 107 194 110 -463 -694 -334 232 195 87 -8 -196 -320 135 484 399 90 87
3546 87 -400 -399 260 393 154 -431 -445 -492 -388 171 17 186 -399 -212 -162 389 287 709 -184 -377 -234 77
3568 77 443 523 142 -496 -509 -236 121 -200 127 12 -691 -309 96 32 366 522 -8 -566 -208 252 233 658
3590 658 378 -216 -363 -57 339 15 282 -58 -737 -686 157 227 140 168 -128 -384 -49 247 699 25 258
3611 258 -145 -547 176 571 410 -181 -360 -643 -381 113 571 132 -646 -114 -326 -258 501 451 124 -474 -70
3632 -70 26 -27 420 449 -98 -225 -241 65 -64 264 -49 -170 -342 -93 60 167 414 54 -528 -34 298 348
3654 348 105 468 -51 -469 78 59 58 332 52 -377 -342 31 244 37 194 -148 -155 -411 44 459 243 92
3676 92 -132 -192 -230 434 339 332 38 10 -673 -319 151 451 -58 -187 -564 -257 60 436 139 -114 -81 -364 85
3699 85 486 383 -138 -380 -187 -310 14 395 5 -461 -588 -326 -81 223 414 74 -429 -156 285 235 266
3720 266 447 -119 -242 -30 97 157 125 -134 -226 -675 254 96 71 179 158 -54 -335 -53 150 160 -14 158
3742 158 -142 -193 32 153 317 -316 -108 -341 -140 252 252 42 -205 -41 -484 117 484 390 -47 -35 74 -105
3764 -105 357 399 191 -145 -262 -279 -332 204 341 37 -399 -402 -221 296 397 186 87 -543 -327 157 359 203
3786 203 265 -85 -86 -316 3 291 213 -173 -664 -36 -104 179 326 55 -71 -417 -178 124 177 -71 70 -471
3808 -471 -203 174 169 36 -14 -206 1 -247 439 175 20 -123 -297 -374 -173 36 87 29 -111 -142 -163 366 462
3831 462 362 87 -317 -28 113 524 384 91 -65 -186 -289 -54 224 165 -156 -336 -394 23 179 243 178
3852 178 -288 -316 -148 176 -19 265 61 -252 -291 -82 19 105 189 -221 -453 -437 168 219 -1 -123 66 -167
3874 -167 -160 302 535 271 -120 -497 -376 -265 281 217 112 -329 -266 -326 -68 295 368 -98 -276 -365 -117 364
3896 364 348 204 62 -36 5 123 488 232 71 -330 -232 98 83 430 100 -320 -309 -300 -21 165 449 -12 -345
3919 -345 -188 -93 424 512 302 7 -327 -256 155 120 138 -156 -400 -326 107 -59 288 69 -136 -173 -130 -20 371
3942 371 228 -72 -2 -19 -229 273 211 114 -183 -221 -204 -141 31 408 -18 -505 -283 -17 413 384 134 45 -398
3965 -398 -7 267 231 347 -149 -330 -424 -150 168 309 182 -86 -270 -152 -101 133 375 127 -178 79 -163
3986 -163 249 416 278 -196 52 -245 -23 151 305 114 -206 -305 -329 104 201 270 -30 -147 -342 -21 209
4007 209 360 192 31 -141 94 194 332 379 -93 -250 -16 -246 187 -26 213 -290 -447 -310 -29 313
4027 313 36 200 -370 -99 -75 394 321 150 -146 -171 85 -42 362 107 -55 -366 -350 -230 41 53 238 88
4049 88 -281 -174 -371 369 384 347 -278 116 11 181 175 -47 -188 -356 -260 -72 -17 255 122 -559 -194 -17
4071 -17 387 38 61 -9 -356 -197 19 358 159 55 -24 -328 -251 48 263 35 -70 -396 -261 -150 300 71
4093 71 67 -254 -32 -283 176 66 33 225 -252 -231 -168 130 184 239 -48 -129 -361 -83 -61 57 -215 -286 -277 -303 95
4118 95 361 266 -13 -228 -1 -9 196 514 185 -294 -219 -67 -170 83 157 -336 -302 -74 -226 446 85 332
4140 332 -134 -335 6 265 536 20 19 -196 -178 304 285 297 -23 -220 -273 -460 199 -52 -153 -394 -22 -372
4162 -372 42 304 96 162 47 -35 -242 213 -83 29 -132 -54 -142 -341 55 -43 -66 -369 -21 -144 -144 304 298
4185 298 -101 -94 -176 -135 375 416 263 -63 -56 34 -60 357 260 129 -440 -409 -98 101 226 175 -121 -298 48 -117
4209 -117 150 343 149 -224 -441 91 195 386 170 -158 -184 -357 25 187 120 -83 -87 -376 -209 191 390
4230 390 -26 58 -233 8 132 394 81 86 19 -362 -338 156 286 172 -51 31 -112 -300 241 305 -138 27
4252 27 -123 172 116 198 103 53 -97 -97 53 -159 210 -221 -201 191 -258 -75 92 -24 -129 -339 -15 -198 -145
4275 -145 170 -42 106 2 184 168 209 135 109 -171 -418 -222 145 170 -308 29 -361 -15 -123 446 86 190
4297 190 10 -156 -330 136 196 60 133 9 -360 37 427 233 -149 -123 -515 -91 -119 206 390 8 -143
4318 -143 -548 41 407 77 255 -173 30 -165 68 341 419 128 -161 -108 -121 326 436 -12 -2 -386 -210
4339 -210 70 233 322 -35 -248 -340 151 156 195 339 -120 -474 -122 6 -59 176 16 -229 -317 -154 -38 318
4361 318 9 -52 -58 120 -70 297 234 -34 -55 -232 -110 92 209 36 -150 -587 -305 -75 -64 -41 197 -192
4383 -192 -82 -51 247 354 308 6 -226 -175 190 244 -115 -264 -275 -123 -156 7 -112 152 -39 -370 -316 118
4405 118 152 -6 25 92 -381 -173 180 91 246 -71 -138 4 -207 258 390 137 -251 -198 -96 189 -8 298
4427 298 -214 -176 -145 50 24 62 185 -212 -249 -272 193 152 22 -6 -30 -264 50 -48 316 130 -352 -352 -121 29
4451 29 40 377 142 -192 -133 46 193 51 116 163 -619 89 -54 56 213 -31 -32 -399 74 -5 75 286 -111
4474 -111 -406 -132 108 240 173 166 -147 -132 -163 290 157 -6 -128 -67 -239 -119 157 44 -121 -243 -430 -306
4496 -306 214 430 468 -31 -75 -292 62 481 71 264 -214 -277 -156 48 71 26 -261 4 -197 6 19 171
4518 171 -106 -125 51 -214 172 70 266 15 58 -322 -215 206 115 16 -213 -226 -379 7 -31 152 -52 -313
4540 -313 -231 -201 160 -90 46 -146 69 -122 -158 -52 1 -239 -8 -73 -32 34 115 -141 -14 -126 -174 179 398
4563 398 114 211 -203 -192 82 -46 265 203 215 -38 -359 -55 309 108 12 -22 -373 -58 219 29 -90 203
4585 203 -33 -192 136 118 216 229 -69 -71 -104 144 549 291 -325 -148 67 -79 72 42 -126 -260 61 -123
4607 -123 202 3 141 104 -65 85 -19 94 134 48 -331 -326 111 237 11 1 191 72 131 -178 205 -128
4629 -128 360 7 -130 -246 -35 -124 111 72 106 -33 -190 351 -9 118 62 -307 -36 -231 27 176 -186
4650 -186 131 -70 -110 64 435 345 -74 -195 -133 146 78 131 -21 4 -215 -121 209 219 73 -60 -109 -308 -131
4673 -131 24 231 -159 52 81 -23 -42 409 126 -24 5 -97 26 196 0 -45 -379 -211 -109 38 -180
4694 -180 131 -107 -64 -90 253 350 215 283 157 -110 35 -15 192 6 52 -56 -471 -341 3 46 -44 204 -42
4717 -42 -336 -200 203 221 116 -56 158 -103 284 337 187 -95 -10 -425 -246 113 92 -88 24 -159 -380 -188
4739 -188 298 261 81 145 -156 131 261 120 -25 -199 191 -166 64 85 125 -105 30 -64 30 171 -73 308
4761 308 -96 -260 89 161 -97 50 -54 -256 -196 149 205 49 262 -145 -345 -34 264 88 -258 8 -179
4782 -179 -186 -265 166 125 207 -108 -61 -139 35 28 94 124 -107 -282 -261 309 102 -52 -166 -52 17 -137 244 -42
4806 -42 -43 -324 85 -264 179 -90 234 -147 -112 54 117 327 221 -145 -36 -34 -227 -96 119 -122 -7 -277
4828 -277 -202 173 89 176 330 -88 -153 -20 213 172 258 -129 -139 -23 17 242 21 -234 7 -42 -228 69 -40
4851 -40 116 -152 -188 -249 24 315 256 -72 -89 -225 -119 288 426 -21 -212 -232 36 111 210 348 -139 -124 -233
4874 -233 30 203 487 270 178 33 51 24 233 291 59 -138 -124 -9 155 199 21 13 -51 -344 -285 359 64
4897 64 79 -114 -86 -327 291 433 58 138 -110 -222 234 31 290 -56 36 -55 12 -91 -183 132 -84 -311 -32
4920 -32 64 96 130 290 308 39 -110 -139 229 22 78 -31 -224 -268 -148 14 -78 -401 -160 -292 -12 170 93
4943 93 118 -184 -16 9 151 79 -172 15 -71 -77 65 -2 -57 63 -80 -186 -39 -59 123 247 -122 21 -75 -58
4967 -58 368 404 253 44 -109 -122 -356 25 202 13 37 -121 -305 140 113 -217 -109 -348 -430 -92 121 68
4989 68 39 -73 46 -69 341 244 -30 -267 -144 -188 66 136 -98 -85 -136 -196 129 55 236 192 14 -98 -92 -98 -21
5014 -21 139 -104 -113 35 22 -226 47 72 -172 63 55 36 231 91 -100 -154 85 -104 44 275 -168 161 -142
5037 -142 -53 -34 17 250 324 -203 -214 -147 85 22 -204 273 -18 -150 -115 245 152 121 194 -208 23 151 79 124
5061 124 406 -142 -243 -32 173 19 47 357 38 -65 166 158 134 96 -78 -101 -240 -4 296 29 92 -175
5083 -175 -179 -14 -62 34 -212 -204 -74 371 6 136 -42 -161 120 -114 -60 20 244 51 81 -253 -241 85 -115
5106 -115 77 144 -290 -90 -84 18 191 198 7 40 22 93 -41 31 164 152 171 71 61 231 345 -15 71 -66
5130 -66 269 60 291 173 -232 38 28 42 284 8 -125 -14 83 74 34 135 191 146 -14 -149 -63 95 -46
5153 -46 48 113 -144 -89 -311 72 -174 -223 -145 -7 72 -143 279 73 -361 56 40 188 38 16 9 -16 -231 149
5177 149 114 137 -117 -162 -406 54 38 -88 46 122 -1 125 6 -73 142 49 -71 -153 -165 176 126 11 80 65
5201 65 -165 101 81 -171 -124 -58 -4 -40 84 49 58 82 -9 13 119 318 -20 115 -102 -75 1 -10 198 197 -216 -13
5227 -13 -401 -59 181 83 -99 -20 -52 139 370 389 462 123 -206 51 -68 -49 258 257 -259 -264 290 -193 -16 142
5251 142 -55 -270 -96 232 129 322 -53 -87 -8 -62 309 221 41 -35 35 -21 -33 47 285 29 -313 -354 79
5274 79 20 212 187 52 34 -28 -108 -145 395 154 -208 38 -270 32 334 4 -111 -55 -452 38 35 180 -87
5297 -87 -101 -7 100 79 -138 237 27 -24 -31 -178 -63 206 -5 54 -151 -201 166 132 63 -235 -123 -264 75 8
5321 8 102 4 160 -258 -188 38 186 457 83 -102 -292 -133 183 -62 223 93 -98 118 -218 40 198 74
5343 74 314 199 -184 -103 344 209 250 20 -88 205 131 14 -11 9 -71 -67 105 -21 -77 42 29 -232 94 -88
5367 -88 -11 -46 284 1 46 -58 127 460 42 -314 -242 -90 -75 194 103 -21 -354 -223 162 304 40 3 -32
5390 -32 -97 130 15 164 116 7 -126 -306 101 -38 184 7 -35 -275 -154 123 37 -89 40 -88 54 282
5412 282 32 5 -7 -153 -20 8 0 347 153 115 -230 85 -290 101 6 -45 -136 -116 -190 127 69 251 39 -94
5436 -94 -78 -31 339 -110 80 -113 -45 63 -14 -118 72 -79 105 52 0 289 217 -34 -91 -146 -45 43 94 221
5460 221 -38 -94 -167 -24 81 -274 -59 -321 -204 -101 130 113 23 -239 -156 61 -239 -121 119 -118 80 90
5482 90 -297 -180 128 238 193 -175 -279 15 -265 -173 191 -99 -60 -17 229 -178 218 -91 160 -46 -125 19
5504 19 -7 28 -16 3 58 97 105 77 59 -24 3 208 -4 -54 39 -45 11 25 215 144 123 254 39 125 -62 47 -46
5531 -46 -226 -228 -131 34 326 104 -110 -58 58 -263 -263 192 -88 -142 241 -99 -4 217 39 175 -5 72 22 43
5555 43 131 145 183 122 -180 -26 -128 68 -51 -137 -38 -219 89 46 10 247 111 90 -217 -158 -17 -117 75 19
5579 19 -365 17 150 -54 -18 -10 -38 -141 -111 -18 147 261 52 -6 -29 192 -75 -75 -271 -160 -184 28 -64 -150 -57
5604 -57 -65 91 128 -64 5 -70 152 -52 -231 -162 -161 -6 -38 -98 -65 77 -174 -99 37 62 -50 -76 -33 284 97
5629 97 12 -150 132 -44 8 274 101 178 100 158 -85 100 -55 284 74 -56 33 -27 143 74 45 -245 -107
5652 -107 -40 -92 -77 287 -148 44 143 -210 -91 45 -6 -211 -150 -211 -213 92 101 40 46 55 -23 98 166 -123 174 -79
5678 -79 -126 -57 179 66 341 113 85 -73 213 257 -66 -271 -16 35 -108 216 -180 8 -31 60 30 -3 100
5701 100 35 -120 92 65 -21 117 -26 104 -111 13 -344 53 59 7 -131 -209 -156 -223 10 -250 -147 207 -7
5724 -7 -235 318 112 346 108 56 63 403 122 54 129 173 -78 -305 78 15 81 -149 -360 -80 -194 -3 63 -86
5748 -86 142 106 -200 -228 -23 192 132 -12 -220 -282 -61 195 -237 -49 -47 91 -79 143 145 -164 -52 -16 52 154
5772 154 369 -64 81 -49 -73 21 -241 188 210 58 -66 -216 -106 349 35 -42 34 -55 -381 -48 424 -246
5794 -246 40 124 121 42 -51 -46 -6 -180 -65 84 -19 -81 22 -194 422 214 -47 161 102 4 20 -33 -225 46
5818 46 220 -15 38 37 239 -38 77 -315 -180 -21 218 177 28 223 -230 113 77 -133 -156 106 134 51 159
5841 159 -226 88 214 278 27 -248 -125 -296 -87 12 364 -63 12 -151 5 46 -28 336 171 -57 88 77
5863 77 212 -3 200 -137 -26 130 -35 84 59 6 189 -4 35 -116 -33 -219 -54 -14 -258 127 54 66 -20
5886 -20 -126 -414 -120 141 -69 22 89 -215 -66 25 38 332 -183 -163 -3 18 170 -36 83 -162 -288 55
5908 55 -8 -118 -17 -5 -108 -43 -197 -25 39 94 129 -90 165 69 -168 89 -111 -112 75 -216 75 18 56 4
5932 4 -171 72 96 -37 -316 -254 -124 52 155 -312 243 220 -262 -379 -100 -38 252 -147 -209 -30 11 298 79
5955 79 59 109 -192 52 -85 146 109 43 18 -102 -7 -297 -16 14 77 69 -61 -50 22 -279 42 13 100 193 -171
5980 -171 -24 208 -133 -41 223 60 -88 88 166 -60 191 216 36 93 -321 -46 132 39 -236 -46 -26 -126
6002 -126 77 15 12 -90 9 95 186 -31 78 -17 -83 -240 69 186 -137 -61 12 -34 -179 92 -163 -4 -178 -195
6026 -195 134 -157 101 -133 -69 -60 -206 88 -25 -64 99 52 61 158 -5 335 67 202 -206 139 186 86 44
6049 44 -34 26 -133 -32 -102 -62 -123 -64 -223 -68 -91 -206 108 37 -216 48 22 211 74 37 -215 -308 -248 -22
6073 -22 119 -57 -178 25 36 149 -49 222 -153 75 -146 88 -36 57 43 115 2 -363 36 -250 166 -163
6095 -163 190 -74 110 -104 -136 122 -275 -331 30 295 -37 -85 186 -382 -170 -46 10 -185 60 -78 123
6116 123 -136 -168 -15 11 -69 70 -57 93 75 61 300 91 -400 -114 71 102 260 141 -107 -164 3 260
6138 260 176 -55 -216 -326 -127 -69 -43 164 -130 -162 -14 22 95 -94 86 -222 -149 184 -125 262 228 66 -76
6161 -76 -231 -46 -32 442 187 -260 -168 -13 -84 206 -94 185 -93 -125 -179 264 -99 73 155 -67 63 -119
6183 -119 105 62 -23 -213 -42 48 -95 62 56 50 -37 59 -73 -6 39 -90 -123 -162 -177 -267 241 27 41 -29 -218 -96
6209 -96 8 99 88 199 8 -107 -1 -131 -17 -25 -6 126 96 -120 -69 27 50 -140 -209 28 -169 206 307 130
6233 130 10 -113 89 -138 -36 97 50 -72 182 177 -168 -200 -72 -123 -369 53 -162 -94 -44 61 -82 -294
6255 -294 -206 10 -2 118 13 -28 -300 30 26 38 -106 78 -109 -113 311 80 -39 -249 -177 -46 84 167 -121
6278 -121 -57 -2 28 55 239 75 -9 -401 59 212 48 -87 13 119 34 -282 -96 -88 -89 57 -51 79 -21
6301 -21 376 -185 307 379 -92 6 5 123 266 246 -336 227 -145 56 194 -154 -197 99 29 -241 -40 113 60
6324 60 -84 365 -77 50 -51 59 -42 -109 -130 141 213 -78 -130 48 82 185 196 6 32 13 29 -58 -113 -21
6348 -21 43 154 -153 -45 -226 109 -111 -136 104 125 -46 -271 -123 9 -28 -38 -22 -24 180 98 199 -75 -267
6371 -267 -77 130 15 130 150 -169 47 41 -99 115 -162 -222 -47 -127 261 55 156 -277 77 -100 -109 186
6393 186 -20 104 -107 15 81 60 108 77 -65 -162 4 -245 -88 -209 -127 138 174 -249 -244 288 452 123 -21
6416 -21 -66 -228 -237 60 6 -106 44 -66 47 201 57 -200 -86 -75 106 -270 3 144 95 -109 -220 -101
6438 -101 -66 36 60 9 170 -192 28 -100 208 -83 8 -25 -113 31 159 20 -112 -163 -43 -184 -168 34 25
6461 25 3 66 -40 42 20 110 -101 -29 -222 67 -47 54 -84 -14 28 -177 -154 122 28 -184 -403 5 -16 151
6485 151 174 -95 22 -252 -442 -202 231 64 -23 -334 -110 -149 -277 127 -21 196 32 -51 113 45 -165 -75
6507 -75 -96 -7 228 105 -231 -15 -72 69 -113 -26 58 154 -107 4 -80 -115 108 12 -165 226 -224 31 -132
6530 -132 -56 145 104 -117 58 6 63 7 165 -164 -41 24 -307 -224 86 99 19 64 -198 45 9 -17 -127 -7
6554 -7 6 84 93 211 100 -205 -175 -197 270 283 43 51 146 -178 -71 -345 25 -29 71 -172 75 160 -79 12 -23
6579 -23 70 -158 -63 -103 -36 79 -60 276 -64 -206 73 37 -79 76 -164 -87 -14 82 -202 -183 -27 4 117 -42
6603 -42 59 217 131 -18 99 -23 -219 131 214 -75 -234 40 243 331 291 -225 13 -78 99 121 -24 92
6625 92 -271 -24 -55 -188 67 203 -280 60 145 185 182 193 43 75 204 -157 81 24 51 -160 210 -278 -163
6648 -163 -46 -62 -29 -26 119 -91 -108 -6 120 -196 79 271 178 148 -32 -146 18 -207 128 81 -56 -37 -35 -220
6672 -220 -107 -28 -191 -167 27 33 6 -36 -144 7 111 178 -290 -114 123 195 67 49 -162 67 218 -53 -149
6695 -149 -171 -86 -178 12 -11 -84 -25 -97 -130 119 26 -42 136 127 21 -146 54 74 -34 -36 -63 -2 -170 -78 311 126
6721 126 -177 -157 275 -139 14 31 -4 146 195 57 -132 -97 -20 -186 -368 17 -106 -12 37 -33 59 55 -62 -116
6745 -116 221 148 -280 207 -356 -72 87 360 161 -64 -196 -88 100 -172 15 135 244 45 -43 130 -261
6766 -261 301 -167 -326 -52 -7 17 180 130 -261 40 -141 167 54 -108 -59 159 -23 -179 154 306 185
6787 185 105 174 122 18 -273 -6 118 -10 -287 100 315 64 278 -322 161 186 59 53 -214 -88 -83 -66 -123
6810 -123 133 -146 87 72 -111 -140 -177 195 102 329 193 97 2 152 39 47 161 192 155 42 -13 75 184 40
6834 40 149 15 25 57 142 24 -56 -138 -64 -60 122 16 54 135 94 -6 127 -155 5 -90 174 12 -7 -15 -301
6859 -301 -21 165 -65 68 105 12 9 103 -314 -32 -327 249 115 169 86 132 -121 -203 240 -183 -51 -8 -257
6882 -257 -29 -18 103 224 -10 247 -65 42 81 245 -215 -25 122 -68 -93 -95 28 -183 -50 -100 162 38
6904 38 -30 -13 -312 9 147 40 339 303 -193 -207 133 109 -91 86 -90 31 -99 84 243 -56 52 -17
6926 -17 73 12 -44 347 -185 -32 -127 95 95 -74 -49 -119 -108 -131 -47 51 47 10 18 -36 -73 -36 -305 297 249 64 190
6953 190 -99 199 -43 47 -185 52 -39 62 262 -192 62 -163 -40 -12 86 102 216 124 33 -47 -29 -14 -58 138
6977 138 -137 20 -140 155 198 171 -181 237 94 38 127 -21 23 -103 -55 35 16 -78 131 12 52 8 67 187
7001 187 26 129 62 -49 -52 5 84 130 38 -8 -261 75 147 52 51 200 -156 49 32 -155 -23 -98 183 -126 203
7026 203 55 46 -18 98 -69 37 33 200 -65 -19 257 -102 -199 37 -11 103 -109 -8 -10 -128 -21 100 87 -106
7050 -106 -146 -58 208 -240 22 -144 -271 -183 88 -103 -76 2 -190 -241 62 -5 52 108 135 -340 -39 169 256 -76
7074 -76 39 -66 -180 170 -12 98 80 16 -167 303 93 56 181 101 -26 -205 221 90 10 78 -94 49
7096 49 -20 36 63 -144 -36 108 -74 -51 66 -42 -93 -41 90 4 -153 -39 -305 88 21 27 23 -105 90 256
7120 256 -50 23 221 217 -159 -71 121 2 -279 44 72 -99 201 -37 138 21 56 -16 -60 -162 3 -76 -269
7143 -269 -189 22 -86 237 66 -106 -150 142 181 241 -147 -18 -122 47 159 267 88 181 132 35 -117 94
7165 94 -46 -284 -55 -220 8 176 -3 -27 -20 -151 193 -95 90 -77 -22 -144 79 33 80 127 -163 188 -169
7188 -169 120 25 169 54 -137 70 6 66 -131 72 -58 13 0 -151 115 -53 117 -12 64 110 -159 -37
7210 -37 -18 -257 104 296 -159 -142 20 -244 205 121 -127 -91 -7 280 -230 32 -260 -72 -138 -2 -147 303
7232 303 -134 -93 246 -32 -208 94 144 -188 125 -162 162 8 56 128 70 -44 -117 133 188 50 303 -21
7254 -21 -119 -242 -161 -141 -461 223 -28 158 103 -153 -126 14 1 15 -156 -110 -158 120 236 -77 -48 98 337 120
7278 120 346 31 -16 -14 293 -164 213 144 -236 252 -120 26 -125 -83 51 106 196 -203 -135 -199 -43 35 -157
7301 -157 -37 -220 -46 6 128 -21 25 -25 -320 -106 161 88 -31 63 28 -104 -101 -53 -236 186 311 23 -62
7324 -62 238 164 -47 226 -45 12 32 -337 115 -206 111 -307 -14 67 -121 169 148 182 245 96 -362 42 -263
7347 -263 114 118 -177 -211 138 63 239 103 17 -32 11 14 -178 122 -79 -327 104 175 124 -20 20 -34 -148 -74 103
7372 103 171 -89 185 71 88 107 86 -100 81 134 59 -82 144 -87 68 -185 -28 19 75 82 72 212 211 -105
7396 -105 2 -53 -4 306 16 -49 -10 198 -27 385 177 160 -144 -146 -7 42 199 8 -83 106 -26 155 89
7419 89 -143 -92 66 -106 -174 -147 173 -172 -17 22 -186 -89 55 142 -118 -56 -98 -95 150 21 79 58 -95 -86 -25
7444 -25 57 68 -105 63 107 28 -9 37 50 -18 -338 279 -108 38 117 104 18 -239 50 227 170 88 95 -54 25 -4
7470 -4 -186 214 72 48 144 -42 117 -192 -65 -71 -118 -139 -5 89 53 22 40 -18 135 168 -53 196 207 68 -64
7495 -64 163 -130 -89 69 21 6 -57 -31 159 182 125 -230 40 6 124 -124 35 -143 -45 124 -23 -47 14 -193
7519 -193 158 -27 -65 87 54 135 47 -148 79 112 -209 -139 -188 44 44 -35 -39 -67 205 -3 281 -77 -211 58
7543 58 117 76 -140 31 -324 1 -38 156 -35 -176 -81 11 98 -130 -185 -1 120 -174 103 87 -150 2 -76
7566 -76 46 -243 -25 37 -25 47 -193 244 -176 -118 -294 -62 3 116 71 -175 81 -158 -41 -119 -119 145 -41
7589 -41 287 87 -381 -100 -55 264 18 -183 -154 -29 98 227 -37 8 -153 -26 130 81 197 120 -132 167
7611 167 115 229 -174 131 204 -127 -38 224 70 -51 -71 -48 -13 76 10 205 -219 134 -52 -46 -109 27 202 159
7635 159 -48 -290 7 31 -131 23 131 -108 115 -11 -6 259 38 -184 -85 -234 10 25 174 -15 -117 -118
7657 -118 50 162 -9 -201 177 142 85 241 -331 23 -39 423 189 -180 -58 70 -102 -36 251 -89 -54 -79
7679 -79 128 38 37 -23 -24 56 24 -115 43 -109 28 27 24 127 -309 178 -35 55 124 -64 137 182 -160 22 32 -128
7705 -128 238 262 -101 -2 -120 3 104 73 107 279 -232 -4 -137 76 -53 202 168 106 69 -238 -156 76 114
7728 114 26 -32 -206 57 241 165 -60 -61 83 25 79 -119 25 0 -284 107 122 -322 -36 -137 55 -197 61
7751 61 84 53 216 -99 65 238 -79 -37 -5 46 -152 32 -127 -123 81 -22 -44 -342 -66 224 34 -34 96
7774 96 106 -182 110 -227 -244 -17 -14 68 24 72 -103 -94 -4 -80 49 -66 128 -124 66 -10 -20 -113 -16 47 -178 16
7800 16 204 -168 -154 -62 57 -58 -256 -82 -94 153 60 -306 -57 -211 132 -25 78 -19 122 260 46 49 -40
7823 -40 -170 27 254 131 128 -56 158 178 -20 198 119 -15 91 -189 -96 -40 -192 -20 -29 -17 9 -78 11 33 44
7848 44 107 137 -61 70 165 167 -79 -143 64 145 -140 -145 -59 119 -187 169 -206 -19 -14 79 -103 -187 -79 43 253
7873 253 175 -92 3 67 -64 -229 49 39 -31 88 94 -138 -190 30 166 181 -172 153 273 -102 135 -37 -157
7896 -157 127 56 37 -248 -4 -59 -60 -119 -13 -95 -161 -59 147 -97 41 -214 103 260 -168 -124 -63 -144 -43 -80
7920 -80 196 -178 44 -109 -38 23 -36 -201 -58 -95 -155 -223 -275 -115 -91 -78 -16 -53 -213 115 23 -13 -125 -45 -222
7945 -222 210 -144 -140 -93 -124 -123 48 -132 -85 -7 -15 -111 54 -49 -125 77 -129 -153 26 -181 52 147 -111 62 58
7970 58 7 40 54 -177 0 175 110 -255 -214 163 37 82 -70 -220 27 42 -185 100 42 184 -8 -15 -186 261
7994 261 -106 124 97 -48 33 89 166 -183 345 125 10 31 228 185 119 59 -84 -2 -242 189 44 179 23
8017 23 -169 72 -98 -112 -3 31 63 -392 70 120 -145 -91 27 13 77 27 -50 39 -110 66 -94 16 -195 -242
8041 -242 -178 87 216 -102 6 -99 -198 -15 -68 -202 144 -50 134 -43 -175 1 -158 4 -34 -214 -7
8062 -7 69 -56 -143 -57 162 -188 -119 81 -41 -226 -210 35 -33 145 15 167 161 170 414 -53 -103 -60 -152 126 25
8087 25 -161 204 -47 79 280 111 -64 51 -61 266 -185 -64 237 -209 90 37 29 6 -163 -31 2 136
8109 136 -168 122 -409 -13 41 53 14 142 -106 62 -36 -194 -62 51 -5 -164 -74 157 -51 -111 60 -62
8131 -62 304 -151 -172 -38 -162 261 217 -108 -184 -164 -49 -76 154 -17 221 -155 -178 326 49 85 359 -207 73
8154 73 -205 50 123 -152 96 -322 -70 70 88 253 19 34 187 6 -50 69 341 -42 41 36 -146 -92 192
8177 192 16 154 -89 -260 -247 21 22 148 26 -43 97 122 23 -144
8191a44
##END NTUPLES=NMR FID
##END=
