##TITLE=1H_SAV32-singlet-bat36(cold)
 CDCl3
 8 sc, 
 24.11.2023
##JCAMPDX= 6.0         $$ Bruker NMR JCAMP-DX V2.0
##DATA TYPE= NMR FID
##DATA CLASS= NTUPLES
##ORIGIN= UXNMR, Bruker Analytische Messtechnik GmbH
##OWNER= root
$$ XWIN-NMR		Version 3.5
$$ Fri Nov 24 14:14:57 2023 Russian Standard Time (UT+4h)  she@DPX200
##.OBSERVE FREQUENCY= 200.1313
##.OBSERVE NUCLEUS= ^1H
##.DELAY= (6, 6)
##.ACQUISITION MODE= SIMULTANEOUS
##.ACQUISITION SCHEME= undefined
##.AVERAGES= 8
##.DIGITISER RES= 18
##SPECTROMETER/DATA SYSTEM= spect
##.PULSE SEQUENCE= zg30
##.SOLVENT NAME= D2O
##.SHIFT REFERENCE= (INTERNAL, D2O, 0, 15.7039)
##AUDIT TRAIL= $$ (NUMBER, WHEN, WHO, WHERE, WHAT)
$$ ##TITLE= Audit trail, XWIN-NMR		Version 3.5
$$ ##JCAMPDX= 5.01
$$ ##ORIGIN= Bruker BioSpin GmbH
$$ ##OWNER= she
$$ F:/spectra/data/she/nmr/H-F/1/audita.txt
$$ ##AUDIT TRAIL=  $$ (NUMBER, WHEN, WHO, WHERE, WHAT)
(   1,<2023-11-24 14:13:24.90 +0400>,<she>,<DPX200>,
      <created by zg, POWCHK disabled, PULCHK disabled
       configuration hash MD5:
       00 E9 B6 7A A2 85 ED C7 34 08 36 98 17 FE 4E 26
       data hash MD5: 16K
       86 E9 95 3D 06 E3 3B E9 AA DA C0 3E E1 70 D9 68>)
$$ ##END=
$$ 
$$ hash MD5
$$ 54 5A B3 AA 55 A2 F6 16 E8 E1 CF 0C BC D3 F5 80
##$RELAX= 
##$RELAX= 
##$RELAX= 
##$RELAX= 
##$RELAX= 
##$RELAX= 
$$ Bruker specific parameters
$$ --------------------------
##$DU= <F:/spectra>
##$EXPNO= 1
##$NAME= <H-F>
##$PROCNO= 1
##$TYPE= <nmr>
##$USER= <she>
##$AMP= (0..31)
100 100 100 100 100 100 100 100 100 100 100 100 100 100 100 100 100 100 
100 100 100 100 100 100 100 100 100 100 100 100 100 100 
##$AQSEQ= 0
##$AQ_mod= 1
##$AUNM= <au_zg>
##$AUTOPOS= <>
##$BF1= 200.13
##$BF2= 200.13
##$BF3= 200.13
##$BF4= 200.13
##$BF5= 200.13
##$BF6= 200.13
##$BF7= 200.13
##$BF8= 200.13
##$BYTORDA= 1
##$CFDGTYP= 0
##$CFRGTYP= 5
##$CHEMSTR= <none>
##$CNST= (0..31)
1 1 145 1 1 1 1 1 1 1 1 1 1 1 1 1 1 1 1 1 1 1 1 1 1 1 1 1 1 1 1 1 
##$CPDPRG= <>
##$CPDPRG1= <>
##$CPDPRG2= <>
##$CPDPRG3= <>
##$CPDPRG4= <mlev>
##$CPDPRG5= <mlev>
##$CPDPRG6= <mlev>
##$CPDPRG7= <mlev>
##$CPDPRG8= <mlev>
##$CPDPRGB= <>
##$CPDPRGT= <>
##$D= (0..31)
0 1.2 0 0 0 0 0 0 0 0.06 0 0.03 0 0 0 0 0.0002 0 0 0 0 0 0 0 0 0 0 0 0 
0 0 0 
##$DATE= 1700820804
##$DBL= (0..7)
120 120 120 120 120 120 120 120 
##$DBP= (0..7)
150 150 150 150 150 150 150 150 
##$DBP07= 0
##$DBPNAM0= <>
##$DBPNAM1= <>
##$DBPNAM2= <>
##$DBPNAM3= <>
##$DBPNAM4= <>
##$DBPNAM5= <>
##$DBPNAM6= <>
##$DBPNAM7= <>
##$DBPOAL= (0..7)
0.5 0.5 0.5 0.5 0.5 0.5 0.5 0.5 
##$DBPOFFS= (0..7)
0 0 0 0 0 0 0 0 
##$DE= 6
##$DECBNUC= <off>
##$DECIM= 32
##$DECNUC= <off>
##$DECSTAT= 4
##$DIGMOD= 1
##$DIGTYP= 9
##$DL= (0..7)
0 120 120 120 120 120 120 120 
##$DP= (0..7)
150 150 150 150 150 150 150 150 
##$DP07= 0
##$DPNAME0= <>
##$DPNAME1= <>
##$DPNAME2= <>
##$DPNAME3= <>
##$DPNAME4= <>
##$DPNAME5= <>
##$DPNAME6= <>
##$DPNAME7= <>
##$DPOAL= (0..7)
0.5 0.5 0.5 0.5 0.5 0.5 0.5 0.5 
##$DPOFFS= (0..7)
0 0 0 0 0 0 0 0 
##$DQDMODE= 0
##$DR= 18
##$DS= 0
$$ [...]
##$SUBNAM2= <"">
##$SUBNAM3= <"">
##$SUBNAM4= <"">
##$SUBNAM5= <"">
##$SUBNAM6= <"">
##$SUBNAM7= <"">
##$SUBNAM8= <"">
##$SUBNAM9= <"">
##$SW= 18.0517328524113
##$SWIBOX= (0..15)
0 0 2 0 0 0 0 0 0 0 0 0 0 0 0 0 
##$SW_h= 3612.71676300578
##$TD= 16384
##$TD0= 1
##$TE= 0
##$TE2= 300
##$TE3= 300
##$TEG= 300
##$TL= (0..7)
0 120 120 120 120 120 120 120 
##$TP= (0..7)
150 150 150 150 150 150 150 150 
##$TP07= 0
##$TPNAME0= <>
##$TPNAME1= <>
##$TPNAME2= <>
##$TPNAME3= <>
##$TPNAME4= <>
##$TPNAME5= <>
##$TPNAME6= <>
##$TPNAME7= <>
##$TPOAL= (0..7)
0.5 0.5 0.5 0.5 0.5 0.5 0.5 0.5 
##$TPOFFS= (0..7)
0 0 0 0 0 0 0 0 
##$TUNHIN= 0
##$TUNHOUT= 0
##$TUNXOUT= 0
##$USERA1= <user>
##$USERA2= <user>
##$USERA3= <user>
##$USERA4= <user>
##$USERA5= <user>
##$V9= 5
##$VALIST= <valist>
##$VCLIST= <CCCCCCCCCCCCCCC>
##$VD= 0
##$VDLIST= <DDDDDDDDDDDDDDD>
##$VPLIST= <PPPPPPPPPPPPPPP>
##$VTLIST= <TTTTTTTTTTTTTTT>
##$WBST= 1024
##$WBSW= 4
##$XGAIN= (0..3)
0 0 0 0 
##$XL= 0
##$YL= 0
##$YMAX_a= 393495
##$YMIN_a= -458955
##$ZGOPTNS= <>
##$ZL1= 120
##$ZL2= 120
##$ZL3= 120
##$ZL4= 120
##$ABSF1= 10
##$ABSF2= 0
##$ABSG= 5
##$ABSL= 3
##$ALPHA= 0
##$AQORDER= 0
##$ASSFAC= 0
##$ASSFACI= 0
##$ASSFACX= 0
##$ASSWID= 0
##$AUNMP= <proc_1d>
##$AZFE= 0.1
##$AZFW= 0.1
##$BCFW= 1
##$BC_mod= 2
##$BYTORDP= 1
##$COROFFS= 0
##$CY= 11.3945322036743
##$DATMOD= 1
##$DC= 2
##$DFILT= <>
##$DTYPP= 0
##$F1P= 15.7292609196834
##$F2P= 12.9074282941183
##$FCOR= 0.5
##$FTSIZE= 0
##$FT_mod= 4
##$GAMMA= 1
##$GB= 0.15
##$INTBC= 1
##$INTSCL= 1
##$ISEN= 128
##$LB= 0.24
##$LEV0= 0
##$LPBIN= 0
##$MAXI= 10000
##$MC2= 0
##$MEAN= 0
##$ME_mod= 0
##$MI= 1.114404
##$NCOEF= 0
##$NC_proc= 0
##$NLEV= 6
##$NOISF1= 3.799351
##$NOISF2= 2.8
##$NSP= 1
##$NTH_PI= 0
##$NZP= 0
##$OFFSET= 15.70392
##$PC= 1
##$PHC0= -24236.72
##$PHC1= 20.65269
##$PH_mod= 1
##$PKNL= yes
##$PPARMOD= 0
##$PSCAL= 0
##$PSIGN= 0
##$REVERSE= no
##$SF= 200.130013532006
##$SI= 16384
##$SIGF1= 3
##$SIGF2= 2
##$SINO= 400
##$SIOLD= 16384
##$SREGLST= <1H.CDCl3>
##$SSB= 0
##$STSI= 0
##$STSR= 0
##$SW_p= 3612.71676300578
##$SYMM= 0
##$S_DEV= 0
##$TDeff= 0
##$TDoff= 0
##$TI= <>
##$TILT= no
##$TM1= 0
##$TM2= 0
##$TOPLEV= 0
##$USERP1= <user>
##$USERP2= <user>
##$USERP3= <user>
##$USERP4= <user>
##$USERP5= <user>
##$WDW= 1
##$XDIM= 8192
##$YMAX_p= 0
##$YMIN_p= 0
$$ End of Bruker specific parameters
$$ ---------------------------------
##NTUPLES= NMR FID
##VAR_NAME=  TIME,          FID/REAL,        FID/IMAG
##SYMBOL=    X,             R,               I
##VAR_TYPE=  INDEPENDENT,   DEPENDENT,       DEPENDENT
##VAR_FORM=  AFFN,          ASDF,            ASDF
##VAR_DIM=   8192,          8192,            8192
##UNITS=     SECONDS,       ARBITRARY UNITS, ARBITRARY UNITS
##FACTOR=    0.0002768,     1,               1
##FIRST=     0,             0,               0
##LAST=      2.2672688,     0,               0
##MIN=       0,             -458955,         0
##MAX=       2.2672688,     393495,          0
$$ Real data points
##PAGE= N=1
##DATA TABLE= (X++(R..R)), XYDATA
0@%%%%%%%%%%%%%%Oj4J6j6J6j6K4l2L2l6M4n2O0o8P6q7R9j12J28j44J60j78K01
37A07k24K49k78L08l39L75m14M54n00N52o12O74p41Q16q97R90j095J212j349J508
57G96j691J907k169K495k907L447m186N248o889R696j5323L0423j37967l41835
71d58955N41762J92483m80484O1882L72822k36394k23294K97574Q6900k30565
81g6269N6161J05662j62564J404J94378o7437j48040Q6272O5206q2380Q336P8331
93E9060l5422p4054L0925O2655k1523n0082J6511K4557k4408O063M1296l9583
105d005n7903O2486N0219o9792k99O6601p0345n2059J24171L0509j21980Q363
117c4034O8240n6861R92R6755m6302r4276N9819L4102o0819N0302N1343j15985
$$ plain form
0 0 0 0 0 0 0 0 0 0 0 0 0 0 0 0 6 -8 8 -8 8 -8 16 -16 16 -20 24 -28 32 -36 40 -47 52 -60 68 -76 84 -94 107
37 107 -117 132 -146 162 -177 198 -216 238 -262 290 -322 352 -389 427 -470 520 -575 637 -712 796
57 796 -895 1012 -1157 1338 -1569 1878 -2308 2940 -3949 5747 -9576 20847 -117120 -458955
71 -458955 82807 275290 -205194 -143312 229510 -6884 -230178 67396 154296 -76269
81 -76269 -20108 85554 -77010 -75606 118772 51335 -96705 -10433 54773 -27607 -19271 59060
93 59060 23638 -50416 -19491 43164 21641 -28441 -11930 12627 -11781 -5718 35578 -4005
105 -4005 -61908 578 50797 -18995 -19294 47307 -23038 -75097 49074 79583 -42397 -34034
117 -34034 34206 -22655 -21663 75092 28790 -65486 -5667 28435 -32384 17918 69261 -46724
129d6724k9096J22817k0719q3025P9165K7983j14479K1001J12476m9799o3613
140d4013P6206L939q3777N0078O4163q9513k8135R7595k1938q9366N5367N7265
152D7871p3801j6069Q3227j6164p7882L3974N4983l9899r486M8072l1931n2404
164d9509N5673N0180n2835k5031M3466j7917n2379M7519N9335o0994n5640N4781
176c351K5489m3988J9639M4971m7911m1945N3018K1279m4065J5576L3283n1631
188a9636j7310P3041r74o7607K7105M3716n2266j8887N5193j1548m5699L3858
200a014K4391m0952M695L2413l1815o326N4056j9899n6016L6186L2486m4811P189
213i417M9051l7383m7504M5124L0455l3630M642J8215m2877j2009N8424M367m6664
$$ plain form
129 -46724 -75820 46997 26278 -56747 22418 50401 -64078 -43077 69399 19600 -44013
140 -44013 32193 36132 -47645 2433 66596 -22917 -51052 46543 24605 -64761 -9394 47871
152 47871 -25930 -41999 41228 25064 -52818 -18844 36139 -3760 -13246 34826 2895 -49509
164 -49509 6164 56344 3509 -21522 21944 4027 -48352 -833 58502 -2492 -58132 -3351
176 -3351 22138 -21850 -2211 42760 -5151 -47096 5922 27201 -16864 -1288 31995 -19636
188 -19636 -36946 36095 35121 -32486 -5381 38335 -13931 -32818 22375 10827 -34872 -1014
200 -1014 23377 -17575 -12880 19533 -12282 -18608 35448 15549 -40467 -4281 28205 -16606 -9417
213 -9417 39634 2251 -45253 -129 30326 -3304 1338 19553 -23324 -35333 23091 27458 -19206
226a9206J2103K0662l6902k016N6746M34n5825j80L8510j0059j7187K7781K394
239A7255l8895O117L3180j5172j7116K7313j102l6813J6950L7600l3857k5699
251c0239N0700P978n4748J3518M2118l3977k0972M8078j669n0989J6200L3758
263A9756k9736k497M5494k4794n0275M0353L7391m2311o201L9774k7381l9530
275c9957M1932L4936l7210j5389K5934j3933j9098L5359J0795l9790L71K5865
287I815j8726p966L7315J152m1406P522L5751j8534k3279L0650R213l5907M306
300a0094K6981j6082j2261K4345k207k5051J1135J2564k6176K25L7582j2605l8316
313b9960K3257K5888k8212J72L6727j4537l5427J7616K1741j6245J693J7716k6886
$$ plain form
226 -19206 -7103 13559 -23343 -25359 31387 31821 -24004 -24184 14326 4267 -12920 14861 17255
239 17255 -21640 -15523 17657 2485 -14631 12682 11580 -25233 -8283 29317 -4540 -30239
251 -30239 20461 28439 -26309 -12791 29327 -4650 -25622 22456 20787 -30202 -14002 19756
263 19756 -9980 -12477 33017 8223 -42052 -1699 35692 -6619 -12820 26954 -427 -39957
275 -39957 1975 36911 -299 -15688 10246 -3687 -22785 12574 23369 -16421 -16050 9815
287 9815 -8911 -16877 20438 21590 -19816 -12294 23457 4923 -18356 12294 21507 -14400 -10094
300 -10094 16887 805 -11456 12889 10682 -14369 -3234 9330 -16846 -16621 20961 8356 -29960
313 -29960 -6703 19185 -9027 -8855 27872 13335 -22092 -4476 17265 1020 2713 20429 -6457
326f457k2835L5556J5271l1531M525K2278k8281j7810M0057J5910l5238q291K3210
339F364o595j1440K2082M176k2819O792J1210j7111K703K3920j4190k4166J8938
352a36J4370k7141m952L1450l877k5318J2937J0578j9261P336K2657j5186j4060
365a0603J7737k719k0022K1029K3233l2526k2673L1180N352k6938J7124K3432
377B3606l1315j9430L1739R349j9543Q985R608k7239m187L4563k774k7770J7634
390C226J4565l2718l035L7717n480l3425J2500J9918k3132q751K9356J34k2362
403a1487J1396J0059j9879N291K3793j4560j7237K0183L883k7391P074K9701j3874
416F952k5039J6366Q007k0284P299K2595j3370j7300J2044L301q208J5769J1091
$$ plain form
326 -6457 -29292 6264 21535 -9996 -5471 16807 -11474 -29284 10773 26683 -8555 -16846 6364
339 6364 -231 -11671 10411 14587 -8232 -1440 9770 -7341 -4638 19282 5092 -19074 -136
352 -136 14234 -12907 -17859 13591 9714 -15604 -2667 7911 -11350 -4014 18643 3457 -10603
365 -10603 7134 4415 -15607 5422 28655 -3871 -26544 4636 9988 -16950 174 23606
377 23606 -7709 -27139 4600 13949 -5594 3391 12999 -14240 -18427 16136 13362 -14408 3226
390 3226 17791 -14927 -17962 19755 14275 -19150 -6650 13268 -9864 -18615 10741 10875 -11487
403 -11487 -91 9968 -9911 -4620 19173 4613 -12624 7559 11442 -15949 -8875 20826 6952
416 6952 -18087 -1721 6286 -13998 -6699 15896 2526 -14774 -2730 571 -7637 8132 19223
429A9223k4605j1985K3163L861j6412J2471J0731k6615r410K6933L878j6999N377
442c89N983j7039J520K0499o329j2781J5754K97k4101J0802K5620j6520j6246
455a2930K0982K667k3201O833K0110j3205j0549J4976m069j7252J3570J4309j6139
468c898k450J6254j1759j5776K2218J6821k1840j0649J7021j764j4908J4191J5454
481A8915k0123j3870J5365J817q496J1919M988k1138k156K1700n328j4744J9261
494H110Q789k9403k747K8198m979j6260J6530K279k3773N735J9883j1527p726
507f891J6386q605k1682J7878J7976k0961l500K1967j0814j9643J9500J5454j5426
520A639m686R980q299p990J5198O100j3905j57N913j2860j700K0750J450k0960
$$ plain form
429 19223 -5382 -17367 5796 9657 -6755 5716 16447 -10168 -19578 7355 11233 -5766 -389
442 -389 5594 -11445 -9925 10574 4245 -8536 7218 7515 -16586 -5784 19836 3316 -12930
455 -12930 8052 10719 -12482 -5649 14461 1256 -9293 5683 1614 -15638 -2068 12241 -3898
468 -3898 -6348 9906 -1853 -17629 4589 21410 -430 -11079 5942 4178 -10730 3461 18915
481 18915 -1208 -15078 287 2104 -6392 5527 10515 -10623 -12779 8921 3593 -11151 8110
494 8110 16899 -12504 -15251 12947 7968 -8292 8238 10517 -13256 -7521 12362 835 -6891
507 -6891 9495 890 -20792 -2914 15062 -5899 -9399 12568 1754 -17889 1611 17065 1639
520 1639 -3047 6933 -1366 -9356 5842 11942 -1963 -2120 3793 -9067 -10767 9983 11433 -9527
534i527j282J4258l255q708J2806Q230j7158n465J4494o45o046J0523n99j6354
548h728L462J3636r248p088J5578j573k1216O861J8783j2874o675J8428l063j6764
562a0481Q932R661j0347L415J2093j3653j3375J6672O074j6665O977J3964k1146
575g879j3911K3834R547j5355N07O131j0735k032J7291K643j0708K787L59j1876
589i397Q084J7748j0393j4651Q807K110j1752N374J4703p612j3940N620O276n153
603d176N064Q662j0365p636R908K340p641N938R933j1032j2971J2000J0699j3557
617b834l245J4673o114j6013Q669J1905q510k766J0372o186j1555J2680R663j4325
631c586J201J4494j3918j3373K0050Q843j7860m60J1212r649q146J4825M877j0691
$$ plain form
534 -9527 -10809 3449 194 -8514 4292 12522 -4636 -10101 4393 3748 -2298 8225 7626 -8728
548 -8728 -5266 8370 -878 -7966 7612 6039 -15177 -8316 10467 -2407 -9082 9346 6283 -10481
562 -10481 -1549 8112 -2235 1180 13273 -380 -13755 2917 8991 -7674 -697 13267 -7879
575 -7879 -21790 2044 11591 -3764 -3257 2874 -7861 -9893 7398 10041 -667 2120 2479 -9397
589 -9397 -1313 16435 6042 -8609 198 2308 -9444 -4070 10633 3021 -10919 -5299 977 -4176
603 -4176 888 9550 -815 -8451 1457 3797 -3844 2094 12027 995 -11976 24 10723 -2834
617 -2834 -6079 8594 2480 -13533 -4864 7041 -1469 -4235 6137 -49 -11604 1076 10739 -3586
631 -3586 -2385 12109 -1809 -15182 4868 13711 -4149 -4609 6603 -3046 -11192 3633 8510 -2181
645b181M35K153p330N537J0657o479n733N459l960n377Q782N763o543l664K32
660b249j808K352O387j985m598J766j786m624O021P770l197o501j522L637K307
675A970o13L065M158q452r511P813Q728n557k084L333p879n125J2134L615q806
690c211L873M455j4197L96K0084m228j5171J0052N860j5878K278J7158n564j1190
704e283P463j18j1249Q121J0753j1875m938J1310n140j0658J2668J0439j2247
717g54o796R265J417o948M955Q998o480q006L654K470l068L782M286r559o852
732i636P032M631n521K801Q087r248j0294J1598J0133r337j871O787n223p272
746g333P600O442l548j877l33o253J053R842k053p393L754j06q454M403J0868
$$ plain form
645 -2181 -1746 407 -6923 -1386 9271 2792 -2941 2518 -1442 -6819 1963 7726 1183 -2481 -2249
660 -2249 -4057 -1705 4682 2697 -1901 -135 -1921 -6545 -524 7246 4049 -2452 -3974 -337 1970
675 1970 1357 4422 8580 128 -9383 -1570 7158 1601 -483 2850 -5029 -10154 1980 5595 -3211
690 -3211 662 5117 -9080 -8684 11400 7172 -7999 2053 7913 -7965 -5687 11471 5907 -5283
704 -5283 2180 2062 -9187 -1066 9687 -2188 -7126 4184 -956 -11614 1054 11493 -754
717 -754 -7550 1715 3132 -3816 1139 10137 3657 -4349 -695 1775 -1293 2489 6775 -2784 -9636
732 -9636 -2604 2027 -3494 -693 7394 -1854 -12148 -550 9583 246 -1625 5162 -61 -7333
746 -7333 267 6709 3161 1284 951 -5302 -4249 5593 3540 -3853 -99 -205 -8659 -4256 6612
761F612l188o322L112J39l574N582M581p207j500N668p325o156J3197N128j3993
776e246j974R857m508n981J0704O850j1219n035P716k85k021P867k32j0962P95
791c674O606l999q41P608j976j1522O51J0464r91n627N242J103q352N9P673J797
807D221k492J24k070m107K935O566l066l534N056k885r212N924R794n711o838
822e295M916L89n889M640Q481m499n527L497j450l277R404K801j0894o58O064
837B703m738k672R081K202j0098k939N975n00r44N452j015n950J319J642j097
852a579N471L093o914m911M524L159k251O51L042m377n696L417L829o29J004r88
868H45n084n19M731K112k330J209L401n657n192R599N656p785k044M474m195n167
$$ plain form
761 6612 3424 -2898 214 353 -3221 2361 6942 -265 -1765 3903 -3422 -9578 3619 8747 -5246
776 -5246 -7220 2637 -1871 -7852 2852 9702 -1517 -6552 1164 879 -1142 6725 6493 -4469 -3674
791 -3674 2932 -1067 -1908 5700 3724 -7798 -7147 3317 2326 -3301 1941 3044 -5308 -5249 2424 4221
807 4221 1729 1853 -217 -4324 -1389 5177 2111 -1423 3633 748 -8464 -2540 7254 1543 -5295
822 -5295 -379 10 -5879 -1239 7242 2743 -2784 713 -737 -4014 5390 8191 -2703 -3361 2703
837 2703 -2035 -4707 4374 6576 -3522 -6461 -486 -986 -1930 3522 2507 -3443 -2124 -482 -1579
852 -1579 3892 6985 71 -4840 -316 2843 592 1243 4285 -92 -5788 -2371 1458 829 1833 845
868 845 -4239 -4758 -27 2085 -245 964 4365 -1292 -6484 3115 8771 986 -1058 3416 -779 -5946
884e946O294N764o059m014K677k143r74P919R89p706K76L657l561P52P966j19
900E772q162r20M876O92j264K556j068m330l77J27k8M233J114o229k326M294R23
917a17j433L195L643n703n327N300M146k620J077J043o093j781O099J376m318
932a513K777J838q469k043J1235K168r190K040N064p254k853R661L327p482k049
947b743K650j809j43N698Mn789M74J625l764K377O927k227p521N34M880n06q61
964a94M566o64o341j152M590R41n05N66l354l316K623K898j739J209K743m153
980a282l974M630M214l061K86K466m131k048L982J707j03P52k754n400K322N132
996B738j866l699K558k36n299J949O293q0k412Lj750m96L895K157k291m56J098
$$ plain form
884 -5946 348 6112 53 -3961 -1284 -3427 -4401 3518 4507 -3199 -2923 734 -2827 -2075 5891 5772
900 5772 -2390 -3310 1566 2258 994 3550 2482 -1848 -2225 -2098 -2126 2107 3221 -3008 -5334 -1040 -117
917 -117 -1550 1645 5288 -415 -5742 -442 3704 1084 2161 3204 -2889 -4670 1429 2805 -1513
932 -1513 1264 3102 -5367 -7410 3825 5993 -3197 -1157 3907 -3347 -6200 3461 6788 -694 -2743
947 -2743 -93 -1902 -2045 3653 3657 -2132 -1658 -33 -3797 -1420 5507 3280 -4241 -3707 1173 667 -194
964 -194 4372 3708 -2633 -3785 805 1746 1241 1807 -1547 -4863 -2240 658 -1081 128 2871 -1282
980 -1282 -5256 -626 3588 527 813 3279 -852 -2900 1082 2789 2686 3438 684 -4716 -2394 2738
996 2738 872 -2827 -269 -505 -5804 -3855 2438 2358 -54 -51 -1801 -2297 1598 3755 1464 1008 2106
1013B106m240k368P986L679p905k682M415k523l110O379L579o694m061M048R42
1028d49j170N246J843q102o09N862j558j525O315j058r887j081Q152J126n070
1043a965J400K288n432j585O036K554k374r27m42r71O68L122J331k220p62r2k721
1060b092O88N012k82m468j149J038o1p8K100J107k130j652l86R14L563Q52l673
1077f97R97J880l876m2O092l10n087J69J20k478K482M988l149m319K651l53l377
1094d309N977M833o793m205L454J621j247L380J910m653l758J619L566P82N19
1109B696k047m050j13K472J966N15n13r27k116j860M417M870l373m135K636p01
1125b63k720K998M618l266m245J175R18o90K848J889m899j391K995j456o33N274
$$ plain form
1013 2106 -2134 -4502 3484 7163 -742 -3424 991 -1532 -4642 1737 5316 -1378 -5439 -1391 -449
1028 -449 -1619 3627 5470 -2632 -3241 2621 1063 -462 5853 4795 -5092 -6173 1979 3105 -1965
1043 -1965 -565 1723 -3709 -5294 742 3296 922 -5 -447 -1418 -750 2372 3703 1483 721 629 -2092
1060 -2092 -1404 3608 3326 -1142 -2291 -1253 -1314 -1392 708 1815 -315 -1967 -2353 -1439 2124 2976 -697
1077 -697 300 2180 -1696 -1738 4354 4044 -1043 -874 -754 -3232 -750 4238 1089 -3230 -579 -932 -4309
1094 -4309 1668 6501 -292 -4497 -1043 578 -669 2711 4621 -32 -3790 -2171 1395 2177 2696
1109 2696 649 -3401 -3514 -1042 924 1439 926 -1 -2117 -3977 440 5310 1937 -2198 438 -263
1125 -263 -2983 15 4633 1367 -2878 -1703 -785 -1475 1373 3262 -1637 -3028 -33 -1489 -2122 3152
1141C152J033n292j065K952J181j353Q48J278l119k220M57J539J828o87j927o00
1157a995l16L03K672J038m27p27j673j645L030L563J34l446j615J054q89N15L134
1174B710M04m642k945J391L104J060j229k64k98j883K01L949K301j464k344j208
1190a157M34J610J841K97k928j606j98j029J115M310q50n169m04L115L77K42K257
1207B257J59m309n31L754O47k80J661k589l067J968J547j144O07J537l377l545
1223d705K835L403j008j054Q73r45j319J326K038P26J26k369j628R22J645P64
1239A630m90p66j484j593O08L199J548j909k622k77R51Q16J305J708j512k481
1255a369M29Q77J171K082o68l833k05J274j140N96L529j450m683p9L366M57L22
$$ plain form
1141 3152 4185 -1107 -2172 780 1961 608 1456 2734 -385 -2605 -2148 -609 1219 532 -1395 -1995
1157 -1995 -2311 -2008 664 1702 1275 548 -1125 -2770 260 3823 3957 511 -1104 -50 -939 -424 2710
1174 2710 3114 -1528 -4473 -3082 22 1082 -147 -411 -709 -2592 -2391 1558 3859 2395 51 -1157
1190 -1157 -723 887 2728 3025 97 -1509 -1707 -2736 -1621 2689 1839 -3330 -3734 -619 -242 0 2257
1207 2257 2416 -1893 -2424 1330 1977 1697 3358 769 -2298 -330 1217 73 680 2217 -1160 -4705
1223 -4705 -1870 1533 525 -529 344 -601 -1920 -594 1444 2170 2296 -73 -1701 -779 866 1630
1239 1630 1140 374 -1110 -2703 -2095 1104 2652 743 -1879 -2156 -1205 -389 916 2624 1112 -1369
1255 -1369 -940 -63 1108 3190 2522 -1311 -1516 -242 -1382 -786 2743 1293 -3390 -3469 -103 354 676
1272F76J366k243k675K463J248k53K038M84m576j416L638J632j985J3R15k894
1288a569k090K960K538j014p36j289j311R40K158J111j53j322n25r56L08L191
1304B241J477l170k056M77p5J06J763Q67j957k634PJ918K110J142j412k217Q43
1321e70L86l99K767R42k789k182O32J297K36N93M36k177j738J250L91O23K527
1338B225j225l834L88L067R75o67J084J10l633q07L727J388k378n02n92k250N51
1355b373K810O99j341P7j073j156J523L866r60k842J213j26j731K011K909r89
1371B517k670j072k83N94J486P43j457j746M47o23O91L196P93l371j568J484J647
1388H08L35K47P19j655k535J162K102K79j45j128j997l84J512N66O25J22p07j959
$$ plain form
1272 676 2042 -201 -2876 -413 835 582 2620 3104 -1472 -2888 750 2382 397 410 1325 -1569
1288 -1569 -3659 -699 1839 825 89 -1200 -2511 -1571 587 1698 1545 223 -302 -1258 -950 2241
1304 2241 3718 548 -1508 -1031 -1106 -1000 763 1630 -327 -2961 -2954 -1036 1074 2216 804 -1413 -570
1321 -570 -184 -583 2184 3126 337 -1845 -1213 84 320 913 1349 -828 -2566 -1316 -925 -302 2225
1338 2225 1000 -2834 -2446 621 1596 929 2013 2123 -1510 -2317 1410 2798 420 -82 -674 -2924 -2373
1355 -2373 437 1136 -205 -128 -1201 -2357 -834 3032 2072 -770 443 317 -1414 597 3506 2517
1371 2517 -153 -1225 -1508 -914 572 1315 -142 -1888 -1441 -2064 -1373 1823 2616 -755 -2323 -839 808
1388 808 1143 1390 2109 454 -2081 -919 1183 1462 1317 189 -1808 -2192 -680 -114 511 633 -74 -2033
1406b033k99L362J159j036k33j452r02J460J684l57L39q00l259m55L867J023k653
1423e85j18Q41k352r76M716J451k993p13P74j368R10K942L1k613k38J29j306M76
1441i92L743o29m187O9J323l15J18K461K44l332j622K595J827K9O69j031k419
1458a449M02J809K13J15K05j547k816J206K519J45q25r8j094r14J368J531P77
1475A547L3j802k061J035K858L82r35R3j251j815J284K240m5j503q46o56l11J572
1493a81J455p16m12n41j368P84K218J171j343j921L27K49j93J729M11j424j395
1510a150m31J46J567Q90J8j666l68M02k55J083K764j092l424j37J743L00M33J140
1528A963j091k756q1J697O03L90J00j431j895J140J865N24n2L19j672j464R77
$$ plain form
1406 -2033 -2332 1030 2189 1153 920 -532 -1434 26 1710 1353 1692 892 -2367 -2822 1045 2068 -585
1423 -585 -703 138 -2214 -3190 1526 2977 -16 -729 45 -1323 -413 2529 2560 -53 -291 -162 -1468 -992
1441 -992 2751 2122 -2065 -1996 -673 -988 -870 1591 1835 -1497 -3119 -524 1303 1332 2001 970 -1449
1458 -1449 -1047 762 975 1090 1295 -252 -3068 -1862 657 802 -23 -121 -1215 -2129 -761 770 1547
1475 1547 1580 -222 -2283 -1248 1610 1992 1057 1150 -101 -1916 -632 1608 1563 60 -786 -1442 -1753 -181
1493 -181 1274 558 146 -395 -1763 -979 1239 2410 1067 -854 -527 -278 -471 1258 1669 245 -1150
1510 -1150 -1581 -1435 132 1022 1040 -626 -994 -592 -847 236 3000 1908 -1516 -1653 90 390 823 1963
1528 1963 872 -1884 -1965 -268 335 725 825 -606 -2501 -1361 504 1028 976 1295 -377 -1841 -864
1545h64K567J333j835j898m72K16Q12J250J63j249k508k50K261J261j04l58q60
1562e35j086M88J697J394l45r20p48o50N00K307k37j671o34m2j041K97K053o1
1580G66j407j432J389K16N21O14L75q31o29l63Q06J510L69j193p51o55j05M94
1598c06J261K94j431j478n5N95J452R88q95j255L92k14K21J620R83j115k382j55
1616a480J431J341j33J56j703j712J24K090Q07L86j478j591l48J709J934J8p99
1633G52l80j744J37K555O86q08j022j147o59J403J354q10k95m4j229j059K363
1650E3K212k074j043P91l38o62K147J198j454j459q2J68J64J036O79j436j162
1667a262M09j62M8J701M32j453j226O95J206r4M64J257j768j830J233Q97O96L89
$$ plain form
1545 -864 1703 3036 1201 -697 -1169 -953 -141 1109 1272 23 -2485 -2735 -474 787 683 325 -535
1562 -535 -1621 -1133 564 1958 1613 693 -55 -705 -205 2102 1865 194 -440 -482 -1523 -1226 827 766
1580 766 -641 -2073 -684 -468 53 667 1042 211 -418 -781 25 1535 1904 711 -40 -695 -800 -306
1598 -306 955 1249 -182 -1660 -1715 -1120 332 1320 425 -830 -438 -652 -431 1189 2172 1057 -1325 -1480
1616 -1480 -49 1292 1159 1315 -388 -2100 -1976 114 921 1307 -171 -1762 -2110 -401 1533 1551 752
1633 752 372 -1372 -1235 1320 2006 1198 176 -971 -1630 -227 1127 317 22 -22 -1251 -2310 53
1650 53 2265 191 -852 -61 -399 -1061 1086 2284 830 -629 -711 -543 -379 657 1336 -100 -1262
1667 -1262 -853 -1015 -967 734 1166 -287 -1513 -818 388 294 758 2015 247 -1583 -350 547 1243 1632
1685A632j244j990K58R57J70Q41N90k022k006J346K209K07j65M54k353p88K210
1702C06J250n48N63o11k768K16K548P84j686l66l8j496K66K266Q18j022j028q91
1720a437Q26J180O19J87o18o87j086J42J649J168j021j913l12K33O08R58K44j194
1738d54m82k22M65Q40J439j90j968m43J582l66k24J734L86l190q22K013K25j87
1756A36M78j65k448m9K044J40M8Q64j100k036J487K153k83m97J6p25j696J127
1774e06J724K13j270r08q03R3J311N75K27l77j096r96J309J889O0j153k77k52
1792b37j47L35J521N0j240p51r90M59J295Q01j041j226k08O05K45J074J287r29
1810I03k234J88J279Q43J11l80l91q09p06R22R16N23n37j464q00P61J014N69M44
$$ plain form
1685 1632 388 -1602 -1344 -387 -217 624 1214 -808 -2814 -1468 741 948 783 1237 -1116 -1904 306
1702 306 1556 1008 1571 960 -1808 -1592 956 1740 54 -312 -350 -1846 -1580 686 1504 482 -546 -1437
1720 -1437 -611 569 1188 1375 757 70 -1016 -874 775 1943 922 -991 -1303 -1070 -462 496 740 -454
1738 -454 -936 -1158 -693 147 1586 1396 -572 -1015 567 201 -23 1711 2097 -1093 -1915 98 323 136
1756 136 614 449 -1999 -2048 -4 136 184 1048 -52 -2088 -601 1552 1269 772 788 63 -1633 -506
1774 -506 1218 1431 161 -747 -1550 -1457 -146 429 656 279 -817 -1813 -504 1385 1445 292 15 -237
1792 -237 -384 -49 1472 1522 282 -469 -1459 -1000 295 1096 55 -1171 -1379 -774 -529 545 1832 903
1810 903 -1331 -1143 136 979 1090 710 319 -490 -1196 -274 642 1165 628 -836 -1636 -875 139 708 1152
1829A152q14j548l33J631J604l17q76k83j182p5J688M97n67m66j131n31O25J603
1847F77J16j117l20%j060J191K282p06j328q6k76L18J327N32p86n94p17n25J177
1866A05N76Q7j099o85n43J55J854N32r67m26K60j002J033J834l18j256m62K24
1884i8J40M02R16l7j836q16K7J110Q55k02l33l69j213M01J725M67k41k07j353
1903f62p18J683J468n74p23n15p46l59Q64K036j359j192o8k43O46J069J56l95
1921C68m45p86Q3J307Q67Q1j239q44k27M44O17P68m87q64q00k47J373J243q79
1940C33p77m69K30L9J187J025o06j220m14L14R02O24m18q63o46j81k41Q07J324
1959I50j58j539q70P47Q83K55O48k21q38p53L89J509O43n31j237p75k35J035O57
$$ plain form
1829 1152 338 -1210 -1543 88 1692 1375 499 216 -966 -1041 647 1144 577 111 -1020 -1551 -926 677
1847 677 793 -324 -644 -644 -1704 -513 1769 1063 -265 -351 -627 -309 1018 1550 764 170 -547 -1072 105
1866 105 681 768 -331 -1016 -1559 -1404 450 982 15 -411 -151 -1153 -120 1714 1396 140 -322 -98
1884 -98 42 444 1360 1323 -513 -1329 -1302 -192 663 461 128 -241 -1454 -1053 672 1139 898 691 -662
1903 -662 -1380 303 1771 1197 474 -41 -787 -1146 -282 1754 395 -797 -865 -1108 -462 607 763 368
1921 368 -77 -863 -780 527 1394 1475 236 -608 -835 -391 226 994 507 -357 -1157 -1404 -31 1212 333
1940 333 -444 -913 -683 -644 543 1568 962 -258 -672 -358 544 1168 750 -113 -759 -940 -1181 -374 950
1959 950 792 -747 -1617 -870 13 268 916 695 -143 -896 -507 1002 1645 1114 -123 -898 -1133 -98 559
1978E59J47l92p76j118K9J886R49o55j153j37K54J12J255N14n57j524l36N52P67
1997C76N88m30n88r79k94O02J068K15l08q73n45L89J298P16m59p00k63l63kJ296
2017G44R99j383j298N48L24p83R22P68j112j177M64P16j51J052N73j181j240J020
2035a95M92m0J138k23j532n94N19R11J25j46l98j063l59M71J272M61o51j143j20
2054a075N57R67Q39l85m02p82l95L54J601K5q78j179l84M46R59K88r3n74j161
2073a272j65N74J583K87j010k51j61k1R78J188r68j066k07k89L78J343L97j370
2091e2j100O86R3m71J072Q96j354j001R63O08k41R88J61j287p57M94P63k40M07
2110F28R0j452q28J275J37J96J95m1j213m82J167J354m01l01J68r34l20J283Q11
$$ plain form
1978 559 706 314 -462 -1580 -1551 335 1284 629 -524 -661 -407 -295 960 1474 917 -607 -943 -391 376
1997 376 964 534 -54 -1033 -1327 -725 343 558 250 -623 -1168 -779 519 1235 776 76 -187 -550 -552 744
2017 744 1743 360 -938 -390 -66 -849 73 841 -271 -1448 -984 -268 -419 633 1206 25 -1215 -195
2035 -195 297 257 1395 1172 -360 -954 -435 476 601 455 57 -1006 -1365 -894 378 839 188 -955 -1075
2054 -1075 -518 449 1288 903 501 -281 -676 -322 1279 1304 426 -753 -1137 -691 268 556 463 -111 -1272
2073 -1272 -1437 -863 720 1007 -3 -254 -415 -436 542 1730 762 -304 -511 -800 -422 921 1318 -52
2091 -52 -1152 -466 -373 -844 228 1124 -230 -1231 -268 340 99 1087 1248 -39 -796 -302 461 221 628
2110 628 718 -734 -1562 -287 -150 46 241 200 -1013 -1495 -328 1026 625 324 492 -442 -762 521 1332
2129A332m50p82p68l42M89J404p4r58r01M1j15Q89J360m23o83o15j88Q58J224
2148A298l82n04k98o73J71O40J336o31j888q3M17j46O53Q69r66p90M01L37J49
2167i0P77N64j147j054J094M89o17O23M85j332j338R58Q35k51k05N43q59r69J048
2186d46J027k90j6K14j029m54J697L41m06n8l34n43q65J343P02o70o55m53J0L41
2206e44Q06N40l78j000j64L82K07J399R5j052q74K50K66N44O71o73j059m32kQ12
2226b06J165p22j160L70J13jO71Q54l42j645M29P98l16P58O06r80j226M03N32
2245A01j73P27j09j315p40P18R31P9j84L18o69p08J135Q90P7q49k06l11l73L35
2265c26J221k78n44o41k08j06R63P00m85r46l2L65J04P53O22n13j286Q6L50P44
$$ plain form
2129 1332 882 100 -668 -1010 -521 883 809 -149 -1050 -1009 -1124 -235 1125 702 19 -596 -784 74 1298
2148 1298 916 412 114 -559 -388 252 1588 957 -931 -1014 -597 -743 -90 779 -187 -977 -576 -239 -90
2167 -90 687 1251 104 -950 144 633 16 639 1124 -208 -1546 -588 247 -4 -209 334 -525 -1494 -446
2186 -446 581 291 275 489 -540 -994 703 1044 638 580 246 -297 -1162 181 883 213 -442 -895 -885 -544
2206 -544 262 802 424 -576 -740 -358 -151 1248 1343 291 -583 -333 -67 477 1148 475 -584 -1016 -1018 -206
2226 -206 959 237 -923 -553 -440 -441 230 1084 742 -903 -474 324 8 766 1372 392 -834 -431 101
2245 101 -72 655 546 -769 -1509 -791 140 219 35 353 -316 -1024 111 1001 1078 229 23 -288 -661 -326
2265 -326 895 617 73 -568 -776 -882 81 781 296 -650 -682 -317 -213 540 1162 649 -637 -551 -201 543
2285E43M84l25q08m30l5M3R69N01r92o93l61N87N69N93k5p79j60J19J27Q16O07
2306A350q16r26j7K03M63J72q8l86m90l14J93R24O09q94o29K49j35O79Q05oo41
2327C05n73k00M13Q33M12q32n99j34k53M17Q32r9o43q58j02M42P47R79o13p14
2347b40j79J67L64O05K30o75q77k7L87P8J56P40j093j028M10O17R73M8n74k20
2367a38l09n3Q81Q62o27l59n30J7J04R15mo25q39j52K22L33O75K11n44p04j67
2388h31P90P71r3k33m9j029n5J159N34k71j005l29J78p7O12O77o90r91L39J17
2408d76K59P44J66n50k07l01N95M40N9l3n63n57j80O45N38n7k66r18j66o5Q42
2429e1N85l74k63o90M18L74O28K34m31q31P3J03M30N92q0o76o43O9O82Q8J11k75
$$ plain form
2285 543 1027 702 -106 -536 -571 -528 441 942 -50 -743 -1104 -517 52 645 620 -159 -319 -200 -73 743 1350
2306 1350 534 -392 -409 -206 257 429 341 -45 -535 -849 -656 268 877 -17 -646 -397 -532 147 952 946 305
2327 305 -268 -468 -55 778 1190 358 -241 -375 -628 -211 621 522 -121 -979 -1081 -639 108 1087 474 -240
2347 -240 -419 -252 112 717 947 272 -605 -632 -245 -167 -11 729 -364 -1392 -982 -365 608 656 82 -138
2367 -138 -447 -500 381 1243 616 257 -273 -256 -152 763 759 134 -705 -857 -635 -302 373 584 40 -664 -831
2388 -831 -41 730 637 404 355 -674 -729 430 964 693 -312 -641 -463 -540 72 749 59 -932 -593 -476
2408 -476 -217 527 693 143 -64 -365 230 670 729 696 133 -424 -604 41 579 522 256 -662 -828 -893 -51
2429 -51 534 160 -103 -793 -375 -1 627 861 430 -401 -328 -225 205 797 717 41 -602 -533 149 237 348 73
2451G3n78k41N1Q83O03l03o56j19j07M78M16N42m40p18k97J64N94J90l85o02k23
2472f75j65M47L37P48o38m06k12K50M29O69j34m92l88K3J21N43M7r3n77p00M93
2493c73M84o0L41j44q50N5J85O73O10l76p32k07J77J98J057K7q04p88j6j56Q53
2514A54M35Q9j464q1O89JK7J045l73j199j44Q54N80k40L02m44m00j92M28M41j62
2535C46l92k34m82J98O22K83j93n26j38R0J58P10O97m92p08kL1M22J20M5j72n15
2557a32o65L90N90J55j92n85J20o19O87P46K70n25o68o5J51J057M42o29p30j75
2577c77J30L00M47J53n80j032M20L88J89N07N9o13p55L41P31J97K83k57q39k71
2597e79Q76K61j71J36m58p69n7Q48J82m1l67j34n32P02M35q6j40K33j92p01M03
$$ plain form
2451 73 -505 -746 -695 188 791 488 -168 -287 -394 84 500 1042 602 -116 -413 -249 345 535 150 -452 -675
2472 -675 -840 -393 -56 692 54 -352 -564 -314 115 784 650 158 -230 -207 -86 457 504 411 -166 -866 -373
2493 -373 111 51 392 248 -602 -547 -362 311 921 545 -187 -394 -217 -19 1038 1065 261 -527 -543 -699 154
2514 154 589 678 -786 -867 -178 -177 -150 895 522 -677 -821 33 613 373 675 231 -169 -361 67 508 346
2535 346 -46 -280 -762 -564 58 341 148 -378 -516 -426 -268 442 1139 647 -61 -63 -32 390 510 555 383 -132
2557 -132 -797 -407 183 338 146 -439 -319 -938 -251 495 765 240 -428 -493 -342 715 1157 528 -202 -377
2577 -377 -247 53 500 653 73 -959 -539 -151 38 545 604 -9 -764 -423 308 505 788 531 -308 -579
2597 -579 297 558 387 523 65 -704 -761 87 269 228 -139 -273 -805 -103 332 246 106 339 147 -554 -151
2618a51J218n07l51l33k70r7M95K90K7n84m95K17j6Q88J22J45p09k59j18L44Q31
2639F87J34l48q12j98L15O58R8j03o94n59L49K11N04J74m78q15K90N08N06o4M47
2660H10o07j060M51P19Q3M26j42r81n47O37N60J17l09j22p55k58J213M27n67j6
2680G9k75j72J61Q19K26l51n43j72n1L32K66l2j92j74k99m31P63N07m7r29O90
2701A75k08k54O44L53k91n83j33m6M12L30K94j071J1J51k21K34M80K46q61o09
2721i47P02L54k4J98L53j124R4N55K02L20J0o95n68P6O59L28j0n77l19l28J50
2742e91Q40L20l17k47o82M49N72M5N4k36m92k67M42K93L73n96k44l90J28K57O83
2763C94j85k82j60k36K98M01N73m92j74n50K05q9Q15K89m64p99J45q9M21J63K59
$$ plain form
2618 -151 1067 560 209 -124 -394 -491 4 294 321 -263 -758 -541 -557 331 453 598 -111 -370 -488 -144 687
2639 687 821 473 -339 -537 -222 436 534 431 -263 -822 -473 -262 242 416 -62 -877 -587 -79 427 363 810
2660 810 203 -857 -406 313 396 822 680 -301 -848 -211 349 466 157 35 -720 -978 235 662 95 79
2680 79 -196 -368 -207 612 838 487 -56 -228 -279 53 319 287 95 -79 -378 -809 -46 461 414 -515 175
2701 175 -33 -287 357 710 419 -164 -297 -343 69 399 693 -378 -367 -216 -437 -203 277 523 -338 -947
2721 -947 -245 109 85 283 636 -488 -394 161 363 683 693 -2 -570 -494 165 493 483 -94 -413 -741 -591
2742 -591 249 569 252 5 -677 -228 344 389 443 207 -285 -552 -110 183 556 -40 -284 -674 -546 -289 394
2763 394 209 -73 -233 -469 -171 230 803 311 137 -413 -208 -297 518 807 343 -456 -311 -400 21 184 443
2784D43n43o34K59K39M74K80j19l75k17K5N66o5N41o70m02j08JN13J03P1m94m13
2806e25J41O8O16R0l51l47j80K06R41L9k18k93j81k45K0L17M49k44n47n43M48
2827c39M85O8P4l27o50J41P12L25j18j84j46m02k27R33J43j6k41o89R9K32L27
2848B00L21l74n22j71P1L99O97l53k32j95j23M07K83K31o8o41n67K15P02Lr1j1
2870A81o84K2j4P57K19n01l6l35j66L08P62J44m24m84j06M96J75K66l21k31l59
2891c31j35K43N42P1o62J7k39%O30J58L27n46m10J08Q39k19j81O1l02m32J13N37
2913A89qn5k77l63K13k5N06J33l91j30j86K26L78K34P6l56l90n9P29M0j53L7q68
2936e00R9m9K88L84q1j31l86j77K31N69L30l76n7n47M04m2P29l52r8m48k34J19
$$ plain form
2784 443 -100 -734 -475 -236 238 518 399 24 -193 -168 398 333 874 204 -198 -306 -305 208 311 382 -112 -525
2806 -525 -384 -316 300 390 39 -308 -488 -282 659 698 480 187 6 -239 -219 98 547 303 -244 -787 -339
2827 -339 146 214 288 -39 -689 -548 164 489 371 187 41 -361 -588 345 488 472 231 -458 -359 -127 200
2848 200 521 147 -375 -546 -475 -76 621 268 36 -159 -282 125 408 639 571 -70 -637 -422 280 283 192 181
2870 181 -503 -481 -495 262 481 -20 -56 -391 -557 -249 513 657 233 -251 -357 139 314 580 259 28 -331
2891 -331 -466 -223 319 390 -272 -255 -494 -494 136 294 621 75 -335 -227 612 393 212 273 -29 -461 -348 189
2913 189 181 126 -151 -514 -301 -326 180 313 -78 -208 -394 -168 210 444 520 164 -226 -285 444 484 331 368 -500
2936 -500 -401 -450 -162 222 141 10 -376 -553 -322 247 577 201 144 -403 1 -41 688 336 238 -210 -444 -325
2958c25P46O9j91m91k06j50O64L3M07m85l47k12L26L96J82J75p02J74m43L66L96
2979C82m2l15j72l67JO72J8J47o40m9L2J70L58K58r6l84k27L62K74l8J45k83o60
3002d54k73L64L06l3K32l89k57J36J40L04J46l30l09J50N77J66j40J14m27m04
3022c81K00L06L8P3p0l52m78K55P18M8j34n74j62J64M66N05k0o06j95O8N9O14
3044E42o1k96k59p5k34L06L61q3k00Kk30j81M50L79j47m56J88j11N6K45N32m71
3066B57o93J33K85p9J51O21p46k95n4K75j7N44q3m73j57m7O07J3q9K86m05m53
3088d19K65L01J51l46j50n69L25L62L52j68K22q77l4J71R16j4k60j25l36q1L09
3109eN90n01m7j48l20J3O04J50l14m69L94l54Q8O19K53o54k08K72j08L69K43j65
$$ plain form
2958 -325 421 490 299 -192 -398 -548 116 149 556 71 -276 -488 -162 234 416 591 -111 63 -380 -14 382
2979 382 340 25 -147 -514 -513 159 177 324 -316 -365 -333 -163 195 453 357 -27 -254 108 382 344 489 206 -454
3002 -454 -727 -363 -57 -90 142 -247 -504 -368 -228 76 222 -108 -417 -267 310 476 336 450 23 -381
3022 -381 -181 125 163 236 166 -186 -664 -409 309 357 223 -351 -513 -349 117 622 602 -4 -199 -131 -72 542
3044 542 481 185 -74 -149 -383 -77 284 201 1 3 -227 -408 42 421 274 -182 6 -105 -49 196 728 257
3066 257 -436 -303 -18 -97 54 675 -71 -366 -420 -145 -162 382 299 -174 -331 -378 229 242 153 439 34 -419
3088 -419 -154 147 298 -48 -198 -767 -442 -80 272 104 326 -551 -585 -414 502 488 228 103 -233 -314 -5
3109 -5 585 84 37 -111 -431 -418 186 336 22 -447 -53 -407 -319 300 553 -101 -309 -37 -145 224 467 302
3131C02o44J55J29J0L00l3k74l86J64K19J12q0L54k36l95MK06J51L56k65j51l11
3153c13K10J62J39Qrl99k08P5M37L66k19j89n43p5O08K85l8p8m13m4P8L85K89
3176E14k14m5m21l37N45L58l53k2j50l67JP91K88n57n02J04mO92L21j2m71m13
3198b54J24l9m1P12k37o48Q4K10RN7L85l4r35K49j10O73R5J33n02k53O8L23K19
3221B88k2k82j25j12k5M59p8L6J35l56m33K54L46J34J29m70l66N83J32K65p0j76
3243B46m04k56K28M62J06j34l2o05q9M98M30k05j23k78j17J47K51O93m99k64k16
3264a61J52J76J20J7l48l2q2NK25J52Pm60l7K72p6L49j99J77n72J28K25q5N26
3287D79k40Jn13J27J71L65j92l5l50m32L87J17M14l08M5q1j17L35Q6O9j63j97
$$ plain form
3131 302 -342 -187 -58 -48 252 219 -55 -441 -277 -58 54 -26 328 92 -303 -299 -93 58 414 149 -2 -313
3153 -313 -103 59 198 206 197 -202 -410 -335 102 468 249 60 -483 -558 50 335 297 219 -194 -238 -160 225 514
3176 514 300 255 -166 -503 42 400 47 25 -125 -492 -491 300 588 31 -471 -367 -371 321 642 630 159 -254
3198 -254 -130 -169 -210 502 265 -383 -299 -89 -80 -23 362 328 -607 -358 -468 205 300 433 -69 -322 -254 69 288
3221 288 266 -16 -141 -253 -278 181 103 139 274 -82 -515 -261 85 219 348 -122 -488 95 227 492 422 246
3243 246 -158 -414 -186 276 382 248 216 -389 -478 20 450 245 122 -156 -273 -126 125 818 319 55 -161
3264 -161 -9 167 287 304 -44 -76 -158 -153 72 224 231 -229 -266 6 -70 279 80 257 -315 -187 38 -47 479
3287 479 239 240 -273 -146 25 390 198 163 -187 -619 -232 -115 299 -9 36 -45 -162 173 259 328 165 -32
3309c2j10q9J75K18J25l99l5k0j4K49J73j11m52L6m1K40M46k9k28j88l78O06L3
3332A75J28L9m48L4j15K02j38L06j72k48k2l1K70N58k07l96j13K6J48K39J45m7
3354C33l77q3RL45K89k54k38l44L2K82k20N96Qn10R8k51L76N27l45k09l87o2L92
3377GK82k57K21p7p20K06K76q5L10j49k96nK6M54Nk30Q9k12k30L67L39J11l02
3400A30l24j59K31L94q7N1l88k57J09J09QL32j98ml69N01J67l8jl28J21P2j30
3423e8J81j47J28m05k14J86O29j19L2l45m08K11M53J75J3l4m27j60L19Q9K36J1
3445C46m87k77L71j28K73M6l8k16l61J66M17N6N7M4l20j70J20L57j30Q2n75J00
3467b67N7J11L75J07k05n20k4L68K2M3J2j37k74L65j33J47L08k14l11m0K45j6
$$ plain form
3309 -32 -142 -231 -56 162 287 -112 -147 -167 -181 68 241 130 -322 -286 -327 -87 359 330 102 -86 -464 142 175
3332 175 303 342 -106 -72 -187 15 -123 183 11 -237 -259 -290 -20 538 331 -65 -178 -152 -4 235 380 333
3354 333 -44 -127 -118 227 516 262 24 -320 -288 -6 -226 370 378 -132 -34 -285 91 618 273 64 -323 -385 7
3377 7 289 32 253 176 -544 -338 -62 -147 163 14 -282 -287 -261 193 198 -32 57 -155 -385 -18 321 432 130
3400 130 -194 -353 -122 272 185 236 -152 -409 -300 -191 -183 149 -49 -53 -422 79 246 208 207 -121 0 72 -58
3423 -58 123 -24 104 -301 -515 -329 300 181 213 -132 -540 -329 124 299 312 278 -149 -309 10 99 335 346
3445 346 -141 -418 -47 -175 98 144 106 -110 -471 -305 112 168 225 269 -51 -221 -101 256 126 208 -367 -267
3467 -267 -210 -99 276 383 178 -342 -366 2 24 67 79 -58 -332 33 -100 47 355 141 -170 -210 35 19
3489A9K86J59q00N6KM54J06j2j26k94m8J3J83L22j90k56l7m1L93K6J43J6n26K6
3513a26k01N18o8l7J25n81N8Q1L42J63j42o9k25j1J74L28J33m33J76o14K36K27
3535E4K28q9k63k08K25p1L83qm76o8k37K96N39n4J41m25j69j46M02M40k35k08
3557E1j19k83K71k12L54J68m74k17M31p5J03N53o18Kp1J97Q7K99k66Q7k95j28
3579a55K45n2J57j80J34m92K57J66Q5k39J65j65qj75M59ml08M91n39m6L90O8o8
3602A86Qk05k36L21J09O1j37j44j14j88L60K22j7l34m01K49L89J91j9j91k36k06
3624c32L90l3K06N3r3m94J6L4J75J03J77k66o14O01K47lPK25n90o9K16j42J59
3647b7L19l83L4n88O08R0p8ql02L7M21l0K07j28Q6n50j2K99M41k41L9j58k05j37
$$ plain form
3489 19 305 464 -336 -280 -278 176 282 270 144 -150 -198 -185 -2 320 130 -126 -163 -204 189 215 358 374 -152 -126
3513 -126 -327 191 123 86 211 -370 -312 -231 111 274 132 63 -162 -173 1 329 462 29 205 -409 -173 54
3535 54 282 193 -70 -278 -53 -124 259 251 -225 -293 -530 -234 305 251 392 -33 -202 -348 54 494 259 51
3557 51 -68 -351 -80 -292 62 230 -244 -461 -30 -105 -2 551 -67 -65 -136 61 148 447 181 268 -27 -155
3579 -155 90 38 195 15 149 -343 -86 80 165 -74 91 -74 -82 -257 202 198 -110 381 -158 -204 186 254 186
3602 186 194 -11 -247 74 183 244 107 -37 -151 -339 21 243 226 -108 -509 -260 129 320 301 110 -126 -332
3624 -332 58 25 231 284 191 -303 -287 -253 -78 25 202 -64 -678 -77 170 167 174 399 -191 -260 -44 -186 -27
3647 -27 292 -91 -57 -645 -37 53 -25 -33 -335 -298 123 93 300 172 258 -292 -304 -5 436 195 234 76 -129 -266
3671b66L77J79j21l47j9KJ03K02m9p2o5j77j00L57L84L1m56l2q1p5L02L83n01
3694d1r7l2l9R3J57K12k60p6J21j95M37n7j2k19k6m5J71k49M78j06m30j81K90
3717a06L13n6ok55N4L0j75K47J72o9l72J76lJ61K19j79m8j74j33J46J94L7k78
3740a05n2l0M1J43L57r7l07j58J5K6K68L22l75k8k5k60K86K75R5l97j09J83l19
3763b51K29L15j20k10k50R3M3J68J41j95J25j63j1L95k36P3k95j56J39K04J30
3784A68o8M6k35l58J98L01J49J78m50o7R2P7P8Q9k8m4n18P1M78K68j88k03j83
3807a49p2J56M20l62J08m00k7K91J19R0J55l94Mj7J68o9R7n7j29j50%K12m6J90
3831A38q1n40L82L9L6J30j33K7j23L7L37J31k75M2r5k68J93l7J93K0l60K2j27
$$ plain form
3671 -266 111 290 169 -178 -197 -195 -92 110 61 -11 -76 -253 -353 4 388 419 -37 -69 -150 -225 77 460 -41
3694 -41 -138 -170 -209 -116 41 253 -7 -83 38 -157 280 223 211 -8 -34 -79 92 -157 321 215 -215 -396 -106
3717 -106 207 151 145 -110 -56 -26 -201 46 218 149 -223 -47 -50 111 330 151 103 -71 -204 -58 136 173 -105
3740 -105 -157 -187 -146 -3 354 257 -50 -208 -193 -167 101 423 48 20 -5 -265 21 296 391 -6 -115 68 -251
3763 -251 -22 293 173 -37 -287 -194 -151 17 158 -37 88 -75 -86 309 73 146 -149 -305 -166 38 168
3784 168 100 146 -89 -447 -249 52 201 379 -71 -138 -46 31 109 198 170 126 -392 -321 157 425 237 34 -149
3807 -149 -221 -65 355 -7 101 -299 -326 -35 84 174 329 -65 -61 -78 90 21 118 61 -68 -218 -218 -6 -52 138
3831 138 57 -483 -101 -62 -26 104 -29 -2 -125 -88 249 380 105 147 52 -216 -23 -60 133 153 -207 -185 -312
3854c12J62L51K34m51J84l65k8M50kl4j75l21R7J10K89M5J44n17j21J08L98P1
3876C17q4l19n2J1j2L21l0J42l74J91j96PM31k21k10j0j65k25M88j64L57j55j42
3899i4Q1J16m0j71J9Q5j92K27k35Q8L95k07k30M8K23L2K33j90j54k86Q4L7L57
3922B26k43P8j40j63K09O9K45k04m0k89J41P7L84J2k21l29o2J10K01K06k36k65
3944b34L75m21O15j53j27k02J2L06l24L40J99k48j73J7p7J50J71O7l23k0n0q9
3966a89L90q9j97Lk97L57K10k07L27j5k94k69J49K35M2P9n68L37j61J91j30L69
3988B73n21j20K48r7rN49l60J35K8k93K70J0N1k6k55oj27L44K15j36j60k09r8
4011b94L68j55K15l60P9J78j82N3K14O1k68r1j08m4M00k03K88p7m85L16K73q0
$$ plain form
3854 -312 -150 201 435 -16 168 -197 -225 225 223 189 14 -307 -210 -100 189 234 378 -139 -260 -152 246 317
3876 317 233 -86 -138 -127 -139 182 152 294 -80 111 -85 -78 353 132 -78 -88 -253 -478 10 -154 203 48 -94
3899 -94 -13 103 63 -108 -89 -4 -196 31 -204 -116 279 72 -158 -110 113 145 378 188 34 -252 -168 -131 226
3922 226 -17 61 -79 -242 -33 36 281 77 37 -252 -111 -34 350 362 141 -188 -250 -140 61 267 31 -234
3944 -234 141 -280 335 182 55 -147 -135 171 -153 187 386 138 -35 -18 -95 55 226 293 -30 -50 -100 -189
3966 -189 201 112 -85 -82 -379 -22 188 -19 308 293 -1 -270 -121 114 156 235 -333 4 -157 34 -96 273
3988 273 -248 -368 -120 -217 -226 323 -37 98 126 -167 103 113 164 138 -117 -123 -250 94 309 173 13 -196 -294
4011 -294 74 -81 134 -226 -147 31 -151 -98 116 177 -91 -182 -290 -334 66 -137 151 74 -411 -95 178 98
4033I8j92m2K18l39K11j54L51k23J41j7j13k3R2L02k29o3j03J28J79j0j08l37
4055b33j27J66K35r9J83N3k00N1j39M92k17j48k27J43J7J57K88m31j31j52J77
4076a42K6J8J66J42j87o9pJ2K43Q3k45N6J65k70L20P8l28j82J9Lj5L10k02j0l84
4101d00K04K19J89r1j21j75K11j79K37n6P3J12l37OQ7r9K82M4n53L18J5j43J47
4124a0K91k41LL8J20l46J35L97k38J21l22Q0O7K42l12OL0m26M89k28mj5o1lJ23
4149f4Q3J89P2r8m27K55J0k04K92j79j51k6j20P05l62N2k62J48Lo8L08Jq4q4j09
4174a20L54j94k6K58j82j16j84J10k1K71N3l15n1J10J84k16m2R5j20L0K10J80
4196B68j32K27n05m2JK12R5k13J69k82p0K1J90l39L11L29n81J54L18j75J40j96
$$ plain form
4033 98 -94 -136 82 -257 -46 -200 151 -72 69 52 -61 -84 8 310 81 18 -85 43 222 212 104 -233
4055 -233 -360 -194 41 -58 125 178 -22 29 -110 382 165 17 -210 -67 -50 107 395 -36 -167 -319 -142
4076 -142 -116 -98 68 210 23 -46 -53 -41 202 285 40 96 261 -9 311 389 61 -121 -102 -99 -114 196 -6 -16 -400
4101 -400 -196 23 212 121 0 -175 36 -143 94 38 111 223 -114 -108 -21 -120 162 206 -347 -29 -14 -157 -10
4124 -10 281 40 43 81 201 -145 -10 387 149 270 -52 28 95 337 25 31 61 -365 124 -104 -108 -123 -184 -187 -64
4149 -64 19 208 280 182 -245 10 20 -184 108 -71 -222 -248 -368 337 -25 27 -235 -87 -84 -152 156 157 73 -11 -120
4174 -120 234 40 14 272 90 -26 -210 -100 -121 150 203 -112 -163 -53 131 -85 -127 -32 -152 -122 88 268
4196 268 136 363 -142 -184 -183 29 124 -89 80 -202 -272 -251 -61 -400 -89 240 -341 -187 131 -44 96 -100
4218a00j1J76q7J03P5N5J98p02K21J51n2j28Qj1k45L11J98J22k56N7l34R8K06
4241E3J48P9k41k19o8J87J33N7Q8o24K32J99j90J47J52j33J33q2Jk81L02J53k72
4264d6j21O0J92p9J57j73r9j37J41j17M59j57k66N8q4J41L5J90k18L63k09k53
4286a63R8L73j78j12P8k88Q0K12j54J17k42J80j15P3J46k30RQ0k53m0L92J32J40
4309C35m25Q7k85M05R8N0j65j57K5P3r7Q0M2o2J68n28M14R6j65K74l21M6K6K21
4333B35j03J02K4k16k2J05k4q8J06k63J03j33K3J79R6k25m5K1L41k25K01j12L9
4356A19k50k4J32o3K80J5k83n6j0L1L83k76O8m10K95k78N09j81K10j63l34M75
4378A89j08K94k82l8l25K1L67J40P3l77J23k37P7L01k07k2r2Lr8J36K48j35K54
$$ plain form
4218 -100 -111 65 -22 81 156 211 409 -293 -72 79 27 -101 -93 -104 -349 -38 160 282 26 83 -251 -153 53
4241 53 201 280 39 -180 -248 -61 72 129 217 -407 -175 24 -166 -19 133 0 133 51 52 -229 73 226 -46
4264 -46 -167 -107 85 6 163 -10 -109 -246 -105 -222 237 80 -186 -128 -212 -71 -36 154 -64 299 90 -163
4286 -163 -65 308 130 18 96 -192 -112 100 -54 63 -179 1 -114 -41 105 -125 -116 -36 -289 -329 63 195 335
4309 335 -90 -3 -288 117 215 265 100 -57 -32 41 -56 24 66 4 172 -356 58 154 -11 263 -58 -12 14 235
4333 235 132 234 258 42 20 125 101 13 119 -144 -41 -174 -151 28 124 -101 -146 -125 216 -9 192 80 119
4356 119 -131 -155 -23 -86 194 209 -74 -130 -140 -109 274 -2 66 -344 -49 -327 182 1 211 48 -286 189
4378 189 81 375 93 55 -270 -249 118 258 331 -46 77 -160 -83 218 11 -11 -103 -100 -198 -62 186 51 305
4401C05m65J03Q3N3LQ2j63m0m6K01K9j59J96j73k09k6J89n8J73j62N2j56K60j8
4425E4p3J78m28J08J56L9j3J7k78J10J93k7J18J22l20Qo%k79L64L02m02j13J29
4449d1j3K11J08j98j19j24L5L20J30o1mn08n3K40Q1j27R7O6k7n3l0K60j7M6j96
4474B3l49j32N54j43M8M8q1k59RL26J52j27q1J28j49K64j83L1m6n2j7l2m8L41
4498B25k0k66L7j03R9J90l1m83K96j42j92M76rko8r4o3j20M02k36N2r1n5O8J95
4523F5J21k15j21J54J39K4k52J45m0K4j12l4J34j65K77J0m15J5K23j59K95r8k42
4546b27k4K65p5K66m7l3l7k61N7L81k99m5j10l3L37j0m1k85J15p0M4q5J13J69
4570F5j19K13j16J0p1K45K2k83N4m1M0O9k39p5P8P0M5j59J83K82n50L47k81N7
$$ plain form
4401 305 -160 -57 26 79 82 164 1 -39 -85 116 145 -14 182 9 -200 -226 -37 -95 78 -84 -32 -188 72 54
4425 54 -19 159 -269 -161 -5 34 21 38 -240 -130 63 36 154 276 -44 -36 -42 -42 -321 43 345 -57 -170 -41
4449 -41 -54 157 265 67 -52 -176 -141 179 309 248 244 -264 -317 -77 4 -123 -26 40 13 -40 -70 190 173 219 23
4474 23 -326 -458 96 -47 1 49 -32 -291 -282 44 196 69 -12 116 -33 231 48 79 33 -19 -36 -68 -116 225
4498 225 205 -61 -24 -127 -28 162 131 -352 -56 -198 -390 86 77 75 7 -87 -150 -270 132 -104 -52 -143 -198 -130 65
4523 65 186 -29 -150 4 143 167 -85 60 20 44 -68 -102 32 -133 144 154 -261 -246 -23 -182 113 15 -227
4546 -227 -251 14 -61 205 158 125 88 -173 -116 265 -34 -79 -189 -222 115 105 64 -221 -106 -176 -132 -217 -104 65
4570 65 -54 159 43 53 -18 227 249 -34 20 -21 19 88 -151 -226 -148 -78 -33 -192 -9 273 -277 70 -211 -154
4594a54J63j92L54L73m55j21l0J65n2J53j8o84M24K51j15R1k98J28j69J3K12%
4616C9k90K61j05J54j02L7K64m05j9M4L4K39j13O3O5k03R9L6k2j64N8k9k9J64
4640G6N5K8o5p7k6p4k5J38M65l43p9m37O60m39M09k15p3Q3j46l1J73o5L05k84
4664A3k02L23k03J6K61l40m6J65J21j50LJ40k48QJ12j36K7K01M0k33j81L91k32
4687a50J03KK32j76N1m0p4J00J8k32K32q6j6p0L71k03j04J9J50R9l41J64j46q6
4711a83J21L7J94k13K04j97j97L87k33K0J21k88j37K44K81N2k50R8m9K22k89J55
4733A00J42l67j16J99j26L26n9k8n7q0j27R0K43j30O5j36p5L06n8Q6l52K54k70
4756a70j20L69M3K79l43l00J15J3L8l6j7J02j24j1K88J87k94k32K20k23L76j98
$$ plain form
4594 -154 9 -183 171 544 89 -32 -62 103 51 204 186 -498 -74 177 62 153 -145 -17 -186 -173 39 39
4616 39 -251 10 -95 59 -43 -6 258 -147 -166 -122 -88 151 38 101 166 -37 62 98 76 -88 -30 -59 -88 76
4640 76 131 159 94 17 -9 -83 -108 30 495 152 73 -364 296 -143 266 51 -22 61 -85 -116 57 -8 297 13
4664 13 -189 134 -69 -53 208 -132 -178 -13 108 -42 -39 101 -147 -139 -27 -163 -136 65 105 -128 -309 82 -150
4687 -150 -47 -45 187 11 62 22 -52 48 66 -166 66 -20 -36 -106 265 62 -42 -23 127 226 -115 49 -97 -183
4711 -183 -62 -25 169 -44 160 -37 -234 153 -80 -60 61 -227 -364 -120 161 213 -37 61 12 234 -55 100
4733 100 242 -125 -241 -42 -168 158 99 71 14 -66 -193 -103 140 10 75 -61 -136 170 112 198 -154 100 -170
4756 -170 -290 79 122 401 58 -242 -127 -114 -76 -112 -129 -27 -151 -162 126 313 19 -213 7 -216 160 -38
4778c8P6R2j20K15k94J17J04l8K9k44N6o3J33L82m09j17J00N8j18R3L5J89k42
4801dn9j63K56n6J47k83JJ72k14J51J75K30j80k63O8M3r8L56l59J71J23l25J47
4824C6kj3l5n8L38l31O6J65j53j61N2L53p7j7o7k75K2K3J45J11J41k25O3m57M57
4849A01k85L73j43J37j53k12K49J7J86m13K76k07M09l52j08L07J13k81q0K59j27
4870F6O4r0k16J77L6k03L8J0N7J92l22P1Q7OK28n48L40o0Q6j18J37M4N7j37k82
4895b80L55k69K94k21K19l00K20N6n2j80K58p9K0k9J47l5j57ok79M59j30J70j35
4918D6j29J9j66P5J86Q4j65N3K7L4L15l52l8J59k00J4J98j44O2J01k99KM5J06
4942C3J28k17N7q1p0J00J78j4j4r6Q9J04l05N5L22J2k90k87J17J02K58j75m5j6
$$ plain form
4778 -38 38 130 10 225 -69 48 152 114 143 -101 -45 -108 25 407 -2 -119 -19 39 -79 14 49 238 -4
4801 -4 -63 -226 30 -26 121 -162 -161 11 -203 -52 123 353 173 -90 -22 21 -77 279 -80 91 214 -111 36
4824 36 34 21 -14 -72 266 -65 1 166 13 -148 -96 257 180 163 96 -179 -157 -134 11 122 263 38 101 -356 101
4849 101 -184 189 46 183 30 -182 67 84 270 -143 133 -74 335 -17 -125 182 295 14 -66 193 66
4870 66 130 40 -176 1 37 -166 -128 -118 -61 131 -191 -120 -33 -27 201 -347 -7 -67 19 -99 38 82 139 2 -280
4895 -280 75 -194 100 -121 98 -202 18 74 22 -158 100 21 41 12 159 124 -33 -39 -318 141 11 181 46
4918 46 -83 -64 -230 -155 31 115 -50 3 30 64 379 27 -11 148 -52 -38 160 16 78 179 -120 -118 -73 33
4942 33 161 -56 1 -80 -150 -50 128 114 100 4 93 197 -108 -53 269 281 -9 -296 -179 -77 181 6 -39 -55
4966e5O4j54J68k82J73p0J46l16M63l30K55j29J31k41K01R5p4O0k94K04o0q5K68
4989A38j78r4j6O8K96j94O5P6l03J75K1p6J15o6m9P3k83M0PM31l81p0L27k67K23
5014G8L5r5j28j01K56k31K79K03q7n34L40P5p4J47j07j24n2q1L89mk49j56J30
5037i1m7p4L25m6J30j21j08qN2k9k07K60J02m4r0l1L0L4J81m55L07k06K55N5j9
5062A55j61q5L92j71P4l31J56N5m11N10k26J1n3J87k00L2K6Q1K70j77l68J15J03
5085a6J50j88P3MO1lj4k45K1j44N16k15j21L85j96j44R2k38K30j74K71n3l3n3
5109c4j60J27l6RJ78J99m70K1M28j71R0j84O5m2K1j63J5K19j34q9j8J5Q3J33j31
5134b9k7J78k66R9J43R0l01P9j50J78L7p5j01P4J28k18j6N8J0K31J36l92o8J64
$$ plain form
4966 -55 9 -145 23 -259 -86 -156 -10 -326 137 -193 62 -67 64 -177 24 119 45 105 -189 15 -45 -130 138
4989 138 -40 -134 -150 -82 214 20 85 161 -142 33 54 -22 93 27 -22 51 -232 -192 -185 246 -135 -205 122 -145 78
5014 78 113 18 -110 -211 45 -186 93 296 209 -325 15 90 16 163 56 -68 -120 -201 188 184 -65 -221 -91
5037 -91 -138 -212 113 67 197 76 -32 -40 12 -17 -224 36 138 94 4 -27 3 37 218 -237 70 -136 119 174 155
5062 155 -6 -91 301 130 204 -127 29 84 -327 183 -43 -32 -85 102 -98 -66 -40 41 311 134 -234 -119 -16
5085 -16 134 -54 19 23 84 81 67 -178 -157 -301 215 0 -121 264 68 -76 16 -222 8 -166 105 52 19 -34
5109 -34 -194 -67 -103 -94 84 283 -187 -166 262 91 181 -3 62 20 41 -122 -107 112 -22 -111 -129 -114 -31 102 -29
5134 -29 -56 122 -144 -45 98 188 -113 -34 -184 -6 31 -44 -145 -71 57 -161 -177 -119 -109 122 258 -134 -202 -38
5158c8j9K38l12J09J61l02L79o7j02n3p8j04L16k4J63k96k18J62j11J35K78k74
5180e7k8q2J67p7J28n2OJ45m78K59K81j61k8p4J03P2O9p0j56O5P8j51K21J37k62
5205E5j17J13k6j53j59K37J65p6j43n4P0J20J79k55k53K84M7j19O8Q5k22J18J20
5228H4p4K45k47L04l78R4n0K47j63j04L5K55m03L4J41L7N0o2k45J03J18M9RJ35
5252B14m05J83Ok30K98j52JJ48l08L35mk81M80l31j55J04oJ91J47k97k60J07M34
5275B19l37K16Ml91K74Q9j22J64k71O7j26J42K1J09K05k39j18j40L35j06j34O1
5297g8j03P7K31j93k38L95k8L9j5j06Ok63K31J10k07J41RpO9J11l13J68J9J93
5321B48k27O4q0n2J87j4k8r2jN8k09P7L06k17q1Lj77K86J8J12o0r0j0j18K1Q7
$$ plain form
5158 -38 -57 181 -131 -22 139 -163 216 149 47 -6 -84 -188 128 104 267 -29 -247 -85 -196 -61 217 -57
5180 -57 -85 -167 0 -77 51 -1 5 150 -328 -69 212 51 23 -51 52 124 193 123 -33 32 110 -41 180 317 55
5205 55 -62 51 25 -128 -287 -50 115 39 -104 -158 -88 32 211 -44 -297 -13 34 -85 -17 68 -154 -36 84
5228 84 10 255 8 312 -66 28 -22 225 62 -42 -7 248 -155 -121 20 57 107 45 -200 -97 21 70 79 214
5252 214 -191 -8 -2 -232 66 -86 -85 63 -245 90 86 -195 285 -46 -201 -97 -103 88 235 -62 -322 -215 219
5275 219 -118 98 102 -289 -15 74 -48 116 -155 -88 -214 -72 -51 58 263 24 -94 -234 101 -5 -139 -78
5297 -78 -181 -104 127 -66 -304 91 63 102 87 -19 -13 -276 -45 65 -142 -1 8 1 70 181 -132 36 55 248
5321 248 21 85 5 -47 140 126 98 6 5 63 -146 -69 237 20 -61 -58 -235 51 69 181 121 31 21 -97 -76 11
5347A1p6M4P5k46O6J86m0L58l93L0j1j05L02j39k46J25P5m13L01L5N3J66k47q6
5371a75q0RJ43j66M22k40j48J91m6j51M05o8j98K5N6M9J48j66j54K49o8r3N05
5394D49n52J05Q3k13o7K92k02K62q7L1k0J31jk33m7J62O8l47J67J38K35m34N9
5417b1r9K95m00O0J43J63r5p3L89l10K3N4l04L2j2K85j36Q6k56J63j25o6M73j40
5441A29j02j37j2K12L1j24P4Mj35K12m2m96K02N3J59j0k04N66k37j12j15O7p9
5464i6J16J29k48L90o4m12o6J18P3J22M0k93M1K95k46M3J74j77qJ64j22R5l46
5487b78L07j47R3k17L13oj04J14k81K72k61J55L1k92K55M6r5o6L78j61j89K80
5509A47k61J6M3N5K9j76J68o7J37j20Q5k02J8K24m9Q0k3j67J65n4J56l8j23j05
$$ plain form
5347 11 -65 -21 54 -192 -126 60 20 378 -15 15 4 -101 201 62 -184 -59 16 -397 -96 -61 -8 158 -89 -175
5371 -175 -255 -246 -103 -269 153 -87 -235 -44 -90 -241 164 96 -102 -77 -21 28 176 10 -144 105 37 -56 449
5394 449 -103 2 85 -128 -195 97 -105 157 70 101 81 212 211 -22 -69 93 161 -186 -19 119 354 -80 -21
5417 -21 -120 175 -225 -165 -22 141 46 -27 362 52 75 129 -175 -143 -155 130 -6 80 -176 -13 -138 -204 269 129
5441 129 27 -110 -122 90 121 -3 71 75 -60 152 110 -386 -184 -131 28 18 -186 380 143 31 -84 -17 -96
5464 -96 20 149 -99 291 227 -185 -251 -133 -60 62 102 -191 -150 145 -101 -58 116 -61 -69 95 -27 68 -278
5487 -278 29 -118 -25 -242 71 65 -39 75 -206 66 -195 -40 -9 -301 -46 0 -95 -161 217 56 -133 147
5509 147 -114 -98 -55 0 29 -147 21 -46 91 -29 56 -146 -128 96 47 127 104 -63 102 48 204 166 43 -62
5533f2Q1J85k64K98j81M6k60J18P5r7PoO6j7q1J60M3J46k93L5m1mJ02J27j38L0
5559G5j6J3J13j46J00p9J12k97J19k64K31l1k55L42Q0l09K50P5k72M8J02k33J35
5582a07R7K01o7k33j60K50J8k11oM48j20j51J75k85J65N2M7k17M06m24J63k8J81
5605A94j41J6J54j62n4r6K37J4j08l1K6j08l0K04k64p9M01k62L34l48r5K04P1
5628G7P4k13j7O6p3O9L8l7j58J11J65l18J83o3J38j89K79k22P1J43l6j69J20j22
5652h3L77k92J42n9j49J55j56N2P0m4O8p5J88j87k00N05k89Qj50L9J48q2J67m35
5676b82J19K82k13N6j10J19J92k09M2o8J63J1j9k07k3J13K7J70k16J28j15k9P1
5699Bk5J36Qk03n1j42Q6R4p1M12k55J4p6O9M6m3j1J16o5k42K17O9O8q8j91Q4j02
$$ plain form
5533 -62 19 204 -60 238 57 103 -157 -39 36 -61 -54 -60 6 -11 -92 68 111 257 -36 -1 -42 -46 56 183 45 75
5559 75 59 72 185 39 139 60 172 -125 -6 -270 -39 -70 -325 17 97 -212 38 113 -159 -111 -9 -242 -107
5582 -107 -10 191 124 -109 -269 -19 -1 -212 -218 230 110 -41 134 -151 14 66 113 -104 302 -122 41 13 194
5605 194 53 69 223 61 7 -89 148 162 54 23 49 -59 -89 115 -149 -228 173 -89 245 -103 -198 6 77
5628 77 151 -62 -79 -13 -86 -17 21 -16 -174 -63 102 -216 -33 -96 42 -147 132 -90 -19 124 88 -81 39 -83
5652 -83 294 2 144 85 -64 91 -65 -13 57 13 81 6 194 7 -193 312 23 31 -119 -80 68 -14 153 -282
5676 -282 -163 119 -94 -38 -148 -29 163 -46 -4 -72 91 102 83 -124 -147 -34 -7 163 -53 75 -40 -69 2
5699 2 -23 113 121 -82 -133 -275 -189 -95 -166 246 -9 5 -71 -2 44 1 -10 106 41 -201 16 85 153 65 -126 -42 -144
5726a44K64k96J87P0j62O7Q5J2J01l63J87j59K24K53l09J35j95J24J6j25J43k73
5748a58K69k8l37O4o2K20K53l16j8K88k37P2k3OJ37J2l00J46L3k13n3K23j69l1
5772b22L52k07L16l88J13j54J45J70q8J73P2k33o1P0k6M3p3j34K42k88K56l31
5794b53J99r6o5R2o5R1L62j10k18J74o7o1p5M58l87Q3l70O31l37P9k37K02j96
5817a66J03k4L47j21J8p3j12Q1j31l6j0l1K7K75l5l01P7m4K14k0o6K7R4j59J84
5842A18j32j78L19o8p1j68O3OJ43P3j44K86q0m21K64j20L10L7J1k96nJ57m07M12
5866A09jn5l5Q6j18k24O0O5J42j83J91m4M6K12l67K53p2J97l49K20k28j80J00
5889a75j8J64M7k32K76k57L71J22j49j01J8j56J92p8P8j61J80j74K7k4K72j03
$$ plain form
5726 -144 120 -176 11 81 -81 -14 71 83 184 -179 8 -151 73 326 17 152 -43 81 97 -28 115 -158
5748 -158 111 83 -254 -190 -252 -32 221 -95 -113 175 -62 10 -13 -7 130 142 -158 -12 21 -192 -245 -22 -191 -222
5772 -222 130 -77 239 -149 -36 -190 -45 125 37 210 282 49 -12 58 32 75 2 -132 110 -178 78 -253
5794 -253 -54 -150 -215 -123 -188 -97 265 155 -63 111 44 -17 -92 366 -21 62 -308 323 -14 65 -172 30 -166
5817 -166 -63 -87 260 139 157 84 -28 53 -78 -114 -124 -155 -128 147 112 -189 -112 -156 58 38 -28 -1 93 -66 118
5842 118 -14 -192 127 59 -12 -180 -117 -111 32 105 -39 247 167 -254 10 -110 200 237 248 -48 -53 104 -303 109
5866 109 108 53 18 104 -14 -238 -178 -113 29 -154 37 -7 39 251 -116 137 65 262 -87 133 -95 -275 -175
5889 -175 -193 -29 18 -214 62 -195 176 298 149 48 66 -90 102 24 102 -59 121 -53 -26 -50 222 119
5911A19j91o4K09r4J44j97Q7K57k23j8k02K46j27J92k56J01q0j21M42l24J48J5
5933F3k04l9J13K82j88l3j11R4J9J31o6R0J01n21J28k74L32j03K61o2J08O5j54
5956C2R2L1k20J71O7M2j6J8k65J62k37M8K66l53J01K99j47R2k65R6r8K35J9l77
5980b07M34k85K89j58O9l63J46J1j83J92K32j01n11N93J80m51K6J03p7K5O8j19
6002h7K72k11J89j74J90j06j07K6J07J43L6k87k41L19k21K08k3q1n2r4K54J07
6024A67N2j59J15j70j84M10j3n33J86J91J20j93k6p5J00k50K5K40P2L0p5q4J99
6047A45m4J00k52L2Q3j94M3j51J37L93m37J37J15P4P4p5l37L30k38j79K79J45
6069A80j39j48j00J91JK61l69K48j47Kk05K63j72N3J8k9o0K29J41r4J4n1P9r8
$$ plain form
5911 119 -72 -136 73 -21 123 -74 13 270 47 29 -173 73 -54 138 -118 -17 -97 -218 224 -100 48 63
5933 63 -141 -180 -67 215 27 -6 -117 -23 -4 127 61 151 252 -269 -141 -415 -83 -186 75 13 121 186 32
5956 32 124 155 -65 106 173 215 199 217 -48 114 -123 -75 191 -162 -61 238 91 183 -82 14 -84 151 170 -207
5980 -207 227 -58 231 73 142 -221 -75 -64 -247 -55 177 76 -435 158 338 -113 -87 16 -61 -36 32 -87
6002 -87 185 -26 163 -11 179 73 -34 -8 99 242 278 -9 -250 69 -152 56 33 -48 -100 -194 60 167
6024 167 219 60 175 5 -179 231 218 -315 -129 62 182 -11 -37 -112 -12 -262 -237 3 75 105 30 -54 145
6047 145 101 201 -51 -19 64 -130 -87 -238 -101 292 -145 -8 107 181 255 180 -157 173 -65 -244 35 180
6069 180 41 -107 -207 -16 -15 246 -123 125 -22 -20 -225 38 -134 -81 -63 -92 -152 77 218 124 138 87 166 68
6093F8O5k94L28m72L69k00QR2l8K21k10k20K82P3J15k23l61L18J81O4N4m30K71
6116F1j78j09J29J88q8L2r6j07J74k1J35j65m7O8j22n5M08l60M2P9Q2jj93L78
6140B34j44r0j00L56l96M28J64l47K28l65j46J65j20J04P9J79l51j57K74j04Q5
6161b4J63l99J63Q6r8l2J98j72PK0q0L78l21L9N5K00j65k5J10l8J08l34K05j22
6185g8Q2K27l27J6r8J06j27L34k17K57j71l3L38j34J68l23j29L8l6K84k26J74
6207A25Ql37L03k02L45m3p4k78J35Q6k88L20j12n8j65J09QM5K3pK65j73j13p7
6231a55L22lk64r8J36j02L61j46LK60n4m13J53j47K07n3J98o63L46P1N8J15l05
6254a73P1J09J61l4j41nN6r3P3j66L60j54P1q6n2n7J91n3J57l66l9J30M0M5L31
$$ plain form
6093 68 133 -161 167 -305 64 -136 -128 -36 -74 147 -63 -283 -1 72 187 -36 -397 -79 102 166 220 -210 61
6116 61 -117 -226 -97 91 3 35 -61 -168 6 -15 120 -45 -92 -24 -146 -201 207 -153 -111 -32 50 49 -144 234
6140 234 90 0 -100 256 -140 288 452 105 333 -32 -178 -13 -133 -29 50 229 -122 -279 -5 -109 -24
6161 -24 139 -260 -97 -11 -109 -141 57 -115 -108 -88 -168 210 -111 -72 -17 183 18 -7 103 65 173 -161 44 -78
6185 -78 4 231 -96 -80 -178 -72 -199 135 -82 175 4 -29 309 175 343 20 -109 -71 -107 177 -49 125
6207 125 133 -204 99 -103 242 199 125 -153 -18 68 -220 100 -12 -70 -235 -126 -118 -73 -50 -57 208 35 -78 -155
6231 -155 167 164 -100 -198 -62 -164 197 51 54 314 260 -153 0 -147 60 7 205 -458 -112 -41 17 132 -173
6254 -173 -102 7 168 134 -7 -12 44 -49 24 -142 218 64 135 49 -3 -60 131 78 235 -131 -170 -40 0 45 376
6279C76n36L40j44o4O0m5k14K22k7q5J60J57l77k0K62q4J7p5K1J56j73J2J60l71
6303b72L76j69J70k94L19k53K4L17k22k77K01J93k21L87k80M6L5k31K55m4l8k7
6325eR0j55Q7M4j56J47k6P0k56K53M6m25Q4o6L29k45L77P6l57l8N3J02j57K01
6349G3k7p9M8o2m8J63J85J9l26O8on4k50L47M0j19j87J53j52L76p9j19p0L98o01
6374c09J7N65k01L6O0k25j5J90k26nm6r8J9K91J5O1k08J33m6L0n3M8mk20J48R2
6400D9j84J64L7j03L7J93j72L23j86M8m05J54p2J35K80m41l2J95Q3kK7k4l08K63
6424E9l6j30Q1j1J10j68Q5k27J48O0L8Q5l6N2k18P7J85j26L4j86J71q1J14L2j75
6449f3J93n1j66J91N2M1l5j34q0J43l65L26j73K6J41j73J58M8p0J17k25J22m4
$$ plain form
6279 376 -160 180 36 -28 32 -13 -227 -5 -32 -117 43 200 -177 -197 65 -19 -2 -77 -56 100 -73 -61 99 -272
6303 -272 104 -65 105 -189 130 -123 -99 218 -4 -281 -80 113 -108 279 -1 45 80 -151 104 60 22 -5
6325 -5 85 -70 17 61 -95 52 26 96 -160 93 139 -286 -202 -268 61 -184 193 269 -88 -126 -73 29 -128 73
6349 73 46 -33 15 -47 -95 68 253 272 -54 14 8 -46 -296 51 91 -28 -215 -62 -214 162 83 -36 -106 292 -309
6374 -309 -292 273 72 108 168 -57 -72 118 -108 -113 -159 -257 -238 53 68 129 -79 54 8 38 -15 33 29 -191 -43 49
6400 49 -135 29 66 -37 0 193 21 344 158 206 -199 -45 -117 18 298 -143 -175 20 103 101 128 104 -204 59
6424 59 23 -107 -26 -37 73 -95 -10 -237 -89 -29 9 94 58 110 -108 -31 154 28 62 -124 47 -34 80 112 -63
6449 -63 130 79 -87 104 156 197 162 28 -52 91 -274 52 -121 -95 46 -127 31 79 9 126 -99 23 -21
6472b1J31O1j21j94qJ61J06o2J26q1k35K45l59K55O8J11r4P4j45o9q2J86j99K09
6496F3j9LJ8k03K44j73N3J39k87j7K09N7M6j33K8l11L24l9J86j49o0J20P3P1m32
6521a89K24n0j74k7K63j81O6Pp1o9L18k61J48J11k41Q9K29M1j69J31k42j32m4
6544b23J8M00k04p4Q2pp5k57L07n1J22n9k08N38m0j38k55p3L01k29l7N45l45j72
6568a34P5LKjn0N1K80k41Q6j13J02m5P9m33N47o27L92J8j5N0k19l3K54J09r7M9
6594H9oq2j8j04J38k7J25j22n1L01l57K60k69J11Q7k8K53k44k1P1l79L9J5L59
6618A40k67J76N2k48K30L0r2j76N50k12k33J35q8M67o50K72j27o7L8r2K74j90
6640g8P9j22J09J95N5j77J02j17J2o1N3J93l52K19j46M6J7K79j54o5j13k8o2k3
$$ plain form
6472 -21 110 171 50 -144 -152 9 115 53 179 98 -137 108 -251 4 72 183 89 163 18 -51 -133 53 -146 63
6496 63 44 47 65 -138 106 -67 -14 125 -162 -179 30 87 133 0 28 -283 41 2 188 39 -21 99 172 243 -189
6521 -189 35 -15 -189 -216 47 -134 -68 -61 -132 -201 117 -144 4 115 -126 -37 192 233 64 195 -47 -179 -223
6544 -223 -205 195 -9 -83 -1 -8 -83 -340 -33 -84 38 -21 -229 309 269 131 -124 -197 104 -125 -162 383 38 -134
6568 -134 -59 -56 -54 -55 -105 -54 226 -15 71 -42 60 15 94 -339 208 -419 -27 -9 -24 26 -193 -226 28 137 40 89
6594 89 83 1 -17 -121 17 -10 115 -7 -58 243 -114 146 -123 -12 75 47 300 56 35 106 -273 -234 -219 140
6618 140 -127 49 101 -147 83 113 21 -155 395 183 -50 85 -3 464 -186 86 -41 -108 -70 -162 112 -78
6640 -78 1 -121 -12 183 238 61 163 46 58 -3 50 243 -109 110 -36 10 27 306 152 87 -26 -54 -116 -139
6664a39J59Q2k29j1L9K00jj7klk61L72j49l23L57J38l72M8J79j76O6K29j40k08
6688a62J33l74M85j90J39R8k20K72J4j92J55j13J17l95K71L05m08P9j31J56J83
6709B22m91J80J69k8l04L08L5j14j74L28p8N7N8J43l37J09k65L16k78L7M6J00
6731C9k93K03k7n0K90j14j22P4N5J68k1l48P5Q6J69l29Q7J7J59p6j6K14k84K87
6755B43l63rK07J10n83L84J27k89k8M9L91j43K2k87L11p6K45k92JK4J44k74n2
6778a38K84k04L9K3k36J37K7k9J45J36k06j12RP8o5P5o4j5J19j42O8rK34r1j43
6803h0j14K83j04l6l8L50j10m29L27L20l71R0k15J43r0R3j64M50m77J42J01o1
6825A0k87K44rL77k08l00J86K04Nl90K60j92k02L93m9j93K67N3o9J22j38q9j2
$$ plain form
6664 -139 20 102 -127 -138 -99 101 100 83 81 78 -183 189 40 -283 74 212 -160 -112 67 -109 -43 186 46 -162
6688 -162 -29 -403 82 -108 31 129 -91 181 195 3 158 45 162 -233 38 343 -65 14 -117 39 222
6709 222 -269 -89 80 52 -252 56 91 -23 -197 131 53 110 168 311 -26 83 -182 134 -144 -107 -61 39
6731 39 -254 -51 -78 -128 162 48 -74 0 55 223 202 -146 -71 15 184 -145 -58 -41 118 42 26 240 -44 243
6755 243 -120 -129 78 188 -395 -11 116 -173 -201 -152 239 96 118 -169 142 66 311 19 20 44 188 -86 -138
6778 -138 146 -58 -19 4 -232 -95 -68 -97 48 184 -22 -134 -125 -47 -112 -37 -101 -116 3 -139 -71 -80 154 63 -80
6803 -80 -194 89 -15 -51 -89 261 151 -278 49 369 -2 88 -127 16 -74 19 -145 305 -172 -30 71 10
6825 10 -277 -33 -42 335 127 -173 13 217 222 -168 92 -100 -302 91 42 -151 116 169 100 222 84 -5 -17
6848a7r6L8J80n4O8J78l40l2K86k28k6K06K3j15k20RK31m1K1J04j09j37n9L81
6872B51k16J15k59M8L49k31J2P4k26J61j47J13j17J31j52K44k5j89k1K62j97J2
6894hj38J90j27J61r5k00K90p7j23J73l20M9K52m5o6K35j13r1J6K11j54k3k9J22
6918I0j10o2j66J71J22j32J24k29R2o7J6K34p0n8J10Q1K60n20J37n6L95m41p4
6941a53j13J05J20j21K35j01k32J99J98k05J12pN4k31l8K58l0l6K62m19J25J72
6963A54p4N8k94O6J49q6K03l77K31J59j97J09l63K68NK08j46j36J41k21J70L8
6985F5M9m73L87n0J01m7K05k47j81K73j82nK73J17l60L3o9K11j84j6K51l04O0
7008i3K38j33k64K77n9O9k47L30j01k33j4O5J23J45Qj45j1J74q6n4J60j02k06
$$ plain form
6848 -17 -113 -75 105 51 119 297 -43 -75 211 -17 -43 163 186 71 -149 -140 91 50 71 175 66 -71 -130 251
6872 251 35 150 -109 -61 288 57 69 143 -83 78 -69 44 -73 58 -94 150 125 -64 -85 177 -20 -8
6894 -8 -146 44 -83 78 -17 -217 73 -4 -127 46 -274 -225 27 -18 -84 151 38 -53 -37 174 20 -3 -32 90
6918 90 -20 -82 -248 -77 45 -87 37 -192 -100 -167 -151 83 13 -45 65 146 406 -114 23 -33 362 -79 -153
6941 -153 -266 -161 -41 -162 73 -28 -260 -61 137 -68 44 37 91 -140 -178 80 50 14 276 -143 -18 154
6963 154 80 138 -156 -90 59 -27 176 -201 30 189 -8 101 -262 6 11 219 73 -63 78 -143 27 65
6985 65 114 -359 28 -22 79 32 237 -10 -191 82 -100 -105 168 285 -75 -42 -111 100 -84 -100 151 -153 -93
7008 -93 145 12 -252 25 -34 35 -212 118 17 -216 -230 -165 -42 103 111 -34 -45 129 43 -11 149 47 -159
7031a59K24j67P6j88L5M27l9n4O6m01L69j11p0J02l51J07K59k1k8j96K54j11k8
7054em0R9O6k06J9J37j10J34rJ5N0r2R7k60J26j02K3m7K14J49l29K00k16K20l20
7079a87J41N0L5J43m1r0j37L02j58r7K10k75q9L92j71J75P0l46K60k50P5J86j49
7102D9N7k01k9J08k79L12P9L0M0j03k7l24M24q3J29p4j0k00K66n9j6P3j27J73
7126B08l70R2J0J34k78K36o6K3p0o8J50J52q3J94l14O2o3L3K6K14k78l2J15O0
7150H7j23k46M98j78j45K33j14o8N9j13j46J24M11l76R2k36K59k49L73m44J73
7171a29P7K63J52l58m0J02q6J8RN1R8q2n4J72l45K15m4J0J4n7P8J58j83j58K42
7196A23k33K42j91N2k26J25PJ89r1K15j66n5L36m26j8K39k7j3r7n3J13M3k18j37
$$ plain form
7031 -159 65 -102 -26 -214 -179 248 209 155 221 -180 189 78 8 110 -241 -134 125 104 76 -120 134 23 -5
7054 -5 -45 54 120 -86 -67 70 -40 94 85 100 150 58 155 -105 21 -81 -58 -105 109 258 -71 129 -87 133 -187
7079 -187 -46 4 39 182 141 51 -86 216 58 -39 171 -104 -193 199 28 203 273 -73 187 -63 12 198 49
7102 49 106 -95 -124 -16 -295 17 96 126 166 63 36 -288 136 53 182 108 98 -102 164 105 89 162 35 208
7126 208 -162 -70 -60 74 -204 32 -34 -11 -81 -149 1 153 70 264 -50 12 -51 -18 8 222 -56 -88 27 87
7150 87 -36 -282 216 38 -107 126 12 -56 3 -110 -256 -132 279 -97 -5 -241 18 -231 142 -302 -129
7171 -129 -52 211 363 5 -35 67 -19 -1 8 59 157 75 21 193 -152 63 19 29 43 -14 64 222 39 -119 123
7196 123 -110 132 -59 -7 -233 -108 -101 88 -3 212 46 -9 327 -99 -117 122 95 82 -15 -68 45 88 -130 -267
7220b67N19j79m3m14L14K42j38L85n00K00p5n7M4J89k17jJ1j67K38K5l1j05j63
7243a90N3R0L6m09N18M6j11R2p8J59k8kj89K09j36K04m97K19K39m20J63m6J08
7266C0J71m20K87k8RJ67m67L95j00J09p1o2J14Q8j12L6j25MJ91k89p5L16l89K14
7290gP8l9J55l27J00M0o9O5Q7j22J57j02O2k14J56rN3J14k98J64J08j78Q1pj16
7315f8O0l4L57n03j07L91l89L06K5j24L2P3jq4L39j49lj33O5R4m5n1J1j07K0O0
7341C5O1j49j26J35m7J91k27j5J87K21l41M2J04p0j13j58N38j59j85n7oJ06J7
7364a6J68k97m2K07p6j48J90k66K25j21N6K02k83j09M17K0o1k65P7l9L69j20J99
7387B87k16j45J46j56R1k1p6L32q1m3o7k49K48l32J52O2K74k47K56l46J37l10
$$ plain form
7220 -267 252 73 30 -384 -70 172 34 419 -81 119 44 -13 31 220 3 2 13 -154 84 109 78 -27 -190
7243 -190 -137 -47 -11 -420 98 144 33 125 47 206 178 176 -13 196 60 264 -233 -14 225 -195 -32 -78 30
7266 30 201 -219 68 40 49 216 -251 144 44 153 82 20 134 222 110 146 21 25 216 -73 -148 168 -221 -7
7290 -7 71 32 187 -140 -40 0 -69 -4 83 -39 118 16 78 -136 20 11 64 178 -120 44 152 -26 55 48 -68
7315 -68 -8 -42 315 -188 -295 96 -293 13 38 -86 -54 19 18 -66 273 124 121 -12 53 147 102 51 62 -45 -25 35
7341 35 96 -53 -179 -44 -91 100 -127 -142 45 266 -75 -33 71 1 -112 -270 268 109 -76 -133 -139 -33 -16
7364 -16 152 -145 -187 20 -56 -204 -14 -280 -55 -176 -120 82 -201 -310 107 127 66 -199 -122 -161 208 88 287
7387 287 71 -74 72 -84 7 -14 -90 242 161 118 51 -198 50 -282 -130 -68 206 -41 215 -131 6 -304
7409c04K45K01Mm69L57j15L13l9n60N34p0O5j57N2j52jp3O5O3R2mP5j67j63k32
7434d40M44q5K08j44L6j34K43N3j70k94M27m8O7k58Q1M7rk36o0J18M19j13m74
7457c22J03L52mK88m31J02R0k19J43K6l8p0N6J64j27k09K49j09K24l28J13j96
7479a43Q0j20J85q4J89J03k50k6J90j74R5l12J1K17J9NJ08l74pK75K03l28J2N55
7503D29m64r9K4J23O5k97o1M1K78j76K52j84j0L76j98k41R6j4l1p2oR6K70l29
7527a32L13j97K34j46j20K41k65R8j20J93l5J79l68mL41l54K16Q6Nj33J06J85
7549C23l44J20k99M57k86J65P4j57L2m3q1J47j29J24p8J52n05L97q0QQ2N1r0j60
7573a20k8K81j21p2J82l46M73k64j74K38J10j15m5JK8p9N1K25j25Kj86J00l85
$$ plain form
7409 -304 -59 142 146 -323 34 -81 232 193 -367 167 97 162 5 57 -95 -96 -169 -104 -41 51 47 122 -45 -208 -440
7434 -440 4 -81 127 -17 19 -115 128 181 11 -283 144 96 163 -95 -14 33 24 -212 -272 -154 265 152 -322
7457 -322 -219 133 129 417 -14 88 178 -41 102 128 90 20 76 240 113 -96 153 44 268 -60 53 -143
7479 -143 -63 -183 2 -82 107 210 -40 -66 124 -50 45 -267 -256 -39 -20 -15 93 -281 -288 -13 190 -138 -126 429
7503 429 -35 -134 -110 13 78 -219 -280 -239 39 -137 115 -69 -79 297 99 -142 -46 -60 -91 -163 -169 -73 197 -132
7527 -132 181 -16 218 72 -48 193 -72 26 -94 99 64 243 -125 -129 212 -142 74 160 165 32 138 323
7549 323 -21 99 -200 257 -29 136 210 53 85 42 -39 108 -21 103 25 177 -328 69 -11 -3 79 130 40 -120
7573 -120 -148 133 12 -60 122 -224 249 -15 -189 49 159 44 -1 0 28 -51 0 225 100 102 -84 16 -369
7596c69J58n0L98l8k83J68O8l3j6op7L05j10j60N6R9Q2l31k9K8J54K96k77k13
7620a80L83j99M8j78L70j33Nj31m7j11K77m3o4p2Q1Mn3K01j1L2k21K39k93J55
7644E9N1p3p7J21j12O7m5m4J36j17q8j02K16J14k57q7O9J20KJ67rk13K32k88K1
7669a37j5K09j58J57j12l60L07K14k46K43j75L54k56O4l23K80J87k42j5j31J80
7690B5J51j70R3j13n0J3J0P0m5J94J02k66J01p2k35l2J76LM4J71j36O9l03J23
7714g7J5K3q4J61j92j56J95k7K03j38l4K57k13p4N3j24L23j15o5pJ00l05J60J74
7738E3l2o7PN5j28j39L52m21N08k64J50K54l99R9n6O5j36n2J50J3K1q2k20L51
7762H2O9m8r2K41l35p7Q3L10j25j48j02K84n6J00q4J45m01m9L52L9j04j38J99
$$ plain form
7596 -369 -211 -261 137 99 -184 -16 52 19 3 -3 -80 225 115 -45 11 110 192 -139 -168 -140 14 310 33 -180
7620 -180 203 4 52 -126 244 111 116 -15 -62 -173 104 61 -3 -75 6 10 -43 158 147 179 -42 197 -96 59
7644 59 110 37 -40 81 -31 36 -9 -53 83 -34 -122 -224 -8 106 -151 -238 -169 -49 -47 120 111 -102 130 -158 -137
7669 -137 -152 57 -101 56 -56 -416 -109 105 -141 102 -73 281 25 89 -234 46 233 -9 -24 -155 25
7690 25 176 6 99 -14 -64 -51 -41 29 -16 178 280 14 115 43 -192 -224 -48 -45 -1 170 34 103 -200 -77
7714 -77 -62 -39 -123 38 -154 -310 -115 -142 61 -77 -111 146 -67 -141 -88 -212 111 -4 -69 -76 24 -281 -121 53
7738 53 21 -46 -39 16 -112 -251 101 -320 188 -76 74 328 -71 28 -28 37 -99 -151 -1 12 33 -49 -269 82
7762 82 151 103 11 252 -83 -160 -77 233 108 -40 -142 142 86 186 102 247 -154 -203 149 188 84 -54 145
7785A45j14n3J14o4R7j60j22m54P71k82J43j33l4K36j33J57J8M6j35m2L59k13
7807A47l59m7J65K7k01L1K16p7J23q0J72J6l43mn9L84k14J01j30r0K41p0L76n62
7831b37L45J88l99J67J28n6k28L8j66L32M7l06J44q7J28j15O7J43J4J9j86kJ68
7854A46J8k26J25m1K41j8j66Oj73J40o2r8J18J01pk23j17J46k4M4K37K2N8l41
7878i4r2K9J44J91J16m37k69M00J8L1J06o6m7K9J21j7K68l64n1K33j19j51j2r7
7902a30oK30p1j10K10K3l34J00R8n2O9P7j89J4J25k10K01k1k0K18J7j69j2j2j13
7927f7K00j44k65K74J46j29Q5j54O0J3r8Q5L7k9O9q9k62K54j02L66l07J75k80
7950a62J89J9K27k72j54K5K08j84J38km2J32k23N8K86m90L48m22L70j35J26j99
$$ plain form
7785 145 31 -22 92 28 125 -35 -157 -611 160 -122 21 -112 -146 90 -43 114 132 178 43 1 360 147
7807 147 -212 -259 -94 -67 -268 -237 -21 -98 25 -55 117 133 -210 -214 -273 111 -103 -2 -132 -222 19 -51 325 -237
7831 -237 108 296 -103 64 192 136 -92 -54 -220 112 159 -147 -3 -90 38 -77 -10 133 147 166 -20 -22 146
7854 146 164 -62 63 22 263 245 79 85 -88 52 -10 -108 10 111 104 -119 -236 -90 -114 -70 167 189 247 -94
7878 -94 -186 -157 -13 178 294 -143 -412 -12 6 37 143 77 30 59 180 163 431 67 16 249 130 -21 -33 -130
7902 -130 -136 94 23 -87 123 146 -188 -88 10 -42 27 104 -85 -71 54 -156 45 24 4 222 239 70 58 46 -67
7927 -67 133 -11 -276 -2 144 15 100 -54 6 19 -79 6 43 14 83 -6 -268 -14 -116 250 -57 118 -162
7950 -162 27 46 273 1 -153 -128 80 -104 34 32 -10 122 -101 -43 243 -247 101 -321 49 -86 40 -159
7972a59N6L03m36R8L09j9l6m0k06M92p22K68j3J5J76l83J52K97P5r0k13L8kn3
7996i3r2K86J1M6n2K19n53J08J88O6k25p8L8M0j41J88J13J07k09l02K60M1O8o4
8020c0Rj07K04k7K8j55J36J2N0%J14j39j06J56l71K1J36K67R2l29j16O0J05k05
8044a95L13k12j20M12j60J13j84L90l55k3M4k33K9J04J48o1K5j98K26j04O9J8
8066D6M0j64J17j20k7J78j4j10p1J50k05K34j65j57M16k23P6k24L25k74J62J25
8088A15lJ08l71Q0J98k4J40k16J81j72o5Q1k60M90k43P3j07N6J46j71J60k12L4
8111A8l9n0lJ36j5K03r8l19M01l56K49j33n6J18r0k22K27N8Q1j98j20L30l04K14
8135C2J21q8L8l11J55L72l48K68j63m8J00p7j22J72P3k35J08l84K17L31j49Nj5
$$ plain form
7972 -159 -103 200 -236 -138 171 152 116 76 -130 362 -360 -92 -105 -90 86 -297 -145 152 227 137 -76 -38 -40 -93
7996 -93 -185 101 112 158 106 325 -228 -120 68 134 -91 -169 -131 -91 -232 -44 69 176 -33 -335 -75 -34 34 -30
8020 -30 -21 -128 76 49 77 -78 58 70 120 120 234 95 -11 145 -226 -205 -69 198 290 -39 -155 -95 10 -195
8044 -195 118 -94 -214 198 38 151 -33 357 2 -21 23 -210 -181 -77 71 10 35 -163 63 -41 28 46
8066 46 86 -78 39 -81 -108 70 56 -54 -125 25 -180 54 -111 -268 148 -75 1 -223 102 -172 -10 115
8088 115 112 220 -151 -71 127 103 243 27 208 36 -29 52 -208 282 39 112 5 61 207 36 196 -16 18
8111 18 -21 -71 -74 62 47 250 152 -167 234 -122 127 -6 -62 56 -34 -256 -29 29 110 -88 -208 122 -182 32
8135 32 153 65 103 -208 -53 319 -29 239 76 28 128 51 -71 101 174 -61 47 -337 -120 211 62 67 52
8158E2j24k41K88j47L21j63J33j80J4J85ml47QK30j05K2L91k19k38MK05K4J33
8181B42k88K05k23j92J08K40J9j21%j20
$$ plain form
8158 52 -72 -313 -25 -172 149 -14 119 -61 -47 138 134 -213 -205 25 -80 -58 333 114 -124 -120 85 109 242
8181 242 -46 159 -64 -256 -148 92 111 -10 -10 -130
8191a30
$$ Imaginary data points
##PAGE= N=2
##DATA TABLE= (X++(I..I)), XYDATA
0@%%%%%%%%%%Qj6J6k4L2m0N3o1P2q8J11j35J60j91K23k57K98l47M02m64N32o06
32c22O89p83Q84r96J121j258J407j570J752j950K163k397K654k934L240l575L940
49B065m340M780n265N804o400P064p814Q663r631J0750j2060J3619j5507J7852
63I580k0859K4871l0520L9123n3951Q6384k80667K03974M15560n68517j7678M00281
75B07581j32553l12434L07048J38140k68685k7717J83879j22807m0288J75367
85A07531l8241j85993Q8156J00969q6210l2896Q4523k7794p1921L0706O9951k6534
97A2247n0587J9467M0610k0763o422L4680k0548n2354N1984N6391o7146l2062
109c4503O6939l7441o1558J02559M3318j33070j3959J00003k9372l0956Q0377
$$ plain form
0 0 0 0 0 0 0 0 0 0 0 0 8 -8 8 -16 16 -24 29 -32 40 -48 63 -72 88 -103 120 -137 161 -186 216 -248 284 -322
32 -322 367 -416 468 -528 593 -665 742 -828 924 -1026 1137 -1260 1394 -1540 1700 -1875 2065
49 2065 -2275 2505 -2760 3044 -3356 3708 -4106 4557 -5074 5676 -6384 7235 -8272 9580
63 9580 -11279 13592 -16928 22195 -31756 54628 -226039 -22065 393495 -175022 -192700 207581
75 207581 75028 -237406 69642 207782 -60903 -88620 95259 -27548 -67836 107531
85 107531 69290 -116703 -28547 72422 -13788 -46684 37839 10045 -61876 -31170 38781 12247
97 12247 -38340 -18873 21737 974 -5448 29232 8684 -43670 8314 64705 -2441 -34503
109 -34503 32436 -5005 -66563 35996 79314 -53756 -67715 32288 2916 -28040 52337
120E2337k8080j00506N9500P1908o2183N934N6732q7425m2407J24988M119j08147
132e3230N2047N6480j02625m541J17809l5183q9268O4424L1819q4300K7068Q0982
144F1482p1296n0248R4657L776r2766M3223P3811o9188l8280Q1352o65q4570K3077
157b5635O7137l6469l0697M4870j3622n1591M8596N6115n5260m1453M5403L995
169A1389m5007L6575N6247n8098o1255O0173M3613n0259m092M1573l7363m4689
181e1193N2797L4511m8716l345M0124l3341k5036O6568J0408p3321J2999N6319
193C8774m1013l1583N4834J653n3301K3496L6664l9480j2263L7762j8423j9160
205b2040M5136q026n8644L0361M9956l8300j2888M6885k4499m8590M6027M0486
$$ plain form
120 52337 24257 -76249 -16749 55159 -7024 -1090 55642 -31783 -74190 50798 54917 -53230
132 -53230 -1183 55297 -47328 -51869 65940 30757 -58511 5913 37732 -46568 -19500 61482
144 61482 -9814 -60062 34595 38371 -54395 -11172 62639 -6549 -44829 36523 35858 -48712 -25635
157 -25635 41502 5033 -25664 19206 5584 -46007 2589 58704 3444 -38009 7394 11389
169 11389 -33618 2957 59204 1106 -60149 24 43637 -6622 -10714 30859 -6504 -51193
181 -51193 1604 36115 -12601 -15946 24178 -9163 -34199 32369 42777 -30544 -17545 38774
193 38774 -2239 -33822 21012 22665 -30636 -7140 29524 -9956 -22219 15543 -2880 -22040
205 -22040 23096 15070 -43574 -13213 36743 -1557 -14445 32440 7941 -40649 5378 45864
217D5864m3513j7286K4931k4551j5065N1570O333n6772M896L5303k4218j0779
229b3287M9544K617n5806K31M7634m157k6087K0776R237l6299JL7487j0157k5979
243a4245J9571M693l4632R315L9311k4837l2991M2555J7969n2630M183N0656k4463
256D455l1307M3794J0009n1183R088M3945k2502j9291L6793j3621n1670L3203
268h287M5422m2800k3485M0928j1833l8908L8624L9984m0311k5741L2411J467
280G471k1587K7288J5107m0573o681L3841r191j6803K8067K431m2172J718L9778
293A8694j2453l0335K4848J6682l3665r23L4014j0214j9644K1629N136k5619N909
306e941J8150j8890n686L3122o915m0999J7110L3835k4202j2528L1379j0237l6955
$$ plain form
217 45864 2351 -14935 9996 -14555 -29620 21950 28283 -28489 -23593 11710 -12508 -23287
229 -23287 26257 28874 -26932 -26701 20933 16776 -9311 11465 20702 -15597 -15596 21891 11734 -14245
243 -14245 5326 10019 -24613 -15298 24013 -824 -33815 8740 26709 -25921 -21738 28918 4455
256 4455 -26852 16942 26951 -24232 -15144 28801 6299 -12992 23801 10180 -41490 -8287
268 -8287 37135 -5665 -29150 11778 -55 -38963 -339 39645 -666 -26407 6004 7471
280 7471 -14116 13172 28279 -12294 -18975 14866 5675 -11128 16939 19370 -22802 -21084 18694
293 18694 6241 -24094 754 17436 -16229 -17152 16862 6648 -12996 8633 13769 -11850 -5941
306 -5941 12209 -6681 -12367 20755 13840 -27159 -10049 23786 -416 -12944 18435 8198 -28757
319b8757J9176L1547j6551j1622J6073j4049j9277L3668J9594l6387o641K7974
331A4748j7266k1317L3831J6323l8491j2569K9417K71j6401J6763J0058k3257
343g890L18J7304j1198k717K2290r980k6575J6013K0137k2291j0467K8228m00
356A2772l0087Q982J9093j7338j332K2128j0870j8756J6689O698j7995J2851K2350
369B5185k7753k5011L3469J5585k9437N276K4824k6800k2693L2773J4156k6238
381f664j227J3980j9341o491L3979K976l1428R628K0899k4542p168L7165j458
394B0308l8641P903K7285j6689j4534K5471L193k7409O196J6839j7190l708K3079
407A2103q588k0816J7481J0195k3619M165L1414j1062l0416J4096J8376j6996
$$ plain form
319 -28757 -9581 21966 5415 -6207 9866 -4183 -23460 10208 29802 -6585 -13226 14748
331 14748 -2518 -23835 9996 26319 -12172 -24741 4676 4947 -11454 5309 15367 -7890
343 -7890 -7572 9732 -1466 -4183 18107 8127 -18448 -2435 17702 -4589 -15056 13172 12772
356 12772 -17315 -8333 10760 -6578 -7910 14218 3348 -15408 1281 7979 -10016 2835 25185
369 25185 -2568 -27579 5890 21475 -7962 -2686 22138 -4662 -27355 5418 19574 -6664
381 -6664 -7891 6089 -13252 -19743 14236 17212 -14216 -4588 16311 -8231 -15399 21766 20308
394 20308 -18333 -10430 16855 166 -14368 11103 14296 -13113 -6917 9922 -7268 -10976 12103
407 12103 3515 -17301 180 10375 -13244 -9079 22335 11273 -19143 -5047 13329 -3667
419c667K84K0147j3279k1656J4157J0985j0385N252Q697k0557j0869K5544Q931
432A3584k0032N180J4578k0460j0347K8351P909k2348l85J0059j2321k461J9941
445A1248m596j8869J0443O608k0085N938K6038j3185k1052J9477J0256k2425L279
458f925K3265r879j6289J2670L081j5724R797J5755j7348j0447J6735l902j6157
471a5368J6634J5645k2004j2851K0237M835j6180R442J7305j7237j6123J7185
483A520Q351j0566O302N423k0377n383K3161L48j9079J0145R970k4503m057L1950
497A3205j360k3727J1583J0911j9922K131K2118q981j3941J4796p24k1570J3279
510b202K1194j9596j2115K0595m523k1449J7307J8562j8723j0371J2998r32p771
$$ plain form
419 -3667 -3383 16764 3485 -18171 -4014 6971 -3414 1838 10535 -10022 -20891 4653 13584
432 13584 -6448 -1268 13310 -7150 -17497 10854 18763 -3585 -3970 6089 -6232 -8693 11248
445 11248 6652 -12217 -1774 4834 -15251 -9313 16725 3540 -17512 1965 12221 -10204 -6925
458 -6925 16340 6461 -9828 2842 5923 -9801 -4 15751 -1597 -12044 4691 789 -15368
471 -15368 1266 16911 -5093 -17944 2293 7128 -9052 390 17695 458 -15665 1520
483 1520 9871 -695 5607 11030 -9347 -14730 8431 8779 -10300 -155 9815 -14688 -18745 13205
497 13205 11845 -11882 -299 10612 -9310 -7179 14939 5958 -7983 6813 6089 -15481 -2202
510 -2202 18992 -604 -12719 7876 3353 -18096 -789 17773 -950 -11321 1677 745 -7026
523g026J2821P144j5256l369J0016o897l512J7695J079k3193k228J7160l53j0951
537f870P906P477j5545o701J8080L383j0450N756L338j3322K385J5640p304j0308
551f535J2834K796k0294K440K1157r056j2986J5005J81j9052P603J5177r557l931
565d218J0697q295j1554J6694J0052j7404n3J6118j4312j4720K2665J1910k0365
578b785m371J0029p028m446J5687K984j4495j181N650o793N420J6895r992j8050
592a2476R690R050r510K039J2851p508j5607O066J0986n355j035O720r189q890
606a2168J1396O146q667K647Q412q437j0708J2166J2464j2923p189J4196j795
619E540j6362O573J4411q611p592Q606l072j1944J0650J2584j3583n351J4407
$$ plain form
523 -7026 5795 12939 -2317 -5686 4330 -2567 -6079 11616 12695 -10498 -12726 4434 4081 -6870
537 -6870 1036 8513 -7032 -13733 4347 7730 -2720 3036 6374 -6948 -4563 11077 3773 -6535
551 -6535 6299 9095 -11199 -8759 12398 3342 -9644 5361 5542 -13510 -5907 9270 -287 -4218
565 -4218 6479 -1816 -13370 3324 13376 -4028 -4081 12037 -2275 -16995 5670 17580 -2785
578 -2785 -7156 2873 -4155 -8601 7086 10070 -4425 -5606 44 -6749 -1329 15566 5574 -12476
592 -12476 -2786 6264 -3246 -1207 11644 4136 -11471 -5405 5581 226 -809 5911 -3278 -12168
606 -12168 -772 5374 -3293 -646 7766 -671 -11379 787 13251 328 -6861 7335 5540
619 5540 -10822 -4249 10162 1551 -6041 2565 -507 -12451 -1801 10783 -2800 -8151 6256
632F256p367j2506J9235J1645k0487n103J5407m769r258J2240N342j3733k626
645e724O108m953J396R794o268q998N771R14m631P649P253q019m511L433J178
660C92K824M751k936o938Q85J051k891L903N990o203q342J207N262K952j297o1
676E49J897n069o743R149R902o479n437M519l589m371J0308M620j1334o17N931
691C236r992k661J8723j944j8445O802J0741j2789k18J8252m016j5242O190O450
705E087q715M445J0649j1223q826J1613l55j1494Q994J0638j2883r021J0855M642
719D406p974K925Q589n653r098N252N744k614J144K913p810o206Q167O609o326
734F8j464N966p177r456J1753J1173j0653o638Q108j238n987P808P135o204m595
$$ plain form
632 6256 -1111 -13617 5618 17263 -3224 -8327 7080 2311 -6947 5293 10635 -3098 -5724
645 -5724 384 -4569 -3173 6621 353 -8645 -2874 -1960 -6591 1058 8311 292 -4219 -786 392
660 392 3216 7967 5031 -1907 -1022 29 -2862 1041 7031 828 -7514 -6307 -1045 1907 610 549
676 549 2446 -2623 -9366 -217 9685 3206 -2231 2288 -1301 -5672 4636 9256 -2078 -2695 3236
691 3236 -6756 -9417 9306 7362 -11083 -4281 6460 -6329 -6547 11705 7689 -7553 -1363 5087
705 5087 -3628 817 11466 243 -8583 3030 2675 -8819 175 10813 -2070 -11091 -236 4406
719 4406 -3568 -643 7946 2293 -6805 -1553 4191 1577 2721 5634 -2176 -8382 -215 6394 68
734 68 -1396 4570 -2607 -12063 -310 10863 210 -6428 1680 442 -5545 2263 9398 3194 -1401
749a401K236k544M93P550j775r852L036L211p425K457J0387l200r078K622K660
764f23k563M612N011o886m079O440j708n142J0890N215j4756m089J2573j374q428
779d907P249N605j1500o641R717K760m635M562J267j0407J293R559j447l065N541
794D951r81r961J180J1599p14q519K283K555p855q38Q819J145n171j314k43j493
810d557L945O123k708n626L666J236o663M691R981p013r238N706L253o022J671
825a555O922m363p514L719J392l299P307L881j0682k538Q992j058l175P528K108
840G665j1055l074Q755J683m057J958q87o344J736M352j941K311J838o010l796
855f866O437M396k420p72K910k863n311M415N499k210k577m89l846m10N321J705
$$ plain form
749 -1401 835 -1709 -1216 6334 4559 -5293 -2257 954 -6471 -4014 6373 3173 -5905 -3283 -623
764 -623 -3186 1426 6437 -449 -4528 1912 204 -4938 5952 11167 -3589 -7678 4895 3521 -4907
779 -4907 2342 7947 -3553 -10194 -477 2283 -2352 2210 3477 -6930 -5637 3922 2475 -590 4951
794 4951 3970 -5991 -4811 6788 6074 -2445 -162 2393 -5462 -6300 2519 3664 -1507 -2821 -3064 -4557
810 -4557 -612 5511 2803 -2823 843 2079 -4584 107 10088 3075 -6163 -457 2796 -3226 -1555
825 -1555 5367 1004 -6510 -2791 -1399 -4698 2609 6490 -4192 -6730 2262 1204 -1971 5557 7665
840 7665 -3390 -6464 2291 3974 -83 1875 988 -5356 -3620 732 -1209 1102 2940 -3070 -6866
855 -6866 -429 3967 1547 775 3685 822 -4489 -74 5425 3215 638 149 -3697 -4107 1214 2919
871B919l775o67K591l594l644Q625N769q628m378N826m97l790N828M718o822n536
887e055M565R25j818M542O61q706m2N796k054r62O524J09q399l16O637J824k342
904A889J202q76m751j2K968N96J978p79o523j648N570K580l087K47K479l800m209
921f176O363N385m056j157K514l901j907P053J426n146M14J289o171j967J0056
936D019K232j0594j299O797m140k776Q952L184q639k719N678J038q23M475m92
951D893o972N2L773j702J82M870l474p863J169O461m62l200K298P51n484Q0N993
968A365J201j372L49j952k336L657L638j611j359R84l824l544N060M457m777k640
984b704K215j933j524M577J732j951k13j001l048K727N485j574m700J942J269
$$ plain form
871 2919 -856 -1523 1068 -2526 -6170 2455 8224 -404 -4782 1044 547 -3243 2585 7303 481 -5055
887 -5055 -490 435 -1383 3159 3820 -4886 -4928 868 -1186 -2148 4376 4485 -3914 -4230 2407 4231 1889
904 1889 3091 2215 -2536 -2548 420 1016 2994 2215 -4308 -5956 -386 2194 -893 -646 1833 -1967 -6176
921 -6176 187 5572 1516 359 2873 -1028 -2935 4118 5544 398 812 2101 -4070 -6037 4019
936 4019 6251 -4343 -5642 1155 -2985 -5761 3191 6375 -2264 -4983 695 1733 910 5385 4893
951 4893 -2079 -2027 1746 44 226 5096 1622 -6241 -5072 1389 927 -2273 25 776 -4708 -4628 1365
968 1365 2566 1194 1543 -409 -2745 912 4550 2939 1580 2564 -1260 -4804 256 4713 -64 -2704
984 -2704 -489 -2422 -3946 631 2363 412 199 -802 -3850 -1123 4362 2788 -1912 30 1299
999A299m441J308O676j448n408n0j94l33L862J696l280j634J591j253p95O397
1015C993L541q516l861O255J93l767M401K862p798l967N628K978k681K009J313
1030B583p218n94P741j84m042M754K63q095l00R325J677o515L6K485l969j737
1046c790O217K162m792k980M04R11J543K208L36l140o85J700q96O79M061n92m824
1063a478o42K972k08o05J398l80k547j572L54J987K462L80l981j67L482k011o22
1080a178N511k43n968J48K377q33J845L154l220n880K338K357k611K628L914o867
1096b528m583N925L364k179J419J564l457k744L334L956o31j180j760l096J76
1111b420L461J255j085k045j439j274K67L779M024m333n133L486K419j843K650
$$ plain form
999 1299 -3142 -1834 4842 3394 -2014 -2064 -2258 -2591 1271 2967 -313 -1947 -356 -1609 -2404 3993
1015 3993 7534 -982 -4843 1412 1605 -2162 2239 5101 -2697 -6664 -1036 1942 -739 1270 2583
1030 2583 -4635 -5229 2512 2328 -1714 3040 3303 -4792 -5092 4233 5910 -605 -569 1916 -2053 -3790
1046 -3790 2427 4589 -203 -3183 -2779 -1868 -325 1883 2219 -921 -1606 94 -802 -123 3938 3346 -1478
1063 -1478 -2120 852 644 39 1437 1057 -1490 -3062 -2708 -721 1741 2121 -1860 -2027 1455 -556 -1178
1080 -1178 4333 4090 -1878 -1730 647 -186 1659 4813 1593 -4287 -1949 408 -2203 425 4339 -2528
1096 -2528 -7111 -1186 2178 -1 1418 2982 -475 -3219 115 4071 3440 2260 500 -2596 -2420
1111 -2420 1041 2296 1211 -834 -2273 -3547 -3280 499 4523 190 -4943 -1457 962 -881 1769
1126A769L283l552m248K281K981j444O11J409m495k313L890o28j558L844M53n485
1142c202j211M350J867j942O2J322k153j404K011K642M46j490k281k39Q94K34
1158i4J511L18k283j326l18j48K458L053j802l452l53K226N62l3K666l41l933
1175a289j883K541L225J73k389j168o19j198Q12L708J294l301k783k42K367K198
1191A446J209q76l296p59J697R19P98K197j725m534J84L823J57j401R67n6l805
1208c055k86M086J188j329N50j415k530K462L119j206p01P34k391k703L054L430
1224C007j779k648L77l31j341K216K100p05j082j774k79K020K222K18r72q70q26
1241d47k10J326J879M72k784k653M76R86Q70M81P23j978k509R76L083P38Q69j073
$$ plain form
1126 1769 5052 1500 -2748 -467 2514 1070 1681 3090 -1405 -3718 172 -456 -2014 1830 2283 -3202
1142 -3202 -4413 -63 1804 -138 -76 1246 -907 -2311 -300 2342 2788 1298 -983 -1222 -328 -94
1158 -94 1417 1735 -548 -1874 -2192 -2340 118 3171 1369 -2083 -2436 -210 352 319 2985 2644 -1289
1175 -1289 -3172 -631 2594 2767 378 -790 -1409 -2607 -1795 1913 3207 -94 -2877 -3119 -752 1446
1191 1446 2655 1779 -1517 -2276 -579 340 1138 3335 1610 -2924 -2740 1083 1240 -161 806 750 -3055
1208 -3055 -3341 745 1933 604 1154 -261 -2791 -329 2790 1584 883 1617 -774 -3477 -423 3007
1224 3007 1228 -1420 -1043 -1374 -2715 -499 1601 896 -186 -1960 -2239 -219 2003 2221 1249 379 -447
1241 -447 -657 669 2548 3020 236 -2417 -1941 -955 -85 396 1119 -859 -3368 -2392 691 1429 2298 1225
1259A225l437O05K983Qk41J744j608m196M91M493O8j948J15j844k041K352K254
1276A023q47N65O57l405r96M993J908k591q25P57j996j383L045K437k534k162
1292a354n31m30R66K393J85j392j467j14Q03J008K376O15l824j107J854J098J1
1309A090P18k45j827k042O96K003Q31Q6k047j803N96J208L10J869Q39l067j981
1326b766K557K140M42n90n26k001q50K041Q81o27L33j307l307J043L650R7j655
1343d45L6N49k196m91M225J714l073j173Q09j212P85L175o7k448r83l00m79J269
1361c05K743j350l844P47J824j333J754K294j456k875k60J978J455L28j6j400
1377B84j907J241N91L5J589l20l311j433K171J604l13j18K75r09j837J494L200
$$ plain form
1259 1225 -2212 -1607 1376 1384 1143 2887 1279 -2917 -2426 2067 2135 187 302 -1542 -3583 -1231 1023
1276 1023 176 741 1398 -2007 -3003 1990 3898 1307 482 1239 -757 -2140 905 3342 808 -1354
1292 -1354 -1885 -2315 -1349 1044 1229 -163 -1630 -1744 -941 67 2443 3058 -766 -1873 -19 1079 1090
1309 1090 1808 1563 -264 -2306 -1610 393 1224 1310 -737 -2540 -1944 -736 -426 1443 2282 -785 -2766
1326 -2766 -209 1931 2373 1783 1257 -744 -1594 447 1328 701 1034 -273 -3580 -2537 1113 1210 -445
1343 -445 -409 140 -2056 -2547 1678 3392 319 -854 -45 -1257 -472 2703 2636 188 -795 -1095 -1574 -305
1361 -305 2438 1088 -2756 -2009 -185 -1518 236 2530 1074 -1801 -2061 -83 1372 1700 1684 284
1377 284 -1623 -382 209 244 1833 1513 -1798 -3231 -1060 544 231 113 388 -521 -2358 -864 2336
1394B336L42j515j579r28P01J672O60p69q49r77j156N13K686M81k237n55k08L8
1412a344J259K078r92n31Nj996j1L709J097l229j442J628j209j065L674J140l983
1429a212j381J757n02N79K960o13k868J09J529m93R39K538j036m265j50L176k88
1446G79q72J052m68k838r56K797J635o49l96m06j446L48K678P33q66r0j246j734
1464a945J682K904l9k365j080l28l06J131J804q87j454q67r63J953K798k40j541
1481B57j09J7q35J066J940J2k573r03K20L65J247N71j451q99o47l12R85K313L72
1500A636k119j187J143R42P0J238N10k014j390P55Q36R64N08j562j522m08J030
1517e70J67L56R75q81k941M24K911L50j92Q36r56k058M98K688R15j001q14j391
$$ plain form
1394 2336 2678 1163 -416 -1344 -643 1029 1689 920 71 -906 -2062 -1549 1137 1618 -619 -1174 -1382 -1344
1412 -1344 -85 1993 1001 470 475 -1521 -1532 2177 3274 45 -1397 231 -978 -2043 1631 2771 -1212
1429 -1212 -2593 -836 -1338 -759 2201 1588 -1280 -1171 358 -135 804 3342 2306 -1959 -2109 1067 779
1446 779 -93 959 491 -2347 -3303 -506 1129 480 84 -322 -1768 -1420 1258 1991 1125 1035 -211 -1945
1464 -1945 -263 2641 2602 237 -843 -1171 -1477 -346 1458 571 -883 -1750 -2713 -760 2038 1798 257
1481 257 148 165 -670 396 2336 2348 -225 -1128 -908 -543 704 1275 -176 -1075 -1722 -2034 -1049 1264 1636
1500 1636 -483 -1670 -527 415 485 1723 2233 219 -1171 -416 420 1384 1892 330 -1192 -1600 -570
1517 -570 -403 -47 928 47 -2894 -2470 441 791 599 1435 479 -1579 -1081 1607 2522 1521 707 -684
1535f84j774J719K505n15j598r02o72k45J916K094l90j974j670J210J175R14Q24
1552A933l21j620j264Q6K301J115j280j538m21n05Q01J537L52q35j722j52M46
1569a087R25K068jk570j56R40m9L71J526m18k082j432J352J137o74L26j36j248
1587a208N9K91Q36J531k81j622k58P98j99J082N78l50j358j209L93J106J119J41
1605A449j727j957N83J207J55J264q1j399j745J022K313J046j198j48j006r77
1621a199N02K396N43j267j977j113M40J544J558p87j531o63k60J083K203M58j586
1638C44q20m97L74J888N76n60j450j62p76l12K324J098k540j854J397N33q71J913
1656F05Q56j715j188P56J205j13N44Q34j419j172N95O80o4O91j18j908j376J278
$$ plain form
1535 -684 -2458 -739 1766 1251 -347 -1249 -1921 -2166 -250 1844 1454 -520 -2190 -980 195 1109 1933
1552 1933 1612 -8 -1272 -1186 1115 2230 950 -588 -1009 -1514 -713 824 1176 341 -1381 -1533 -1087
1569 -1087 -162 1906 1905 -665 -821 119 70 441 1967 1549 -533 -1965 -613 524 -150 176 40 -1208
1587 -1208 -1149 -858 -22 1509 1228 -394 -652 146 -53 1029 1607 1257 -101 -1310 -917 189 1308 1449
1605 1449 -278 -2235 -1652 -445 -290 974 893 -506 -2251 -1229 1084 2130 932 784 -222 -1199
1621 -1199 -697 1699 2242 975 -1002 -2115 -1675 -131 1427 640 -891 -1554 -1814 -731 1472 1930 344
1638 344 -476 -973 -599 1289 1865 1305 -145 -307 -1083 -1395 929 2027 -513 -2367 -970 -437 -1308 605
1656 605 1461 -254 -1442 -686 519 406 950 1784 365 -807 -212 468 404 1095 977 -931 -2307 -1029
1674a029J280K42k58L38j617j172J994J773k42l90j121j087J314J130M5m98K61
1691I63j465j860J444K280o67j325L10j406n99K672J181r47k42m11j382P84L031
1708B361J70k538p01N03l99L50J628J78k040j050k4Q78J429j38m36p78n75K45
1726i37J183J122K88j119j431L23R73O43o5j09j268q87L25O07P85N54n46k061
1744a620k69J798Q41q53J186L11k694k57K705Q28j701K45r5j715M6K096M2j210
1762c16M07p08j502J439J895k34j368J27l18p56J732J629l06j826m24j70N35J321
1780A157K09j232n72q47l62J117J827m98j777l71R01J38P89J268p13j583j53O66
1798c6N44Q39L20j309j761N74P32J21L01J58r60k021Q84J768M83L15q89l21m55
$$ plain form
1674 -1029 251 493 235 573 -1044 -2216 -222 1551 1309 919 -202 -1289 25 1155 1200 702 963
1691 963 -502 -2362 -918 1362 695 -630 -320 -1726 -2325 347 1528 581 339 -72 -1454 -670 2361
1708 2361 2531 -7 -708 -205 -604 -254 1374 1552 -488 -1538 -1562 -684 745 607 171 -607 -1182 -937
1726 -937 246 1368 1656 537 -894 -571 402 1045 980 871 -397 -1284 -959 -352 433 987 441 -1620
1744 -1620 -1889 -91 750 -103 1083 1394 -1300 -1557 1148 1976 275 520 425 -1290 -1244 852 894 -316
1762 -316 91 -617 -2119 -680 1215 981 -387 -260 -578 -1334 398 2027 1721 -105 -529 -699 -164 1157
1780 1157 1366 134 -438 -1285 -1647 -530 1297 799 -978 -1349 -448 -310 479 1747 1034 -549 -702 -36
1798 -36 508 1347 1667 358 -1403 -829 -97 24 325 483 -477 -2498 -1614 154 637 952 63 -258 -713
1817g13J60J595J042j112r14o33l35J401Q21p29o13n89p63K7J297J104p02j430
1835a086K33k72N81J580P29j413n75j69m66Q06K032n98k222J83L5j38O79J558
1853A477q17k101l1O30N38J409J51j617l79J55M31J216N93o62j392m98J70M58
1871b69R54J96j222p38N6j07P15J898p36j368k26J37J035O37K74k80j167j058
1889a269J027J387J57j114o62m01m96N53J702q2j538k43k3N5J360J190o35j158
1907a90O8O8k06R01J274j206j953K62J82Q87N32j17o38j070n5M36J605L53m92
1926F41j413k71P94P77R14l82o43o44o94N85J028M07p16j501K10K95L30Q75l1
1945E61m60j071j21J197N13M59k69r12m74K28O11K31O93m69j788l96J082R67J05
$$ plain form
1817 -713 -553 1042 2084 972 58 -575 -910 491 1312 583 -30 -619 -1382 -1355 -58 1046 344 -1086
1835 -1086 -853 -1125 -544 1036 1765 352 -223 -392 -858 -52 1980 1382 -840 -657 -622 -760 -81 1477
1853 1477 660 -1441 -1472 -842 -304 1105 1256 -361 -740 -585 -154 1062 1655 993 -399 -897 -727 -269
1871 -269 685 881 -341 -1079 -1023 -1130 -415 1483 747 -621 -847 -710 325 962 1236 956 -211 -1269
1889 -1269 -242 1145 1302 188 -474 -875 -1371 -818 884 802 -736 -979 -1002 -947 413 1603 968 -190
1907 -190 -122 -54 -260 641 1915 709 -1244 -982 -800 87 619 502 -136 -1206 -1261 -825 780 1133 641
1926 641 -772 -1043 -249 528 1442 1060 417 -227 -921 -336 692 1099 383 -1118 -908 -613 -283 592 561
1945 561 101 -970 -1091 106 619 1078 809 -103 -577 -349 262 493 1186 717 -1071 -1467 -385 582 687
1964F87p50j71o70l83J161Q17J32n22p79n70P10J498L51o28r14m95p20O93J195
1983F42N95j529p83N1K47Q72K53N60j122j375P39J238P20R9k89j340j60J71R89
2002E78Q70p69r96o01l21O33J053J12p40q70O5M98L64R20P05j423j150Q16R64
2021G08n14P17L90j211j357M73J107Q7k52L37j308p52J352N74k65M74Q4j175l54
2040h85J232J012k31j000j36l78m16J213P54m09q06j122NP88Q73J9m90r89O6J36
2060g64J029J308k20j501o22q4J139J226o56o82r95j66K69M87J114m12j519k58
2078a307P76O0R18P00j004r11L64N02J92R44J99j349j274J001R78p28M15N82k011
2097i53j135J915N98m33K51k29q47JR16J174o74rR1j150k60J277N69q28j03l69
$$ plain form
1964 687 -63 -234 -904 -1287 -126 691 823 301 -478 -1048 -338 1160 1511 883 -31 -526 -1246 -553 642
1983 642 1237 -292 -1075 -1024 -777 95 348 908 -214 -1589 -850 388 1108 1207 918 -422 -582 -411 578
2002 578 1448 679 -317 -918 -1239 -606 447 559 -181 -1051 -986 -488 -124 796 1501 78 -1072 -256 708
2021 708 194 911 1301 90 -1267 -794 313 400 148 485 -823 -1575 -223 351 86 560 644 -531 -885
2040 -885 347 1359 1128 128 -8 -386 -802 411 1165 756 -50 -1172 -1167 -379 494 513 23 -966 -900 -764
2060 -764 265 1573 1353 -148 -770 -854 285 1511 855 173 -822 -988 -719 -232 882 470 -1049 -1307
2078 -1307 -531 -471 447 1147 143 -768 -404 98 290 1234 1433 84 -1190 -189 789 61 476 1058 -953
2097 -953 -2088 -173 425 -8 243 14 -833 -832 84 1258 584 575 666 -484 -744 533 1102 274 171 -198
2117a98n41m12J147J466j306j051M37k65J48J166Q45r81q04l15O9J119O42J12
2135A278j718l78K90M26P53N12j340q30k96M18J162Q63p00j084K9J89L09O93J095
2154A671p55j827K07J215j79K63M93j190j434R53P36Q1K34l41r00o05R25J537
2172A084o97j33M54q16r87J393R89m20o67l90q1q13J080Q19q85l67J7o58K59J236
2192D17O44p16q69M36j77J28R23Q42j155j215L99K31K59O76q2j216o86L7N96R05
2212C77K05k81j090l20Q24Q11M78m90k28q96Q9P47P19L63r09j301M3P68j57M54
2232B06O68j077j474L60J830j03J63p5q88o34J299P94k00l14n2j041m73J052P36
2251G77p89k59N9n08r3M24J115j06q00p71N61l0P55Q48n17n64m41J07K75O87K70
$$ plain form
2117 -198 -739 -1151 -4 1462 156 -895 -458 -723 -575 591 1436 455 -349 -664 -595 524 1166 1278
2135 1278 -440 -818 -528 -102 651 1163 -177 -1007 -1303 -885 277 1140 440 -644 -615 -426 -117 576 1671
2154 1671 916 -911 -704 511 332 595 1088 -102 -1536 -583 153 234 468 127 -773 -1378 -453 1084
2172 1084 387 254 708 -108 -1095 298 1287 867 200 -190 -271 -1084 -4 815 -70 -437 -420 -1078 -819 417
2192 417 1061 345 -524 -88 -265 -137 786 1628 473 -742 -343 -112 147 823 741 -475 -1161 -1124 -528 377
2212 377 582 301 -789 -1109 -285 526 1004 514 286 -610 -521 226 945 1308 399 -902 -859 -91 -248 206
2232 206 874 -203 -1677 -1317 513 410 573 498 -390 -1024 275 1069 869 555 503 -538 -1011 41 777
2251 777 -12 -271 -212 -720 -813 -389 726 620 -180 -951 -390 -420 335 1183 666 102 -339 -232 43 730 1000
2272A000j089p86M3N03M39K11Pp26q50M13J311K66J92o95o42J95L42N7N98J95
2292I84j158p21M04O76j66L27j62p69o97Q12M39N19K19r42p73L77Q42P90L2m47
2312E86q65l58L15O41M29j12p06q92J95N81K81K90J56j108j57n3R57R48n17n31
2332H0m14k43M47N04L29m2j222n57O28L24M79L35o80j123L30R15L30L59k68p98
2352b87l33L73P91L35k31j92m20r10M71N61O69j001j56o15m9M27O56O24o43l82
2372c12j76J60O74N24q5n46r00L7J000J54J46k08j181n17M35Q23J80r1m47r3k89
2393g12L23J088P8l23n97l59L02N81K38R0o99p70K23M89K55M32l32q17l89N8P44
2414i7P51m00k07l93l78O50Q70L64m77r04j75J30K95O72j92n31o47r0J38M58O46
$$ plain form
2272 1000 -89 -875 -832 -329 110 321 328 -398 -1248 -835 476 742 934 239 -403 -208 134 191 789 984
2292 984 -174 -895 -491 185 19 346 184 -585 -1282 -470 -31 488 707 -235 -1008 -631 211 1001 1033 586
2312 586 -279 -637 -322 319 748 636 -70 -962 -767 -186 95 385 541 -567 -724 -777 180 1128 611 80
2332 80 -334 -577 -130 374 703 661 -561 -1118 -490 -166 313 648 -32 -1155 -825 90 420 779 511 -287
2352 -287 -620 -247 544 879 648 456 36 -874 -403 158 827 -174 -330 -945 -994 -567 89 713 70 -312
2372 -312 -488 -328 346 870 785 239 -661 -624 376 530 676 468 -713 -1230 -795 28 208 117 -330 -423 -712
2393 -712 -389 699 777 454 -143 -502 -200 381 619 709 10 -760 -537 -48 207 639 307 -510 -899 -841 -97
2414 -97 654 254 47 -346 -724 -74 796 1160 683 -221 -396 -266 29 701 509 -22 -669 -759 -621 -163 483
2435D83k42o52l80L55O46K78K19j57q73j60P55K84J74k91q85Ql33N99O29r9m56
2456i8q46K15M51N42K69q8k07o91j6M07O01M06m25o05k63k3K69M40K4o36m57O5
2478f66M14N11K81j65o24m57P69k4N11M24o29r43K7P27M44J13o29k58o68k7R68
2499I9J87K45n59q24L36K28L78P72l92l94p26L68P54Q9K38m12j028m3P09L12k55
2520H2L78m26j080L7J091M67m27n9l86r5K14N62O11l54m18n37l7L17N57j44m52
2541i9k14k17J9M77R1M39n41r55N37O13J00K74j99m71l25J5N06O28m9m54p79m7
2563f51K45M35L74K0r43n18N61K52M39M91l22r22J63P48L39K9Q5p85p04M2R84
2584C62n6J50l64p58j48N55M79K76m80m62k54Q1R61P04l89l96j58l60j34J072
$$ plain form
2435 483 241 -411 -791 -436 210 488 707 550 -323 -483 272 556 730 439 -446 -438 -771 -172 457 358 -98
2456 -98 -944 -729 -278 264 533 445 238 -453 -469 -62 539 945 520 -85 -348 -371 -102 338 362 -274 -731 -666
2478 -666 -252 259 540 375 -249 -706 63 39 550 974 345 -598 -571 156 600 713 84 -174 -842 -869 99
2499 99 286 531 -28 -852 -516 -288 90 862 470 76 -650 -282 472 561 799 387 -641 -684 25 337 82
2520 82 460 34 -1046 -1009 82 549 122 63 -323 -418 -204 358 969 615 197 -340 -377 -60 497 353 -99
2541 -99 -313 -530 -511 -34 57 496 -45 -1000 -463 150 250 524 325 -146 -471 -456 50 678 629 175 -604 -651
2563 -651 -406 29 403 423 -520 -1038 -477 -225 214 705 383 -539 -376 372 711 740 825 40 -664 -622 362
2584 362 306 456 92 -666 -814 -259 220 496 16 -446 -700 -619 342 1046 657 261 103 -257 -391 681
2604F81J85r30k61J16k22K21N86j23n43j10k41K19O40O22p65m03K99j35J93K83
2624C12M36j36q95j19M81j75M44Q3m85o98J34K54L66L75R1l90k45k81N18O01J25
2645G96j10r38oM71J65K50P5j016o06K03P85N65l75j01n97o77R26J021m92J24
2665D63m07l86J89J43Q20k08o31O0r76L24J043L17q24pn56R8K19Q30k34n05k21
2686d49J27L8N66O09p89j82Pj32J8M38L22n37q02L23K03J46K18P8k92k79j8M84
2708I7K28J32j32m61l17Q8Q37r1l1jm55p54O13L93J48Q6n05o73J99Q02M02k65
2730C40j55k69k88M22M04K47l89l41l47j57O15M57l85p7o33k68L70Q13L9m48j1
2751f1m99j99O81P73r6m13l55j52J78N11R1k54n24k09n9K92M87K81o23m24L01
$$ plain form
2604 681 866 -64 -325 -209 -431 -210 376 253 -290 -400 -641 -422 218 840 75 -328 -29 -164 29 312
2624 312 748 612 -283 -402 79 -96 348 431 -54 -752 -618 -364 2 377 468 78 -167 -448 70 671 796
2645 796 686 -252 -258 213 378 628 703 -313 -919 -716 69 634 259 158 -439 -1116 -190 831 339 463
2665 463 56 -330 -141 2 822 614 -17 43 -933 -609 434 751 -73 -80 -636 -538 -319 511 277 -228 -449
2686 -449 -322 -284 282 891 102 -80 -73 -205 -187 251 573 36 -766 -443 -240 -94 124 202 -90 -369 -387 97
2708 97 325 457 325 -136 -453 -365 472 381 350 349 -106 -860 -247 146 294 380 -125 -798 -599 203 605 340
2730 340 185 -84 -372 50 454 701 312 -29 -376 -533 82 539 154 77 -556 -824 -454 359 398 -50 -61
2751 -61 -560 -759 -78 695 599 186 -169 -321 -143 368 459 205 -319 -528 -587 -295 192 473 -150 -574 -273
$$ [...]
8191A28
##END NTUPLES=NMR FID
##END=
