##TITLE=1H_SAV32-singlet-bat35
 CDCl3
 8 sc, 
 20.11.2023
##JCAMPDX= 6.0         $$ Bruker NMR JCAMP-DX V2.0
##DATA TYPE= NMR FID
##DATA CLASS= NTUPLES
##ORIGIN= UXNMR, Bruker Analytische Messtechnik GmbH
##OWNER= root
$$ XWIN-NMR		Version 3.5
$$ Mon Nov 20 13:56:51 2023 Russian Standard Time (UT+4h)  she@DPX200
##.OBSERVE FREQUENCY= 200.1313
##.OBSERVE NUCLEUS= ^1H
##.DELAY= (6, 6)
##.ACQUISITION MODE= SIMULTANEOUS
##.ACQUISITION SCHEME= undefined
##.AVERAGES= 8
##.DIGITISER RES= 18
##SPECTROMETER/DATA SYSTEM= spect
##.PULSE SEQUENCE= zg30
##.SOLVENT NAME= D2O
##.SHIFT REFERENCE= (INTERNAL, D2O, 0, 15.7039)
##AUDIT TRAIL= $$ (NUMBER, WHEN, WHO, WHERE, WHAT)
$$ ##TITLE= Audit trail, XWIN-NMR		Version 3.5
$$ ##JCAMPDX= 5.01
$$ ##ORIGIN= Bruker BioSpin GmbH
$$ ##OWNER= she
$$ F:/spectra/data/she/nmr/H-F/1/audita.txt
$$ ##AUDIT TRAIL=  $$ (NUMBER, WHEN, WHO, WHERE, WHAT)
(   1,<2023-11-20 13:55:33.10 +0400>,<she>,<DPX200>,
      <created by zg, POWCHK disabled, PULCHK disabled
       configuration hash MD5:
       00 E9 B6 7A A2 85 ED C7 34 08 36 98 17 FE 4E 26
       data hash MD5: 16K
       15 90 33 2C 4B 0E 4D A9 7D 5D 21 F1 84 6D 16 02>)
$$ ##END=
$$ 
$$ hash MD5
$$ 89 F0 2B EF E2 EA 68 8C B7 4B 91 4E AF AE 94 70
##$RELAX= 
##$RELAX= 
##$RELAX= 
##$RELAX= 
##$RELAX= 
##$RELAX= 
$$ Bruker specific parameters
$$ --------------------------
##$DU= <F:/spectra>
##$EXPNO= 1
##$NAME= <H-F>
##$PROCNO= 1
##$TYPE= <nmr>
##$USER= <she>
##$AMP= (0..31)
100 100 100 100 100 100 100 100 100 100 100 100 100 100 100 100 100 100 
100 100 100 100 100 100 100 100 100 100 100 100 100 100 
##$AQSEQ= 0
##$AQ_mod= 1
##$AUNM= <au_zg>
##$AUTOPOS= <>
##$BF1= 200.13
##$BF2= 200.13
##$BF3= 200.13
##$BF4= 200.13
##$BF5= 200.13
##$BF6= 200.13
##$BF7= 200.13
##$BF8= 200.13
##$BYTORDA= 1
##$CFDGTYP= 0
##$CFRGTYP= 5
##$CHEMSTR= <none>
##$CNST= (0..31)
1 1 145 1 1 1 1 1 1 1 1 1 1 1 1 1 1 1 1 1 1 1 1 1 1 1 1 1 1 1 1 1 
##$CPDPRG= <>
##$CPDPRG1= <>
##$CPDPRG2= <>
##$CPDPRG3= <>
##$CPDPRG4= <mlev>
##$CPDPRG5= <mlev>
##$CPDPRG6= <mlev>
##$CPDPRG7= <mlev>
##$CPDPRG8= <mlev>
##$CPDPRGB= <>
##$CPDPRGT= <>
##$D= (0..31)
0 1.2 0 0 0 0 0 0 0 0.06 0 0.03 0 0 0 0 0.0002 0 0 0 0 0 0 0 0 0 0 0 0 
0 0 0 
##$DATE= 1700474132
##$DBL= (0..7)
120 120 120 120 120 120 120 120 
##$DBP= (0..7)
150 150 150 150 150 150 150 150 
##$DBP07= 0
##$DBPNAM0= <>
##$DBPNAM1= <>
##$DBPNAM2= <>
##$DBPNAM3= <>
##$DBPNAM4= <>
##$DBPNAM5= <>
##$DBPNAM6= <>
##$DBPNAM7= <>
##$DBPOAL= (0..7)
0.5 0.5 0.5 0.5 0.5 0.5 0.5 0.5 
##$DBPOFFS= (0..7)
0 0 0 0 0 0 0 0 
##$DE= 6
##$DECBNUC= <off>
##$DECIM= 32
##$DECNUC= <off>
##$DECSTAT= 4
##$DIGMOD= 1
##$DIGTYP= 9
##$DL= (0..7)
0 120 120 120 120 120 120 120 
##$DP= (0..7)
150 150 150 150 150 150 150 150 
##$DP07= 0
##$DPNAME0= <>
##$DPNAME1= <>
##$DPNAME2= <>
##$DPNAME3= <>
##$DPNAME4= <>
##$DPNAME5= <>
##$DPNAME6= <>
##$DPNAME7= <>
##$DPOAL= (0..7)
0.5 0.5 0.5 0.5 0.5 0.5 0.5 0.5 
##$DPOFFS= (0..7)
0 0 0 0 0 0 0 0 
##$DQDMODE= 0
##$DR= 18
##$DS= 0
##$DSLIST= <SSSSSSSSSSSSSSS>
$$ [...]
##$SUBNAM2= <"">
##$SUBNAM3= <"">
##$SUBNAM4= <"">
##$SUBNAM5= <"">
##$SUBNAM6= <"">
##$SUBNAM7= <"">
##$SUBNAM8= <"">
##$SUBNAM9= <"">
##$SW= 18.0517328524113
##$SWIBOX= (0..15)
0 0 2 0 0 0 0 0 0 0 0 0 0 0 0 0 
##$SW_h= 3612.71676300578
##$TD= 16384
##$TD0= 1
##$TE= 0
##$TE2= 300
##$TE3= 300
##$TEG= 300
##$TL= (0..7)
0 120 120 120 120 120 120 120 
##$TP= (0..7)
150 150 150 150 150 150 150 150 
##$TP07= 0
##$TPNAME0= <>
##$TPNAME1= <>
##$TPNAME2= <>
##$TPNAME3= <>
##$TPNAME4= <>
##$TPNAME5= <>
##$TPNAME6= <>
##$TPNAME7= <>
##$TPOAL= (0..7)
0.5 0.5 0.5 0.5 0.5 0.5 0.5 0.5 
##$TPOFFS= (0..7)
0 0 0 0 0 0 0 0 
##$TUNHIN= 0
##$TUNHOUT= 0
##$TUNXOUT= 0
##$USERA1= <user>
##$USERA2= <user>
##$USERA3= <user>
##$USERA4= <user>
##$USERA5= <user>
##$V9= 5
##$VALIST= <valist>
##$VCLIST= <CCCCCCCCCCCCCCC>
##$VD= 0
##$VDLIST= <DDDDDDDDDDDDDDD>
##$VPLIST= <PPPPPPPPPPPPPPP>
##$VTLIST= <TTTTTTTTTTTTTTT>
##$WBST= 1024
##$WBSW= 4
##$XGAIN= (0..3)
0 0 0 0 
##$XL= 0
##$YL= 0
##$YMAX_a= 457727
##$YMIN_a= -544887
##$ZGOPTNS= <>
##$ZL1= 120
##$ZL2= 120
##$ZL3= 120
##$ZL4= 120
##$ABSF1= 10
##$ABSF2= 0
##$ABSG= 5
##$ABSL= 3
##$ALPHA= 0
##$AQORDER= 0
##$ASSFAC= 0
##$ASSFACI= 0
##$ASSFACX= 0
##$ASSWID= 0
##$AUNMP= <proc_1d>
##$AZFE= 0.1
##$AZFW= 0.1
##$BCFW= 1
##$BC_mod= 2
##$BYTORDP= 1
##$COROFFS= 0
##$CY= 11.3945322036743
##$DATMOD= 1
##$DC= 2
##$DFILT= <>
##$DTYPP= 0
##$F1P= 15.7292609196834
##$F2P= 12.9074282941183
##$FCOR= 0.5
##$FTSIZE= 0
##$FT_mod= 4
##$GAMMA= 1
##$GB= 0.15
##$INTBC= 1
##$INTSCL= 1
##$ISEN= 128
##$LB= 0.24
##$LEV0= 0
##$LPBIN= 0
##$MAXI= 10000
##$MC2= 0
##$MEAN= 0
##$ME_mod= 0
##$MI= 1.114404
##$NCOEF= 0
##$NC_proc= 0
##$NLEV= 6
##$NOISF1= 3.799351
##$NOISF2= 2.8
##$NSP= 1
##$NTH_PI= 0
##$NZP= 0
##$OFFSET= 15.70392
##$PC= 1
##$PHC0= -23873.99
##$PHC1= 17.45269
##$PH_mod= 1
##$PKNL= yes
##$PPARMOD= 0
##$PSCAL= 0
##$PSIGN= 0
##$REVERSE= no
##$SF= 200.130013532006
##$SI= 16384
##$SIGF1= 3
##$SIGF2= 2
##$SINO= 400
##$SIOLD= 16384
##$SREGLST= <1H.CDCl3>
##$SSB= 0
##$STSI= 0
##$STSR= 0
##$SW_p= 3612.71676300578
##$SYMM= 0
##$S_DEV= 0
##$TDeff= 0
##$TDoff= 0
##$TI= <>
##$TILT= no
##$TM1= 0
##$TM2= 0
##$TOPLEV= 0
##$USERP1= <user>
##$USERP2= <user>
##$USERP3= <user>
##$USERP4= <user>
##$USERP5= <user>
##$WDW= 1
##$XDIM= 8192
##$YMAX_p= 0
##$YMIN_p= 0
$$ End of Bruker specific parameters
$$ ---------------------------------
##NTUPLES= NMR FID
##VAR_NAME=  TIME,          FID/REAL,        FID/IMAG
##SYMBOL=    X,             R,               I
##VAR_TYPE=  INDEPENDENT,   DEPENDENT,       DEPENDENT
##VAR_FORM=  AFFN,          ASDF,            ASDF
##VAR_DIM=   8192,          8192,            8192
##UNITS=     SECONDS,       ARBITRARY UNITS, ARBITRARY UNITS
##FACTOR=    0.0002768,     1,               1
##FIRST=     0,             0,               0
##LAST=      2.2672688,     0,               0
##MIN=       0,             -544887,         0
##MAX=       2.2672688,     457727,          0
$$ Real data points
##PAGE= N=1
##DATA TABLE= (X++(R..R)), XYDATA
$$ plain form
0 0 0 0 0 0 0 0 0 0 0 0 0 0 0 0 8 -8 8 -8 8 -16 16 -16 24 -24 30 -32 40 -44 51 -57 65 -76 84 -92 106 -116
36 -116 131 -146 162 -181 200 -222 245 -269 297 -328 359 -397 436 -481 529 -584 646 -714 791
55 791 -882 983 -1107 1252 -1429 1650 -1933 2309 -2828 3592 -4804 6957 -11520 24907 -139499
70 -139499 -544887 71577 307937 -205512 -133966 240779 -56613 -259523 127035 192872
80 192872 -117022 -41835 107757 -70599 -73360 136734 41059 -125653 2812 82387 -47837
91 -47837 -47019 75712 46926 -52942 -21129 42216 2904 -28682 24709 20312 -57816 -27605 64901
104 64901 14830 -70992 -10131 35642 -19662 21031 73937 -53393 -99120 71153 96889 -42173
116 -42173 -30445 14042 -55849 -2507 118362 18293 -101131 -10939 36755 -19305 38248
$$ packed form
0@%%%%%%%%%%%%%%Qj6J6j6J6k4L2l2M0m8N4o2P2q4R5j08J22j41J60j76J98k22
36a16K47k77L08l43L81m22M67n14N66o25O87p56Q33r17J010j113J230j360J505
55G91j673J865k090K359k681L079l583M242n137O420q396J1761j8477L6427j64406
70a39499m05388O16464K36360n13449P1546L74745k97392k02910L86558O5837
80A92872l09894P5187J49592j78356k761K10094r5675j66712J28465P9575j30224
91d7837Q18J22731k8786r9868L1813O3345l9312l1586N3391m397p8128L0211R2506
104F4901n0071q5822O0861M5773n5304M0693N2906j27330m5727J70273K5736j39062
116d2173J1728M4487o9891N3342J20869j00069j19424R0192M7694n6060N7553
$$ plain form
127 38248 57754 -81837 -68891 78735 21938 -71335 30260 50002 -66604 -16784 75947
138 75947 -15251 -44853 74361 40663 -79283 -3994 74569 -22500 -33931 60367 -6504 -91916
150 -91916 18574 77370 -40499 -60543 39761 19577 -48377 4645 33664 -32421 -8383
161 -8383 70770 8285 -69853 4288 63385 5634 -9276 23649 -28900 -64953 35324 84553
173 84553 -27650 -77961 6366 23415 -17576 23666 36376 -51193 -51328 46272 32218 -42859
185 -42859 830 44026 -22060 -22449 52772 12547 -46704 25297 49049 -44720 -43754 33009 6653
198 6653 -31954 12735 6162 -43146 4093 46399 -18828 -31115 33667 12422 -29180 13142
210 13142 12738 -38575 4877 58480 -7063 -55083 1394 28522 6743 23263 12068 -53383
$$ packed form
127C8248J9506j39591J2946J47626n6797r3273J01595J9742j16606M9820R2731
138G5947r1198k9602J19214l3698j19946P5289P8563r7069j1431R4298o6871q5412
150i1916J10490N8796j17869k0044J00304k0184o7954N3022K9019o6085K4038
161h383P9153o2485p8138P4141N9097n7751j4910L2925n2549l6053J00277M9229
173H4553j12203n0311Q4327J7049m0991M1242J2710q7569j35R7600j4054p5077
185d2859M3689M3196o6086l89P5221m0225n9251P2001K3752r3769R66P6763k6356
198F653l8607M4689o573m9308M7239M2306o5227j2287O4782k1245m1602M2322
210A3142m04n1313M3452N3603o5543m8020N6477K7128k1779J6520j1195o5451
$$ plain form
222 -53383 -36164 45704 33738 -25193 -18125 -9265 -28703 4356 48286 6400 -45734 -9074
234 -9074 30745 -1101 -13627 21017 7879 -26333 918 16947 -23300 -14715 38867 10499
246 10499 -46899 -7633 33885 -9556 -10981 37326 -5730 -52100 19628 51257 -27139 -32385
258 -32385 31780 6238 -31613 16140 16432 -43548 -3472 60545 -6223 -60065 5270 27720
270 27720 -15105 11108 30810 -40290 -50144 41061 51741 -21067 -22137 11539 -12965 -10632 38276
283 38276 13919 -40663 -8054 28949 -9164 -19283 22303 11760 -25935 -1012 17862 -22535
295 -22535 -17455 39962 22077 -33348 -11500 23075 4207 4119 20686 -12940 -32964 12166 23079
308 23079 -22981 -17961 17829 -4775 -18048 19476 8948 -30644 5779 45203 -602 -34207
$$ packed form
222e3383J7219Q1868j1966n8931P068Q860j9438L3059M3930m1886n2134L6660
234i074L9819l1846j2526L4644j3138l4212K7251J6029m0247Q585N3582k8368
246A0499n7398L9266M1518m3441j425M8307m3056m6370P1728L1629p8396n246
258c2385O4165k5542l7851M7753K92n9980M0076O4017o6768n3842O5335K2450
270B7720m2825K6213J9702p1100r854R1205J0680p2808j070L3676k4504K333M8908
283C8276k4357n4582L2609L7003l8113j0119M1586j0543l7695K4923J8874m0397
295b2535N080N7417j7885n5425K1848L4575j8868q8J6567l3626k0024M5130J0913
308B3079m6060N020L5790k2604j3273L7524j0528l9592L6423L9424m5805l3605
$$ plain form
320 -34207 -2791 10867 3811 23781 13950 -38306 -24869 37260 27137 -12846 1271 2671 -26851
333 -26851 -3204 35606 -353 -37251 -2589 17750 -13835 -11343 20073 7421 -6032 15537
345 15537 4145 -25029 6728 38714 -1016 -29997 -1460 5648 -12419 10304 24842 -19295
357 -19295 -29130 20144 21525 -15133 -3879 11302 -9636 -1203 20693 -11243 -31037 18713 35865
370 35865 -15075 -24487 10868 1390 -7381 30393 18648 -40387 -26712 27721 17444 -11793 -791
383 -791 -4449 -23868 5399 32493 -5728 -23283 17152 15158 -24242 -6042 22408 -4939 -15260
396 -15260 14346 872 -33362 -1573 36862 5305 -21869 -33 910 -7816 21119 22097 -24325
409 -24325 -20312 23619 12010 -18675 1117 12440 -14705 -7706 17145 -10623 -31284 10879
$$ packed form
320c4207L1416J3658p056J9970r831n2256J3437O2129j0123l9983J4117J400k9522
333b6851K3647L8810l5959l6898L4662K0339l1585K492L1416j2652j3453K1569
345A5537j1392k9174L1757L1986l9730k8981K8537P108j8067K2723J4538m4137
357a9295r835M9274J381l6658J1254J5181k0938Q433K1896l1936j9794M9750J7152
370C5865n0940r412L5355r478q771L7774j1745n9035J3675N4433j0277k9237J1002
383g91l658j9419K9267K7094l8221j7555M0435j994l9400J8200K8450k7347j0321
396a5260K9606j3474l4234L1789L8435l1557k7174K1836R43q726K8935R78m6422
409b4325M013M3931j1609l0685J9792J1323k7145O999K4851k7768k0661M2163
$$ plain form
421 10879 27245 -9854 -17400 -555 -6948 3405 32099 8716 -36001 -13272 27537 9929
433 9929 -7137 10296 -3457 -26932 5447 27682 -9558 -21092 11530 5042 -22169 -3950
445 -3950 12320 -9468 -3499 20204 -10022 -32430 15555 37576 -4492 -12841 10474 -4409 -11864
458 -11864 22228 17897 -28920 -22277 16537 3645 -16860 1208 -513 -16964 6093 19300 -17650
471 -17650 -24902 18208 24664 -7956 -8172 5341 -8017 -824 31610 14877 -26589 -11681 17068
484 17068 4766 -1691 7906 -10308 -24394 5152 13578 -20063 -14051 20912 2464 -24258 2737
497 2737 14883 -5615 10492 25922 -13852 -28363 14204 24608 -2848 -1111 755 -24080 -7730
510 -7730 32916 8627 -30355 -5603 13915 -9879 -6351 14675 -3516 -15628 11588 14131 -16021
$$ packed form
421A0879J6366l7099p546J6845o393J0353K8694k3383m4717K2729M0809j7608
433I929j7066J7433j3753k3475L2379K2235l7240j1534L2622o488k7211J8219
445c950J6270k1788N969K3703l0226k2408M7985K2021m2068q349K3315j4883p455
458a1864L4092m331m6817O643L8814j2892k0505J8068j721j6451K3057J3207l6950
471a7650p252M3110O456l2620k16J3513j3358P193L2434j6733m1466J4908K8749
484A7068j2302o457R597j8214j4086K9546Q426l3641O012L4963j8448k6722K6995
497B737J2146k0498J6107J5430l9774j4511M2567J0404k7456J737J866k4835J6350
510g730M0646k4289l8982K4752J9518k3794L528K1026j8191j2112K7216K543l0152
$$ plain form
523 -16021 -7616 21125 11389 -4530 4130 -4186 -16740 12445 30297 -8297 -31873 -821 14215
536 14215 -5639 -2731 9372 -11779 -17155 15907 14787 -16696 -4388 19488 -219 -8877 10702
549 10702 603 -14812 14964 25093 -19381 -27187 13931 13871 -9097 4363 4341 -21660 -4002
562 -4002 26040 3396 -16182 6430 10575 -9382 339 10497 -12531 -9143 22539 5196 -30335
575 -30335 -10279 20201 9501 -1411 1748 -12184 -15973 14045 25414 -2863 -15898 -3263
587 -3263 -2467 1673 18492 7318 -18476 -5978 14779 -206 -11830 6392 9525 -9092 -7971
600 -7971 215 -8452 -2542 19501 6942 -20953 -8901 14303 9621 6567 10457 -8282 -22098
613 -22098 4978 24160 -3383 -21190 -2184 4450 -6170 1364 4839 -11255 -5497 17092 5815
$$ packed form
523a6021Q405K8741r736j5919Q660q316j2554K9185J7852l8594k3576L1052J5036
536A4215j9854K908J2103k1151n376L3062j120l1483J2308K3876j9707q658J9579
549A0702j0099j5415K9776J0129m4474p806M1118o0k2968J3460k2k6001J7658
562d002L0042k2644j9578K2612M145j9957R721J0158k3028L388L1682j7343l5531
575c0335K0056L0480j0700j0912L159j3932l789L0018J1369k8277j3035J2635
587c263P96M140J6819j1174k5794J2498K0757j4985j1624J8222L133j8617J121
600g971Q186q667N910K2043j2559k7895J2052K3204m682l054L890j8739j3816
613b2098K7076J9182k7543j7807J9006O634j0620P534L475j6094N758K2589j1277
$$ plain form
626 5815 -16985 -5183 11487 2535 1722 9179 -9182 -18234 13524 24169 -6064 -13313 3468
639 3468 -80 -5198 6107 2010 -13414 -3363 7949 -7970 -13408 4911 8096 -245 2618 -3136
653 -3136 -13238 2650 22479 9897 -12048 -13030 -1613 8797 12241 4042 -11204 -13619 697
666 697 8812 2924 -3762 -3810 -3150 -2017 1401 1156 -3766 323 11738 3164 -15041 -5933 12643 9166
682 9166 1746 -388 -10856 -10535 11548 16097 -6483 -13103 -2409 -3947 -1796 10924 -239 -16386
696 -16386 1009 14079 -4482 -8753 7847 8119 1280 4867 -1940 -13208 2239 18117 2548
709 2548 -13203 -6561 -3085 -2478 10105 9346 -11462 -14007 6439 12841 -427 -4824 3022 2577 -990
724 -990 2338 -1127 -7276 3120 13963 -518 -15300 -5350 6629 4107 5214 3492 -14440 -16537
$$ packed form
626E815k2800J1802J6670q952q13P457j8361r052L1758J0645l0233p249J6781
639C468l548n118J1305m097j5424J0051J1312j5919n438J8319L185q341K863n754
653c136j0102J5888J9829j2582k1945r82J1417J0410L444q199j5246k415J4316
666F97Q115n888o686m8O60J133L418k45m922M089J1415q574j8205R108J8576l477
682I166p420k134j0468L21K2083M549k2580o620J0694j538K151J2720j1163j6147
696a6386J7395J3070j8561m271J6600K72o839L587o807j1268J5447J5878j5569
709B548j5751O642L476O07J2583p59k0808k545K0446O402j3268m397P846m45l567
724i90L328l465o149J0396J0843j4481j4782R950J1979k522J107j722j7932k097
$$ plain form
738 -16537 10981 17479 -5805 -9242 3179 -104 902 12739 5100 -8195 3118 10663 -6711
751 -6711 -10372 5788 4005 -5358 1557 -2637 -17825 -2462 20954 8223 -12464 -7278 2379 2519
765 2519 9469 10050 -8556 -13704 6147 10617 -4132 -2253 5103 -2752 -3622 6527 -200 -11062
779 -11062 1418 14978 -1204 -16142 -5068 5558 4504 7221 3521 -11539 -7509 12353 12890
792 12890 -554 -3060 -430 -3758 431 7845 -1911 -11360 986 7532 -6894 -10646 1610 5568
806 5568 3369 2359 -6370 -11889 2486 15940 5778 -6896 -3272 -2315 -1404 11962 11602 -10021
820 -10021 -12696 5978 7000 -5090 -2827 818 -3801 -354 4148 -7106 -9958 9844 12217 -6666
834 -6666 -8110 1025 -2248 2161 14882 4060 -16595 -8175 12044 8071 -3583 -1534 -3347 -6526
$$ packed form
738a6537K7518O498k3284l437J2421l283J006J1837p639j3295J1313P545j7374
751f711l661J6160j783r363O915m194j5188J5363K3416j2731k0687N186R657J40
765B519O950N81j8606n148J9851M470j4749J879P356p855q70J0149o727j0862
779a1062J2480J3560j6182j4938J1074J0626j054K717l700j5060M030J9862N37
792A2890j3444k506K630l328M189P414r756r449J2346O546j4426l752J2256L958
806E568k199j010q729n519J4375J3454j0162j2674L624R57R11J3366l60k1623
820a0021k675J8674J022j2090K263L645m619L447M502j1254k852J9802K373j8883
834f666j444R135l273M409J2721j0822k0655Q420K0219l973j1654K049j813l179
$$ plain form
848 -6526 2011 5061 -6676 -6981 6145 4861 -7010 -4702 4144 3890 3945 6787 -3270 -13636 -675
863 -675 14672 5753 -7287 -7236 -5351 -958 9264 7881 -8481 -9159 6498 5581 -5552 -862 4393
878 4393 -2981 -1373 4923 -4903 -9648 5996 12316 -1662 -9083 -3853 -1307 4008 11142 -279
892 -279 -15107 -5548 7979 3568 -393 2036 -2641 -3791 5347 6189 -3057 -3141 5619 3993 -4268 -5469
908 -5469 -4076 -267 7684 4424 -11775 -12555 3581 10046 3194 -681 -2742 -7529 -969 12725 6993
923 6993 -8917 -3738 6206 964 -2413 2834 -755 -3623 6087 3963 -13357 -9623 11200 7887
937 7887 -8097 -4328 -528 -7747 3082 18025 2815 -14431 -2267 10696 4041 1300 4575
950 4575 -3688 -6555 6024 4436 -10503 -4363 9363 492 -10825 -4086 723 -1731 4588 8480
$$ packed form
848f526Q537L050j1737l05J3126j284j1871K308Q846k54N5K842j0057j0366J2961
863f75J5347q919j3040N1J885M393J0222j383j6362o78J5657r17j1133M690N255
878D393p374J608O296r826m745J5644O320j3978p421N230K546N315P134j1421
892b79j4828R559J3527m411l961K429m677j150R138Q42r246q4Q760j626q261j201
908e469J393L809P951l260j6199p80J6136O465o852l875k061m787O560J3694n732
923F993j5910N179R944n242l377N247l589k868R710k124j7320L734K0823l313
937G887j5984L769L800p219J0829J4943j5210j7246J2164J2963o655k741L275
950D575q263k867J2579j588j4939O140J3726q871j1317O739M809k454O319L892
$$ plain form
964 8480 -5177 -13133 2793 14100 6283 -699 -2427 -5349 1042 11125 4403 -8213 -4387 3442
978 3442 -212 -3916 -89 -1410 -3528 3977 3158 -8858 -6764 5791 7392 2180 -1514 -6597 -3972
993 -3972 9533 12081 -1941 -7729 850 2272 -907 2071 156 -6921 -2979 3896 -2515 -7125 615
1008 615 5974 2963 356 -2236 -6658 1385 14940 7749 -10739 -9370 2719 4078 3926 5046 -4872
1023 -4872 -11676 353 9900 1230 -5518 462 -65 -4989 880 2427 -5116 113 9547 -1474 -12065
1038 -12065 -464 10594 5110 -798 -898 -6448 -6135 7435 10188 -3990 -9606 -2992 1267 3664
1052 3664 4388 -1790 -6574 569 6915 859 -6270 -793 5037 2032 -1694 -3306 -4766 -759 6349
1067 6349 4245 -4772 -7500 -1947 3425 4907 1626 -5255 -6382 3071 5774 -1562 -2669 2295 2441
$$ packed form
964H480j3657p956J5926J1307p817o982j728k922O391J0083o722j2616L826P829
978C442l654l704L827j321k118P505q19j2016K094J2555J601n212l694n083K625
993c972J3505K548j4022n788Q579J422l179K978j915p077L942O875o411m610P740
1008F15N359l011k607k592m422Q043J3555p191j8488J369J2089J359j52J120r918
1023d872o804J2029R547q670o748N980n27m924N869J547p543N229R434j1021j0591
1038a2065J1601J1058n484n908j00n550L13J3570K753j4178n616O614M259K397
1052C664P24o178m784P143O346o056p129N477N830l005l726j612j460M007P108
1067F349k104r017k728N553N372J482l281o881j127R453K703p336j107M964J46
$$ plain form
1082 2441 733 171 -3687 -2934 4776 6465 -2151 -8015 -5048 -125 5588 7784 -2746 -12780 -4461
1097 -4461 8018 7703 990 -3109 -3920 -960 3768 4416 454 -1558 246 122 -2524 -2473 68 2373
1113 2373 1764 -1790 -6820 -6420 1915 9806 4807 -7412 -7893 1524 7004 7119 3047 -4591 -5581 2090
1129 2090 6479 1196 -3189 -2196 -1075 142 1551 -2015 -5397 1227 6419 -745 -7273 -4192 3005
1144 3005 5548 2522 -1047 -3473 -2209 3993 7566 1614 -4658 -2541 1514 1614 -515 -2179 -3026
1159 -3026 -136 3776 -418 -7951 -2298 8006 6136 -1275 -3458 -3740 28 7967 8338 -2480 -8840
1174 -8840 -3037 3646 4650 2744 -2426 -6937 -1511 4392 986 -3144 -294 2192 -203 -2668 -2612
1189 -2612 312 3825 5197 1214 -5876 -5057 2815 7670 4967 -2517 -8185 -4859 4632 7164 -233
$$ packed form
1082B441j708n62l858P53P710J689q616n864K967M923N713K196j0530j0034Q319
1097d461J2479l15o713m099q11K960M728O48l962k012J804j24k646N1K541K305
1113B373o09l554n030M00Q335P891m999j2219m81R417N480J15m072p638r90P671
1129B090M389n283m385R93J121J217J409l566l382O624N192p164o528L081P197
1144C005K543l026l569k426J264O202L573n952o272K117M055J00k129j664q47
1159c026K890L912m194p533N653J0304j870p411k183k82L768P939L71j0818o360
1174h840N803O683J004j906n170m511N426N903l406m130K850K486k395k465N6
1189b612K924L513J372l983p090Q19P872M855k703p484n668L326R491K532p397
$$ plain form
1204 -233 -5963 -3308 1198 1655 2034 636 -2279 827 4489 -946 -4224 496 3685 2468 1591 -3070
1220 -3070 -8046 -1314 9028 4826 -6672 -6219 -395 691 2951 3688 -3176 -5093 2017 4288 -465
1235 -465 -998 2063 1655 1193 1309 -3095 -5295 3413 8824 -535 -8116 -4731 943 3721 4261 -489
1251 -489 -7720 -5836 3912 6392 -119 -2130 -135 -615 1839 4685 -501 -3028 3319 4650 -4288
1266 -4288 -7452 -305 3502 1529 166 -3884 -8063 -1365 8462 5021 -3050 -3918 -1797 1047 5740
1281 5740 5331 -3072 -5090 2493 4712 -1538 -2578 1489 1512 -140 -772 -4429 -4938 2099 5146 -1148
1297 -1148 -6253 -4611 -497 4525 7312 1533 -6643 -2681 6199 5050 504 -626 -1561 -1549 1329 762
1313 762 -3569 -2285 3294 1459 -3881 -3497 -552 688 5011 4773 -4446 -8173 1070 7815 4307 -1525
$$ packed form
1204b33n730K655M506M57L79j398k915L106L662n435l278M720L189j217q77m661
1220c070m976O732J0342m202j1498M53N824J086K260P37o864j917P110K271m753
1235d65n33L061m08m62J16m404k200Q708N411r359p581L385N674K778N40m750
1251d89p231J884R748K480o511k011J995m80K454K846n186k527O347J331q938
1266d288l164P147L807j973j363m050m179O698R827l441q071q68K121K844M693
1281E740m09q403k018P583K219o250j040M067K3j652o32l657n09P037L047o294
1297a148n105J642M114N022K787n779q176L962Q880j149m546j130r35J2K878n67
1313G62m331J284N579j835n340L84K945J240M323k38r219l727R243O745l508n832
$$ plain form
1329 -1525 -3536 -2639 627 4602 2622 -3542 -3200 1719 765 -2083 -1159 -63 162 1521 738 -3978
1345 -3978 -4835 4141 8847 1121 -5844 -3284 365 3410 5762 720 -6780 -4247 3107 2798 -590
1360 -590 -456 -1068 -2369 1471 2203 -3372 -2081 4983 3357 -2553 -3299 -1248 1885 6088 3384 -5027
1376 -5027 -7052 437 4787 2760 -231 -3526 -5234 -262 5278 1629 -3218 -1374 1868 1679 -532
1391 -532 -1036 221 2901 3537 -756 -5264 -2801 3972 4526 295 -3375 -5230 -2753 3390 6016 -218
1407 -218 -6851 -2855 2942 2522 1234 908 -1088 67 3752 816 -3855 156 5045 1207 -3735 -2731
1423 -2731 -2524 -1599 4989 5038 -5834 -8424 709 5233 2610 894 -1916 -3773 1149 5996 1830 -2616
1439 -2616 928 2699 -347 -1240 -398 -1297 461 3179 -377 -6591 -5273 2041 5315 1481 -3561 -5339
$$ packed form
1329a525k011Q97L266L975j980o164L42M919r54k848R24J096K25J359p83m716
1345c978q57Q976M706p726o965K560L649L045K352n042p500K533P354l09l388
1360e90J34o12j301L840P32n575J291P064j626n910p46K051L133M203k704q411
1376e027k025P489M350k027k991l295j708M972N540l649m847J844L242j89k211
1391e32n04J257K680O36m293m508K463O773N54m231l670j855K477O143K626o234
1407b18o633L996N797m20j288l26j996J155L685k936m671M011M889l838m942J004
1423b731K07R25O588M9j0872k590R133M524k623j716k810j857M922M847m166m446
1439b616L544J771l046q93Q42q99J758K718l556o214J318P314L274l834n042j778
$$ plain form
1455 -5339 -1782 5131 6329 175 -3168 -479 1466 1845 2201 261 -2106 -451 1558 -1295 -3960
1470 -3960 -741 3106 1655 -1594 -3835 -4346 1752 7133 2803 -4710 -4406 372 3751 4203 2058 -2981
1486 -2981 -4413 1116 3874 130 -2208 -1066 -143 -69 -793 -2946 -2161 2227 3736 -910 -4968 -2168
1502 -2168 2810 4139 2760 -590 -4307 -1640 4428 4414 -524 -2915 -2079 -326 1450 504 -2339 -2446
1518 -2446 2106 1917 -3091 -3777 965 3591 3460 1139 -3635 -4465 1462 6197 3462 -2715 -5235 -3091
1534 -3091 1935 4639 1087 -3745 -3177 286 1104 310 -290 215 1046 604 -1769 -1504 948 3293 3416
1551 3416 -172 -4412 -4298 1829 6259 2564 -4496 -5991 -1836 2755 3564 31 -4021 -3589 867 3197
1567 3197 1389 -931 -145 994 831 390 -957 -1796 1287 3751 -42 -4657 -3843 1283 3863 1499
$$ packed form
1455e339L557O913J198o154l343K689J945L79L56j940k367J655K009k853k665
1470c960L219L847j451l249k241n11O098N381m330p513L04M778L379M52k145n039
1486b981j432N529K758l744k338J142R23P4p24k153P85M388J509m646m058K800
1502b168M978J329j379l350l717K667O068j4m938k391Q36J753J776r46k843j07
1518b446M552j89n008o86M742K626j31k321m774q30N927M735k735o177k520K144
1534c091N026K704l552m832N68L463Q18p94o00N05Q31m42k373K65K452K345J23
1551C416l588m240J14O127M430l695p060j495M155M591Q09l533m052M32M456K330
1567C197j808k320P86J139j63m41j347q39L083K464l793m615Q14N126K580k364
$$ plain form
1583 1499 -2208 -4039 -1716 3028 2808 -476 -1653 -343 742 1908 983 -1811 -709 2928 2696 -1919
1599 -1919 -4403 -1599 2604 3597 495 -5157 -5595 418 4291 2729 -1005 -3593 -3101 1715 4805 2439
1615 2439 -1690 -1603 783 735 -201 208 187 1115 1443 -2215 -4545 -685 4409 2831 -1878 -4450 -3167
1632 -3167 322 5098 4890 -2564 -5805 -358 3537 3069 1879 -1534 -4000 -19 3421 222 -3106
1647 -3106 51 1756 -1223 -1575 -660 -1593 85 4141 1187 -4781 -2658 2919 3821 1681 117 -2145
1663 -2145 -2349 2304 4573 -470 -3887 -300 2051 -597 -1488 -875 -1002 645 2410 -223 -4713 -2345
1679 -2345 3916 4666 317 -2448 -3431 -1010 4712 4613 -1764 -4137 -838 528 1623 1657 -971 -2911
1695 -2911 -303 1402 -1687 -1962 2042 2070 430 -90 -2601 -2495 4147 6309 -361 -4982 -2522 926
$$ packed form
1583A499l707j831K323M744k20l284j177J310J085J166r25k794J102L637k32m615
1599a919k484K804M203R93l102n652m38O013L873j562l734k588M92M816L090k366
1615B439m129Q7K386m8r36M09k1R28L28l658k330L860N094j578m709k572J283
1632c167L489M776k08p454l241N447L895m68j190l413k466L981L440l199l328
1647c106L157J705k979l52R15r33J678M056k954n968K123N577R02k140j564k262
1663b145k04M653K269n043l417L587K351k648q91O13j27J647J765k633m490K368
1679b345O261P50m349k765r83K421N722r9o377k373L299J366J095L4k628j940
1695b911K608J705l089k75M004K8j640n20k511J06O642K162o670m621K460L448
$$ plain form
1711 926 2561 3734 -76 -5792 -3536 3184 2392 -1045 -1089 -902 -912 1313 1625 -1523 -1051 3081 3172 -2275
1729 -2275 -3156 802 2457 2103 787 -2417 -4832 -919 4441 2102 -2834 -3238 -1446 -40 2035 2364
1745 2364 -2172 -2207 2794 2574 -1879 -1167 2339 2024 800 39 -2457 -3429 1834 5045 -209 -4465 -3153
1762 -3153 -889 2084 3709 108 -4117 -2097 2213 2762 517 -433 343 574 546 54 -1454 -49 2462
1779 2462 1653 -1665 -3041 -2283 1036 4259 1324 -4152 -4777 385 4067 2371 -450 -1808 -2228 810
1795 810 3491 1180 -1650 1 1430 -449 -884 -461 -486 719 2215 -244 -4980 -3050 3501 3923
1811 3923 -108 -2599 -2348 -692 2961 4181 170 -2937 -1192 1627 1477 358 -78 -859 -832 720
1827 720 -676 -2545 -1032 2884 2311 -2349 -3608 -632 1938 3131 2413 -2100 -4184 -16 3847 2438
$$ packed form
1711I26J635J173l810n716K256O720p92l437m4J87j0K225L12l148M72M132R1n447
1729b275q81L958J655l54j316l204k415L913N360k339m936m04J792J406K075L29
1745B364m536l5N001k20m453P12L506l15j224p61k496r72N263L211n254m256J312
1762c153K264K973J625l601m225K020M310N49k245r50P76K31k8m92j508J405K511
1779B462q09l318j376P58L319L223k935n476o25N162L682j696k821j358m20L038
1795H10K681k311k830J651J429j879m35M23k5J205J496k459m736J930O551M22
1811C923m031k491K51J656L653J220m011l107J745K819j50j119m36p81K7J552
1827G20j396j869J513L916n73m660j259K976K570J193p18m513k084M168L863j409
$$ plain form
1843 2438 -211 -1825 -2191 72 2513 681 -2092 -925 1520 107 -2116 -1201 409 2134 2241 -840
1859 -840 -3297 -1328 2292 3997 1902 -1767 -3645 -887 3079 3340 -731 -3254 -1943 66 1242
1874 1242 14 -1440 -327 1406 467 -884 -1200 753 2707 2307 -183 -2693 -2124 1666 4232 1764
1890 1764 -2842 -3681 -786 2351 2430 -412 -2495 -2197 388 1837 40 -1397 1029 1233 211 -714
1906 -714 -356 -369 2034 3066 -69 -4449 -2526 2494 2991 311 -2179 -3736 -1753 2287 2854 -336
1922 -336 -2320 -941 897 1125 657 364 -129 901 1516 -834 -2408 -303 2660 2250 -1263 -3738 -2514
1939 -2514 725 3047 1399 -2409 -3477 -669 2086 2534 382 -1841 -1164 848 1336 468 -436 98
1955 98 1469 1254 -1502 -2665 -428 2538 2105 -1125 -3551 -2583 732 3333 2268 -1586 -2843 -696
$$ packed form
1843B438k649j614l66K263K441j832k773J167K445j413k223R15J610J725J07l081
1859h40k457J969L620J705k095l669j878K758L966K61m071k523J311K009J176
1874A242j228j454J113J733r39j351l16J953J954m00k490k510N69L790K566k468
1890A764m606q39K895L137P9k842k083K98K585J449j797j437K426K04j022r25
1906g14L58j3K403J032l135m380J923N020M97k680k490j557J983M040N67l190
1922c36j984J379J838K28m68k93m93J030O15k350j574K105K963m10l513k475J224
1939b514L239K322j648l808j068K808K755M48k152k223O77K012M88q68r04N34
1955I8J371k15k756j163K237K966m33l230k426R68L315K601j065l854j257K147
$$ plain form
1971 -696 2017 2731 471 -1651 -1249 724 1135 171 -956 -11 1178 85 -2240 -2148 -257 2056 1973
1988 1973 -828 -3284 -2504 1402 4294 2352 -1721 -3003 -687 2610 2930 381 -1823 -1035 509 793
2004 793 -161 -585 -339 728 487 -1160 -2462 -372 2049 1948 147 -2304 -2278 1151 4147 1530 -1976
2021 -1976 -2143 -659 1220 1888 -12 -2200 -1123 903 205 -1611 -714 350 594 1392 -55 -2898
2037 -2898 -1351 3402 3523 -429 -2541 -1902 444 2884 2668 -787 -3560 -1298 1493 966 -7 -802
2053 -802 -1006 -773 520 63 -828 205 2419 1198 -2247 -2307 871 2608 2784 224 -3001 -3026 1100
2070 1100 3719 1396 -1579 -2939 -1957 952 3116 280 -2165 -939 1205 536 265 276 -21 1244
2086 1244 1270 -710 -2188 13 2654 1345 -778 -1609 -2101 -565 3034 1855 -2494 -2895 117 1482
$$ packed form
1971f96K713P14k260k122M02J973M11r64j127R45J189j093k325R2J891K313q3
1988A973k801k456P80L906K892j942m073j282K316L297L20k549k204P88J544K84
2004G93r54m24K46J067k41j647j302K090K421j01j801k451K6L429K996k617l506
2021a976j67J484J879O68j900k188J077K026o98j816Q97J064K44P98j447k843
2037b898J547M753J21l952k112O39K346K440k16l455k773K262K791n27r73p95
2053h02k04K33J293m57q91J033K214j221l445o0L178J737J76k560l225k5M126
2070A100K619k323k975j360R82K909K164k836k445J226K144o69k71J1k97J265
2086A244K6j980j478K201K641j309k123q31m92J536L599j179m349m01L012J365
$$ plain form
2102 1482 891 479 -528 -667 1277 2007 -1187 -2091 1512 2430 552 -805 -1695 -2118 586 3762 1037
2119 1037 -3832 -3419 731 1986 1341 590 -1699 -2109 1451 2516 -254 -368 1382 340 -942 -416
2135 -416 106 -148 1547 1642 -2593 -4339 -200 2699 2133 -229 -2907 -3601 218 4221 2358 -1284 -2158
2152 -2158 -709 741 2048 1733 -985 -1630 940 759 -943 -1091 514 747 193 -890 -1989 -1151 2191
2169 2191 2977 -410 -2623 -1138 795 1588 2314 -171 -2864 -981 2428 1261 -1242 -1061 48 -177
2185 -177 91 149 -2182 -1159 3098 1919 -2045 -2166 274 1020 1980 2261 -1206 -3492 147 3173 1544
2202 1544 -932 -819 -719 -668 1186 509 -1346 -241 1418 -327 -2341 -865 1435 1614 1213 -629 -2709
2219 -2709 -1357 2910 3257 93 -2304 -2280 -637 2263 2384 -772 -2814 -1479 904 400 150 -16 -444
$$ packed form
2102A482n91m12j007j39J944P30l194r04L603R18j878j357q90m23K704L176k725
2119A037m869M13M150J255o45p51k289m10L560J065k770j14J750j042j282N26
2135d16N22k54J695R5m235j746M139K899n66k362k678o94L819M003j863l642q74
2152b158J449J450J307l15k718o45K570j81j702j48J605K33n54j083j099Q38L342
2169B191P86l387k213J485J933P93P26k485k693J883L409j167k503J81J109k25
2185a77K68N8k331J023M257j179l964j21K440P46R60K81l467k286L639L026j629
2202A544k476J13J00N1J854o77j855J105J659j745k014J476K300J79m01j842k080
2219b709J352M267L47l164k397K4J643K900J21l156k042J335K383n04k50j66m28
$$ plain form
2236 -444 -211 690 -363 -1288 880 2650 990 -1183 -1631 -1100 1412 2672 593 -2974 -2837 451 1863
2253 1863 659 -590 -1614 -1359 665 1278 78 -776 331 1685 335 -849 -362 398 1699 2178
2269 2178 -650 -3288 -1555 2068 2198 -347 -1998 -2327 -1166 1700 2044 -660 -1934 88 1081 271
2285 271 573 501 -7 770 1230 -1263 -1925 350 2677 918 -1544 -2236 -1760 1045 2911 803 -2387
2302 -2387 -2453 -145 2061 2043 238 -1418 -507 939 1331 424 -713 370 1259 71 -1709 -1555 456
2319 456 1651 791 -1130 -2607 -1334 1445 2670 1064 -1476 -2121 -341 2412 2400 -141 -1138 -154 427
2336 427 203 -293 -509 -222 534 356 -1781 -1516 463 1832 1352 -544 -2140 -1546 1505 3118 1095
2353 1095 -1559 -1976 77 1406 1588 166 -1267 -1061 298 127 -629 -609 -115 781 109 -1510 -1477 305
$$ packed form
2236d44K33R01j053r25K168J770j660k173m48N31K512J260k079l567J37L288J412
2253A863j204j249j024K55K024O13j200q54J107J354j350j184M87P60J301M79
2269B178k828k638J733L623J30k545j651l29J161K866L44k704j274K022R93q10
2285B71L02p2n08P77M60k493o62K275K327j759k462o92M76K805J866k108l190
2302b387o6K308K206j8j805j656R11J446L92r07j137J083Q89j188j780J54K011
2319D56J195q60j921j477J273K779J225j606k540o45J780K753j2k541r97R84N81
2336D27k24m96k16K87P56j78k137K65J979J369m80j896j596N94L051J613k023
2353A095k654m17K053J329J82j422j433K06J359j71p56K0M94Q96o72j619L3J782
$$ plain form
2371 305 2103 1863 -593 -2485 -1218 1832 2727 1113 -1332 -1874 -182 1130 1380 -317 -1442 -544
2387 -544 398 353 -554 -856 214 1151 324 -1086 -1462 654 2385 1940 -646 -2045 -1393 1105 2760 812
2405 812 -2046 -2074 -604 1115 1284 -546 -1483 -849 413 561 -513 -610 1102 1643 616 -1060 -1218 467
2423 467 2232 1831 -541 -2328 -1629 991 2186 673 -1700 -2376 -793 1043 1192 -352 -991 -355 683
2440 683 593 -510 -198 834 1387 540 -802 -1743 -326 1857 1415 -667 -2692 -1728 688 1889 1084
2457 1084 -1455 -2145 -205 1622 1285 -113 -483 47 703 481 -130 -558 532 1292 441 -1508 -2022 -344
2475 -344 1476 1938 -470 -2388 -1491 707 2197 1293 -1131 -1662 -1 1149 1224 545 -509 -432 553 107
2493 107 -766 -408 339 1356 391 -1286 -2043 -284 2127 1901 -527 -1978 -1295 1093 2446 1618 -1032
$$ packed form
2371C05J798k40k456j892J267L050Q95j614k445n42J692J312K50j697j125Q98
2387e44R42m5r07l02J070R37q27j410l76K116J731m45k586j399O52K498J655j948
2405H12k858k8J470J719J69j830r37O34J262J48j074r7J712N41j027j676j58J685
2423D67J765m01k372j787O99K620J195j513k373o76J583J836J49j544o39O36J038
2440F83r0j103L12J032N53q47j342r41J417K183m42k082k025R64K416J201q05
2457A084k539o90J940J827l37j398l70N30O56k22o11m28J090P60q51j949n14J678
2475c44J820M62k408j918Q97K198J490r04k424n31J661J150P5o79j054P7R85m46
2493A07q73L58P47J017r65j677p57J759K411k26k428j451O83K388J353q28k650
$$ plain form
2510 -1032 -1985 36 1106 741 151 -403 -858 208 584 -923 -1237 805 1487 -342 -1406 -1050 -328
2527 -328 1455 2161 -26 -2406 -1351 1563 2182 690 -683 -1362 -1021 813 1429 -816 -1273 110 636
2544 636 -581 -1329 -473 309 1338 1107 -710 -1954 -332 2224 1816 -30 -1548 -1836 7 1980 1432
2561 1432 -877 -1716 -401 539 51 197 -275 -319 521 157 -1506 -641 1463 2119 518 -1244 -1599 -396
2579 -396 2136 2863 -49 -3094 -1548 609 1251 1359 -386 -2712 -1440 1038 828 -476 -279 173 -395
2596 -395 35 262 -185 59 1861 1215 -2072 -1759 507 1651 677 56 -1884 -2028 587 2321 278
2613 278 -1799 -745 332 125 916 706 -960 -228 1630 687 -1451 -911 789 1272 499 -240 -2064
2630 -2064 -1522 1615 2253 -491 -1804 -986 -545 993 1368 201 -1250 -471 1019 250 -336 676 1151
$$ packed form
2510a032r53K021J070l65n90n54m55J066L76j507l14K042O82j829j064L56P22
2527c28J783P06k187k380J055K914O19j492j373o79L41J834O16k245m57J383N26
2544F36j217p48Q56P82J029k31j817j244J622K556m08j846j518k88J843J973n48
2561A432k309q39J315R40m88J46m72m4Q40l64j663Q65K104O56j601j762l55J203
2579c96K532P27k912l045J546K157O42J08j745k326J272K478k10j304J97M52n68
2596c95M30K27m47K44J802o46l287L13K266J144r74o21j940j44K615J734k043
2613B78k077J054J077k07P91k10j666P32J858r43k138N40J700M83p73p39j824
2630b064N42L137O38k744j313Q18M41J538L75j167j451P79J490p69n86J012M75
$$ plain form
2647 1151 351 162 -794 -1392 728 2275 552 -2116 -2396 -322 1175 2281 701 -2370 -2823 534
2663 534 2035 975 166 -608 -1413 270 1581 106 -636 408 827 -1112 -1415 -59 331 453 850
2680 850 -1179 -2674 -384 2215 1529 -501 -1196 -875 9 2125 2020 -844 -1532 247 932 -106 -158
2697 -158 -55 -456 280 429 -1128 -1926 205 2032 1116 -823 -1313 -636 1103 2182 952 -1643 -1336
2714 -1336 609 1186 609 212 -773 -1117 31 348 -916 -717 1006 1245 -393 -1150 -827 6 1947 1799
2732 1799 -1289 -2393 -229 1614 1900 700 -1208 -2106 -50 1600 812 -580 -1114 -746 150 260 -21
2749 -21 -513 253 1299 -200 -1489 -700 1003 1887 911 -208 -1811 -996 1262 2207 -196 -1809 -1518
2766 -1518 -104 860 669 -122 -1075 -230 839 444 -662 85 1267 1024 368 -560 -1100 95 1532 1172
$$ packed form
2647A151q00j89r56n98K120J547j723k668k80K074J497J106j580l071m53L357
2663E34J501j060q09p74q05J683J311j475p42J044M19j939l03J356L90J22L97
2680H50k029j495K290K599o86k030o95L21Q84K116j05k864o88J779O85j038n2
2697a58J03m01P36J49j557p98K131J827r16j939m90O77J739J079j230k595L07
2714a336J945N77n77l97r85l44J148L17j264J99J723K39j638p57L23Q33J941j48
2732A799l088j104K164J843K86j200j908q98K056J650p88j392n34L68Q96J10k81
2749b1m92P66J046j499j289P89J703Q84r76j119j603Q15K258R45k403j613K91
2766a518J414R64j91p91r53Q45J069l95j106P47J182k43o56r28n40J195J437l60
$$ plain form
2784 1172 -1042 -2181 -759 706 1397 521 -1155 -1950 -409 977 877 -68 -766 -85 384 345 31 -216
2802 -216 804 1082 -148 -1181 -1151 708 1577 1032 -1134 -2132 -1092 819 1925 411 -1305 -1298 -11
2819 -11 1082 817 41 -388 -91 370 207 -369 -347 647 739 -190 -1365 -1215 -198 1423 1059 -797 -1757
2838 -1757 -1115 1161 1788 687 -1089 -1255 -71 1326 1034 -59 -404 -79 407 -19 -612 -846 438
2855 438 684 10 -1395 -1289 82 1675 1242 -431 -1425 -1240 1140 1861 711 -851 -790 -277 955 1002
2873 1002 -188 -750 -181 229 -521 -909 -520 542 990 22 -1273 -1309 492 1729 1429 -182 -1483 -1137
2891 -1137 976 1699 734 -890 -1458 -615 810 718 -626 -650 -121 184 -497 -769 -435 318 1267 390 -1254
2910 -1254 -1228 461 1873 1311 -270 -1695 -1022 495 1408 743 -1127 -1281 -421 691 372 -395 -527 149
$$ packed form
2784A172k214j139J422J465O91q76j676p95J541J386j00r45o98O81M69l9l14k47
2802b16J020K78j230j033L0J859Q69n45k166r98J040J911J106j514j716PJ287
2819a1J093k65p76m29K97M61j63n76K2R94R2r29j175J50J017J621l64j856r60
2838a757O42K276O27j101j776j66J184J397k92j093l45L25M86m26n93k34J284
2855D38K46o74j405J06J371J593m33j673r94J85K380P21j150j562O1N13J232M7
2873A002j190n62N69M10p50l88L89J062M48r68j295l6J801J237l00j611j301L46
2891a137K113P23r65j624n68Q43J425r2j344k4N29L05o81k72L34P53R49q77j644
2910a254K6J689J412n62j581j425O73J517R13o65j870j54Q60J112l19p67j32O76
$$ plain form
2928 149 267 -20 -321 -295 770 1392 613 -1006 -1297 86 1827 1179 -599 -1797 -1192 446 1295 459
2946 459 -976 -969 -247 408 779 -146 -185 87 632 214 -503 -276 763 1566 395 -902 -1389 -275 1488
2965 1488 1031 -496 -1799 -1194 501 1400 400 -927 -772 -201 607 728 291 -12 301 847 -4 -957
2983 -957 -285 1085 1389 148 -1210 -1661 -351 1159 1282 -120 -1919 -972 857 1134 629 -186 -732
3000 -732 -353 1085 577 -518 -461 521 493 -493 -959 -627 460 1138 561 -1459 -2063 168 1296 1205 67
3019 67 -1470 -1408 633 1781 1018 -771 -641 63 454 312 79 -470 -300 502 -188 -1225 -386 703 927
3038 927 181 -1062 -1368 -384 1743 1645 -664 -1530 -656 145 1147 1159 -428 -1236 -503 855 35 -990
3056 -990 -86 234 -68 -94 -701 -1121 195 1767 955 -1126 -1232 54 1280 1306 452 -784 -1581 638
$$ packed form
2928A49J18k87l01K6J065O22p79j619k91J383J741o48j778j198O05J638Q49q36
2946D59j435PP22O55L71r25l9K72N45m18p17K27J039Q03j171j297m87J114J763
2965A488m57j527j303O05J695Q99j000j327J55N71Q08J21m37l03L13N46q51r53
2983i57O72J370L04j241j358m51J310J510J23j402j799R47J829K77n05q15n46
3000g32L79J438n08j095N7R82k8r86m66L32J087O78n77k020o04K231J128r1j138
3019F7j537O2K041J148p63j789J30P04L91j42k33n49J70Q02o90j037Q39J089K24
3038I27p46j243l06R84K127r8k309q66Q74Q01J002J2j587q08P33J358q20j025
3056i90R04L20l02k6o07m20J316J572q12k081j06J286J226K6q54j236p97K219
$$ plain form
3074 638 1391 -230 -505 -399 -592 -322 191 -202 -855 700 1016 -487 -1563 -482 1215 1273 864 -325
3092 -325 -1948 -740 1620 1613 -368 -1471 -1203 -244 895 1282 -470 -1428 -310 531 -208 -157 427 184
3110 184 355 521 -860 -744 1137 1801 62 -1238 -1131 -208 684 1398 211 -2213 -1235 975 774 303
3128 303 -143 -701 -535 504 918 -568 -888 1090 929 -326 -875 -372 -191 1043 1165 -491 -2024 -495
3146 -495 1165 605 7 -465 -1295 -411 1303 752 -376 -66 609 148 -304 206 313 311 1027 167 -1699
3165 -1699 -1395 1023 1412 332 -786 -1445 -870 914 1934 289 -1551 -773 39 643 928 546 -730
3182 -730 -570 359 198 -654 473 873 -39 -760 -1246 -1093 325 1467 509 -1289 -1848 -170 1155 1209
3200 1209 509 -877 -1389 685 1625 447 -562 -287 78 -129 340 -281 -760 -4 1145 -59 -1491
$$ packed form
3074F38P53j621k75J06j93K70N13l93o53J555L16j503j076J081J697N8m09j189
3092c25j623J208K360pj981j103K68R59J139L87j752r58J118Q41p39N1N84k43
3110A84J71J66j381J16J881O64j739j300J07R23Q92P14j187k424R78K210k01m71
3128C03m46n58J66J039M14j486l20J978j61j255n49N03J81J234J22j656j533J529
3146d95J660n60n98m72q30Q84J714n51j128L10O75m61m52N10J07kP16q60j866
3165a699L04K418L89j080j118o59N75J784J020j645j840P78Q12O04K85l82j276
3182g30J60R29j61q52J127M00r12p21m86J53J418J142r58j798n59J678J325N4
3200A209p00j386n12K074R40j178j009K75L65k07M69o21m79P56J149j204j432
$$ plain form
3217 -1491 -819 470 972 926 -85 -1020 -804 1083 1703 229 -575 -474 -153 435 836 -201 -836 232
3235 232 595 -759 -984 -124 648 776 21 -770 -1037 431 1649 1152 -593 -1353 -530 649 1639 929
3253 929 -1055 -1431 44 577 -37 -299 -290 -137 184 56 -589 -120 1156 1054 -154 -874 -536 390 1374
3272 1374 1419 -509 -1678 -668 1010 1122 45 -940 -1078 -515 960 436 -484 -229 361 304 183 -500
3290 -500 -121 567 1199 258 -709 -1091 506 1418 772 -531 -1445 -1218 209 1007 289 -1027 -901 330
3308 330 383 202 186 -213 31 572 68 -627 -143 1002 926 -176 -1264 -976 -84 1161 846 -710 -1573
3327 -1573 -936 426 1044 658 -491 -832 141 829 119 -223 -165 365 250 -211 -611 -437 638 724 -134
3346 -134 -1305 -1430 191 1080 1035 -454 -1520 -892 585 1299 596 -269 -608 253 379 194 -299 -91 374
$$ packed form
3217a491O72J289N02m6j011r35K16J887O20j474q04J01L21N88M01j037o35J068
3235B32L63j354k25Q60P72J28p55p91k67J468J218m97j745p60Q23J179R90p10
3253I29j984l76J475N33o14k62RJ53L21j28o45M69J276j02j208p20L38R26R84
3272A374M5j928j169J010J678J12j077r85j38N63J475n24r20K55N90n7j21o83
3290e00L79O88O32r41r67l82J597R12o46j303r14K27J427P98p18j316J26J231
3308C30N3j81j6l99K44N41n04o95M84J145p6j102j088K88Q92J245l15j556q63
3327a573O37J362O18l86j149l41R73O88p10l42N8N30j15m61m00J74J075Q6q58
3346a34j171j25J621Q89m5j489j066O28J477P14p03q65l39Q61J26j85m93K08M65
$$ plain form
3365 374 212 -290 -1039 -349 642 692 43 -1365 -1514 -223 1351 1187 4 -1252 -758 496 1307 482
3383 482 -610 -656 12 524 90 -165 -446 28 302 -237 -1015 -442 740 1293 136 -1112 -877 250 1293
3402 1293 1572 -22 -1224 -741 874 1070 454 -429 -761 -154 213 343 -371 -430 140 532 -164 -1076 -511
3421 -511 549 1240 348 -612 -1276 74 1494 1088 -42 -1298 -905 307 958 338 -775 -857 -189 230
3439 230 -22 -148 -325 443 728 -235 -708 -278 768 1508 579 -775 -1168 -222 1058 880 -194 -1251
3457 -1251 -1091 -42 736 256 -715 -579 116 428 54 -261 -168 810 701 9 -457 -316 596 1244 468 -1208
3477 -1208 -1323 -203 902 754 -348 -1295 -1117 285 1013 339 -362 -220 220 148 130 -45 -11 613 757
3496 757 -310 -829 -662 523 885 507 -964 -1553 -420 1242 886 -435 -1195 -857 113 750 485 -404
$$ packed form
3365C74j62n02p49O90R91N0o49j408j49J291J574j64j183j256M94J254Q11q25
3383D82j092m6O68N12m34k55k81M74K74n39p78N73J182N53j157j248K35J127J043
3402A293K79j594j202M83J615J96o16q83l32O07L67J30p14n9N70L92o96r12N65
3421e11J060O91q92r60o64J350J420m06j130j256L93J212O51o20j113q2O68M19
3439B30k52j26j77P68K85r63m73M30J046P40r29j354l93R46J280j78j074j057
3457a251J60J049P78m80r71J36O95L12l74l15R3R78j09o92m66J41R12O48p76j676
3477a208j15J120J105j48j102r47J78J402P28o74p01J42M40p2j8j75L4O24J44
3496G57j067n19J67J185L62l78j471n89J133J662l56j321p60L38R70O37k65q89
$$ plain form
3514 -404 -392 338 506 -46 -142 30 610 501 -465 -1033 -681 327 1348 -7 -1464 -1354 -557 694 985
3533 985 326 -1226 -894 718 885 161 -404 -204 -230 -119 174 -571 -177 667 453 -755 -1415 -593 152
3552 152 1088 607 -942 -1341 -205 1379 1067 86 -346 -747 130 1097 518 -441 -745 402 412 -386 -458
3571 -458 -254 329 421 -165 -1099 -812 729 1370 343 -466 -484 -326 776 1323 324 -1010 -383 167 40
3590 40 31 -245 19 -67 67 -479 -747 -122 957 863 -275 -655 -894 296 1584 1467 -787 -1557 -152 852
3610 852 496 231 -557 -1146 -342 394 68 -378 43 67 -162 -383 -74 9 388 1125 -89 -1294 -372 1024
3630 1024 1228 196 -688 -1194 -688 1054 1147 -359 -1048 -403 144 164 365 -102 -653 41 774 -88 -675
3649 -675 441 956 527 187 -483 -1139 58 1604 635 -949 -961 -220 101 452 333 -778 -751 686 791
$$ packed form
3514d04J2P30J68n52r6J72N80j09r66n68L52J008J021j355j457J10P97J251K91
3533I85o59j552L32J612J67p24n65K00k6J11K93p45L94Q44k14j208o60Q22P45
3552A52R36m81j549l99J136J584l12r81m32m01Q77R67n79r59l04J147J0p98p2
3571d58K04N83R2n86r34K87J541O41j027q09j8J58J102N47r99j334O27N50j27
3590D0rk76K64q6J34n46k68O25J079r4j138l80k39J190J288j17k254p70J405J004
3610H52l56k65p88n89Q04P36l26m46M21K4k29k21L09Q3L79P37j214j205R22J396
3630A024K04j032q84n06N06J742R3j506o89O45N47K0K01m67n51O94P33q62n87
3649f75J116N15m29l40o70o56J197J546r69j584j2P41L21L51j19j111K7J437J05
$$ plain form
3668 791 -89 -62 397 130 228 357 -730 -341 914 1041 -321 -1200 -716 147 1047 1176 -314 -1449 -985
3687 -985 779 898 121 -139 -568 -28 490 735 -19 45 429 92 -828 -700 316 276 369 -145 -926 -1187
3707 -1187 398 1576 394 -878 -847 -630 514 1315 520 -672 -418 689 584 224 -118 -221 -217 428
3725 428 -6 -669 -416 461 501 -431 -822 -604 83 997 894 -437 -1119 -29 693 593 114 16 -468 -220
3745 -220 360 56 -685 -253 591 -71 -385 -494 -90 331 857 314 -1184 -1102 365 1033 668 130 -1088
3764 -1088 -732 386 765 286 -783 -464 -529 -80 7 -332 -197 403 152 -565 -615 -152 761 798 -61 -641
3784 -641 -905 202 1203 1067 -639 -1329 -500 554 512 177 -595 -951 34 494 -142 -47 142 235 322 -53
3804 -53 -310 -529 773 1201 82 -700 -740 92 644 736 -56 -914 -746 520 639 -65 -442 -288 -168 501
$$ packed form
3668G91q80K7M59k67R8J29j087L89J255J27j362q79M84Q63R00J29j490j135M64
3687i85J764J19p77k60m29N40N18K45p54O4L84l37r20J28J016m0R3n14p81k61
3707a187J585J178j182j272L1K17J144Q01p95j192K54J107j05l60l42j03MO45
3725D28m34o63K53Q77M0r32l91K18O87R14j03j331o82J090P22j00m79r8m84K48
3745b20N80l04p41M32Q44o62l14j09M04M21N26n43j498Q2J467O68l65n38j218
3764a088L56J118L79m79j069L19o5M49Q7l39J35O00k51p17n0M63R13L7q59n80
3784f41k64J107J001j36j706o90Q29J054m2l35p72l56R85M60o36R5J89R3Q7l75
3804e3k57k19J302M28j119p82m0Q32N52R2p92q58J68J266J19p04l77J54J20O69
$$ plain form
3824 501 250 -257 -26 604 475 -424 -902 -97 645 1020 416 -765 -1147 -75 933 799 -636 -1075 -478
3843 -478 192 804 302 -441 -248 335 246 141 -42 107 392 412 -273 -783 -474 384 963 -78 -1229 -970
3863 -970 -296 726 997 -377 -1024 -311 277 692 354 -34 -280 -115 218 -43 -290 -383 560 63 -447 -842
3883 -842 -574 515 851 454 -908 -1066 -150 980 840 51 -607 -422 425 837 563 -257 -308 -52 55
3902 55 69 -421 6 405 137 -169 -767 -430 519 1183 388 -1041 -1028 -133 897 809 -166 -554 -490 -88 617
3923 617 305 -210 -472 243 -56 -434 -244 191 444 92 -7 -563 -282 925 1255 413 -749 -838 -49 746
3943 746 1148 -144 -708 -600 122 244 214 -428 -122 69 -71 -382 -522 130 585 687 -184 -530 -314 797
3963 797 852 293 -845 -628 -43 742 683 -263 -956 -482 -132 391 381 -431 -153 422 -29 -210 -305 51 410
$$ packed form
3824E01k51n07K31O30j29q99m78Q05P42L75o04j181l82J072J008j34j435m39N97
3843d78O70O12n02p43J93N83q9j05j83J49K85K0o85n10L09Q58N79j041j151K59
3863i70O74J022K71j374o47P13N88M15l38l88k46J65L33k61k47r3R43m97n10l95
3883h42K68J089L36l97j362j58R16J130j40p89o58J85Q47M12k74q20n1K56J07
3902E5J4m90M27L99k68l06n98L37R49O64p95j429J3Q95J030q8r75l88O4M02P05
3923F17l12n15k62P15k99l78J90M35K53l52r9n56K81J207L30q42j162q9P89P95
3943G46M02j292n64J08P22J22l0o42L06J91j40l11j40O52M55J02q71l46K16J111
3963G97N5n59j138K17N85P85n9r46o93M74L50N23j0q12K78N75m51j81r5L56L59
$$ plain form
3984 410 559 -134 -783 -456 406 1046 322 -961 -1031 -357 552 726 -299 -1034 -581 189 564 -6 -176 51
4004 51 85 66 49 -93 157 830 402 -244 -963 -551 270 761 406 -668 -977 -102 766 498 -29 -534 -418
4025 -418 117 496 236 -60 22 455 29 -306 -434 -18 488 578 -214 -913 -865 388 962 284 -481 -1121 -371
4046 -371 462 882 -101 -454 -121 42 425 307 310 -1 256 -69 -373 -741 8 614 191 -341 -641 -613 263
4067 263 947 659 -833 -799 -248 736 699 395 -468 -483 127 697 -244 -289 -25 -33 -150 -273 -635 -462 508 652
4089 652 -272 -792 -502 554 619 551 -354 -922 -207 709 605 -79 -382 -205 279 9 201 -221 -250 158 345
4110 345 -289 -512 -2 670 692 159 -885 -820 416 1041 548 -437 -587 -369 41 690 324 -738 -402 -73
4130 -73 -206 -422 301 75 -97 234 -91 -529 -44 1045 860 -411 -844 -423 591 746 690 -323 -1353
$$ packed form
3984D10J49o93o49L27Q62O40p24j283p0O74R09J74j025p35M53P70L75n70j70K27
4004E1L4j9j7j42K50O73m28o46p19M12Q21M91l55j074l09Q75Q68k68n27n05J16
4025d18N35L79k60k96Q2M33m26l35j28M16N06R0p92o99M8J253N74o78p65o40P50
4046c71Q33M20r83l53L33J63L83j18Ll11K57l25l04l68P49O06m23n32l00K8Q76
4067B63O84k88j492L4N51R84l7l04q63j5O10N70r41m5K64qj17j23l62J73R70J44
4089F52r24n20K90J056O5o8r05n68P15R16j04o84l03J77M84k70J92m22k9M08J87
4110C45o34k23N10O72K2n33j044O5J236O25m93r85j50K18M10O49l66j062L36L29
4130g3j33k16P23k26j72L31l25m38M85J089j85j271m33M21J014J55n6j013j030
$$ plain form
4149 -1353 -300 564 438 -43 -444 -572 -259 561 -145 -332 -107 489 224 -306 -18 76 237 727 206 -781
4169 -781 -617 601 555 204 -370 -410 -468 260 844 -23 -162 58 552 -343 -29 193 31 696 901 -368
4189 -368 -975 -28 669 757 -267 -554 -833 -300 1043 711 -419 -677 -67 308 584 473 -100 -309 -119
4208 -119 282 10 -43 335 351 -437 -626 -571 -494 612 762 -301 -1258 -655 383 951 315 -200 -939 -639
4228 -639 572 978 218 -439 182 277 169 127 -226 -14 393 293 -562 -756 -184 301 456 421 -543 -1107 57
4249 57 1033 326 -389 -458 -22 350 206 18 -510 -162 310 104 -424 -41 266 276 240 -365 -917 -679 584
4270 584 861 180 -837 -708 -72 576 546 -152 -874 -361 370 175 -278 54 -185 -287 -210 -193 -240 163 624
4291 624 134 -791 -527 -67 517 985 366 -1006 -797 314 990 197 -234 -555 -469 160 871 -56 -182 -5
$$ packed form
4149a353J053Q64j26m81m01j28L13Q20p06j87K25N96k65n30K88R4J61M90n21r87
4169g81J64J218m6l51n74m0n8P28N84q67j39K20M94q95L14K22j62O65K05j269
4189c68o07R47O97Q8j024k87k79N33J343l32j130k58O10L75K76j11n73k09J90
4208a19M01k72n3L78J6p88j89N5P7J106J50j063r57O03J038N68o36n15p39L00
4228f39J211M06p60o57O21R5j08m2l53K12M07j00q55j94N72M85J55l5r64n64J164
4249E7R76p07p15o9M36L72j44j88n28L48M72k06n28L83L07J0l6o05n52K38J263
4270E84K77o81j017J29O36O48l0o98p22N13P31j95m53L32k39j02P7J7m7M03M61
4291F24m90r25K64M60N84M68o19j372K09J111O76p93m31l21Q6O29P11r27j26J77
$$ plain form
4311 -5 336 217 -109 60 -19 459 324 -198 -531 -46 768 799 -79 -493 -597 -247 578 505 -152 -709 -317 52
4333 52 59 17 -323 -198 257 281 61 -420 63 779 209 -146 -794 -344 488 802 223 -736 -929 -36 445 563
4355 563 -207 -435 -538 56 505 277 180 85 280 34 -243 -170 97 632 246 -540 -762 -299 520 712 -20
4376 -20 -680 -858 89 723 581 -16 -517 -344 136 407 201 -229 9 35 -12 -397 -444 -139 677 346 -379
4397 -379 -880 -612 506 896 246 -717 -656 -230 656 628 65 -399 30 230 483 -14 -190 -162 131 186 -241
4418 -241 -564 265 507 192 -452 -898 -475 486 837 522 -717 -700 -121 436 473 -223 -189 -374 47 165 218
4439 218 -46 91 57 29 -289 -354 28 678 341 -95 -416 -423 489 937 572 -488 -734 50 333 551 163
4460 163 -361 -258 -142 88 -131 -93 -77 -43 -129 -635 -166 150 646 544 -424 -889 -289 501 1085 487 -474
$$ packed form
4311eL41j19l26J69p9M78j35n22l33M85Q14L1q78m14j04L50Q25p3o57n57L92L69
4333E2Pm2l40J25M55K4k20m81M83P16n70l55o48M50Q32L14n79r59j93Q93M81J18
4355E63p70k28j03N94M49k28r7r5J95k46k77P3K67N35l86p86k22M63Q19J92p32
4376b0o60j78R47O34j42n97n01J73M80K71k06m30K38K6m7l85m7L05Q16l31p25
4397c79n01K68J118L90o50r63O1M26Q86k8n63m64M29K00K53m97j76K8K93N5m27
4418b41l23Q29K42l15o44m46M23R61L51l15j239J7N79N57L7o96L4j85M21J18N3
4439B18k64J37l4k8l18o5L82O50l37m36l21pR12M48l65j060k46P84K83K18l88
4460A63n24J03J16K30k19L8J6L4q6n06M69L16M96j02r68m65O00P90N84n98r61
$$ plain form
4481 -474 -801 -168 434 751 -137 -563 -369 -143 346 230 66 -29 382 39 -274 -308 213 638 519 -347 -785
4502 -785 -416 352 847 159 -781 -654 -231 265 427 -41 -667 -167 32 55 66 -170 152 227 60 -213 -467
4523 -467 -151 733 471 -505 -851 -896 391 1031 106 -308 -891 -168 412 253 113 -415 75 83 372 -166 -354
4544 -354 469 481 -10 -329 -806 -382 288 624 -431 -1180 -370 298 581 370 -218 -573 -115 135 504 261
4564 261 -236 -43 122 194 -182 -254 79 433 -64 -530 -854 -140 427 433 -71 -1042 -549 472 868 405 -162
4585 -162 -460 -204 259 833 160 -325 -38 315 -15 -146 209 10 -16 -74 -381 -605 -245 843 558 -219
4605 -219 -442 -514 147 549 666 -354 -736 81 408 398 -93 -218 -230 -20 191 -233 -123 324 747 13 -153
4626 -153 -515 -240 501 1037 129 -689 -468 465 407 302 -237 -613 -422 -12 389 -32 -578 -20 -7 -132 -305
$$ packed form
4481d74l27O33O02L17q88m26J94K26M89j16j64r5M11l43l13l4N21M25j19q66m38
4502g85L69P68M95o88r40J27M23M96J62m68o26N00J99K3J1k36L22P5j67k73k54
4523d67L16Q84k62r76l46m5J287O40r25m14n83P23N80j59j40n28M90QK89n38j88
4544c54Q23J2m91l19m77M24O70L36j055p49Q10O68K83k11n88l55M58K50L69k43
4564B61m97J93J65P2l76p2L33L54m97m66l24P14N67On04r71M93J021L96m63n67
4585a62k98K56M63N74o73m85K87L53l30j31L55j99k6n8l07k24L60J088k85p77
4605b19k23p2O61M02J17j020l82Q17L27j0m91j25j2K10K11m24J10M47M23p34j66
4626a53l62K75P41N36r08q18K21R33n8j05n39l76J91M10M01m21n46N58J3j25j73
$$ plain form
4647 -305 -31 164 479 297 -227 -608 149 698 598 -196 -411 -587 -269 1042 231 -393 -522 -274 43 159
4667 159 87 -446 -164 110 114 60 -288 670 558 3 -144 -49 -65 627 607 -132 -753 -426 207 107 266 -213
4689 -213 -517 -247 461 265 28 -65 365 152 160 136 -46 96 500 247 -472 -512 -131 46 426 408 -599 -702
4711 -702 -8 678 374 -299 -6 -468 -127 480 103 -36 309 106 159 -230 -11 43 285 435 -337 -1069 -398
4732 -398 598 577 -192 -659 -496 -22 551 623 -139 -763 -94 240 275 233 -88 -219 49 285 -238 -432 133
4753 133 242 -129 -468 -653 -105 523 600 148 -655 -499 394 384 265 -44 -177 -250 142 482 66 -339 115
4774 115 205 -165 -592 -465 -171 388 349 -181 -908 -14 573 770 294 -290 -424 87 694 513 -150 -435 -85
4795 -85 24 -319 32 -177 111 -36 26 -448 -398 344 444 487 -293 -617 -257 570 906 160 -333 -484 87
$$ packed form
4647c05K74J95L15j82n24l81P57N49j00p94k15j76L18J311q11o24j29K48L17J16
4667A59p2n33K82K74Mn4l48R58j12n55j47R5j6O92k0p39o21L27O33j00J59m79
4689b13l04K70P08j96k37r3M30k13Qk4j82J42M04k53p19m0L81J77L80j8j007j03
4711g02O94O86l04o73K93m62L41O07l77j39L45k03N3l89K19N4K42J50p72p32O71
4732c98R96k1p69m67J63M74N73P2p62o24O69L34L5m2l21j31K68K36n23j94N65
4753A33J09l71l39j85N48O28P7m52q03J56Q93j0j19l09j33p3L92L40m16m05M54
4774A15R0l70m27J27K94N59l9n30p27Q94N87J97m76n84j34N11O07j81o63k85L50
4795h5J09l43L51k09K88j47O2m74N0P42J00M3p80l24L60Q27L36p46m93j51N71
$$ plain form
4816 87 127 259 -209 -355 -542 -16 482 -229 -324 55 261 -44 -136 -110 195 744 598 -220 -450 -252 407 574
4838 574 89 -579 -544 -285 563 227 -193 -504 -114 55 61 -12 -271 190 461 -72 -357 -29 169 390 275
4859 275 -361 -589 -379 298 394 451 -382 -611 -336 301 458 158 -373 -168 222 43 -208 -45 317 272 52
4880 52 -450 -201 11 554 96 -82 -589 -334 323 180 417 -348 -631 22 353 319 125 -330 -389 95 561
4901 561 -91 177 266 343 -110 -431 -385 -37 500 251 -233 -424 -263 170 617 219 -113 -398 129 317 508
4922 508 -18 -103 -120 -109 107 18 -308 81 235 196 -807 -634 79 482 415 -251 -666 -126 514 661 16 -364
4944 -364 -284 114 220 298 158 -60 -68 65 -23 -326 -212 126 78 347 -227 -512 98 383 647 -218 -459 -380
4966 -380 213 631 326 -142 -449 -291 366 277 -117 -77 -138 -44 -289 -124 -47 -62 339 85 -422 -523 228 774
$$ packed form
4816H7M0J32m68j46j87N26M98p11r5L79K06l05r2K6L05N49j46q18k30J98O59J67
4838E74m85o68L5K59Q48l36m20l11L90J69Op3k59M61K71n33k85L28J98K21j15
4859B75o36k28K10O77R6N7q33k29K75O37J57l00n31K05L90j79k51J63L62m5k20
4880E2n02K49K12N43m58j78n07K55O57j43K37p65k83O53L31l4j94m55n9M84M66
4901E61o52K68Q9P7m53l21M6L48N37k49m84j91J61M33M47l98l32k85N27J88J91
4922E08n26q5j7J1K16q9l26L89J54l9j003J73P13M03o7o66m15N40O40J47o45l80
4944c64Q0L98J06P8j40k18qJ33q8l03J14L38m8K69n74k85O10K85K64q65k41P9
4966c80N93M18l05m68l07J58O57q9l94M0o1R4k45J65P7j5M01k54n07j01P51N46
$$ plain form
4988 774 428 141 -805 -405 515 572 153 -433 -283 -66 237 297 -48 -338 -246 -124 178 -263 53 -27 378
5009 378 274 -293 -506 384 631 616 -209 -750 -117 -52 521 367 -102 -438 -204 -66 463 -45 25 133 104
5030 104 220 -40 -41 178 217 -23 -482 -444 -50 540 515 -14 -619 -528 77 331 316 -107 -708 -298 15 516
5052 516 386 -152 -206 428 -84 -330 111 280 409 119 -629 -770 -115 544 455 -135 -731 -265 33 508 593
5073 593 -151 -326 45 -49 277 254 -271 144 376 69 -213 20 155 296 -74 -421 -608 1 257 499 -43
5094 -43 -514 -534 46 467 505 -286 -486 -238 302 230 -31 210 369 -98 28 -187 -458 -146 24 -50 -398 -354
5116 -354 279 281 347 338 -444 -144 131 663 459 -366 -240 -174 125 -27 -339 0 -108 173 -53 -394 -175 170
5138 170 209 23 -248 -520 -182 463 770 128 -260 -462 -58 -133 291 -271 -191 -369 75 -133 -329 39 -169
$$ packed form
4988G74l46k87r46M00R20N7m19n86J50K17L03O0l45k90R2J22L02m41L16q0M05
5009C78j04n67k13Q90K47j5q25n41O33O5N73j54m69l36K34J38N29n08P0J08k9
5030A04J16k60jK19L9k40m59L8L94N90k5n29o05R1O05K54j5m23o01M10L13N01
5052E16j30n38n4O34n12k46M41J69J29k90p48j41O55O59q9n90n96M66K98M75Q5
5073E93p44j75L71r4L26k3n25M15K32l07k82K33J35J41l70l47j87O09K56K42n42
5094d3m71k0N80M21L8p91k00K48N40p2k61K41J59m67J26k15k71L12J70p4l48M4
5116c54O33KO6rp82L00K75N32k04q25J26O6K99j52l12L39j08K81k26l41K19L45
5138A70L9j86k71k72L38O45L07o42l88k02M04p5M24n62Q0j78M44k08j96L68k08
$$ plain form
5159 -169 -100 -244 -148 -178 161 674 288 -146 -429 56 538 671 -20 -384 -403 107 484 145 -19 -230 -398
5180 -398 -387 324 -21 -248 263 60 -70 -140 188 268 318 377 -218 -575 -73 503 435 -114 -96 -218 -17 348
5202 348 233 -244 -317 -28 283 253 -185 -63 7 139 234 -302 -659 324 531 417 -316 -496 -660 277 469
5223 469 74 -355 -294 122 71 177 3 119 -287 3 81 -223 -148 412 303 -50 -355 -361 -266 389 461 -353 -739
5246 -739 -434 304 402 383 -428 -420 -188 602 392 -119 -60 -245 40 100 15 17 -77 251 -97 -370 -170 281 401
5269 401 148 -297 -697 -497 316 598 129 -466 -248 94 445 204 -16 -311 -67 268 254 -241 -3 35 -178
5290 -178 -198 -150 -281 -72 526 344 -210 -436 -124 301 653 333 -131 -356 -206 23 -69 207 -211 106 28
5311 28 -136 -212 54 70 390 156 -498 -359 -21 474 158 64 -442 -367 64 438 146 -411 -391 -174 314 189
$$ packed form
5159a69O9j44R6l0L39N13l86m34k83M85M82J33o91l64j9N10L77l39j64k11j68
5180c98J1P11l45k27N11k03j30p0L28Q0N0N9n95l57N02N76o8n49J8j22K01L65
5202C48j15m77p3K89L11l0m38J22P0J32R5n36l57R83K07j14p33j80j64R37J92
5223D69l95m29O1M16n1J06j74J16m06K90P8l04P5N60j09l53l05oR5O55P2q14l86
5246g39L05P38R8j9q11QK32P90k10n11N9j85K85O0q5Kr4L28l48k73K00M51J20
5269D01k53m45m00K00Q13K82m69n95K18L42L51k41k20k95K44L35j4m95K38L8k13
5290a78k0M8j31K09N98j82n54k26L12M25L52l20m64k25J50K29r2K76m18L17p8
5311B8j64p6K66J6L20k34o54J39L38M95l16r4n06P5M31L74k92n57K0K17M88j25
$$ plain form
5333 189 -202 -200 -160 33 -270 -276 37 205 361 191 -191 -122 236 430 298 -220 -205 -53 147 757 248 -376
5355 -376 -16 76 338 34 78 -53 -345 27 127 -181 -233 612 389 -41 -286 -505 -115 247 597 -107 -560
5376 -560 -451 116 40 44 -261 -326 -83 8 -27 60 -9 74 -100 -139 -39 -29 49 322 99 -259 -234 307 387 107 -35
5401 -35 -641 -507 76 550 208 -117 -325 36 355 307 72 -171 -194 -123 220 -167 -43 182 572 -152 -480
5422 -480 -538 149 397 60 -283 -511 -297 69 241 281 -84 -146 -105 194 306 -169 109 -160 -51 -43 -83 -95 4
5445 4 212 -13 -423 -525 -83 372 640 -15 -353 -482 112 429 450 121 -134 14 205 240 68 -95 -41 65
5467 65 -132 -394 -348 289 181 -58 -267 -380 6 466 258 -72 -339 -322 220 600 270 100 -432 -193 -78
5488 -78 150 -36 -168 -163 -176 -146 -283 -210 22 269 39 -208 -388 -261 103 337 130 -267 -369 116 366 197
$$ packed form
5333A89l91KM0J93l03oL13J68J56j70l82O9L58J94j32n18J5J52K00O10n09o24
5355c76L60R2K62l04M4j31k92L72J00l08n2Q45k23m30k45k19L90L62L50p04m53
5376e60J09N67p6Ml05o5K43R1l5Q7o9Q3j74l9J00J0P8K73k23l58K5N41Q0k80j42
5401c5o06J34N83M74l42l25k08L61L19m8k35k43k3P1L43l87J24K25L90p24l28
5422d80n8O87K48l37l43k28K14L66J72M0l65o2M1K99J12m75K78k69J09Qm0j2R9
5445DK08k25m10j02M42M55K68o55l38j29N94L17K1l29k55J48J91L5j72j63N4J06
5467F5j97k62M6O37j08k39k09j13L86M60k08l30k67J7N42L80l30j70n32K39J15
5488g8K28j86j32Nj3L0j37P3K32K47k30k47j80J27L64K34k07l97j02M85K50j69
$$ plain form
5510 197 -109 -402 -192 -2 346 2 -214 52 81 -282 -299 -102 -24 622 328 -308 -451 6 111 376 12
5531 12 -385 -372 189 195 132 -12 -188 27 72 -53 -79 -79 11 206 16 -131 -369 407 592 326 -395 -17 -187
5554 -187 369 805 -128 -313 -283 -31 133 352 -60 -95 18 313 317 176 148 195 146 9 -104 -122 127 148 159
5577 159 -322 -489 -294 417 160 14 -358 -380 -73 472 492 -86 16 146 109 -83 -8 56 252 16 104 -317
5599 -317 -53 188 212 262 -419 -428 -122 442 219 73 -353 -420 -121 349 320 -165 -455 11 244 -113 -281 135
5621 135 5 -219 -139 -344 -267 -114 345 143 -108 -248 -27 42 238 278 -225 -293 111 404 67 -166 -320 -472
5643 -472 273 -185 -26 84 -85 40 -82 0 -68 165 195 -6 -81 -154 -219 229 310 235 -214 -254 -61 398 168
5666 168 -88 -243 -27 87 -62 141 12 121 306 -11 -259 -251 328 632 145 -315 -389 -178 491 374 266
$$ packed form
5510A97l06k93K10J90L48l44k16K66K9l63j7J97P8O46k94o36j43M57J05K65l64
5531A2l97J3N61Oo3j44j76K15M5j25k6%R0J95j90j47k38P76J85k66p21L78j70
5554a87N56M36r33j85L0K52J64K19m12l5J13K95Mj41k8M7m9j37j13j8K49K1J1
5577A59m81j67J95P11k57j46l72k2L07N45K0n78J02J30l7j92P5O4J96k36Q8m21
5599c17K64K41K4N0o81rL06N64k23j46m26o7K99M70k9m85k90M66K33l57j68M16
5621A35j30k24Q0k05P7J53M59k02k51j40K21O9J96M0n03o8M04K93l37k33j54j52
5643d72P45m58J59J10j69J25j22Q2o8K33L0k01p5p3o5M48Q1p5m49m0J93M59k30
5666A68k56j55K16J14j49K03j29J09J85l17k48QN79L04m87m60p4K11O69j17j08
$$ plain form
5687 266 -349 -457 -142 204 285 -135 -279 -198 -6 -61 -148 228 241 215 -106 1 93 282 511 197 -474 -588
5709 -588 -30 96 386 107 -185 -418 40 352 50 -94 62 -129 -18 -42 -118 26 123 115 1 -434 -218 226
5731 226 434 317 -245 -364 -309 192 405 119 -451 -25 -151 26 -16 -65 -158 -8 31 70 -143 -26 191 155
5753 155 -70 -294 -466 419 534 77 55 -118 -192 109 291 190 32 -276 147 334 150 -17 109 -1 82
5774 82 13 -229 -171 221 59 -20 -313 -205 -21 122 285 -272 -405 -62 416 394 -67 -238 -25 -2 254 106
5796 106 -135 -47 -185 94 -32 131 296 166 131 44 -469 -340 232 205 148 -179 -204 -150 41 381 12 100 -76
5819 -76 -122 92 7 -124 -390 526 -131 -81 -167 -105 227 348 63 -364 -233 55 376 162 -90 -405 -7 62
5841 62 329 157 -81 -109 -318 98 -116 -168 -54 -145 -5 -84 152 252 231 275 -168 -543 -79 173 254 295 -79
$$ packed form
5687B66o15j08L15L46Q1m20j44Q1J92n5q7L76J3k6l21J07R2J89K29l14o71j14
5709e88N58J26K90k79k92k33M58L12l02j44J56j91J11k4p6J44R7qj14m35K16M44
5731B26K08j17n62j19N5N01K13k86n70M26j26J77m2m9r3J50L9L9k13J17K17l6
5753A55k25k24j72Q85J15m57k2j73p4L01J82j01j58l08M23J87j84j67J26j10Q3
5774H2o9k42N8L92j62p9k93J08J84J43J63n57j33L43M78k2m61j71K13K3K56j48
5796A06k41Q8j38K79j26J63J65j30l5q7n13J29N72k7n7l27k5N4J91L40l69Q8j76
5819g6m6K14q5j31k66R16o57N0q6O2L32J21k85m27J31K88L21k14k52l15L98O9
5841F2K67j72k38k8k09M16k14n2J14r1J40p9K36J00k1M4m43l75M64K52Q1M1l74
$$ plain form
5864 -79 -230 -198 110 84 44 -101 -506 -75 86 238 162 17 -13 298 -73 -217 98 260 266 -99 -280 -309 -67
5887 -67 294 125 -184 -304 70 81 204 16 -129 -361 -59 52 5 107 67 166 247 115 -518 -220 170 25
5909 25 -15 -482 -554 145 218 369 74 -129 -307 204 290 99 -84 -138 -57 95 -119 -206 34 -23 179 -273 112
5932 112 -136 102 316 152 -320 -344 -125 192 382 -123 -462 -204 47 166 178 -46 -92 -103 -23 53 50 -147 214
5955 214 -83 -207 -258 -446 55 254 -4 -235 -393 14 120 422 -105 3 -303 44 39 57 -26 -304 -192 145
5977 145 -82 -213 41 171 94 -10 -207 -175 240 173 36 -112 -425 88 414 311 -33 -114 -141 109 459 55
5999 55 60 -175 -154 -27 -74 -53 -115 303 -73 -53 -198 -202 154 238 55 -274 -193 -29 35 37 224 -368 -491 -101 147
6024 147 94 -24 11 -98 -158 -21 -102 34 23 135 -169 -205 -105 161 170 127 -28 -146 -111 352 234 -108 -186 -385
$$ packed form
5864g9j51L2L08k6m0j45m05M31J61J52p6j45l0L11l71j44L15J62Ol65j81k9K42
5887f7L61j69l09j20L74J1J23j88j45k32L02J11m7J02m0R9Q1j32o33K98L90j45
5909B5m0m67p2O99P3J51k95k03j78N11Q6j91j83n4Q1J52k14q7K40n7K02m52L85
5932A12k48K38K14j64m72k4K19L17J90n05l39K58K51J19J2k24m6j1Q0P6lj97L61
5955B14k97j24n1j88N01J99k58k31j58M07J06L02n27J08l06L47nJ8q3k78J12L37
5977A45k27j31K54J30p7j04j97L2M15o7j37j48l13N13L26j03l44q1k7K50L50m04
5999E5Nk35K1J27m7K1o2M18l76K0j45mL56Q4j83l29Q1J64O4KJ87n92j23L90K48
6024A47n3j18L5j09o0J37q1J36j1J12l04l6J00K66Rm3j55j18L5M63j18l42p8j99
$$ plain form
6048 -385 -119 168 -4 67 -199 84 231 94 -58 98 89 -34 141 -88 -274 160 164 212 -305 -302 -126 328 412
6071 412 -95 -256 -66 -140 145 -37 -37 140 36 -49 157 18 -64 41 202 -57 -139 -340 236 181 201 -126 -276
6094 -276 -236 42 300 40 -151 -168 -189 84 -37 -40 -129 184 -18 74 -220 18 347 261 -72 8 -100 -82 138
6117 138 -61 -246 -138 -151 144 319 12 10 -342 -189 107 127 74 47 -17 -317 51 19 59 -10 181 -254 -501
6140 -501 -84 31 310 180 -81 -575 -56 349 277 82 -209 -8 143 300 67 107 -107 -146 8 -241 -243 74
6162 74 148 320 -187 -36 -351 -182 408 195 -112 -548 -104 66 234 7 -54 227 -103 91 -241 63 35
6183 35 -14 -171 109 58 45 339 207 -41 -218 191 137 384 121 3 -298 129 143 6 121 -214 -431 -185
6205 -185 -67 241 -114 -91 240 -43 51 -305 -21 225 -34 43 -261 -109 163 315 220 -84 -27 65 -77 436
$$ packed form
6048c85K66K87j72P1k66K83J47j37j52J56rj23J75k29j86M34MM8n17LJ76M54Q4
6071D12n07j61J90p4K85j82%J77j04q5K06j39q2J05J61k59q2k01N76n5K0l27j50
6094b76M0K78K58k60j91j7k1K73j21lq9L13k02R2k94K38L29q6l33Q0j08J8K20
6117A38j99j85J08j3K95J75l07kl52J53K96K0n3k7o4l00L68l2M0o9J91m35k47
6140e01M17J15K79j30k61m94N19M05p2j95k91K01J51J57k33M0k14l9J54k49kL17
6162G4P4J72n07J51l15J69N90k13l07m36M44J70J68k27o1K81l30J94l32L04k8
6183C5m9j57K80n1j3K94j32k48j77M09n4K47k63j18l01M27J4j37J15l35k17K46
6205a85J18L08l55K3L31k83R4l56K84K46k59P7l04J52K72J52r5l04N7R2j42N13
$$ plain form
6227 436 18 -182 -121 -105 140 119 219 -173 114 164 -174 -5 -194 399 216 -64 22 21 -38 193 83 169 -218
6250 -218 -121 160 -38 -16 45 -131 138 81 15 -360 -103 187 199 -121 -66 -111 129 251 -101 -224 -242 80 155
6273 155 213 -21 -448 -289 -12 -9 131 51 -141 -21 -116 104 -42 107 -162 249 -217 -161 -39 -90 234 4
6295 4 -114 -290 -213 363 34 -193 43 4 80 209 34 -117 -32 -69 77 76 -306 -138 90 -133 135 -105 -331
6318 -331 -23 94 134 -33 94 290 45 3 -99 -194 -307 114 451 169 -58 -56 149 -36 -93 12 121 95
6340 95 134 -282 -334 137 198 283 52 -253 -216 -11 80 256 -108 -59 -151 -358 270 -164 -288 -47 48 -76 -50 -95
6364 -95 164 117 -227 57 -416 -50 142 278 23 -34 215 70 358 192 -132 -301 -281 -201 243 97 162 -247
6386 -247 138 261 6 179 -55 157 46 -277 -318 -81 -3 368 -74 -3 -212 -55 172 136 -158 -153 -159 -4 125
$$ packed form
6227D36m18k00O1J6K45k1J00l92K87N0l38J69j89N93j83k80Q6jn9K31j10Q6l87
6250b18R7K81j98K2O1j76K69n7o6l75K57K90J2l20N5m5K40J22l52j23j8L22P5
6273A55N8k34m27J59K77LJ40q0j92J20r5K20j46J49k69M11m66N6J22n1L24k30
6295Dj18j76P7N76l29k27K36l9P6J29j75j51Q5l7J46jl82J68K28k23K68k40k26
6318c31L08J17M0j67J27J96k45m2j02r5j13M21L37k82k27KK05j85n7J05J09k6
6340I5L9m16n2M71O1Q5k31l05L7K05R1J76l64M9r2k07O28m34j24K41R5j24K6m5
6364i5K59m7l44K84m73L66J92J36k55n7K49j45K88j66l24j69K0Q0M44j46O5m09
6386b47L85J23k55J73k34K12j11l23m1K37P8L71m42P1k09J57K27l6k94NoJ55J29
$$ plain form
6409 125 -66 -252 -117 28 -43 -104 -5 -307 278 159 -117 -475 -148 84 194 -90 -352 -297 -96 63 196
6430 196 -12 -175 -79 33 100 152 46 -59 167 70 -144 136 66 341 20 -439 -93 -240 -34 252 376 -40
6452 -40 -63 -128 68 163 13 -55 28 331 -73 45 144 -110 186 72 -136 41 134 309 -112 -97 -417 -271 -10
6475 -10 94 90 -169 -373 37 157 427 60 104 -80 227 119 83 229 -57 -93 86 138 -175 87 -24 180
6497 180 -340 -171 -242 -161 403 94 96 -383 118 94 157 332 -55 158 166 197 -124 -146 34 -41 30 -45 -49 117 206
6522 206 174 -184 -299 50 92 151 197 -71 -382 -104 72 61 -68 -219 -18 -432 62 -65 -21 -123 45 68
6544 68 -84 -31 -26 142 281 78 -127 -304 183 292 27 -97 13 -164 -123 109 -175 -110 -115 -142 -109 -48 53 391
6568 391 -107 -8 137 -20 -89 122 178 -105 -90 -307 -238 92 -65 -393 -35 193 131 293 14 -156 -155 -58 -142
$$ packed form
6409A25j91j86J35J45p1o1R9l02N85j19k76l58L27K32J10k84k62N5K01J59J33
6430A96k08j63R6J12O7N2j06j05K26r7k14K80p0K75l21m59L46j47K06K86J24m16
6452d0k3o5J96R5j50o8Q3L03m04J18R9k54K96j14k08J77R3J75m21J5l20J46K61
6475a0J04mk59k04M10J20K70l67M4j84L07j08l6J46k86l6J79N2l13K62j11K04
6497A80n20J69p1Q1N64l09Km79N01k4O3J75l87K13QL1l21k2J80p5P1p5mJ66Q9
6522B06l2l58j15L49M2N9M6k68l11K78J76j1j29j51K01m14M94j27M4j02J68K3
6544F8j52N3NJ68J39k03k05j77M87J09k65j24J10j77M1K32k84O5nk7L3O1J01L38
6568C91m98R9J45j57o9K11N6k83J5k17O9L30j57l28L58K28o2J62k79j70JR7q4
$$ plain form
6591 -142 52 26 -34 28 109 188 -96 29 391 435 -30 -255 -293 114 256 179 49 -224 -172 260 -20 -100 -150 -4
6615 -4 -57 164 121 -33 -119 76 46 -129 92 44 268 217 -70 -178 -166 18 184 -36 -206 -234 -411 36 39 170
6639 170 -131 -238 352 -25 107 118 84 132 -135 -224 -186 -39 4 90 -44 -39 -149 -6 240 -103 -5 -271 -181 -228
6663 -228 212 -113 -97 -104 -145 357 -267 23 118 -20 3 -211 -10 102 139 134 -321 -336 5 -83 193 152 19 -56
6687 -56 -341 334 291 85 -92 26 -348 91 284 147 65 -330 293 -40 -260 -300 293 266 150 -288 -277 186
6709 186 50 324 -46 -254 -53 -129 72 28 197 -51 60 33 -47 178 126 179 -277 -119 -168 111 -76 142
6731 142 -61 -54 -389 264 -38 -247 196 -65 -108 -213 37 73 162 -42 300 7 113 -106 -146 -126 240 -210
6753 -210 -244 21 40 182 311 -280 -14 -37 -73 107 -83 -56 5 144 66 189 -65 137 -177 -147 3 -179 13
$$ packed form
6591a42J94k6o0O2Q1P9k84J25L62M4m65k25l8M07J42p7j30k73N2M32k80q0n0J46
6615dn3K21m3j54q6J95l0j75K21m8K24n1k87j08J2J84J66k20j70k8j77M47LJ31
6639A70l01j07N90l77J32J1l4M8k67q9L8J47M3Q6j34Nj10J43K46l43R8k66R0m7
6663b28M40l25J6pm1N02o24K90R5j38K3k14K01J12L7nm55j5L41q8K76m1j33p5
6687e6k85O75m3k06j77J18l74M39J93j37q2l95O23l33k20m0N93k7j16m38J1M63
6709A86j36K74l70k08K01p6K01m4J69k48J11k7q0K25n2N3m56J58m9K79j87K18
6731A42k03Pl35O53l02k09M43k61m3j05K50L6Q9k04L42k93J06k19m0K0L66m50
6753b10l4K65J9J42J29n91K66k3l6J80j90K7O1J39p8J23k54K02l14L0J50j82J92
$$ plain form
6776 13 318 41 -85 55 -29 93 23 -33 -171 -136 -154 114 43 263 -58 -223 104 -181 34 179 57 -68
6798 -68 26 -86 14 -94 132 -75 -125 -37 -130 193 14 187 -181 -259 178 9 -19 8 -157 38 145 158 -66
6821 -66 42 140 17 59 191 101 -28 -27 78 -213 -77 -81 -181 56 61 -216 -171 27 19 386 158 233 -138 -113 -71
6846 -71 -48 105 -15 179 117 -195 -170 132 143 114 -80 -128 13 79 288 150 -205 106 108 -17 -86 128 -180 -93
6870 -93 104 31 14 -91 -88 40 -150 -377 -60 190 23 190 -51 -77 -144 -25 248 -155 -199 47 -44 200 150
6893 150 -65 -148 22 106 -68 69 -31 -214 -1 -47 -105 -317 -150 195 74 -153 33 -80 334 40 -158
6914 -158 -178 -58 -7 -29 454 -42 -191 -351 101 -4 -159 -37 -174 207 279 -10 364 103 253 -115 77
6935 77 -9 -218 158 -207 57 -332 -429 94 -35 12 131 49 26 50 189 84 118 107 222 41 -382 -216 236
$$ packed form
6776A3L05k77j26J40q4J22p0n6j38L5j8K68p1K20l21j65L27k85K15J45j22j25
6798f8R4j12J00j08K26k07n0Q8r3L23j79J73l68p8M37j69k8K7j65J95J07J3k24
6821f6J08R8j23M2J32r0j29JJ05k91J36mj00K37Nk77M5J98qL67k28P5l71K5M2
6846g1K3J53j20J94o2l12K5L02J1k9j94m8J41O6K09j38l55L11Kj25o9K14l08Q7
6870i3J97p3j7j05LJ28j90k27L17K50j67J67k41k6o7J19K73m03m4K46r1K44n0
6893A50k15q3J70Q4j74J37j00j83K13m6n8k12J67L45j21k27J86j13M14k94j98
6914a58k0J20N1k2M83m96j49j60M52j05j55J22j37L81P2k89L74k61J50l68J92
6935G7q6k09L76l65K64l89r7N23j29M7J19q2k3K4J39j05L4j1J15j81m23J66M52
$$ plain form
6958 236 -25 153 -9 -357 181 67 99 28 -180 -64 -3 -121 183 92 -156 -259 49 -26 -36 -126 74 -97
6980 -97 1 75 -228 315 84 -175 255 115 -96 127 165 186 -371 -14 88 100 -12 46 -190 -36 257 143
7002 143 -113 -22 256 217 24 218 -271 135 324 267 9 76 -208 97 187 84 -137 -122 68 147 69 125 -160
7025 -160 -141 20 37 -172 48 9 30 -87 -271 -326 -1 260 164 241 -100 -143 -17 111 251 -21 -120 46 -213
7048 -213 104 42 59 167 18 -140 76 -264 -56 49 88 107 -105 -136 13 106 -76 21 249 129 212 -266 -59
7071 -59 -134 -195 22 252 -459 -308 127 13 91 -334 -103 234 -287 67 -210 -173 -293 308 64 -53 -184 -149
7093 -149 -67 101 -133 -96 -248 145 228 184 0 -3 -167 -11 -88 68 -36 79 -9 -75 -268 -114 295 158 141
7116 141 98 -54 -132 -197 -10 8 -244 141 303 -108 177 -63 47 -169 77 -25 13 -227 50 254 -89 67
$$ packed form
6958B36k61J78j62l48N38j14L2p1k08J16O1j18L04r1k48j03L08p5j0r0K00j71
6980i7R8P4l03N43k31k59M30j40k11K23L8K1n57L57J02J2j12N8k36J54K93j14
7002A43k56R1K78l9j93J94m89M06J89n7k58O7k84L05R0j03k21J5J90P9p8N6k85
7025a60J9J61J7k09K20l9K1j17j84n5L25K61r6P7l41m3J26J28J40k72r9J66k59
7048b13L17o2J7J08j49j58K16l40K08J05L9J9k12l1J49R3j82R7K28j20Q3m78K07
7071e9p5o1K17K30p11J51M35j14P8m25K31L37n21L54k77L7j20O01k44j17j31L5
7093a49Q2J68k34L7j52L93Q3m4j84lj64J56p7J56j04J15q8o6j93J54M09j37j7
7116A41m3j52p8o5J87J8k52L85J62m11K85k40J10k16K46j02L8k40K77K04l43J56
$$ plain form
7138 67 18 83 72 92 61 94 -212 154 48 66 145 120 -68 80 -38 -50 91 -81 1 -120 -24 -33 47 60 -65 147
7164 147 -226 80 91 19 -152 42 88 -68 174 276 254 -68 5 100 63 -270 56 14 82 -44 -4 139 -64
7187 -64 -237 32 -69 -24 75 -79 92 205 8 -40 -17 166 -17 62 -140 -81 117 48 65 33 124 246 -203 43
7211 43 -323 51 -114 -171 -172 25 -20 75 149 -51 113 -70 65 -88 288 -239 183 -48 -18 32 177 -85 -29
7234 -29 80 -447 -28 19 -31 -50 -68 -145 -67 -185 128 -96 131 -175 -153 -2 -50 107 3 92 -146 -74 241 -109
7258 -109 -263 55 174 -97 -21 74 28 102 220 -182 -22 -66 145 268 -103 141 -169 -149 -34 59 79 -46 -139
7281 -139 -94 15 -69 185 98 91 -230 -24 -358 139 -27 -83 -29 80 -187 250 -204 168 -108 -68 84 19 -86
7304 -86 -127 -275 -355 -97 -84 91 -148 -95 -187 97 -155 11 -284 122 122 -73 -201 65 65 63 55 -180 132 35 -37
$$ packed form
7138F7m9O5j1K0l1L3l06L66j06J8P9k5j88J48j18j2J41j72Q2j21R6rQ0J3j25K12
7164A47l73L06J1p2j71J94M6j56K42J02k2l22P3R5l7l33L26m2O8j26M0J43k03
7187f4j73K69j01M5R9j54J71J13j97m8K3J83j83P9k02N9J98o9J7l2R1J22m49K46
7211D3l66L74j65n7jJ97m5R5P4k00J64j83J35j53L76n27M22k31L0N0J45k62N6
7234b9J09n27M19M7n0j9j8p7P8j18L13k24K27l06K2J51m8J57j04Q9k38P2L15l50
7258a09j54L18J19k71P6R5m6P4J18m02J60m4K11J23l71K44l10K0J15R3K0j25r3
7281a39M5J09q4K54q7pl21K06l34M97j66n6N4J09k67M37m54L72k76M0J52o5j05
7304h6m1j48q0K58J3J75k39N3r2K84k52J66k95M06%j95j28K66%kqk35L12r7p2
$$ plain form
7329 -37 -18 50 96 308 10 -35 -57 -42 -199 135 90 129 -143 -11 126 109 -96 -76 -62 -160 -167 57 218 -219 444
7354 444 134 242 121 130 -255 -28 42 -41 -185 12 -70 -156 -116 -100 -31 -184 -107 -269 210 129 -207 128 46 148
7378 148 -60 -95 249 238 193 -16 -68 91 10 -73 303 -252 -13 -117 -2 295 46 226 184 -192 -184 96 -158
7401 -158 -64 148 100 -62 154 68 216 -176 -171 75 153 206 -171 -156 174 211 -113 35 -71 42 -197 179 174 -11
7425 -11 -442 -55 176 86 -305 -28 -181 103 -99 -92 259 12 -47 -143 -223 67 46 88 149 30 -39 21 -55 133
7449 133 106 -106 -107 -284 94 65 -59 155 -29 169 56 61 -64 -114 -63 163 100 -72 85 253 -62 -20 386
7472 386 -58 51 220 133 -58 100 -194 -1 -139 -10 -84 -284 219 -11 -88 -178 24 215 -142 -91 240 285
7494 285 -28 18 89 111 381 -172 72 -128 -108 62 184 -73 163 152 -146 -46 258 18 221 -42 -67 89
$$ packed form
7329c7J9O8M6K12k98m5k2J5j57L34m5L9k72J32J37j7k05K0J4r8pK24J61m37O63
7354D44l10J08j21Rl85K27P0q3j44J97q2q6M0J6O9j53P7j62M79q1l36L35q2J02
7378A48k08l5L44j1m5k09n2J59q1q3L76n55K39j04J15K97k49J80m2l76QK80k54
7401a58R4K12m8j62K16q6J48l92NK46P8N3l77J5L30L7l24J48j06J13k39L76nj85
7425a1m31L87K31r0l91K77j53K84k02PL51k47n9r6q0K90k1M2O1j19o9O0p6J88
7449A33k7k12jj77L78k9j24K14j84J98j13Nj25n0N1K26o3j72J57J68l15M2M06
7472C86m44J09J69q7j91J58k94J93j38J29p4k00N03k30p7r0K02J91l57N1L31M5
7494B85l13M6P1K2K70n53K44k00K0J70J22k57K36j1k98J00L04k40K03k63k5J56
$$ plain form
7516 89 -127 -181 -125 -6 -69 -9 83 16 -204 183 177 -86 57 -249 112 -76 21 -348 -73 155 39 -88 24
7539 24 51 225 -139 -151 33 -100 -84 -140 -302 -121 303 -136 -126 63 -222 -157 -151 89 -142 117 -204 -291 126
7562 126 220 -102 -193 -15 -32 -212 107 18 68 28 -88 140 -253 60 6 23 47 270 174 -70 -38 92 157 68
7586 68 152 -68 -90 191 285 -108 -25 -53 101 -37 122 148 -64 42 117 209 -160 14 -36 3 -21 177 -115 -120 67
7611 67 95 320 -128 135 86 183 -117 224 235 98 -48 -187 219 120 -161 183 15 -296 74 -33 139 -22
7633 -22 -31 204 139 332 -28 -50 5 47 -45 -44 -185 -34 -61 -136 111 91 -121 145 -142 -148 -153 277 211 -144 -257 -180
7659 -180 -112 -160 -25 -180 147 -124 224 54 20 -38 345 -56 237 -114 -129 -136 213 -40 -7 157 -78 14 -58
7682 -58 -220 -152 -69 -12 -120 108 95 31 58 9 137 -319 -219 -116 -157 -114 -120 -76 -21 -130 -28 -50 -219 -87 -127
$$ packed form
7516H9k16n4N6J19o3O0R2o7k20L87ok63J43l06L61j88R7l69K75K28j16j27J12
7539B4K7J74l64j2J84j33J6n6j62J81M24m39J0J89k85O5OK40k31K59l21q7M17
7562A26R4l22r1J78j7j80L19q9N0m0j16K28l93L13n4J7K4K23r6k44L2J30O5q9
7586F8Q4k20k2K81R4l93Q3k8J54j38J59K6k12J06P5R2l69J74n0L9k4J98k92nJ87
7611F7K8K25m48K63m9R7l00L41J1j37j46j39M06r9k81L44j68l11L70j07J72j61
7633b2rK35o5J93l60k2N5M2r2Jj41J51k7p5K47k0k12K66k87onM30o6l55j13P7
7659a80O8m8J35j55L27k71L48j70l4n8L83m01K93l51j5pL49k53L3J64k35R2p2
7682e8j62O8Q3N7j08K28j3o4K7m9J28m56J00J03m1M3oM4N5j09J02k2j69J32m0
$$ plain form
7707 -127 117 -24 -114 49 -280 183 35 -73 180 -68 -41 139 -140 0 134 170 -60 -53 -14 -60 -1 121 17
7730 17 -135 -10 24 -41 136 129 -122 49 105 70 29 15 127 81 35 270 216 -51 166 -59 136 -65 -220 324
7754 324 250 15 -127 -173 -28 -9 -169 281 -95 195 161 -80 -224 109 -85 142 -20 -89 1 -46 -54 104 -73
7777 -73 23 -67 -439 33 37 -32 66 191 -62 312 29 112 -113 83 -49 105 -6 -104 64 101 -99 -178 174 -70
7801 -70 115 157 50 132 -6 17 47 63 -164 -156 -17 -12 -141 -23 80 177 105 60 -355 -184 108 174 133 -134 -299
7826 -299 -104 159 -299 41 112 -136 53 95 -44 153 166 169 58 -30 97 74 -140 6 73 101 -189 -200 10
7849 10 -367 -119 227 -195 99 182 -195 72 125 223 61 -18 -170 -203 10 -108 101 74 -10 94 -123 185 14
7872 14 68 -120 120 -96 -200 271 -15 -117 -23 -79 -133 237 -114 -146 -112 36 -1 40 432 83 11 -25 1 180
$$ packed form
7707a27K44j41r0J63l29M63j48j08K53k48K7J80k79J40J34L6k30PL9m6N9J22j04
7730A7j52J25L4o5J77pk51J71N6l5m1j4J12m6m6K35n4k67K17k25J95k01j55N44
7754C24p4k35j42m6J45J9j60M50l76K90l4k41j44L33j94K27j62o9R0m7qJ58j77
7777g3R6r0l72M72Mo9R8J25k53L74k83Q3k25J96j32J54j11r8J68L7k00p9L52k44
7801g0J85M2j07Q2j38K3L0J6k27QJ39Nj29J18J03R7p2m5m15J71K92O6m1k67j65
7826b99J95K63m58L40P1k48J89M2j39J97J3Lj11q8J27k3k14J46O7K8k90j1K10
7849A0l77K48L46m22K94Q3l77K67N3R8j62p9j52l3K13j18K09k7q4J04k17L08j71
7872A4N4j88K40k16j04M71k86j02R4n6n4L70l51l2L4J48l7M1L92l49p2l6K6J79
$$ plain form
7896 180 42 97 0 188 -2 47 -138 -45 -124 193 -12 -50 221 -140 64 173 -92 84 -36 130 -39 -160
7918 -160 193 8 20 88 194 -21 107 -12 -44 -21 -128 -107 -93 -65 39 -74 96 -160 193 116 -383 74 12
7941 12 -139 -12 44 90 -69 -63 117 -4 -228 86 -32 -113 -6 -45 -130 22 10 -129 -252 127 189 24 52 -26
7965 -26 -52 -64 17 -2 19 -27 12 101 -77 61 -24 -59 19 -18 12 -366 12 56 40 114 220 -93 -159 78 -128 244
7991 244 141 -174 -37 34 -109 189 154 42 -34 -39 4 23 -57 119 37 206 -163 -261 273 109 28 -73 104 -79
8015 -79 183 -65 -27 296 187 -1 4 165 205 8 3 95 -74 120 205 83 69 30 -203 232 0 85 22 -88
8039 -88 -110 -7 106 -233 113 81 -96 -272 -68 -173 -36 264 -157 92 84 -64 9 -9 64 50 77 -501 143
8062 143 -225 -144 -60 -36 -107 -206 97 -26 293 14 -69 145 51 199 -237 -256 -78 -28 -25 -40 202 -217 -105 -2
$$ packed form
7896A80j38N5r7J88j90M9j85R3p9L17k05l8K71l61K04J09k65J76j20J66j69j21
7918a60L53j85J2O8J06k15J28j19l2K3j07K1J4K8J04j13J70k56L53p7m99M57o2
7941A2j51J27N6M6j59OJ80j21k24L14j18q1J07l9q5J52j2j39j23L79O2j65K8p8
7965b6k6j2Q1j9K1m6L9Q9j78J38q5l5P8l7L0l78L78M4j6P4J06l13o6K37k06L72
7991B44j03l15J37P1j43K98l5j12p6nM3J9q0J76q2J69l69r8N34j64q1j01J77j83
8015g9K62k48L8L23j09j88NJ61M0j97nR2j69J94Q5j22j4l9k33M35k32Q5o3j10
8039h8k2J03J13l39L46l2j77j76K04j05J37L00m21K49qj48P3j8P3j4K7n78O44
8062A43l68Q1Q4K4p1r9L03j23L19k79q3K14r4J48m36j9J78N0Lj5K42m19J12J03
$$ plain form
8086 -2 101 -5 -57 53 -99 -70 -107 -47 84 39 -15 97 -76 108 61 -203 -73 92 -57 42 19 -48 -9 -126
8110 -126 -63 -158 -77 19 139 -26 -173 -192 130 -33 188 133 180 -151 -68 -155 111 55 -178 84 6 24 -23 -88 5
8135 5 68 -144 49 116 -83 -114 -121 47 -219 -92 -114 62 4 276 -277 186 0 -116 -159 88 10 -117 4 -114
8159 -114 -82 -14 -12 76 156 -155 59 57 220 1 122 -23 150 117 352 105 199 195 -386 131 175 205 -30 -29 -65 216
8185 216 -128 5 -134 -90 134 -12
$$ packed form
8086bJ03j06n2J10j52K9l7O0J31m5n4J12j73J84m7k64J30J65j49R9k3o7L9j17
8110a26O3r5Q1R6J20j65j47j9L22j63K21n5M7l31Q3q7K66n6k33K62p8J8m7o5R3
8135EO3k12J93O7j99l1pJ68k66J27k2J76n8K72n53M63j86j16m3K47p8j27J21j18
8159a14L2O8KQ8Q0l11K14kJ63k19J21j45J73l3K35k47R4mn81N17M4L0k35Jl6K81
8185B16l44J33j39M4K24j46
8191a2
$$ Imaginary data points
##PAGE= N=2
##DATA TABLE= (X++(I..I)), XYDATA
$$ plain form
0 0 0 0 0 0 0 0 0 0 1 -8 8 -8 16 -16 21 -24 32 -40 48 -57 72 -87 103 -120 137 -161 190 -217 251 -289 330
31 330 -376 429 -486 548 -618 693 -777 868 -969 1079 -1198 1330 -1473 1629 -1801 1987
47 1987 -2190 2413 -2659 2930 -3226 3558 -3924 4336 -4801 5327 -5933 6636 -7464 8455
61 8455 -9672 11200 -13185 15888 -19790 25943 -37131 63928 -265909 -34523 457727 -174176
73 -174176 -201477 211994 47105 -259411 129301 243098 -109701 -119399 127809 -15716 -78511
84 -78511 112606 62719 -142944 -18323 97593 -32533 -74874 57934 35266 -74104 -47750
95 -47750 36244 1039 -39110 6672 22442 -44001 -20892 69240 32530 -61275 -5127 63375
107 63375 4420 -4256 47087 -43731 -95975 60351 98136 -68365 -79281 17242 -19009 -8356
$$ packed form
0@%%%%%%%%JrJ6j6K4l2L7m5N6p2Q8j05J29j59J90k23K57k98L51m07M68n40O19
31C30p06Q05r15J034j166J311j470J645j837K048k277K528k803L102l430L788
47A987m177M603n072N589o156O784p482Q260r137J0128j1260J2569j4100J5919
61H455j8127K0872k4385K9073l5678M5733o3074J01059l29837K31386M92250o31903
73a74176k7301M13471j64889l06516L88712J13797l52799r698K47208j43525o2795
84g8511J91117m9887k05663J24621J15916j30126m2341J32808k2668j09370K6354
95d7750Q3994l5205m0149M5782J5770o6443K3109R0132l6710r3805N6148O8502
107F3375n8955q676N1343r0818n2244J56326L7785j66501j0916R6523l6251J0653
$$ plain form
119 -8356 92566 7901 -119138 -15350 78780 5513 8185 43521 -62705 -65050 88152 53029
131 53029 -74862 4914 61356 -53262 -37637 70372 -2363 -65107 42998 39123 -84463
142 -84463 -25803 80425 -6997 -54903 41344 12156 -76966 19292 93946 -26359 -68403 42159
154 42159 42045 -43917 -7378 40608 -20781 -22339 52086 6316 -74561 -1783 70466 2892 -37520
167 -37520 6109 -11326 -40909 40736 83151 -29685 -83918 17845 55589 -8162 802 23175
179 23175 -44398 -48959 48986 43679 -44949 -16454 44622 -10667 -32403 41853 22242 -47789
191 -47789 9474 50471 -36637 -46971 42238 28052 -32961 2297 19143 -29054 -148 46702
203 46702 -13811 -43721 24094 20227 -34651 -855 22760 -23674 1261 55288 -3054 -55262
$$ packed form
119h356J00922q4665j27039J03788R4130p3267K672L5336j06226k345J53202l5123
131E3029j27891P9776N6442j14618J5625J08009p2735o2744J08105l875j23586
142h4463N8660J06228q7422m7906R6247k9188q9122R6258P4654j20305m2044J10562
154D2159j14q5962L6539M7986o1389j558P4425m5770q0877P2778P2249o7574m0412
167c7520M3629j7435k9583Q1645M2415j12836n4233J01763L7744o3751Q964K2373
179B3175o7573m561R7945n307q8628K8495O1076n5289k1736P4256j9611p0031
191d7789N7263M0997q7108j0334Q9209j4186o1013L5258J6846m8197K8906M6850
203D6702o0513k9910O7815l867n4878L3796K3615m6434K4935N4027n8342n2208
$$ plain form
215 -55262 10189 50240 8180 -1366 -353 -43904 -27582 49696 32010 -44097 -35295 1594 -7444
228 -7444 7931 39979 624 -47560 -5712 43022 8658 -18485 15076 14316 -21425 -1173 24164
241 24164 -9883 -13932 31968 9983 -48346 -14048 39062 -2463 -26608 19045 -1670 -48666
253 -48666 12546 53325 -24480 -42986 31697 23157 -28886 8201 27207 -28379 -8091 54258
265 54258 -3693 -66478 2691 43290 -12854 -12281 17399 -33117 -44316 41941 52890 -32667
277 -32667 -39197 17168 7543 -6738 30605 14993 -39421 -9570 37315 256 -25134 14479
289 14479 13334 -28427 -12010 17229 -14359 -19928 30607 18335 -40378 -18679 29966 9369
301 9369 -8711 7517 -10223 -27870 13899 30837 -16914 -20550 22382 8716 -17819 11198
$$ packed form
215e5262O5451M0051m2060r546J013m3551J6322P7278j7686p6107Q802L6889r038
228g444J5375L2048l9355m8184M1848M8734l4364k7143L3561p60l5741K0252K5337
241B4164l4047m049M5900k1985n8329L4298N3110m1525k4145M5653k0715m6996
253d8666O1212M0779p7805j8506P4683q540n2043L7087J9006n5586K0288O2349
265E4258n7951o2785O9169M0599n6144N73K9680n0516j1199Q6257J0949q5557
277c2667o530N6365r625j4281L7343j5612n4414K9851M6885l7059k5390L9613
289A4479j145m1761J6417K9239l1588n569N0535j2272n8713K1699M8645k0597
301I369j8080J6228j7740j7647M1769J6938m7751l636M2932j3666k6535K9017
$$ plain form
313 11198 11820 -27717 -2942 36945 -7500 -45650 -3669 23660 5580 8597 5519 -31876 -17160
326 -17160 44282 31803 -23536 -14148 5863 -16244 -4232 29667 -2867 -41470 -4388 26120
338 26120 -7085 -15488 17446 10432 -12496 4921 5869 -19618 4176 36373 -1707 -34553 352
351 352 20077 -2535 5382 19874 -16076 -29694 19080 25154 -20792 -16613 10296 -5848 -8958
364 -8958 14019 -5478 -24869 18848 39039 -13617 -28637 16881 18542 -3889 18233 13360 -38520
377 -38520 -25425 33923 21562 -22966 -13335 -157 -14770 3873 29030 -5246 -28655 11788
389 11788 20270 -19931 -8496 27777 5165 -15329 12643 10457 -21148 3325 39964 4420
401 4420 -32086 -5196 9570 -5933 8350 12176 -27482 -24838 22961 15460 -22089 -5363 17342
$$ packed form
313A1198O22l9537K4775L9887m4445l8150M1981K7329j8080L017l078l7395J4716
326a7160O1442j2479n5339R388K0011k2107J2012L3899l2534l8603L7082L0508
338B6120l3205q403L2934p014k2928J7417R48k5487K3794L2197l8080l2846L4905
351C52J9725k2612P917J4492l5950j3618M8774O074m5946M179K6909j6144l110
364h958K2977j9497j9391M3717K0191n2656j5020M5518J661k2431K2122m873n1880
377c8520J3095N9348j2361m4528R631J3178j4613J8643K5157l4276k3409M0443
389A1788Q482m0201J1435L6273k2612k0494K7972k186l1605K4473L6639l5544
401D420l6506K6890J4766j5503J4283L826l9658K644M7799p501l7549J6726K2705
$$ plain form
414 17342 -5700 -7994 18422 675 -20925 16174 33682 -9592 -23682 4674 6153 2972 18813
427 18813 -978 -39656 -15261 31022 11811 -18768 -1413 960 -18987 6472 30933 -4885
439 -4885 -22222 12475 13994 -16765 -3784 19550 -1359 -8673 12926 -5863 -28654 12951 35792
452 35792 -12253 -29358 4725 2994 -12098 13510 14377 -26972 -20260 24760 14633 -15423 711
465 711 10881 -7850 2908 17003 -13351 -22912 18422 24204 -15961 -19530 5344 465 -1668
478 -1668 21292 7526 -30564 -13107 23866 9710 -9641 778 -5710 -18619 5681 17705
490 17705 -13785 -14868 19972 6373 -25830 -848 21239 -2525 -1855 14633 -14301 -27735 17081
503 17081 30612 -7982 -13625 1363 -11658 -3061 30604 7703 -35022 -10191 19800 -5029
$$ packed form
414A7342k3042k294K6416j7747k1600L7099J7508m3274j4090K8356J479l181J5841
427A8813j9791l8678K4395M6283j9211l0579J7355K373j9947K5459K4461l5818
439d885j7337L4697J519l0759J2981K3334k0909p314K1599j8789k2791M1605K2841
452C5792m8045j7105L4083j731j5092K5608Q67m1349O712M5020j0127l0056J6134
465G11J0170j8731J0758J4095l0354r561M1334N782m0165l569K4874m879k133
478a668K2960j3766l8090J7457L6973j4156j9351J0419o488j2909K4300J2024
490A7705l1490j083L4840j3599l2203K4982K2087k3764O70J6488k8934j3434M4816
503A7081J3531l8594n643J4988j3021Q597L3665k2901m2725K4831K9991k4829
$$ plain form
515 -5029 -12985 10144 -914 -17472 6539 14402 -13240 -8596 22242 12136 -12401 -3179 1609
528 1609 -8084 10653 24221 -12475 -34143 1537 22133 -3717 -11439 4441 -7538 -16045 12940
541 12940 16226 -16346 -8991 19770 3256 -13217 8067 8652 -9201 9857 21248 -17309 -26098
554 -26098 18045 21444 -13004 -7046 4040 -15818 -5951 22984 2027 -23503 -143 12433 -9114
567 -9114 -5553 11347 -4260 -7893 19627 9758 -24466 -4152 30534 12673 -10511 -5262 -6838
580 -6838 -9651 12871 19476 -12272 -25224 -3172 5826 2738 11430 3385 -18574 -5991 19290
593 19290 5609 -10425 5851 12161 -6775 -8505 5877 1094 -334 14368 3396 -22821 -9694
606 -9694 17285 8750 -5516 -2217 -10483 -18133 6720 24132 -2959 -22032 1923 15857 1138
$$ packed form
515e029p956K3129j1058j6558K4011P863k7642M644L0838j0106k4537R222M788
528A609r693J8737J3568l6696k1668L5680K0596k5850p722J5880j1979q507K8985
541A2940L286l2572P355K8761j6514j6473K1284N85j7853J9058J1391l8557q789
554b6098M4143L399l4448N958J1086j9858R867K8935k0957k5530K3360J2576k1547
567i114L561J6900j5607l633K7520r869l4224K0314L4686j7861k3184N249j576
580f838k813K2522O605l1748j2952K2052Q998l088Q692q045k1959J2583K5281
593A9290j3681j6034J6276O310j8936j730J4382m783j428J4702j0972k6217J3127
606i694K6979q535j4266L299q266p650K4853J7412k7091j9073K3955J3934j4719
$$ plain form
619 1138 2147 8710 -4333 -4176 15103 5367 -18413 -7102 13266 2392 -7308 1315 -6828 -14315
633 -14315 11960 22326 -9275 -18627 5452 7716 -2994 4905 4852 -9966 -3028 10249 -2587
646 -2587 -10767 6817 10594 -4002 -4606 -2985 -9250 2844 18446 2961 -18258 -12251 6499 13765
660 13765 9288 -1031 -11565 -8441 7406 12794 1616 -6851 -4845 -2003 -1003 81 -15 -3799
674 -3799 -2031 6430 741 -14437 -4188 15749 9473 -4713 -4540 -5801 -4125 13282 14996 -9622
688 -9622 -16324 886 3703 -535 6623 -773 -16374 -1317 14610 -3299 -11467 6330 8757 -2849
702 -2849 -954 -1305 -8235 3651 17390 1128 -16179 -5081 5153 2587 6845 5012 -12619 -13733
716 -13733 7919 12170 -4788 -10541 -160 2217 -3743 -1171 334 -3878 3853 12516 -461 -14026
$$ packed form
619A138J009O563j3043J57J9279r736k3780J1311K0368j0874r700Q623q143p487
633a4315K6275J0366l1601r352K4079K264j0710P899n3j4818O938J3277j2836
646b587q180J7584L777j4596o04J621o265J2094J5602j5485k1219O007J8750P266
660A3765m477j0319j0534L124J5847N388j1178q467K006K842J000J084r6l784
674c799J768Q461n689j5178J0249J9937o276j4186J73j261J676J7407J714k4618
688i622o702J7210K817m238P158p396j5601J5057J5927j7909q168J7797K427j1606
702b849J895l51o930J1886J3739j6262j7307J1098J0234k566M258j833j7631j114
716a3733K1652M251j6958n753J0381K377n960K572J505m212P731Q663j2977j3565
$$ plain form
730 -14026 -1095 13082 6251 -827 -1242 -11492 -11795 12224 17311 -9177 -15285 3279 4254 -1038
744 -1038 6964 2620 -10580 -1368 9369 -5038 -10492 7368 8721 -4981 -1502 1458 -8990 1509
758 1509 21052 5171 -18844 -9995 6003 4360 2579 2686 -10553 -13356 7738 13314 -3578 -4573
772 -4573 6588 1437 -3067 5984 2730 -7938 1858 13352 -2595 -17931 -3214 10789 4750
785 4750 -38 -1758 -11086 -6116 13057 11847 -5967 -7757 547 100 1740 7296 -142 -9064 2042
800 2042 9394 -4583 -9203 4555 8476 387 -3165 -6605 -7897 4533 14966 2355 -11689 -4794
814 -4794 3339 3260 10121 8706 -10157 -11529 8890 10275 -5434 -4865 2509 -1766 -2581 2483 -4653
829 -4653 -8042 8328 10571 -9690 -11120 4208 5021 3064 10779 2091 -14920 -4605 16928 10235
$$ packed form
730a4026J2931J4177o831p078m15j0250l03K4019N087k6488o108J8564R75n292
744a038Q002m344j3200R212J0737j4407n454J7860J353j3702L479K960j0448J0499
758A509J9543j5881k4015Q849J5998j643j781J07j3239k803K1094N576j6892r95
772d573J1161n151m504R051l254j0668R796J1494j5947j5336J4717J4003o039
785D750m788j720r328M970J9173j210j7814j790Q304m47J640N556p438q922J1106
800B042P352j3977m620J3758L921q089l552l440j292J2430J0433j2611j4044O895
814d794Q133p9O861j415j8863j372K0419J385j5709N69P374m275q15N064p136
829d653l389J6370K243k0261j430J5328Q13j957P715q688j7011J0315K1533o693
$$ plain form
843 10235 -7280 -5315 -400 -3982 1307 5277 -5474 -7751 5114 4397 -7966 -5343 6398 5709
857 5709 511 1465 -3480 -9492 3581 17312 5012 -10797 -6653 1551 4371 8188 4514 -10257
871 -10257 -11215 5210 5694 -8259 -5200 3385 -2933 -3908 3933 -1426 -5923 8235 13474 -2092 -9382
886 -9382 637 5917 5859 7487 -2558 -15158 -4038 10870 3957 -5099 -2338 -3212 -5236 2603 4674
901 4674 -4429 -5275 3856 3405 -5325 -4009 1769 4364 7692 3228 -9678 -8257 8608 12035 -414
916 -414 -6972 -5467 -5669 -638 9564 3323 -12141 -6957 6913 2409 -3507 2184 2044 -2414 3906
931 3906 4649 -9036 -6360 13320 9315 -10583 -7763 2525 -2149 1959 12703 -1773 -18145 -3711
945 -3711 12628 3436 -4499 60 -2918 -6089 5604 6927 -7642 -3873 10431 2302 -10576 -2758
$$ packed form
843A0235j7515J965M915l582N289L970j0751k277J2865p17j2363K623J1741o89
857E709n198R54m945o012J3073J3731j2300j5809M144Q204K820L817l674j4771
871a0257r58J6425M84j3953L059Q585o318r75P841n359m497J4158N239j5566p290
886i382J0019N280n8J628j0045j2600J1120J4908o913r056K761q74k024P839K071
901D674r103q46R131m51q730J316N778K595L328m464j2906J421J6865L427j2449
916d14o558J505k02N031J0202o241j5464N184J3870m504n916N691j40m458O320
931C906P43j3685K676J9680m005j9898K820J0288m674M108J0744j4476j6372J4434
945c711J6339r192p935M559k978l171J1693J323j4569L769J4304q129j2878P818
$$ plain form
959 -2758 5960 1323 1570 4667 -6073 -11912 3963 14490 2154 -7663 -5127 -2513 2732 10209
973 10209 2922 -9428 -4411 6409 2504 -3514 209 754 -2899 1611 2145 -8003 -6060 6883
987 6883 6620 -2211 -4667 -3970 -45 9842 9870 -4513 -9446 2330 6181 223 293 682 -5502 -2343
1003 -2343 5055 -401 -6466 1340 6026 203 -3903 -3277 -3137 2665 11729 3339 -13202 -8300 8513
1018 8513 9133 2588 1386 -4429 -8173 2855 11524 345 -9278 -2485 489 -4767 -749 2870 -3983
1033 -3983 -1663 7415 -615 -10151 2048 14136 5235 -4346 -2321 -2030 -1262 8439 9121 -6390 -11382
1048 -11382 -903 4555 2921 333 -4522 -7346 -63 6304 93 -7276 -988 6409 2344 -2264
1062 -2264 -1434 -107 3052 7353 3548 -5327 -6013 1179 5296 2828 -1916 -7002 -6000 3057 5706
$$ packed form
959b758Q718m637K47L097j0740n839J5875J0527j2336r817K536K614N245P477
973A0209p287j2350N017J0820l905o018L723N45l653M510N34j0148J943J2943
987F883k63q831k456O97L925R887K8j4383m933J1776L851n958P0L89o184L159
1003b343P398n456o065P806M686n823m106O26J40N802R064q390j6541M902J6813
1018H513O20o545j202n815l744J1028Q669j1179r623O793K974n256M018L619o853
1033c983K320R078q030r536J2199J2088q901r581K025K91P68R701O82j5511m992
1048a1382J0479N458j634k588m855k824P283O367o211p369O288P397m065m608
1062b264Q30J327L159M301l805q875o86P192M117k468m744n086J002R057K649
$$ plain form
1077 5706 -3051 -4875 2037 2946 -324 -775 -1594 -22 5867 5896 -3261 -7285 -1167 5132 5886 3610
1093 3610 -5543 -11958 -1877 10046 5365 -4571 -6797 -3778 557 4007 3192 -1291 -2666 296 1496
1108 1496 -1265 -604 2128 3312 1137 -2974 -5253 -2481 4582 8361 743 -10382 -8005 4107 8003
1123 8003 3041 -2204 -6468 -4891 4053 7242 463 -4228 -1370 1577 1455 1156 -1260 -3901 1126
1138 1126 4927 -2316 -8635 -2850 4809 4483 -436 -3967 -3490 -125 4831 6469 -366 -5564 -1499
1153 -1499 3563 2360 -585 -1600 -1231 911 2801 -819 -6928 -1420 7946 3922 -6014 -6461 -1998
1168 -1998 1703 6702 4528 -5555 -8967 251 7632 5669 1213 -2906 -4566 297 5830 1360 -4310
1183 -4310 -1345 1427 -1624 -4100 -2294 1233 3491 2194 -2028 -5915 -2342 5916 7848 2126 -4137
$$ packed form
1077E706q757j824O912R09l270m51q19J572N889K9r157m024O118O299P54k276
1093C610r153o415J0081J1923m681r936k226L019M335L450q15m483j375K962J200
1108A496k761O61K732J184k175m111k279K772P063L779p618j1125K377J2112L896
1123H003m962n245m264J577Q944L189o779m691K858K947j22k99k416k641N027
1138A126L801p243o319N785P659l26m919l531M77L365M956J638o835n198M065
1153a499N062j203k945j015L69K142J890l620o109N508R366m024r936m47M463
1168a998L701M999k174j0083l412R218P381j963m456m119j660M863N533m470n670
1183d310K965K772l051k476J806L527K258j297m222l887L573Q258J932n722o263
$$ plain form
1198 -4137 -6430 -470 7905 7449 -2267 -7267 -2067 2984 1873 -128 -1233 -3102 -1024 2334 -1657
1213 -1657 -4713 1047 4836 1616 -717 -2436 -4061 2163 10162 4388 -7826 -5890 3031 3477 1782
1228 1782 1310 -4211 -5754 1874 4230 -1633 -2975 1110 1112 -552 226 -1780 -1880 4694 8189 -1485
1244 -1485 -8437 -1924 5275 4589 1814 -2834 -7263 -3856 5295 5869 -2301 -4915 -981 242 1213 3204
1260 3204 -621 -3379 2419 4333 -3633 -5488 3474 6797 1549 -1962 -3078 -4258 1202 8396 3052
1275 3052 -6906 -6028 -183 2153 4019 1996 -4400 -5222 2927 5853 -800 -2716 2462 2370 -1192 -1518
1291 -1518 -2797 -2159 3168 4278 -2661 -7020 -2916 2803 4968 4187 -1732 -7541 -2111 7368 5302
1306 5302 -2349 -2333 -714 -133 2338 1888 -1919 -1533 3208 1306 -4498 -3340 1299 1754 1958 747 -6415
$$ packed form
1198d137k293N960Q375m56r716n000N200N051j111k001j105j869K078L358l991
1213a657l056N760L789l220k333j719j625O224P999n774j2214J936Q921M46j695
1228A782m72n521j543P628K356n863j342M085Kj664P78k006j00O574L495r674
1244a485o952O513P199o86k775m648m429L407R151N74q170k614L934J223R71J991
1260C204l825k758N798J914p966j855Q962L323n248l511j116j180N460P194n344
1275C052r958Q78N845K336J866k023o396q22Q149K926o653j916N178r2l562l26
1291a518j279O38N327J110o939m359M104N719K165p81n919n809N430R479k066
1306E302p651J6J619N81K471m50l807L86M741j902n804J158M639M55K04j211p162
$$ plain form
1323 -6415 -7503 2651 8776 2210 -4634 -4010 -160 3489 5302 2368 -3485 -2667 2488 1876 -1907
1338 -1907 -1396 314 -112 -754 -957 -3795 -3275 3931 6658 -2013 -7733 -1814 4033 5088 4195 -721
1354 -721 -6003 -1673 5852 4745 -1472 -2198 -1040 -1823 256 1480 -3184 -3207 3212 1676 -4898 -4159
1370 -4159 652 3618 4451 1123 -5251 -4604 4110 7914 2310 -2294 -3172 -2547 2216 5558 620 -5162
1386 -5162 -2589 1439 470 -1835 -2129 -340 2060 1509 -1924 -4113 -66 5833 5181 -851 -3904 -2771
1402 -2771 905 5480 4694 -2273 -7535 -2223 4194 2575 -1390 -1741 -2133 -983 1996 462 -3988 104
1418 104 5376 1026 -4074 -1091 1571 1901 4866 3637 -5790 -6845 3557 6659 599 -2798 -3316
1433 -3316 -3290 941 4408 45 -4376 -608 2485 -303 -1594 624 840 1062 2467 -516 -5235 -2258
$$ packed form
1323f415j088J0154O125o566o844O24L850L649J813k934n853Q18N155o12l783
1338a907N11J710m26o42k03k838N20P206K727q671n720N919N847J055q93m916
1354g21n282M330P525j107o217p26J158p83K079J224m664k3O419j536o574P39
1370d159M811K966Q33l328o374O47Q714L804n604m604q78O25M763L342m938n782
1386e162K573M028r69k305k94J789K400n51l433k189M047N899o52o032l053J133
1402b771L676M575p86o967n262N312O417j619l965l51l92J150K979j534m450M092
1418A04N272m350n100K983K662L30K965j229r427j055J0402L102o060l397n18
1433c316K6M231L467m363m421L768L093k788j291K218K16K22J405k983m719K977
$$ plain form
1449 -2258 4589 5323 -1008 -5245 -3995 847 5747 4171 -2984 -5453 -621 2629 1572 931 -340
1464 -340 -1456 -26 2221 210 -2322 691 3988 800 -3305 -3869 -1974 2484 5150 -158 -7128
1479 -7128 -4217 2774 4636 2530 -441 -3659 -2801 3185 5121 151 -2826 -303 1657 478 -636
1494 -636 -1757 -1221 2292 2223 -2617 -5564 -989 3938 3506 -102 -2414 -3571 262 5413 4313 -1690
1510 -1690 -3287 -543 1986 2208 297 -2309 -1803 1775 1623 -3601 -3764 1591 3401 1115 -2012 -4557
1526 -4557 -3110 3245 6145 1522 -4305 -3893 554 4323 4579 433 -4156 -2447 1800 1781 -225 -1232
1542 -1232 -920 -203 -1037 -2360 -1420 1659 2697 1391 -1750 -3924 -1370 4335 6531 836 -5460 -4282
1558 -4282 1642 4630 3286 -1630 -4645 -2396 2110 2965 51 -2583 -1115 575 349 -720 -904 -951
$$ packed form
1449b258O847P34o331m237J250M842M900j576p155k469M832L250j057o41j271
1464c40j116J430K247k011k532L013L297l188m105n64J895M458K666n308o970
1479g128K911O991J862k106k971l218Q58N986J936m970k977K523J960j179j114
1494f36j121N36L513o9m840k947M575M927m32l608k312j157L833N151j100o003
1510a690j597K744K529K22j911k606N06L578j52n224j63N355J810k286l127k545
1526d557J447O355K900m623n827M12M447L769K56m146m589J709M247j9k006j007
1542a232L12P17q34j323R40L079J038j306l141k174K554N705K196n695o296J178
1558d282N924K988j344m916l015K249M506Q55k914k634J468J690k26j069j84m7
$$ plain form
1574 -951 1902 3457 -445 -3698 -1163 3977 4580 408 -3075 -3304 -626 3056 2036 -2647 -3091 -1010
1590 -1010 378 684 -453 -1847 -546 2538 2325 -2210 -3384 1009 4116 3303 -722 -4488 -3291 2928
1606 2928 5726 1194 -3273 -4325 -1968 2131 3713 738 -3608 -2781 881 1459 55 232 964 579
1622 579 668 -1073 -2461 1767 4840 1672 -3893 -4589 -1368 2073 4328 1970 -5011 -6620 650 5054
1638 5054 2307 -539 -2301 -2898 1003 4845 805 -2848 483 2884 -556 -2018 128 -314 163 2892
1654 2892 117 -5677 -3007 3644 3313 -622 -2143 -2341 -1042 3090 4443 -871 -3768 668 3072
1669 3072 -127 -1391 -183 210 380 1272 -1376 -4468 -1623 4252 3342 -2238 -4011 -2357 911 5187
1685 5187 3899 -2762 -4162 758 3255 2327 1337 -818 -2470 -258 2004 -1049 -2151 1189 1347 -1854
$$ packed form
1574i51K853J555l902l253K535N140O03m172l483k29K678L682j020m683m44K081
1590a010J388L06j137j394J301L084k13m535j174M393L107q13m025l766J197O219
1606B928K798m532m467j052K357M099J582k975m346Q27L662N78j404J77P32l85
1622E79Q9j741j388M228L073l168n565o96L221L441K255k358o981j609P270M404
1638E054k747k846j762n97L901L842m040l653L331K401l440j462K146m42M77K729
1654B892k775n794K670O651l31l935j521j98J299M132J353n314k897M436K404
1669C072l199j264J208L93J70Q92k648l092K845N875r10n580j773J654L268M276
1685E187j288o661j400M920K497r28r90k155j652K212K262l053j102L340J58l201
$$ plain form
1701 -1854 -2170 -1857 -1091 3607 4625 -2288 -5761 -780 3574 3403 2304 -966 -4778 -1655 5049 3769
1717 3769 -1578 -2255 -611 -398 1026 1029 -1716 -1810 1927 1646 -3157 -3305 1846 3601 1491 -474 -2153
1734 -2153 -2858 1808 5654 2315 -3979 -3314 493 1413 1408 721 -2991 -3108 2035 2051 -2715 -2239 2004 1992
1752 1992 -800 -807 -1410 -1223 3205 5101 -631 -5290 -1731 2155 3208 2428 -1486 -5021 -1900 2884
1768 2884 1846 -1266 -1748 -371 142 227 74 -481 847 2290 1329 -2084 -1877 267 2686 3151 -131
1785 -131 -5172 -4079 2186 4260 356 -2942 -3000 -1473 1024 3217 71 -2558 -64 2151 568 -551
1801 -551 850 1088 799 1468 -777 -4207 -1431 3876 3287 -2428 -3951 -1958 608 3070 2395 -1568
1817 -1568 -3830 -793 2836 2121 -261 -193 -84 161 1222 366 -1937 -388 2946 1324 -3425 -3821 384
$$ packed form
1701a854l16L13P66M698J018o913l473M981M354j71j099l270l812L123O704j280
1717C769n347o77J644K13J424Lk745r4L737k81m803j48N151J755k110j965j679
1734b153p05M666L846l339o294O65L807R20no87l712j17N143J6m766M76M243j2
1752A992k792po03J87M428J896n732m659L559L886J053p80l914l535L121M784
1768B884j038l112m82J377N13Q5j53n55J328J443r61l413K07K144K419M65l282
1785a31n041J093O265K074l904l298n8J527K497K193l146k629K494K215j583j119
1801e51J401K38k89O69k245l430K776N307n89n715j523J993K566K462o75l963
1817a568k262L037L629p15k382O8J09K45J061q56k303J549L334j622m749l96M205
$$ plain form
1834 384 2508 1671 -315 -3158 -3774 1213 4534 1877 -1822 -1980 -457 1572 3081 952 -2359 -921
1850 -921 1686 93 -2343 -1114 630 1415 525 -2414 -3554 -504 3037 2795 -79 -2972 -2723 1040
1866 1040 4226 3063 -1504 -3116 -148 1926 1718 135 -1592 -591 1092 0 -2055 -1267 589
1881 589 1508 702 -1943 -3030 -836 2820 3985 582 -2984 -2317 1508 3725 1948 -1281 -2413 -1274
1897 -1274 1193 1969 -826 -1930 5 730 -842 -1346 -412 392 1706 2127 -963 -3741 -683 4086
1913 4086 3674 -691 -2646 -2257 130 3165 2414 -1617 -3103 -636 967 842 -258 -627 -362 171 1026
1930 1026 -861 -1846 928 3187 1480 -1591 -2627 -377 2982 3325 67 -3287 -3038 473 2876 1517
1946 1517 -1344 -2568 -1161 1123 1505 -198 -465 302 1393 865 -1010 -1522 1238 3121 1288 -1892
$$ packed form
1834C84K124q37j986k843o16M987L321k657l699j58J523K029J509k129l311J438
1850i21K607j593k436J229J744P85q90k939j140L050L541k42k874k893K49L763
1866A040L186j163m567j612K968K074k08j583j727J001J683j092k055P88J856
1881E89R19q06k645j087K194L656J165l403l566O67L825K217j777l229j132J139
1897a274K467P76k795j104J935P25j572n04R34Q04J314M21l090k778L058M769
1913D086m12m365j955L89K387L035p51m031j486K467J603j25j100l69K65N33Q55
1930A026j887r85K774K259j707l071j036K250L359L43l258l354K49L511K403j359
1946A517k861j224J407K284L82j703k67P67J091n28j875n12K760J883j833l180
$$ plain form
1962 -1892 -2826 -1148 1951 2979 317 -3255 -3239 -92 2359 2169 -493 -2207 -1035 1386 1328 393 -245
1979 -245 636 1389 109 -1461 -1161 990 2601 1172 -1929 -3485 -1476 1880 3215 204 -3495 -2859
1995 -2859 514 3129 2506 -472 -2165 -61 1531 1623 2 -694 161 813 293 -1449 -1915 316 2098
$$ packed form
1962a892r34J678L099J028k662l572J6L147K451j90k662j714J172K421n8r35o38
1979b45Q81P53j280j570L00K151J611j429l101j556K009L356J335l011l699O36
1995b859L373K615o23k978j693K104J592R2j621o96Q55O52n20j742m66K231J782
$$ [...]
8191c0
##END NTUPLES=NMR FID
##END=
