##TITLE=1H_SAV32-singlet-bat34(cold)
 CDCl3
 8 sc, 
 24.11.2023
##JCAMPDX= 6.0         $$ Bruker NMR JCAMP-DX V2.0
##DATA TYPE= NMR FID
##DATA CLASS= NTUPLES
##ORIGIN= UXNMR, Bruker Analytische Messtechnik GmbH
##OWNER= root
$$ XWIN-NMR		Version 3.5
$$ Fri Nov 24 14:07:21 2023 Russian Standard Time (UT+4h)  she@DPX200
##.OBSERVE FREQUENCY= 200.1313
##.OBSERVE NUCLEUS= ^1H
##.DELAY= (6, 6)
##.ACQUISITION MODE= SIMULTANEOUS
##.ACQUISITION SCHEME= undefined
##.AVERAGES= 8
##.DIGITISER RES= 18
##SPECTROMETER/DATA SYSTEM= spect
##.PULSE SEQUENCE= zg30
##.SOLVENT NAME= D2O
##.SHIFT REFERENCE= (INTERNAL, D2O, 0, 15.7039)
##AUDIT TRAIL= $$ (NUMBER, WHEN, WHO, WHERE, WHAT)
$$ ##TITLE= Audit trail, XWIN-NMR		Version 3.5
$$ ##JCAMPDX= 5.01
$$ ##ORIGIN= Bruker BioSpin GmbH
$$ ##OWNER= she
$$ F:/spectra/data/she/nmr/H-F/1/audita.txt
$$ ##AUDIT TRAIL=  $$ (NUMBER, WHEN, WHO, WHERE, WHAT)
(   1,<2023-11-24 14:05:34.46 +0400>,<she>,<DPX200>,
      <created by zg, POWCHK disabled, PULCHK disabled
       configuration hash MD5:
       00 E9 B6 7A A2 85 ED C7 34 08 36 98 17 FE 4E 26
       data hash MD5: 16K
       10 43 27 0C 6E A8 4E 54 99 0C D4 4B 5B C4 F0 EE>)
$$ ##END=
$$ 
$$ hash MD5
$$ 93 E6 80 BF 9B 91 03 15 7A 59 24 FB 5A 3C B5 92
##$RELAX= 
##$RELAX= 
##$RELAX= 
##$RELAX= 
##$RELAX= 
##$RELAX= 
$$ Bruker specific parameters
$$ --------------------------
##$DU= <F:/spectra>
##$EXPNO= 1
##$NAME= <H-F>
##$PROCNO= 1
##$TYPE= <nmr>
##$USER= <she>
##$AMP= (0..31)
100 100 100 100 100 100 100 100 100 100 100 100 100 100 100 100 100 100 
100 100 100 100 100 100 100 100 100 100 100 100 100 100 
##$AQSEQ= 0
##$AQ_mod= 1
##$AUNM= <au_zg>
##$AUTOPOS= <>
##$BF1= 200.13
##$BF2= 200.13
##$BF3= 200.13
##$BF4= 200.13
##$BF5= 200.13
##$BF6= 200.13
##$BF7= 200.13
##$BF8= 200.13
##$BYTORDA= 1
##$CFDGTYP= 0
##$CFRGTYP= 5
##$CHEMSTR= <none>
##$CNST= (0..31)
1 1 145 1 1 1 1 1 1 1 1 1 1 1 1 1 1 1 1 1 1 1 1 1 1 1 1 1 1 1 1 1 
##$CPDPRG= <>
##$CPDPRG1= <>
##$CPDPRG2= <>
##$CPDPRG3= <>
##$CPDPRG4= <mlev>
##$CPDPRG5= <mlev>
##$CPDPRG6= <mlev>
##$CPDPRG7= <mlev>
##$CPDPRG8= <mlev>
##$CPDPRGB= <>
##$CPDPRGT= <>
##$D= (0..31)
0 1.2 0 0 0 0 0 0 0 0.06 0 0.03 0 0 0 0 0.0002 0 0 0 0 0 0 0 0 0 0 0 0 
0 0 0 
##$DATE= 1700820333
##$DBL= (0..7)
120 120 120 120 120 120 120 120 
##$DBP= (0..7)
150 150 150 150 150 150 150 150 
##$DBP07= 0
##$DBPNAM0= <>
##$DBPNAM1= <>
##$DBPNAM2= <>
##$DBPNAM3= <>
##$DBPNAM4= <>
##$DBPNAM5= <>
##$DBPNAM6= <>
##$DBPNAM7= <>
##$DBPOAL= (0..7)
0.5 0.5 0.5 0.5 0.5 0.5 0.5 0.5 
##$DBPOFFS= (0..7)
0 0 0 0 0 0 0 0 
##$DE= 6
##$DECBNUC= <off>
##$DECIM= 32
##$DECNUC= <off>
##$DECSTAT= 4
##$DIGMOD= 1
##$DIGTYP= 9
##$DL= (0..7)
0 120 120 120 120 120 120 120 
##$DP= (0..7)
150 150 150 150 150 150 150 150 
##$DP07= 0
##$DPNAME0= <>
##$DPNAME1= <>
##$DPNAME2= <>
##$DPNAME3= <>
##$DPNAME4= <>
##$DPNAME5= <>
##$DPNAME6= <>
##$DPNAME7= <>
##$DPOAL= (0..7)
0.5 0.5 0.5 0.5 0.5 0.5 0.5 0.5 
##$DPOFFS= (0..7)
0 0 0 0 0 0 0 0 
##$DQDMODE= 0
##$DR= 18
##$DS= 0
$$ [...]
##$SUBNAM2= <"">
##$SUBNAM3= <"">
##$SUBNAM4= <"">
##$SUBNAM5= <"">
##$SUBNAM6= <"">
##$SUBNAM7= <"">
##$SUBNAM8= <"">
##$SUBNAM9= <"">
##$SW= 18.0517328524113
##$SWIBOX= (0..15)
0 0 2 0 0 0 0 0 0 0 0 0 0 0 0 0 
##$SW_h= 3612.71676300578
##$TD= 16384
##$TD0= 1
##$TE= 0
##$TE2= 300
##$TE3= 300
##$TEG= 300
##$TL= (0..7)
0 120 120 120 120 120 120 120 
##$TP= (0..7)
150 150 150 150 150 150 150 150 
##$TP07= 0
##$TPNAME0= <>
##$TPNAME1= <>
##$TPNAME2= <>
##$TPNAME3= <>
##$TPNAME4= <>
##$TPNAME5= <>
##$TPNAME6= <>
##$TPNAME7= <>
##$TPOAL= (0..7)
0.5 0.5 0.5 0.5 0.5 0.5 0.5 0.5 
##$TPOFFS= (0..7)
0 0 0 0 0 0 0 0 
##$TUNHIN= 0
##$TUNHOUT= 0
##$TUNXOUT= 0
##$USERA1= <user>
##$USERA2= <user>
##$USERA3= <user>
##$USERA4= <user>
##$USERA5= <user>
##$V9= 5
##$VALIST= <valist>
##$VCLIST= <CCCCCCCCCCCCCCC>
##$VD= 0
##$VDLIST= <DDDDDDDDDDDDDDD>
##$VPLIST= <PPPPPPPPPPPPPPP>
##$VTLIST= <TTTTTTTTTTTTTTT>
##$WBST= 1024
##$WBSW= 4
##$XGAIN= (0..3)
0 0 0 0 
##$XL= 0
##$YL= 0
##$YMAX_a= 313291
##$YMIN_a= -368562
##$ZGOPTNS= <>
##$ZL1= 120
##$ZL2= 120
##$ZL3= 120
##$ZL4= 120
##$ABSF1= 10
##$ABSF2= 0
##$ABSG= 5
##$ABSL= 3
##$ALPHA= 0
##$AQORDER= 0
##$ASSFAC= 0
##$ASSFACI= 0
##$ASSFACX= 0
##$ASSWID= 0
##$AUNMP= <proc_1d>
##$AZFE= 0.1
##$AZFW= 0.1
##$BCFW= 1
##$BC_mod= 2
##$BYTORDP= 1
##$COROFFS= 0
##$CY= 11.3945322036743
##$DATMOD= 1
##$DC= 2
##$DFILT= <>
##$DTYPP= 0
##$F1P= 15.7292609196834
##$F2P= 12.9074282941183
##$FCOR= 0.5
##$FTSIZE= 0
##$FT_mod= 4
##$GAMMA= 1
##$GB= 0.15
##$INTBC= 1
##$INTSCL= 1
##$ISEN= 128
##$LB= 0.24
##$LEV0= 0
##$LPBIN= 0
##$MAXI= 10000
##$MC2= 0
##$MEAN= 0
##$ME_mod= 0
##$MI= 1.114404
##$NCOEF= 0
##$NC_proc= 0
##$NLEV= 6
##$NOISF1= 3.799351
##$NOISF2= 2.8
##$NSP= 1
##$NTH_PI= 0
##$NZP= 0
##$OFFSET= 15.70392
##$PC= 1
##$PHC0= -24233.79
##$PHC1= 18.05269
##$PH_mod= 1
##$PKNL= yes
##$PPARMOD= 0
##$PSCAL= 0
##$PSIGN= 0
##$REVERSE= no
##$SF= 200.130013532006
##$SI= 16384
##$SIGF1= 3
##$SIGF2= 2
##$SINO= 400
##$SIOLD= 16384
##$SREGLST= <1H.CDCl3>
##$SSB= 0
##$STSI= 0
##$STSR= 0
##$SW_p= 3612.71676300578
##$SYMM= 0
##$S_DEV= 0
##$TDeff= 0
##$TDoff= 0
##$TI= <>
##$TILT= no
##$TM1= 0
##$TM2= 0
##$TOPLEV= 0
##$USERP1= <user>
##$USERP2= <user>
##$USERP3= <user>
##$USERP4= <user>
##$USERP5= <user>
##$WDW= 1
##$XDIM= 8192
##$YMAX_p= 0
##$YMIN_p= 0
$$ End of Bruker specific parameters
$$ ---------------------------------
##NTUPLES= NMR FID
##VAR_NAME=  TIME,          FID/REAL,        FID/IMAG
##SYMBOL=    X,             R,               I
##VAR_TYPE=  INDEPENDENT,   DEPENDENT,       DEPENDENT
##VAR_FORM=  AFFN,          ASDF,            ASDF
##VAR_DIM=   8192,          8192,            8192
##UNITS=     SECONDS,       ARBITRARY UNITS, ARBITRARY UNITS
##FACTOR=    0.0002768,     1,               1
##FIRST=     0,             0,               0
##LAST=      2.2672688,     0,               0
##MIN=       0,             -368562,         0
##MAX=       2.2672688,     313291,          0
$$ Real data points
##PAGE= N=1
##DATA TABLE= (X++(R..R)), XYDATA
$$ [...]
2113a742K54J769Q28j034j173l54J249J121l75q07o39J563P23j112j001L40R24
2130E34Q83L10k780r83J476K220k32k030j215P7J336J934n83k104k8J616M49n41
2148C39j7k82o1J259j32j887p33J869J206j134j554m62O81J856M42j455j863K80
2166a648K338J044j262j017J78L51R82L09j293q73J334R85r80j607O5J084P59
2183G49K50j748j423P21K424O19j538q81j72J282J311k92j547l05P37J055r08
2200C34q99k45R75N46o64j432k2J299R70j56j294j090R00J780J135j411j776R4
2218i56J230Q80o0j467o82R05J098n52j290Q5Q50O95r03o51m57P85J964K83k171
2237d14j163J014J424Q34q85j461q32J425J361m47j853j84P70O49j7n43m66K13
$$ plain form
2113 -1742 -1488 281 1109 75 -1098 -1452 -203 918 543 -264 -903 660 1383 271 -730 -390 534
2130 534 1417 1727 -1053 -2036 -560 1660 1428 -602 -1817 -1740 -404 1530 947 -1157 -1185 431 880 339
2148 339 322 40 -21 1238 1106 -781 -1514 355 1561 427 -1127 -1589 -908 948 1390 -65 -1928 -1648
2166 -1648 690 1734 472 -545 -367 -16 966 1275 -18 -891 443 1428 448 -1159 -1094 -10 749
2183 749 999 -749 -2172 -1451 973 1592 54 -827 -999 283 1594 1302 -245 -550 187 1242 334
2200 334 -565 -810 165 711 47 -1385 -1407 -108 862 706 -588 -1678 -778 1002 2137 726 -1050 -956
2218 -956 274 1154 1094 -373 -1055 -150 948 396 -894 -809 41 736 -167 -818 -1275 -490 1474 1757 -414
2237 -414 -1577 -563 861 1695 810 -651 -1483 -58 1303 856 -997 -1181 -411 238 221 -322 -788 -575
2255e75J635k75j267q87J484J606m15j240j154l8J690J322j058k174j14J574M93
2272F07n84m81l29K23P65L87j080o07J479J121q56q42n38M33J621N15j901j459
2290a526M03J730N52q95j199o58J018R47L16r47n13M37J078j53j209PJ161P71
2308A320m13j188r95O63J639L91j487j441J72J499J043o02j325n82J213R15k9
2325G93n68o01J09J190k86j320L32Q31J27k99j103q30P73J712M29j666r85K68
2343a094O63J133M86j468r51J130J297m75r56J51L68k18L96n98p91N64J445n20
2361E62j503q41P16J831L38p68j310m17J443J580k72j643k94P36M93l38l85q9
2379a61J27M13O1j164n66J325P52k29r64p08p0J805J289j109j723p1J208J182
$$ plain form
2255 -575 1060 785 -482 -1369 115 1721 1306 66 -1088 -1126 564 1886 828 -1346 -1460 114 607
2272 607 23 -458 -787 -564 201 588 -492 -1099 380 1501 645 -197 -735 -302 1319 1834 -67 -1526
2290 -1526 -1123 607 1159 264 -935 -1593 -575 372 688 -259 -772 -335 743 590 -619 -612 549 1320
2308 1320 907 -281 -1276 -613 1026 1417 -70 -1511 -1339 160 1203 601 -724 -1306 -93 822 793
2325 793 225 -376 -267 923 637 -683 -351 480 607 308 -795 -1625 -852 860 1289 -377 -1362 -1094
2343 -1094 -431 702 1188 -280 -1231 -101 1196 721 -235 -84 284 66 462 -136 -927 -363 1082 562
2361 562 -941 -1782 -1066 765 1103 335 -975 -1392 51 1631 1359 -284 -578 158 651 313 -72 -161
2379 -161 -34 379 440 -724 -1290 35 787 558 -406 -1114 -1184 621 1910 801 -922 -993 215 1397
2397A397l77j179n57N35P18M1j128N7M76J98p1r72Q9P34R51J68j094j168L40J800
2417I58P83q82j780j87J397O33l30o97q21L30Q20M58r35r64J328M82l90p86j24
2436g07N56J169L95j430j081N14J606N66j231j045m50Q64Q67L95j350o14Q37K45
2454A06J09m17j92N11N80j58n41r37P08J313J47j328j087N16J012L16J40j286
2472d88j110Q63J592j63j162m27P90N29k8j22o82N30Q70j77r85j037J362J071
2490A226p7r68j255j14R96J236m47j422p55J410Q76k15m11l08Q8N64M73j066l40
2509e09P00R71n48j115m92L57J066O36j075j594M37J266Q71l6j206q27O47J224
2527G73K58r21k99M21K31J35n99o37M73Q18J7j178o83K45J210K98k01j728N13
$$ plain form
2397 1397 1020 -159 -716 -181 537 578 -550 -493 -17 181 110 -862 -773 -39 912 1080 -14 -1182 -842 958
2417 958 1741 859 -921 -1108 289 922 592 -105 -926 -596 224 682 -253 -1217 111 593 203 -583 -707
2436 -707 -151 1018 1413 -17 -1098 -584 1022 1588 357 -688 -1138 -274 593 988 -362 -976 -139 106
2454 106 215 -202 -394 117 697 539 -2 -939 -231 1082 1229 -99 -1186 -670 342 658 798 -488
2472 -488 -1598 -735 857 694 -468 -895 -105 424 396 274 -408 122 992 815 -170 -1207 155 1226
2490 1226 1149 181 -1074 -1188 -192 1044 597 -825 -1580 -170 706 491 80 -228 -140 424 897 -169 -509
2509 -509 191 1162 614 -501 -993 -636 430 1066 -9 -1603 -1166 100 971 935 -271 -1098 -451 773
2527 773 1031 110 -189 232 463 598 -1 -638 -165 653 670 -508 -1191 -946 264 562 361 -1367 -854
2546h54R78J012m17r80k82K48P91P31j189n77L05O11N7j134q6M87P32J92r86p38
2566a099K32J366J099j442j019K5R33P39M44j038j213M23J467m41j080L5M24Q4
2584f1j3k44m70M13J032q6j148l99O07J005M25K0j572l53P97J427n25j048n34
2603g27J06N61M92k81q60K98P74j87p40k0P31M06J84l50j183K61J039P23n60j567
2623i00j54Q39O33K58r95o83K46J107K1o04k52K03P47L16q56m87M20R82N48j164
2643B25r55j39J405M43l63j332p10J109P94R7m38r75K1Q64M94m35l38L88O63m57
2663C61n44j88J94Q31M36r63j506K02J495M75o41o59m65KJ384N20q24p02N20N87
2683E15q9K33m93l93N66L84j030q45O61J010k9p02o28n8L84J264l50j008m81P17
$$ plain form
2546 -854 124 1136 719 -261 -543 -295 496 1227 38 -539 -234 377 434 -700 -786 -299 433 625 -361 -1099
2566 -1099 -867 499 1598 156 -863 -838 95 834 1278 240 -973 -550 917 476 -604 -569 -145 -61
2584 -61 -74 -318 -788 -375 657 571 -577 -976 -369 636 1061 1081 -491 -844 -47 1380 855 -193 -727
2603 -727 -621 -60 432 151 -709 -411 363 176 -564 -584 147 553 737 387 -796 -535 504 1227 667 -900
2623 -900 -1054 -215 418 676 -319 -1002 -756 351 372 -232 -484 -281 466 782 -74 -561 -141 841 1389 225
2643 225 -730 -869 536 979 616 -716 -1426 -317 477 574 136 -839 -818 46 540 105 -233 155 818 361
2663 361 -183 -371 -177 654 1090 127 -1379 -1177 318 793 152 -507 -972 -970 414 934 110 -592 -72 515
2683 515 426 659 166 -227 339 723 -307 -1152 -491 519 490 -212 -840 -898 -514 750 400 -608 -1089 -372
2703c72J126j98q8p67J69M34M33m29r73M19R11k37p66q73Q11O60M57o23r29l30
2723a165J096P69J38q93m78L04Q52K26m68p16N0M13N1j53o39J00Q96j19l43p84
2743h63J02J127O53n58j250o3J014N32R6n26r39L10Q02J88k85r21J11N17K59m70
2763a64k99K70N04R2n06n39l4J275P89j036r05k11Q55J004k68o18r05P5J074N5
2783E08r18l23K35N89j11k46j93L05K94O19o11p88K28J187N18r69o11o22P51Q37
2803F79j62o88o48L62O07J79k40k29j39M32M25p87r7J9J189J0n13p80k67N31J013
2824H96l09j270l37L97J110J46n72q73PR40O46o46m12J37M31L02n47n60N43P85
2844H14j74m79q89Q5N37Q97n8j307n11L47J084J91n22l54k4N98K54j19n56L0N49
$$ plain form
2703 -372 754 556 468 -299 -130 304 737 308 -665 -246 665 428 -338 -1211 -400 260 717 94 -835 -1165
2723 -1165 -69 700 838 -55 -533 -229 623 849 381 -335 -285 128 179 26 -613 -513 383 264 -79 -863
2743 -863 -761 366 1019 461 -789 -852 162 694 790 264 -675 -365 437 625 340 -581 -470 47 306 -164
2763 -164 -463 -193 311 403 -103 -642 -676 599 1388 352 -553 -764 91 1095 827 209 -696 -621 453 508
2783 508 -410 -733 -498 91 -20 -266 -459 -154 140 759 148 -640 -412 775 1293 324 -287 -909 -158 679
2803 679 517 -171 -819 -457 150 329 89 -140 -279 153 578 -209 -306 -287 902 912 399 -381 -648 -117 896
2824 896 587 -683 -1020 -623 487 633 61 -812 -805 135 781 135 -277 -140 291 593 46 -514 29 814
2844 814 640 161 -728 -643 -106 791 733 -574 -1085 -738 346 537 15 -339 -363 235 489 370 -186 -156 393
2865C93K21o83k82K12M40L65n68l96o10P62J025n46r88j11M21Q79K55m12p71J57
2885b37M77M90m96m00m3M88j1r9p48J90L43L16m26o00l08Q36J096k41p13o07J43
2906e50J205N65j023m58q6P75k04j17k25m68N95J45l11n38P5P20K83k58p02j45
2926g22L84J203k22p73l83K58Q50J88p51m02j51L87N17m13l70j91O86J28m29l68
2946e74K15L01R12l33r48n4L93R70J65r97p29J8J151K77q79l45K49K84l13L15
2966G8k81n6N79L32n96o78J51R18K54l05m64l00J21P78R0n78p92K39M31K69k59
2987f9l14j64M85J75J79o93l5Q47O0j73n15j53O08M49m28l85q13M51Q72K72p46
3008i0p68m4Q64M11j61k66l34J58L73L7l18k52R56O7p54k76k6Q82M1J26r23n95
$$ plain form
2865 393 614 -69 -351 -139 301 666 98 -298 -908 -146 879 333 -655 -766 -345 534 789 377 -394 -237
2885 -237 240 730 234 -166 -209 279 268 169 -579 -389 -46 270 -156 -756 -1064 -228 868 627 -86 -693 -550
2906 -550 655 1220 197 -261 -347 428 224 107 -118 -586 9 154 -157 -695 -620 100 383 125 -577 -722
2926 -722 -338 865 643 -130 -513 -255 595 783 32 -370 -521 -134 383 -30 -400 -591 95 223 -206 -574
2946 -574 -359 -58 854 521 -427 -481 -88 882 1047 50 -679 -661 490 767 -112 -457 -208 76 -237 78
2966 78 -203 -259 320 652 56 -622 -471 447 701 396 -68 -368 -247 531 621 43 -749 -510 -79 190 -69
2987 -69 -383 -547 -62 113 292 -401 -436 411 471 298 -217 -370 238 687 259 -126 -939 -488 384 656 -90
3008 -90 -858 -902 -38 373 212 -54 -388 -230 143 180 -138 -390 566 633 -121 -397 -423 459 500 626 -297 -892
3030h92P22M17L03n74o37N5O82K15M45m17n59M11L68m52n23K53M07J42l41k64
3050b39n44O31P31j31p56o26K16Q77N32k99q96J57M44N59k02k77l27M30o1l7o82
3071e00k23O30O41o56n36m6M41Q45P3p24m68N27L84N56o74o17j29M85N12j13n62
3092a54J05J66j58k14k50K36qP69k45o55n29R06Q91l45k55p26l1Q70O70p23m73
3113a53j60L48QO7o4k46j57N88j96l03j63M18N05j41n95k07J96Q91%o58n80N6
3135e46J048mk74p55K67J79P7J00m77j97N53N42o63j33K14K16L01m0o32lJ77O08
3157E58M5l59o30j51M47N24q0j004K74j43Q52K21o18j27M49J67k72k72J61m5O80
3178F77j71p13l23K7J131m6n93m48k51K94R41l29m40j33Q3N86j54m12M35K4J7
$$ plain form
3030 -892 -170 247 550 -24 -661 -606 76 291 736 319 -240 171 539 87 -436 -183 224 366 25 -239
3050 -239 -783 -152 579 448 -308 -934 -718 159 691 392 -504 -347 97 656 454 177 -150 280 219 182 -500
3071 -500 -723 -93 548 -108 -644 -690 -249 596 669 -55 -523 4 388 944 270 -347 -476 9 521 408 -154
3092 -154 -49 117 -41 -255 -505 -269 -277 492 247 -408 -937 -31 860 515 260 -466 -497 373 1043 320 -153
3113 -153 -313 35 43 110 46 -200 -357 231 35 -268 -431 -13 492 351 -244 -451 -255 636 636 -22 -602 -546
3135 -546 502 498 224 -531 -264 -85 -8 92 -385 -582 -29 513 -150 -283 -69 147 448 408 -224 -227 -50 558
3157 558 603 244 -386 -537 -90 434 354 -650 -376 -519 333 554 -64 -191 258 425 153 -119 42 -3 677
3178 677 506 -207 -530 -503 628 582 -11 -459 -710 -416 525 196 -244 -377 -294 292 138 -274 161 185 202
3199B02O5m15j98L57P24k48p02n49L17Q02K45n82m74n2K18R18n91n5nL98K15l57
3221B33l52k77M53N09k05q76m5L18M08k3m14o96M51M82L53L0n46m28O82M21n2
3242D26m28L9J00K26j7l12l12K57L69k90o95J53J77O14M58q67m89j02Q85N63k48
3263E07q47O4K03N65J76n96k80J41K35J61p28j58N34K36j28l84k80K70P00N8m72
3284b3m92K82O37K32k55m79n31N86N46k13n27j85K55K13p1k75k96P09N6j42k32
3305b05l45K45J094j81m11k45k48O24K97j90o35k09M25M49l73O3p16L93Q7K29
3325A48q6m03M69K13m3m86l25N61M98J6n65l12j57O43L59k53p40J01J05L10L19
3346C72l20k46K81J08O2k40j42K13M49m92l81q7J99N58J59m04q42J59N51J15P2
$$ plain form
3199 202 267 -148 -346 11 735 487 -215 -764 -447 355 600 18 -456 -508 -290 628 37 -18 -23 375 590 233
3221 233 -119 -396 57 566 361 -515 -560 -242 166 143 -271 -967 -516 -34 319 349 -197 -625 57 478 426
3242 426 -2 37 137 363 346 34 -278 -21 348 58 -637 -484 -307 307 765 -102 -591 -693 192 755 507
3263 507 -340 -276 -73 492 668 72 -208 -67 168 329 -399 -557 -23 213 85 -299 -579 -309 391 449 -23
3284 -23 -515 -233 404 636 381 -98 -629 -43 503 290 -237 -422 -167 46 -25 -300 -596 113 169 27 -205
3305 -205 -550 -305 789 608 197 -48 -296 328 625 435 -200 -409 16 465 92 155 -561 -168 -81 148
3325 148 62 -341 128 341 298 -188 -513 48 546 562 -3 -315 -472 171 530 277 -463 -362 -257 53 372
3346 372 52 -194 87 195 257 17 -125 88 537 45 -336 -423 -224 334 493 89 -753 -594 -43 72 144
3367A44o17NK52M62r1j18j16J65M25k73k30l00L57K95J69n00o59r0R46N60q07
3388b1o21K16K40M53N1n11k31O20L24K7m24n07N72J34j99j46k45K86L32M1m46
3409e5o91J16Q75J95m24m45l2L61O19R1n84l72L47M71j92l85O9q9M05p9n55n6
3431d10R0N90j51k46m48M33J44M82j87l12p08P12O11K0q57j27M50Q1Q2l81k78
3452d10j8N45J31o37l5M30N21M8k73p13j74J002J06k37l92p2K34K57Jj99o47L32
3474b00L59K04m09k81K47K61j45k89J1J27O11n0l99k42J01L50K09Pm92m92L09
3495b03L92Q0l55l47L02M01j57j10k08J07L35P0l36k77J59P86l1l68o03LL99M89
3517E28o5o93k07K16M99j94Ol55O4L14K57o46J18K55M19j28m73n07L00K78L62
$$ plain form
3367 144 -473 -468 -216 246 155 37 -79 86 511 238 8 -292 65 360 529 29 -630 -720 226 786 -21
3388 -21 -642 -426 -186 267 318 -193 -424 196 520 547 123 -384 188 322 123 -23 -268 18 350 391 -55
3409 -55 -746 -630 245 440 16 -429 -461 -100 519 610 26 -346 1 472 280 -105 -36 -125 280 201 -354 -410
3431 -410 -320 270 119 -127 -575 -142 2 484 297 -15 -723 -11 600 620 -237 -364 86 167 249 -132 -410
3452 -410 -428 117 248 -389 -424 6 527 575 302 -411 -585 417 523 286 -106 -178 56 313 314 115 -532 -200
3474 -200 159 363 -46 -327 -80 181 36 -253 -242 -115 496 446 47 -195 -94 256 465 472 -20 -512 -203
3495 -203 189 269 -86 -433 -131 270 113 3 -205 -98 237 307 -29 -306 -147 639 608 240 -363 -360 39 528
3517 528 463 -230 -437 -221 278 84 90 -265 -201 113 370 -276 -158 97 516 388 -85 -592 -292 -14 348
3538C48n82q5n8N35J43q3l32m23L50L98k9M6k72No3M20l02l18M17J48R3m56m55
3561e55M72J38K52l48m58j58L76N43ol65l46K59M36m6q0m2j11O5L6j14k2j65L97
3584A58j10k13l93K64N37J44k19o66l1L29N28J61n04j42J64K35L53l28m60K44
3604E1LM21o77k7L05K1n7m29J16n41O60Q05m43l82k02L13M51K8m72r5J3j2M23
3627B73l66J30k67R2Ll1k5j68P99m12K7p28O38L68k39O0k97k07M18L60k18j82
3649B8n56L71J51Q2k33l2k04N11K11l97k17j0M69K97k39n51K62L03R8N4m60j80
3671b42J03L70J76k46m55M51l05L56m80J02O1J96O6l4n87M80L41J63k07n81k46
3692e18N75M01K1p21l80J91N42K39m02k91J67j31Q46n69n8J00L63j69l83j84L16
$$ plain form
3538 348 -234 -319 -377 158 301 218 -114 -537 -187 211 182 228 -44 -39 -102 318 16 -302 115 263 356 -100 -555
3561 -555 -83 55 307 -41 -499 -657 -281 262 256 -109 -455 -196 240 194 114 72 -39 26 62 -52 -74 -239 158
3584 158 48 -165 -558 -294 243 387 168 -498 -529 -200 328 489 -15 -157 7 242 595 267 -193 51
3604 51 54 475 -202 -229 76 97 40 -389 -273 -814 -154 651 208 -174 -376 -63 388 416 -56 -151 -138 -150 273
3627 273 -93 37 -230 -138 -135 -166 -191 -359 440 28 55 -673 -35 333 94 154 -143 -350 68 428 210 28
3649 28 -528 -157 -6 76 -157 -189 -393 118 329 -68 -285 -295 174 471 232 -319 -57 246 344 398 -62 -242
3671 -242 -139 231 407 161 -294 157 -148 208 -272 -170 -109 87 153 119 -468 12 353 516 309 -272 -518
3692 -518 57 458 479 -242 -622 -431 111 350 -52 -343 -176 -307 539 -30 -88 12 375 206 -177 -361 -45
3713d5M83k5l51n64n5M75O42k01o25M7j88P00Kl71k07Q4N65k56J14l97M20q7K65
3736D25m44j71K06J52K90m55l98k66L66L54J22j83p24O45O24k32k09m82L52K13
3756A85J62j68l33J18K50R9k69n54Q7M62N57m38n79o0N09K39j0l3n11J69L46o4
3778A64r5mr8M7K04r2m95N62n0l3k04m54N11l0N36n16k38j31K79N61K10n83m44
3801c93K60K38J23M1l54k60N05K17o37o4J26N05p7k19m71K22O40K36n60k83k60
3822d65L47L57J48m40k19N4P1L21qk81k3K50k0L2l90Q4L10q7Q1k74J64L41K56
3845F09l03m22k11J72K03K2K07k69j55J31Q2j49J03J5j40J93r6k30k43O14L80
3866E13l75k85r4J07M50n7n38l0MM08M56o84l96J94K81K97l81K75l37K60J50l05
$$ plain form
3713 -45 438 413 62 -502 -557 -82 560 359 -266 -219 -407 293 295 -76 -283 -199 366 110 224 -173 247 160 425
3736 425 -19 -190 16 168 458 3 -395 -661 -295 59 181 -2 -726 -81 543 311 102 -380 -28 185
3756 185 347 179 -154 -36 214 313 44 -510 -423 39 596 158 -421 -481 28 267 257 224 -287 -118 228 164
3778 164 69 65 -33 14 218 126 -369 193 143 110 -94 -548 -37 -67 469 -47 -285 -416 -137 424 634 51 -393
3801 -393 -133 105 228 269 -85 -345 160 377 -260 -324 -198 307 230 11 -460 -238 402 638 78 -205 -465
3822 -465 -118 239 387 -53 -272 -218 -147 174 166 -115 -138 112 92 124 -266 -182 128 41 122 -152 12 353 609
3845 609 306 -116 -327 -155 48 70 277 8 -147 -16 66 -83 20 35 -105 88 -8 -238 -481 133 513
3866 513 138 -147 -241 -134 316 259 -279 -309 -305 103 559 -125 -521 -327 -46 251 -130 145 -192 68 218 -87
3888h7oN6J84K62l11k83l68K41O40J8n95j49j42P73r6n4m27K57j6L10k53N8mJ66
3912A74k5j50l84L97J57p8o9m17o4M56K77o4l91j05K30J33K71j40k88r3K72J69
3934B68q5k41j8p0M93n87j11N9M07K22k84l56j57L13K51M5o2m78PM68L48m5n35
3957a48l19N39K78l46p4l14N45j47l63J28M7n9N17o3m78l44O38P0K16l06l58O9
3979b72L68J76rl48j91K88J92Q3m09k73M28K89l37l86p0O06K95l76m38QJ92O04
4001D20K05p57m2L3L45J80j32k32j64R7l4m4k36J10L78J07m51j46J68L05J68R4
4023C72o06q3q0P86j53j35m98n4M18K56j75l25k8K57J44j61k93J69M96j37Q4j54
4045A00k19p8M06J73n66j10L64J53k46k3j97k76J26L93J39k27R3K99j77l5k12
$$ plain form
3888 -87 -93 -37 147 409 98 -185 -553 -312 328 346 -249 -398 -540 233 137 83 -344 -87 -103 207 -46 12 8 174
3912 174 149 -1 -385 12 169 91 22 -395 -459 -3 274 210 -181 -286 -56 77 348 208 -80 -173 99 268
3934 268 183 -58 -76 -146 347 -240 -351 -292 115 337 53 -303 -460 -147 104 149 87 -391 -384 84 432 387 -148
3957 -148 -467 72 350 4 -70 -384 161 14 -349 -221 -174 -233 284 221 -257 -601 37 107 323 17 -341 -272
3979 -272 96 272 263 -85 -276 12 204 287 -122 -395 33 322 -15 -401 -471 135 430 54 -384 -376 -184 420
4001 420 625 -132 -174 -141 204 384 252 20 -144 -47 -81 -125 -361 -251 127 234 -217 -363 -195 110 278 372
4023 372 -234 -317 -397 389 236 101 -397 -451 -33 223 48 -277 -305 -48 96 -65 -358 -189 307 170 254 100
4045 100 -119 -197 209 382 -184 -294 70 223 -23 -46 -243 -519 -393 0 139 -88 5 304 127 92 -120
4066a20J37L61M7k80j72l57N49K35k17l10k38L03J60J20r7o05M20K9K54j0j04
4087A05n9o3L12k18m3l41L38MO1n09p7K49K20L76m81p3N9L64J17j15n78K24k3
4110a51L89j28O7q2K67l65O8m30R9L96P7k8k63j88Q4O05l3l11m29J68K67O6l02
4133a57P0L9j17K96j12K2l08N63l37l6r2K50n7R0R0m78l01N81J66L08m63l33k25
4156e41N11M02l52j30J6O4K66j0n28J79L12Kj80m14K29N7O20j65o58K10R8K64
4178B52J28n15R6N8M25k81r5l25J92k21L15J24m54L88q2R0k9k94lK71L52n8l91
4201e7k63K41K43Q6l7m64l8r4M61K65l91j98j05N49m3m46J84J8K24qm11L11O8
4224I5J79j10j28j88o1M37K0j4m08K49l21K96k8J14k73J95J63J24l95R8j88L06
$$ plain form
4066 -120 17 378 425 145 -27 -384 165 400 183 -127 -365 -62 98 218 121 -484 -64 -35 219 209 105
4087 105 46 -17 295 77 34 -307 31 35 96 -413 -490 -241 -21 355 -126 -199 -140 224 341 226 -352 -128 -151
4110 -151 238 110 177 95 362 -3 65 -365 -266 130 207 179 -84 -272 -188 417 384 73 -356 -188 79 145 -157
4133 -157 -87 -48 -165 131 19 41 -267 296 -41 -77 -169 81 24 114 204 -274 -575 6 172 480 17 -316 -541
4156 -541 -30 372 20 -110 -94 -30 236 226 -302 -123 189 191 11 -403 -174 -117 503 338 -320 -110 -12 252
4178 252 380 -135 -39 19 444 163 68 -257 -65 -286 29 153 -301 87 5 95 66 -228 -231 40 392 334 -57
4201 -57 -320 -79 164 250 213 -251 -289 -383 78 343 -48 -246 -351 198 155 -291 -107 -89 135 127 -284 27 95
4224 95 274 164 36 -152 -213 224 244 230 -178 71 -250 46 18 132 -141 54 217 341 -54 44 -144 162
4246A62j28r8Q7K4J79Q6m51l38K33K31P5o3O5p06M62L75P6l77p0L90p5Q1r0k1
4270A09K06k3l98r2J80J54P5j16p4m36NL22K79k59q0l81M00M41Ml49J1K07P9o28
4294c64K88k01L15P8N7l50J43j5L60r4n23N54l84L82p9N4n46M40j37n5N49m34
4316C8Nj68Q9J22k69JJ37Q8J09l41n4J25L62k5j57j73k8K49L10l44j70j84j21
4339c99N63J62m52J20Q9m2k61M5jr6K44J04k29l17P01j77L52k92k75k51O41L7
4361B66K10n34q3k22L84J9p3k64N54k0j67j95j07M45q1J43m98r0J78N05r9r9l92
4384b20j6K62K68k41k06k15K20K40k19J03L7J0J60p7k28n0K70K59lk56k65j4L61
4407A80J34p7o58K7K36N00k18k44J30p1K13J2l98L47O5k65L00n48J09N22j89K73
$$ plain form
4246 162 34 -64 23 47 226 312 -139 -477 -244 -13 62 -1 64 -642 -180 195 271 -106 -176 214 139 220 130 109
4270 109 315 292 -106 -198 -18 136 211 95 21 -415 -410 -88 191 -68 -148 -529 -129 312 316 -33 -22 185 264 -364
4294 -364 -76 -277 38 116 173 -177 -34 -49 311 217 -306 248 -136 246 167 221 -325 115 -22 -77 472 38
4316 38 43 -125 -36 86 -183 -182 -45 43 152 -189 -243 -118 244 219 62 -111 -139 110 420 76 -94 -278 -399
4339 -399 164 326 -126 -6 83 41 -220 -175 -176 -272 -28 76 -153 -470 231 54 406 114 -161 -412 229 266
4361 266 476 -58 -141 -363 21 40 -33 -297 257 237 70 -125 -232 213 132 275 -223 -313 -135 370 271 172 -220
4384 -220 -236 26 294 53 -153 -368 -148 92 -127 -24 13 23 183 106 -122 -172 98 357 354 98 -167 -181 180
4407 180 314 237 -421 -394 -158 342 124 -120 10 -61 152 164 -234 113 178 -87 213 -335 -226 296 107 380
4429C80m25n3K5L9M72m62j63m24N64L21r6l76M2J58o2J91r9j47K08J39j39l83
4451b90j8l9N80L8k28k81J9L85Pn3m83N5L56L37j70O2j69k02K23N1m43L18j52
4474i7O0J17k05O9p0K87j0j05m81p0O12L80l03k74M2r4M55Q1l67m48L75J72K47
4497C73l40N3k27OR4O9k60L3L02L5j05n47M8M01L91K7l79j12K54K59k50l21j06
4520c02K56J61qk16j54J28K44J10l25j50M33k94N06M8p64N8L43J14J13j51m48
4541b98K67l7J79k10j8J9K38l19L78k15j86K38P9o7j65p5O50k76k27k19k64M62
4563f6L74r3m38L6kK21j04j80k02L50K31j84k37J31J28L74K9m56J60l01L21N03
4585E95o55l01K34r7M40P2k11l38N0K19K53k85l6K41j93K85k2k79J9K38J52l28
$$ plain form
4429 380 -45 -98 -73 -34 438 -24 -187 -611 -47 274 178 -198 -156 2 -60 131 32 -115 93 232 93 -290
4451 -290 -308 -347 233 271 43 -238 -219 166 173 120 -363 -308 48 385 215 277 108 -94 129 180 -263 55 -97
4474 -97 -37 80 -125 -56 -126 161 151 46 -435 -505 107 487 184 -90 -48 -142 313 394 27 -421 -46 126 373
4497 373 33 86 -141 -135 -41 28 -232 -199 103 138 33 -514 -466 -65 326 353 -26 -138 116 375 125 -196 -302
4520 -302 -46 115 107 -109 -263 -135 109 219 -106 -256 177 -117 389 437 -327 -269 74 188 301 150 -298
4541 -298 -31 -68 111 -99 -117 -98 140 -179 199 -16 -202 36 115 48 -117 -192 458 182 -45 -264 -528 -66
4563 -66 308 215 -223 -187 -189 32 -72 -252 -454 -104 127 -57 -294 -163 -35 339 368 -88 72 -229 92 595
4585 595 -60 -361 -127 -224 216 288 77 -261 -211 8 261 -24 -60 181 -12 273 251 -28 -9 229 381 53
4607E3j55n6K77K42n43k18lM00L28j21k91m75L49L82K04n35R1J81l3J77k20n1
4629a7N4K61j61q3j85j71K76K80j34l54j94K68K54Q9k52J40j20o6K89j03J54p7
4651A48k4q9M8l88J35L78J62l20m55j15N08k49J36L08m14M3L6J98K06l52Q1K71
4673B52k4R0m82Q9K26j52l28L00j31J37K40j68m49K10k33M59J30l7l07Q6K78K67
4695D53l10k16j88L29j38r8L66l29J15J19j87q7K5L51m8k20j32l7J99L67J40m87
4717a3k80K26J90j37k8q6j15J34m9jl4K71j32J22j29j60L30N8K67l15k60l88L85
4740a44K19l2o4j23k1P6K64l72K57M8k55L61q4L4l60L82rj80j8k59J63M97l55
4763B5m0k55L69K54l4l33k06J0J49P7j73J66l08O80k26j55J24l39K47L49j97j93
$$ plain form
4607 53 -102 -158 119 361 -182 -400 -403 -3 325 204 -87 -562 -213 169 373 -162 -71 110 77 254 34 -17
4629 -17 37 298 137 54 -131 -302 -26 254 120 -234 -428 -160 94 183 -69 71 -49 -115 174 71 225 148
4651 148 124 35 83 -305 -170 208 370 50 -405 -520 -12 -261 -125 183 -231 -188 -152 46 252 -100 -19 252
4673 252 228 318 -164 -75 151 -1 -329 -29 -160 -23 217 49 -400 -190 -423 36 166 129 -178 -92 186 453
4695 453 143 -73 -261 68 -70 -168 198 -131 -16 103 -84 -171 -146 205 157 -63 -195 -232 -33 334 474 -13
4717 -13 -293 -67 123 -14 -42 -128 -243 -109 -158 -159 -193 78 -54 68 -61 -221 109 167 434 119 -141 -529 -144
4740 -144 75 43 -21 -144 -165 -89 175 -197 60 108 -147 214 130 164 -196 186 177 -3 -21 -280 -117 380 25
4763 25 -15 -270 99 353 319 -14 -220 -210 -61 16 -157 9 -299 381 155 0 124 -215 32 381 184 -9
4785ik48M25L3j94k31j93M16N60m68k45K96j16k61L61q8l1K20o3J21o8k61k6K20
4808A50J58j5k28l98N33j5J5n65K56K35O2j34q6j93j84O93j7n6l69N1J41lk89
4831b58J05L29j4j35l80J23L3K34q2K04k7n29L06L64k05O0k73R4R2j55K26k27
4853a15J4K08j31m1m8j60M79K36m54j74N8K74J10n8k54l4N9O1K24l27o7J01J93
4876A54p9J23l92l0K4Q9J28k49K41r0N45n63j51K31m7N56l60j79Q4k03L81j15
4898I8j27j78J18L7N0R0k21L5M17j93j47m61N94P1J81j28m66L05p8J1K22r2j17
4921B1L2k21O06m49m4l84M09o2j53J67JM07o0j41o3J88r9K39l90k55m12M59L43
4944A39r6Oj64k24L54P2o0J63m65K3K82p5n6J29J76j05j96Pk3K09M06m10l67K68
$$ plain form
4785 -9 -257 168 201 7 -224 -417 -1 559 91 -154 142 26 -235 126 38 7 227 164 285 217 -44 -70 150
4808 150 308 293 65 -333 200 185 200 -365 -109 126 188 54 -32 -225 -409 284 267 211 -158 -107 34 31 -258
4831 -258 -153 176 162 27 -353 -230 -197 37 -45 159 132 -397 -91 273 68 128 -145 -51 41 -114 112 -115
4853 -115 -101 107 -24 -65 -113 -273 206 442 -12 -186 -128 146 256 198 -56 -90 -31 30 254 -73 -140 -39 154
4876 154 75 198 -194 -224 -200 -111 17 -232 9 -81 464 -99 -250 -19 -66 490 130 -49 35 -168 213 98
4898 98 -29 -207 -89 -52 -2 88 -133 -98 319 126 -21 -482 112 183 364 236 -230 75 -3 8 230 138 21
4921 21 53 -168 438 -11 -55 -439 -30 -92 -245 -78 -77 330 270 129 66 254 155 394 4 -251 -663 -204 139
4944 139 43 49 -115 -339 15 87 27 190 -275 -252 30 -45 -101 28 204 99 -97 -90 -113 96 502 92 -275 -7
4968gJ72N5o0j8k73q9K66R8n7k64L70L7qk11j41J03J43K00l25k43K67j36K88P1
4992B38l40j76J74J18J10k55j83J62n5K98L1j42J16nK73o01L66l23L7J69j00l3
5014a21L4K22K54n03Q6p0j01M19l4N0m07J21K55K72l10j26nk20L26k83j59J99
5036a01K77J4j32l00P7j31M91j08k30j13J51M37l30M9j20L2K16m7j60o5j91J03
5058a81R6J9O9j36K53K48m89j79R0M00J13k04N9k67j75N63k3j14O7k40l76M23
5080A6J44k63q3K69k3J44r8j73J45J85k86L8l92J01O68k09k22R3j12K79J39n03
5102a43J78k22P5K20P5k17n1k4K22r4k34J08M0J05k14J59k99M85J82l14K4k09
5124a48o6K78L9J15o11K02J67J16l07J69j06R3J52j11Lj7P2j40K98l91k3j2L07
$$ plain form
4968 -7 165 220 160 142 -131 -220 46 144 87 -177 193 230 222 11 -130 -27 116 316 -9 -252 15 -121 167 238
4992 238 -102 -278 -104 14 124 -131 -314 -152 -207 91 122 -20 96 91 364 -237 129 -194 -157 12 -88 -121
5014 -121 -87 135 389 -114 -28 -98 -199 220 186 236 -171 -50 205 477 167 41 36 -184 142 -141 -300 -101
5036 -101 176 190 58 -242 -165 -296 195 87 -143 -256 -105 332 2 51 -69 -37 179 132 -28 -93 -284 -181
5058 -181 -85 -66 3 -133 120 368 -121 -300 -210 190 303 99 158 -109 -284 279 256 142 209 -31 -407 16
5080 16 160 -103 -186 83 60 204 106 -67 78 263 -23 15 -377 -276 392 183 -39 54 -58 221 360 -143
5102 -143 35 -187 -112 108 183 -34 -85 -109 113 19 -215 -107 -67 38 -176 -17 -316 169 351 37 61 -148
5124 -148 -214 64 103 218 -393 -191 -24 92 -215 -46 -152 -59 93 -18 -15 -32 40 -100 198 -193 -216 -228 79
5147G9J50m37j27j24P86k74P2j12j49K19O3j78j22N4L45k55J05k33J78l65N26
5168B01p4l77k28M41K56l33q8m3O3K65q7J73o7k35K62j21R9J55m0o1r3r1j34L8
5192a19J5K58j06k34k01J94M29j44j39k97R8M68o9J76n13J5J95j32M20l92m4J88
5214F6j46J68l38M2J3N38Rn21J43k27N14J67m75j95l89M70L10o7j02j14O5J35
5236F6J83l64p1K05K37m14J92N5k88K79N3j22k68J57L52J04k47k54%J76L0Q6j54
5259gk23J57O3J03k03q4J80J69L6j68k23L08J02m9k78l3K6J99J28p7l68q8M46
5282A16j19J13j79k79J04L89J6j75o5J84K22l20k91J41O6K83p3k36j68p6K48K9
5304g0L07k80k61K00R9J70o6k69K16J60j35l20J97J20K6J41j12l13K09K56l3l03
$$ plain form
5147 79 229 -208 -335 -459 327 53 125 13 -136 83 146 -32 -154 -100 245 -10 95 -138 40 -325 201
5168 201 127 -250 -478 -37 219 -114 -202 -245 -182 83 -4 169 102 -133 129 8 107 262 222 161 68 -23 -157 -119
5192 -119 -104 154 48 -186 -387 -193 236 92 -47 -344 -246 222 153 329 -184 -169 26 -106 314 -78 -122 66
5214 66 -80 88 -250 -208 -195 343 352 -169 -26 -253 261 428 -47 -242 -631 -161 149 82 -20 -134 -69 66
5236 66 249 -115 -186 19 256 -158 34 89 -199 80 133 11 -257 -100 252 356 109 -145 -145 31 61 147 -7
5259 -7 -230 -73 -10 93 -110 -194 -14 155 191 23 -200 108 210 161 -117 -150 -124 75 203 126 -242 -330 116
5282 116 -3 110 -69 -348 -244 145 161 -14 -79 105 327 7 -284 -143 -77 206 133 -103 -271 -347 -99 -70
5304 -70 237 -43 -304 -104 -5 165 99 -170 46 206 71 -249 -52 68 94 235 123 -190 19 275 242 -61
5326f1k59J00J10K2K30k67m4K39J25o5R3k71R8L06l49K35l88o6K14R3j00l78K46
5349a37M47k46k15p9MJ58M64k63l76K06mN7p0Kj52K37j01J59m76L19J87J91l06
5372Fo3k34Q5J33M83m98J75k71L04M7J49m11J51j7K66l03J6K4j65L42q0m79L69
5395B9j02K96j04l28k6M2K22K8j01k46K54j0R3Q0j22j47K16K85k52j40M8k52K74
5418C7m1r9P5J66k90N08l28j9o8J13K72k36l31K28n2J67m0p9r0m2K36M3l19J3
5442a76K48L2o0j47j14K17J57j54q5j2O6l8K46k19R0j1j99lJ01J13j87k9p0K35
5466Ak61K58L0K59j51p4j68J16j5J72n2l70K21Q1l7Kj59OO0K92k10K6k06P7m2
5491a44lM42k45K55k95K02k83j18L19o1J71m36j63L26NM31m69j63l9K5K07J76
$$ plain form
5326 -61 -320 -220 -110 -88 142 -125 -169 70 195 130 223 -48 50 356 7 242 -146 -212 2 95 -5 -383 -137
5349 -137 310 64 -151 -230 -226 -68 396 133 -243 -37 -41 16 -54 -52 -204 33 -68 91 -385 -66 121 312 6
5372 6 -57 -291 -206 -73 410 -88 87 -184 120 167 316 -95 56 39 305 2 18 42 -123 219 139 -340 29
5395 29 -73 223 119 -209 -235 -193 29 57 -44 -290 -36 -46 47 127 5 -142 74 359 107 -33 15 -237 37
5418 37 -4 -103 -28 138 -152 356 28 9 -59 54 326 90 -241 -13 -65 102 62 -17 -107 -149 87 130 -189 -176
5442 -176 72 104 44 -103 -217 0 157 3 -82 -94 -28 -66 180 -39 51 40 -159 -162 -61 52 -135 -164 -234 1
5466 1 -260 -2 28 287 136 62 -106 10 -5 167 115 -255 -34 47 10 12 -147 -141 -81 211 1 27 -179 -102 -144
5491 -144 -147 295 50 305 10 212 -71 -189 130 69 240 -196 -359 -33 -28 403 -66 -229 -268 -243 -36 140
5513A40k60k0K94k67J47pJ99k96J37K7o8m85M63N4k9j28k68L35j83J34K01k72
5535a52m5%K38K64j73j25N7J07j88q2k48M4M59r0j14P0L0N8P8j28l88P7L10m2
5559A7K36j49l2l44K59J40j59N2k58K84nj59K2K33j30l4j35K4QL08o9j07p9r7
5583a74R2L09j10k39J54lj21J87k30P5R1j68L4j45j8Q3M84m60j12J74J15J30j73
5606b5qk04J22J35J22n1j74J9l5p6m4r5M9O80k76p5pl29L76O9J21l61J74j63K51
5631A95o4R5k09N3N1j57K84l79j01K33lq3J59j66Q1R4o7j07J43J18j32K11k39
5654A0j66LJ93n0j1P2j91J76J54K82o36M8J66j55L13m28J98M4J03j94P9l14N15
5677B11k87Q3l4RJ08Lj6p6J56l53L12O8K9j85r2j15J63L53n27J35J11n8K10p1
$$ plain form
5513 140 -120 -140 154 -113 34 27 226 -70 67 94 26 -459 4 58 29 -99 -367 -32 -215 -81 120 -152
5535 -152 -197 -197 41 305 132 7 64 171 -17 -99 -347 -303 156 66 -48 22 52 110 188 60 -328 -251 59 17
5559 17 253 104 72 -272 -13 127 -32 20 -238 46 41 -118 -96 137 7 -27 -162 -138 -130 178 109 2 -77 -174
5583 -174 -82 227 117 -122 32 29 -92 95 -135 -60 31 -137 -103 -248 -266 -183 301 -159 -271 -97 18 148 -25
5606 -25 -33 -237 -115 20 142 91 -83 -64 -99 -175 -219 -314 -265 415 139 64 57 -272 104 173 294 -67 107 -56 195
5631 195 131 226 17 70 121 -36 248 -131 -232 1 -2 -85 74 -92 -11 83 16 -91 52 170 38 249 10
5654 10 -156 -153 40 -10 -21 51 -140 36 190 472 -164 -116 50 -105 208 -220 -22 22 125 -69 10 -304 211
5677 211 -76 7 -27 -18 90 93 77 1 157 -196 116 184 213 28 -64 -179 -16 337 -190 -55 56 -2 208 137
5701A37k12j09L61q4j50l02P2J47J98k7p5l10K61L27J95j52l55J56Q1j87MJ02
5723G8l0K78k86k04K11j20J24j46J99j08n1o4K51J30k35j09j76O54n09J55q4L
5745c9K87q6j77j37j37M81QN4n10J55J98k8K23n19J21jK47Q6j22k99L42j42K25
5768B30q7j65m8J18J57k97P5m7L3j0j87K0Q5N5L80k57m7j51J14P0k3L7k6p7RP3
5794C4J00l49K68j18K9Nj2j61K46K20k26l01K73K29k14P8l17J81Q7j9rk28J34
5817g0j91K04K8J10j02pK4n0K88n71M23j75j9j57J58j01J03J61o9o5L2kO7Q2n91
5842d90L04K15J7M3j28J47p6J5J4n9M9j16L09K53p03NO5o8L70r3l17J54M7Q2n8
5867a9j21K30m03J23K83J49k37N9J93k21r4J8L2j9K8q9j08J75Nj61N32m88K6J05
$$ plain form
5701 137 -75 -184 177 93 -57 -359 -287 -140 58 31 -44 -354 -93 234 429 277 -78 78 159 -28 -24 78
5723 78 48 326 40 -164 47 -73 51 -95 104 -4 -55 -119 132 262 27 -82 -258 396 -113 42 -42 -39
5745 -39 248 162 -15 -152 -289 192 200 254 -256 -101 97 69 292 -227 -106 -107 140 226 104 -195 147 5 230
5768 230 143 -22 -70 48 205 -92 -17 -64 -31 -41 -228 -208 -123 -68 312 55 8 -143 -29 41 18 55 29 -48 -39 34
5794 34 134 -215 53 -65 -36 -31 -43 -204 42 262 36 -265 8 237 23 101 -216 -35 52 33 24 -204 -70
5817 -70 -261 -57 -29 81 -21 -28 -4 -54 234 -337 86 -89 -108 -265 -107 -208 -105 56 -13 -78 -46 -48 19 101 -490
5842 -490 -186 29 46 89 -39 108 32 47 61 2 51 -65 244 497 -206 -201 -136 -204 166 73 -244 -90 -43 39 -19
5867 -19 -140 90 -313 -190 93 242 5 64 257 36 -58 -40 -8 -27 1 -88 -196 -21 -16 -177 355 -133 -107 -2
5891bO1K3k00N6K8k06K62k06J01J07J19l41L11k87O9L06j23K36m72J7M3M03j08
5914A97j73p5J64O6J35k66J09j65K5j0J01k4k25J27J08k20P2m5J63K86o2l83q1
5937a76J58J23L95n65J19k24O62j33k56j60o4o8K48j68O7K87r6p5q3M4j49K74
5959A60J43j28l18J04o0K00K09l59j33P8K36J31k48n9j23K90j1k70L36k84k2J88
5981F0m9k91L35J69K7l87J2P6j51L50J68m02R8l23N08j1k20j48QM2J03K76m9O0
6005B61r8j20N8pj30J06J60k16n3j87L70L0j33j54j81J76P4K18k52j59P3L34j7
6028A53p9k3J1jj9o8l01K81L2J49k33K08j70k84M70K24l80o4j38L47O7j7p3j08
6052a6O2K9J73k51M2J74j36m1j8l43L74J78o1j71m83O73l39J68R7j68j14r1N57
$$ plain form
5891 -2 59 82 -118 -62 -34 -240 22 -184 -83 24 143 -198 113 -174 -105 201 78 314 -158 -141 -98 305 197
5914 197 24 -51 113 179 314 48 157 -8 17 7 108 84 -141 -14 94 -126 -54 -99 64 350 288 -95 -176
5937 -176 -18 105 500 -65 54 -170 492 359 103 -57 -121 -189 59 -109 -42 245 149 74 -9 35 -114 160
5959 160 303 175 -143 -39 -99 101 310 -49 -182 -104 132 263 15 -44 -167 123 112 -158 178 -106 -128 60
5981 60 11 -280 55 224 251 -136 -124 -48 -199 151 319 -83 15 -308 200 189 -31 -179 -171 -129 -26 250 201 261
6005 261 163 43 101 94 -36 70 230 14 -39 -226 144 174 41 -113 -294 -118 -44 174 -78 -237 -164 170 153
6028 153 74 51 62 61 42 -26 -327 -46 -14 135 -98 110 -60 -344 126 350 -30 -94 -232 115 182 165 92 -16
6052 -16 46 75 248 -3 39 213 77 36 18 -325 49 227 166 -5 -488 185 -154 14 111 -57 -171 -262 295
6075B95q0m25L00j9J4l54M68m22L73l27J35j53L0L25j42L8J15k48K21r9J69j6
6097A98l4m2k58K94P1m07J57K79k58k69M11j66q4P8K2j47j82L58j00K23k6m76
6119c58K64K1J14j57K1J38k2q3j5J05n0oM9J24j87j95J95L58r5r0k41R7J62J28
6143B77k08m81L35J53J79j23l5j43J41j19p0J28j32K72k16N2l49K54J77J36k20
6164Hj00k73M73J3K68j66k00k18k8K61K79l45o7O5%J32J9j72P2N4n3K8k15L69
6188B04l60L41j59l3o1K32J28k77k99L7L68M3q7oJ09l37K38j48p9L08k93J97n3
6211A3j33J54J84j27j75k06J39q0M78j53j76k20L14j14L05j97j1k32L37L9N1p1
6233A19j04K29l09J56j74k5J5J92N6j86o3L9K34o5J7p0j2k65L14M9L3j74k1R0
$$ plain form
6075 295 215 -210 90 71 85 -269 199 -223 150 -177 -42 -195 -165 160 18 56 171 -77 144 45 214 198
6097 198 164 122 -136 158 229 -178 -21 258 0 -269 142 -24 -108 -30 -8 -155 -337 21 -79 144 118 -358
6119 -358 -94 -73 41 -116 -95 43 21 -62 -77 28 -22 -28 21 145 -42 -237 -42 316 221 131 -110 -13 149 277
6143 277 69 -412 -77 76 255 132 97 -46 95 -24 -94 34 -98 174 -42 10 -339 -85 92 228 8
6164 8 -92 -365 108 121 389 223 23 -195 -223 38 317 -28 -95 -30 -30 102 121 -51 21 75 22 50 -165 204
6188 204 -156 185 26 -7 -68 164 292 15 -284 -247 121 164 77 71 180 -157 81 -67 -146 162 -131 66 13
6211 13 -120 34 218 91 -84 -290 -151 -231 247 94 -82 -302 12 -102 203 6 -5 -237 100 139 190 119
6233 119 15 244 -65 91 -83 -108 -93 99 155 -31 -94 -55 179 114 131 61 49 -216 98 147 180 6 -15 75
6257G5k33O1R4K14p5J13l05O4j41J31J25j34j68Q7J02R7J14k42k02N3J38J77l88
6280b43L43j80m8M33m91J1L83o7m7nk49J11K75R7k31l11R1L91j82Q0j86j12M6
6303i1J86l42K89k48K33j56p1J68k15K34J02j1k63J9J05J09J75j87l9P4J69k47
6325gJ08m33K31J30n0O8k95k5O6J52Q6j73r0K83J5j6K9m07L99q7jj3J6J22K4K2
6351A54j90j31k09K66J34J0q4j12J97k79L02j17p6L1j62M18l81K10j57K48J52
6372B24k54j65j59L14K28k82J34M9j57o7L2M2K3L4p6O8j11J48k35J98J63k36k24
6395c09l2N24k03k29p9R7P9L09j86J64j70Q2K11k12M2J84l38K41n7l29L05j26
6417c2J23j09o2K9%K28J6k17k54K81J67J85M1k85k69j71M02j00N0N5J0M9k17K66
$$ plain form
6257 75 -158 -97 -3 211 136 249 -56 8 -133 -2 123 -11 -179 -92 10 107 221 -21 -223 -170 -32 145 -243
6280 -243 100 -80 -128 305 -186 -175 208 141 94 89 -160 -49 226 323 92 -219 -128 263 81 161 -25 -137 -91
6303 -91 95 -247 42 -206 27 -129 -200 -32 -247 -13 89 78 -185 -166 -61 48 223 36 -3 71 240 -7
6325 -7 101 -332 -101 29 -21 47 -248 -273 -207 -55 31 -142 -232 51 66 50 79 -328 71 -16 -17 -30 -14 108 132 154
6351 154 -36 -167 -376 -110 24 34 -50 -162 35 -244 58 -59 -135 -104 -266 152 -229 -19 -176 72 224
6372 224 -30 -195 -354 -40 188 -94 40 89 -68 -135 -103 -61 -38 -4 -80 -12 -123 25 -210 -12 151 -85 -309
6395 -309 -341 183 -20 -249 -328 -231 -152 157 -29 135 -35 47 258 46 88 272 -66 175 118 -211 94 -32
6417 -32 91 -18 -80 -51 -51 177 193 -24 -278 3 170 355 396 111 -158 -329 73 -27 23 78 88 137 -80 186
6441A86k37R0j19L12k25M0O9P3j43j82K64p2j44K92k90M1j50J11j46qL73l11Q
6464a68K21j14J00J3k09L01Ll6l00J93J34n2K1Q5k14R7O6j20K55l24k92K85j36
6487a91l6p8Q4O4k3M7j39L05N6L7p6l29K33J34K07j58k56N4Oj16L30j91j25K11
6511E0k54L6K57j83J96k9j22J1L5j78K02J45J6j44k58J78K16j83j39j22J85J16
6533C1L0Q2j06k01K49k91J84j25Q9R5J04R6o34O53k57J87j30l1J8k54L26oo9j41
6557a01m5K05j42K69k34l9L03k00L52m11L62k06lj82k71L02L91l41o3k06K5J46
6579h9K34L1l72mK38J52n4K2k05l4K26J61l75J67P7m5Pj01Jj77R4L46k40l80N16
6604A96k6q2K68l34j15J0K54j38K8j46m1J04j08M7J12pl5m1K3q5k34L86K67l87
$$ plain form
6441 186 -51 39 -80 232 7 47 116 189 46 -136 128 56 -88 204 -86 -45 -195 -84 -230 -238 135 -176 -168
6464 -168 53 -61 39 52 -157 144 147 111 -189 4 138 86 107 192 -22 75 141 21 276 -48 -340 -55 -191
6487 -191 -227 -305 -221 -157 -180 -133 -272 33 89 126 50 -279 -46 88 295 137 -119 -65 -59 -175 155 -36 -161 50
6511 50 -204 -168 89 -94 102 73 -49 -38 -3 -181 21 166 182 38 -220 -42 174 -9 -148 -270 -85 31
6533 31 61 143 37 -164 85 -206 -22 -147 -58 37 141 237 -397 256 -1 186 56 25 43 -211 115 109 40 -101
6557 -101 -146 59 -83 186 -48 -87 216 16 368 -43 319 113 110 -72 -343 -41 350 9 -54 -260 -235 -89
6579 -89 145 176 -196 -200 38 190 136 158 -47 -81 145 306 -69 98 175 130 137 36 37 -140 -46 300 60 -320 196
6604 196 170 88 356 22 -93 -83 171 33 61 -85 -126 -22 -130 -83 29 22 -13 -54 -31 -116 -350 36 303 -84
6628h4N4j8N5PP0R6j58l13L03j32N0m6J72j77K04k11J18l01M17o8j97j29K38o5
6652a15MM2j25J3j17M08j38j6N2k8j72L18l02J32q6K09j81j63J40K23M4mj22j2
6676DK05k86K48LR7m59J52J54o6j2q4j23J98m6J43k54o0L80P2k84l18M90J84l65
6700b7j03p7J36K21M3o8J4k00J0K21r4q4m53K14L39o2j23K2J35J04Nj69R0J32
6724B26j48k8j3j3l5k8K12j10j78l04M94j67K57%k25o4J30J7m7j11K17p4J14j54
6748c2O2j27J12Q4l27J60J8R7p2M0j5Q8J1q4K83k09k26J12J8J83l44r2L44k81
6772a97lJ56n1J00j00J27M4l21M74l92J64j78J72N9R9p4o3J05k92K16Q2k2J24
6795B29k69j21j3K61k16m6J62L58l41J35k63R9k3Q9N2j67J10L5K7j76R7l30J12
$$ plain form
6628 -84 -30 -48 7 14 84 180 22 -291 12 -120 -70 -116 56 -121 83 -128 -10 -311 106 38 -159 -288 -50 -115
6652 -115 -111 -69 -194 -181 -298 110 -28 -44 8 -20 -192 126 -176 -44 -130 79 -102 -265 -125 98 142 138 16 4
6676 4 209 -77 171 174 271 -188 -36 118 52 40 -44 -167 31 -15 128 -126 -186 194 266 -18 -336 154 338 -27
6700 -27 -130 -207 -71 150 193 125 139 -61 -51 170 76 -8 -461 -247 92 30 -93 -71 64 168 173 4 94 226
6724 226 78 50 37 24 -11 -39 173 63 -115 -419 75 -92 165 165 -60 -124 6 23 -24 -135 82 8 122 -32
6748 -32 30 -97 15 99 -228 -68 -50 47 -25 15 0 88 99 15 298 89 -137 -25 -7 176 -168 -260 84 -197
6772 -197 -200 -44 -95 5 -95 32 76 -245 229 -163 1 -177 -5 54 153 79 16 121 -171 45 127 105 229
6795 229 -40 -161 -174 87 -129 -175 -13 345 4 139 -124 -25 -48 41 93 -74 36 71 98 -78 19 -311 -199
6818a99K53J15j89j23L0J24J40j31o5j42L18k1j81k48j2M15P1r1j59k01L64o6
6840Bl4j2Q0k24r5J43J63j00nL0L45r9q3j06L53k74K9k39J76j29K53k2j03kk13
6865a66J48J3qJ87k50k8j13J3J54k4j05J34j1r4J37k99L21O9k05J80k33L68K48
6888D36n63L4Q4M4r7J24k40K98l8j83N6j23R4R8N0k70L41k40J01K31Qo1m16M0
6912a92K40L1o2J82j64lK53l65k33M03Q1j23J39k63J35J10K9n9j65O2m0J23k55
6935a36J23n8J62J08j67J70j90Mp8o0J26o8O3o2k39M76p7j50l0K34l10K74j90
6958g5J76q7k06L41l51K05j85j33K21lK7J13q7j12J19p9M10m36J57k27R2Q9K4
6981gJ77l40J5J57J01j6j18n4M15m3j0k16k70J84K37Pl87J66K23Mj23K32m18Q8
$$ plain form
6818 -199 54 169 -20 -143 -113 11 151 20 -45 -187 131 110 -71 -319 -331 84 155 64 -95 -296 68 2
6840 2 -32 -44 36 -188 -283 -140 23 -77 -82 -52 293 194 111 5 358 84 113 -126 50 -79 174 152 49 47 -166
6865 -166 -18 -5 -13 174 -76 -104 -217 -204 -50 -74 -179 -45 -56 -150 -13 -312 9 78 -127 53 -180 188 436
6888 436 -127 -93 -9 35 -62 62 -178 120 82 -101 -45 -168 -74 24 74 -196 145 -95 6 237 245 184 -232 -192
6912 -192 48 79 17 199 35 32 285 -80 -313 90 171 48 187 -76 59 169 198 139 -26 36 -4 119 -136
6935 -136 -13 -71 91 199 32 202 12 16 -62 -122 4 -64 -1 -63 -302 174 97 -53 -83 151 -159 115 -75
6958 -75 101 14 -192 149 -202 3 -182 -315 -94 -97 -70 43 -44 -156 -37 -116 294 -142 15 -212 -120 -31 -7
6981 -7 170 -170 -155 2 103 87 -31 -85 330 287 277 61 -209 -25 212 219 -168 -2 221 225 102 334 -84 4
7005DL04l08O7k28J54k05L11p7K51m73J34K41j2j5k15k7J3K24j86J79j47M2j77
7028a46L7j00K34p1P7J40m64j83N14m2J34k0p7r1K07j11n06M54j29J24q6K64l36
7051a77M3R3K3kj54L0K31P1r4Q3l8M5o7q2%m22K07L2K00j99k26L69R9j45J94j25
7077a1j88M47n2m08K01j46J18M7k5r1RJ79j0j05k00J01R5J7L60m36r3L3R3p7L64
7102B22j04j58j11j17J02n1J48l0P2K75j82l70M95j36J68l03k44J64J94K9j11
7123d8O7J28l2kj20J14J44k07M7L2l10K50J02k40j04L20k10J47r2K18j41o2N4
7146E5J14j16j88L3J54j44K22nj76l8J4L07l36m3k8R6R8J47j20L9n3j32L2m5p7
7171a90K17o8J64J47n22L56J29j19j30k90M03r2j1%m1J5Q6l09M57k95q3k0M9K56
$$ plain form
7005 4 308 0 67 -161 -7 -212 99 22 273 -200 -66 175 163 148 -67 -94 -81 143 -43 136 -11 31 -146
7028 -146 -109 -209 25 -46 31 171 -293 -476 38 -4 130 110 33 -58 149 38 -468 -14 -143 -19 -105 159 -177
7051 -177 -134 -41 -18 -20 -174 -144 87 158 64 147 109 154 87 5 5 -417 -210 -178 22 -177 -403 -34 65 -80 114 -11
7077 -11 -199 248 196 -212 -11 -157 -39 8 -17 -108 -99 80 70 -35 -235 -134 -39 -22 338 -98 -191 -158 -65 -142 222
7102 222 118 -40 -151 -268 -166 -217 -69 -99 -27 248 66 -304 191 55 223 -80 -324 -160 34 63 -48
7123 -48 19 147 115 113 -7 107 251 44 91 123 -187 63 165 -75 -179 141 -69 78 -14 204 63 1 55
7146 55 169 53 -135 -102 52 -92 130 125 -51 -89 -75 232 -104 -147 -175 -79 19 166 46 85 32 -100 -68 -113 -190
7171 -190 27 -41 123 270 -252 104 233 114 -16 -306 97 5 -6 -6 -47 -32 54 -255 202 -93 -176 -196 -147 109
7195A09k05J64l4K29l77J94J57l78j80K31J52K04m1L1J68k55k89qL58p6j35J89
7217B08k17J9M0K30l21jrJ84l35N66k85q7J06P7j10j34m0P5J14J14l92Q6n8L93
7241B23r6k52J08j44J11M4J07n9m0l7N2k24K70l45L08Q9jl89K82l8J28J81m52
7264a74J87j0J12l33K98k65J16K72l73K18j65m4J54r4L68j33j50J36J67k46k70
7285b29K68j17J76P3Q9n48J30L17Rn4l76O7l0K64K5j79J67P7k90J29K70k79K19
7308A78r6j43m27M47j16L97k34l42L99l89J85M36k57J34l81J63J28r5J18l14J90
7329a9K10k9j35q4q3L51j96J04m12J75Q1J82j54k08J89R0K26l09k6k10R8K13k31
7352a77K22k3J86j7q2n0r6L4J97q1j27M5k01M75k65J36j94K76j20o1K7o8j99K90
$$ plain form
7195 109 -96 68 34 263 -114 80 237 -141 -321 -90 62 266 225 256 424 169 -120 -128 230 154 19 208
7217 208 -9 10 50 280 -41 -42 -51 133 -202 364 79 -8 98 175 65 -69 -109 -34 80 194 -198 -112 -170 223
7241 223 127 -125 -17 -161 -50 -6 101 42 2 -35 17 -207 63 -282 26 115 114 -275 7 -31 97 278 -174
7264 -174 13 3 115 -218 80 -185 -69 203 -170 48 -117 -161 -7 -101 267 134 -16 120 287 41 -229
7285 -229 39 -78 98 171 260 -288 -158 159 168 114 -262 -195 -225 39 64 -115 52 129 -161 -32 238 -41 178
7308 178 82 -61 -488 -41 -157 240 6 -336 63 -326 -141 295 38 172 -209 -46 82 -13 105 -209 -19
7329 -19 191 162 27 -57 -140 211 15 119 -293 -118 -37 145 -9 -217 -28 62 288 -21 -47 -257 -159 54 -177
7352 -177 45 22 208 191 109 59 -37 -3 194 113 -14 31 -170 305 40 176 -18 258 138 77 104 36 -163 127
7376A27l62J68J39j13o3j1K15q3j08J22K56m29L09m35O23j90N4k46oj42J55K72
7398B52k37J3k81J69j9o5m8J18K96j53j37J83k2l1J04l4q3k93M22j20K0K09n55
7421b92M2L99O8l31P8l1j73K69p1N6n8N2o7J53j36J24N3P1k96%J20Q8K75k25j25
7446D3J35J8l44J79K12j67K17l11J30Q5m35M34j07J67m6l87K35L36l52m6k58J49
7468a13j54J71K42k61n7J09l78P21j50k83K40m6J8rO7l38M33j79l58N01k59PJ84
7491A08k74J28Nq8J58m1P6j10o3J00J78j49K9l4p0l0l3K75k41n5M8p6j07K59j39
7516a46mJ66j43j40K62O6q7J05j35M06k62j91K34j77M5n4J89k82J00lL8J61k27
7539g9J31k86J35L5J85k38q2J95k3N8O6l65M69k56J74q2j98K51j66L03l23P7P8
$$ plain form
7376 127 -235 -67 72 -41 -104 -115 100 17 -91 31 287 -142 167 -268 355 165 219 -27 -33 -175 -20 252
7398 252 15 28 -253 -84 -103 -168 -216 -98 198 45 -92 91 69 38 142 108 25 -268 154 34 54 263 -292
7421 -292 -250 149 217 -114 -36 -67 -240 29 -42 14 -44 8 -59 94 -42 82 135 206 -90 -90 30 118 393 168 43
7446 43 178 196 -148 31 243 76 293 -18 112 197 -238 196 89 256 210 -177 58 394 42 -4 -262 -113
7468 -113 -267 -96 146 -115 -172 -63 -441 280 130 -153 87 41 59 50 117 -221 212 33 -325 176 -83 -76 108
7491 108 -166 -38 -33 -121 37 -4 72 -38 -101 -1 177 28 57 23 -47 -77 -110 165 -76 -131 -83 -159 -266 -7 -146
7516 -146 -150 16 -127 -267 -5 61 -26 79 -56 350 88 -103 131 -46 -1 -55 134 -148 -48 -51 -13 148 -79
7539 -79 52 -234 -99 -64 121 -117 -199 -4 -27 31 97 -268 201 -55 119 37 -161 90 -76 227 -96 -19 59
7562E9j00K93l44j21K58q6K06q0r2lQ2k16L48k95N1J30j27N3Oq2K0KM3p0m6o1
7588a72M20k94K59l37K16j50J59n8J29J07k92j56J36J83j41l3k59J11K1K19j21
7609e3MJ20R2k01r3J40n5L4J82j64j86K74P6n6k77k5J51R3O8l0j94P3K27m3j95
7634c8J44r5j09M8N0j57J1L53j99j15O5k84K61J19N8m10j7K71j8l1j02J04j53
7657b44K42j32J13j12J04j42K34j71J84R7k64J13Q3o4k77J72K04k73K24j98J67
7678F0j80L9Q5K01j75K2J3lJ9j91J08k12L11m28K41j7K3m6J77L9K7j52j00K22
7702H3k12Q2P2M0J68k44J0l7J0j44QJ51L37k39j33j94K96K9j11j95M4K2K84J43
7726B70l56o6J88k72P2J32o0J77j69l73M72rJ18m32j56L88J46n13K49J65j34J37
$$ plain form
7562 59 -41 252 -92 -213 45 -41 165 85 -7 -10 72 -144 204 -91 -40 90 -37 16 22 -60 -40 -38 5 -65 -111 -172
7588 -172 248 -46 213 -124 92 -58 101 43 172 279 -13 -169 -33 150 9 -24 -283 -172 -151 68 -53
7609 -53 -49 71 163 -38 -131 9 -46 -12 170 6 -180 94 170 114 -163 -188 -37 56 124 94 -100 -27 200 157 -38
7634 -38 106 11 -98 -50 0 -157 -146 207 8 -107 -42 -326 -65 54 112 -298 -315 -44 -62 -93 -195 -91 -244
7657 -244 -2 -134 -21 -133 -29 -171 63 -108 76 173 -91 22 105 41 -236 -64 140 -133 91 -107 60
7678 60 -120 -81 4 205 30 52 65 62 81 -110 -2 -214 97 -331 -90 -107 -84 -130 47 86 113 -39 -139 83
7702 83 -129 -47 25 65 233 -11 -1 -38 -28 -172 -164 -13 324 85 -48 -242 54 83 -28 -223 -179 -157 127 270
7726 270 -86 -152 36 -236 -164 -32 -92 85 -84 -457 15 6 124 -308 -464 -76 70 -443 -194 -29 -163 -26
7748b6k82K11R2K2j50L22k72J02o1J81%j52j09J6K29L5k69j27K20J85j6l37K60
7771G4KJ14P7l35q9K16k00J69M8j29j91J31P3J23r9o7O9k6K60m25K91j19j5K67
7795B19k27O4J2J98k91L5j39K18P2j88P6j76l0K42l4j4j83R7q2K3L2n8M51k86
7819C1O4JL0p2k45K5J1J06j37J93M9R0k73p5K01r5j43P3k4K51R7p8j31j0j83M86
7845B42k84O9L9P6k17lJ06j76o0J90L85l10j17j05J24R4o9l9L36m25n2K22J35
7868A61k59k3K33J6k53L12k74k10M89l29K12p7j30K82j53J12l85M83n66O00J9
7889B60k34j08K45K37l97J23k00J00K17j76J23j04k15J38K68k25l84M65j41O9
7909F1r0kj29K53j57J3J31j42K18k67o0NJ09K67l13J75k64K09j55R6K27Jl67K17
$$ plain form
7748 -26 -308 -97 -5 17 -133 189 -83 19 -42 139 139 -13 -122 -106 123 158 -111 -238 -18 167 151 -186 74
7771 74 76 190 267 -68 -157 59 -141 28 76 -53 -244 -113 -40 83 -16 -83 -14 -40 220 -205 86 -33 -48 219
7795 219 -8 56 68 266 -25 10 -129 89 161 -27 49 -127 -157 85 51 37 -146 -49 -131 -108 -76 -134 317 31
7819 31 95 96 126 54 -191 -166 -155 -49 -186 7 56 146 -127 -202 -1 -96 -239 -166 -190 61 158 80 -51 -61 -244 242
7845 242 -42 27 66 142 -75 -78 28 -148 -208 -18 367 57 -60 -165 -41 53 -16 -55 281 -144 -196 26 161
7868 161 -98 -121 112 128 -125 187 -87 -297 192 -137 75 -2 -132 150 -3 109 -276 207 -359 241 260
7889 260 26 -82 163 400 3 126 -74 26 243 67 190 86 -129 9 277 52 -332 133 -8 61
7909 61 -29 -31 -160 93 -64 -51 80 -62 156 -111 -171 -166 -57 210 -103 72 -192 17 -138 -42 185 186 -181 36
7933C6j59J53n4j88J11K67j33j77K03k65K34J41m94K86m4p9N24l36m02N49k93
7954a20K39J66o7j94j48J77k82J78j08J24K0r1J44L2n8j8M5m5l1Q2O3J62j80K1
7978A11m61M27J8O4l51k8K58Km07J11J27J14J33p2n9r7L53l02R3q1J12PJ25r6
8002A01j71m5L6m5O8%J38Lk24p5L04k33l2J82p8L86k72l87J11N63l89O6r3l3o9
8027a88L94j37j08l18L09j78O8J15m2J67q3L04k74j74L3K45q5K9j17J29Q7p5j72
8050g1P1P6N4J7J16n76J23J35J94j17j41J61l75N81J5m77L21k67j04L31j91l5
8072a59K46j10J01k17Q3n8J13J71k22j94L25J17J2j13j4q3l00M39q7k94K79j4
8094B1j44L44l09J86J26j60l0j04J5r7J47PK60j92j15J44k57K05k63j9N2J3J29
$$ plain form
7933 36 -123 30 -24 -212 -101 166 33 -144 59 -206 28 169 -325 -39 -83 -162 362 26 -376 173 -120
7954 -120 119 285 218 24 -124 53 -229 -51 -159 -35 -15 -106 38 70 12 -6 39 -6 -37 45 108 270 90 111
7978 111 -350 77 95 159 -192 -220 38 40 -367 -256 -129 -15 118 46 -13 -110 243 -59 34 -47 65 72 197 101
8002 101 -70 -115 -79 -124 -56 -56 82 85 -139 -214 90 -143 -175 7 -71 315 43 -344 -233 330 -59 7 -86 -119 -188
8027 -188 206 69 -39 -357 -48 -226 -158 -43 -85 82 -1 303 29 -145 -112 133 48 77 -40 89 176 101 -71
8050 -71 0 76 130 147 263 -313 -190 -55 139 22 -119 42 -333 248 263 -214 107 -160 -264 67 -124 -159
8072 -159 87 -23 78 -139 -56 -114 -1 170 -52 -246 79 196 208 95 81 -2 -302 137 50 -244 35 21
8094 21 -123 221 -88 98 224 64 34 -70 -55 -152 -5 2 262 70 -45 99 -158 47 -216 -235 -183 -170 -41
8117d1J27j39Oj51K13Q7k12M0M0Q4j0j50J12j99K25K21l85QR0J19j04j98k6O4
8141a79J8L49k56j63N19k96R4j01Lj43J54P5k3M2l04K56pr5j9j55O2J52K15l44
8165a46N4J26l9j85L46k73K37o8J32l64Q5j7M07q7o3k01J43Ln2J02r3rn9r6j37
8190b54L53
$$ plain form
8117 -41 86 -53 -47 -198 15 102 -110 -70 -30 54 44 -106 6 -193 32 253 -132 -124 -34 85 -19 -217 -243 -179
8141 -179 -161 188 -68 -231 288 -8 86 -15 -12 -155 -1 74 51 93 -211 45 38 -57 -76 -231 -169 -17 198 -146
8165 -146 -92 34 -5 -190 156 -117 120 52 184 -180 -95 -112 295 208 145 -56 87 90 38 140 47 38 -21 -117 -254
8190 -254 99
8191I9
$$ Imaginary data points
##PAGE= N=2
##DATA TABLE= (X++(I..I)), XYDATA
0@%%%%%%%%%%Qj6J6j6K4l2M0m8N6p2Q8j04J28j52J76k08K40k80L24l72M25m82
32b57N50o25P09q00Q98j007J128j259J403j561J731j919K124k349K595k861L154
49A654l478L832m218M647n125N658o260O941p716Q612r662J0908j2418J4299j6708
64i034J9918k4443L1334m3220O9288k28060J59086L38422m32705k9588K81623
75A32621r8807k05379K63121Q7316k43045k3647J75039q3711n4454J18960k2905
86D5109j36527P6832Q9773p5807n0066P3791R539o4418j1122N3627k283l9704
98c1256J1507K9618l3813k986O9098j121q2842K0019P8036l1378m0031M1102l4685
111h732n9837Q7777N7271j03695l2790O8013j3315m591P6004l9303j08050N4477
$$ plain form
0 0 0 0 0 0 0 0 0 0 0 0 8 -8 8 -8 16 -16 24 -24 32 -40 48 -56 72 -80 96 -112 128 -152 172 -200 225 -257
32 -257 293 -332 377 -423 475 -532 596 -663 740 -821 910 -1009 1115 -1234 1361 -1500 1654
49 1654 -1824 2008 -2210 2437 -2688 2970 -3290 3651 -4065 4547 -5115 5793 -6625 7674 -9034
64 -9034 10884 -13559 17775 -25445 43843 -184217 -25131 313291 -119414 -149002 132621
75 132621 33814 -171565 91556 178872 -64173 -87820 87219 3508 -50946 68014 45109
86 45109 -91418 -14586 75187 -620 -50686 23105 32644 -31774 -42896 10731 8448 -31256
98 -31256 -19749 9869 -23944 -26930 42168 41047 -41795 -21776 56260 24882 -15149 25953 -8732
111 -8732 -68569 19208 76479 -27216 -60006 8007 -5308 -9899 66105 26802 -81248 -26771
123b6771Q8920n0805k4149L9878n4361k8140R9801M671r5559L1597N7237o4984
135b2665r693P4818l3321n8647O3684K2219q0959J5518P8275m0379m5117N6496
147B0229L60n7752M3444N1250o8853l8838P0778J7306o0544M844L7417l0625j1650
160b2634N5963j0333p3472J9352P4723j5858m9531J7238Q666l2619L2689N9400
172F3584n3843p2939N2964N3237m6367j0651L9850m0434l9513P2238L1133p7572
184b8313l793P0570k7363m8497N5477J8363o5071J8531N4506n2892l5041O8420
196B4897J1300o0820J3665L3232l8026k205M8274k8182m8528M2041L1237m0913
208a4028l957K7091j8960P46M6200j3276n3075J6455M2848q921j8253N97k1039
$$ plain form
123 -26771 62149 11344 -12805 27073 -27288 -55428 44373 49044 -46515 -14918 42319 -22665
135 -22665 -32358 42460 9139 -49508 14176 36395 -44564 -29046 49229 8850 -36267 20229
147 20229 20589 -37163 6281 57531 -11322 -50160 20618 37924 -22620 -17776 19641 -10984 -22634
160 -22634 33329 22996 -50476 -31124 43599 27741 -21790 -4552 4114 -28505 4184 63584
172 63584 9741 -63198 -10234 43003 -3364 -14015 25835 -14599 -54112 18126 49259 -28313
184 -28313 -32106 38464 11101 -37396 18081 36444 -28627 -10096 44410 -8482 -43523 24897
196 24897 36197 -24623 -10958 22274 -15752 -17957 30317 2135 -46393 -4352 26885 -14028
208 -14028 -17985 9106 -9854 -9108 37092 23816 -29259 -12804 30044 21123 2870 3467 -17572
221a7572j1533M0332K1769l7877k4598J9313J1946O60J0625l526k8124j857L2850
234A2408K630k8645P428K2367j8890j1016K5805l647k1660K3788J3394m4470q915
247b9423M9001k552l7472J8998J3352l6536J8592N0377l8474m2209M8087K1920
259C3661m4998L649K6536l5625j0721N6903p366o5974J6968N1947k1001j4688
271a0709K6655k3017l3321M6196L8260m5483k9212L4516Q475k0829K1104J6165
283B8800l7137q174M0111n230l5720J5179K2118k8343j5788K6843l744k5399K8434
296A950K4891m3518j7729M9002J1184l2486N216J0988k3908P427L5942k0883l6930
309b8854K8940K5827k9771l434K4568k3064j4847M1082M183m9084l063L6327K59
$$ plain form
221 -17572 -29105 11227 32996 -4881 -29479 -10166 1780 2440 13065 9539 -18585 -20442 12408
234 12408 15038 -13607 -6179 16188 -2702 -13718 12087 8440 -13220 10568 23962 -20508 -29423
247 -29423 19578 17026 -20446 -1448 11904 -24632 -6040 44337 5863 -36346 11741 33661
259 33661 -11337 -7688 18848 -16777 -27498 29405 22039 -43935 -26967 24980 3979 -10709
271 -10709 15946 -7071 -40392 5804 44064 -1419 -30631 3885 12360 -8469 12635 28800
283 28800 -8337 -16511 23600 18370 -17350 -2171 19947 -8396 -24184 2659 -1085 -26484 1950
296 1950 26841 -16677 -34406 14596 25780 -6706 -1490 9498 -14410 -6983 28959 8076 -28854
309 -28854 86 25913 -3858 -7292 17276 -5788 -20635 20447 24630 -24454 -27517 8810 9069
322I069j1542R440j2254k0966L0436L0805k9697k2270K0245K303j3258J3062O853
335A2226k2689m521K0970j707j7821R944J5444j0626m641O752r459p9K4955q77
349A7871l0859m180K3490L940q479L724p262j6116J7929K1441k1589j6540J7695
362A065L359q853J1729r94k6116Q789L7265j2124l7111J3171K2548j4667L033
375A094J9857k6580k5236L5333K2479l1149j1738K1364p730j3139K5892O140l2710
388a6123P910L3824k0633k6785K8959J7133k8358m074J8362j8442j4386L4622
400A2009R564m1806n906L1892k307r969J8823p065k8137K0400L1691k4452k4364
413a9627K3528J0138j9793P238J2199k3910l055L4196j950l3437Q15J7962n488
$$ plain form
322 9069 -2473 6967 -5287 -26253 4183 34988 5291 -16979 3266 5569 -7689 5373 12226
335 12226 -10463 -14984 5986 4279 -13542 -3598 11846 1220 -3421 3331 -6128 -6207 18748 17871
349 17871 -12988 -17168 6322 10262 1783 5507 -1755 -17871 58 21499 -90 -16630 1065
362 1065 4424 -4429 7300 6306 -19810 -11021 26244 14120 -22991 -9820 12728 -1939 1094
375 1094 20951 -5629 -30865 4468 26947 -4202 -15940 5424 -2306 -15445 10447 16587 -16123
388 -16123 -8213 25611 4978 -21807 7152 24285 -4073 -8147 10215 -8227 -22613 12009
400 12009 21573 -20233 -26139 5753 3446 -6523 12300 5235 -22902 -2502 29189 4737 -19627
413 -19627 3901 14039 -5754 1484 13683 -10227 -13282 20914 18964 -14473 -13658 4304 -1184
426a184l99J0255j7470j9685K3271K2507j9154j0772J7080j08r847J3692O127
439A4313j8436J37J8286j0022j9905J1639J4377r512k337N172j5306k484K9528
452A5450M314l0593n242J7677j217k143J1593j0290k0178J6930K2246j6089j3750
465a1292J3962O73p117J2132j984k4515O516K8019p956k2847P101J0408n880Q556
479E776J2963k0070j4828K2585J0832j9132j502R945j1998m453J6774l976k0570
492a7654J2999K1519j9909j8357K0872J0381j2265P307M673k4112o23L2638K879
505B0348k7251l07J2308q369L958J9028j6165k5659J9637K0344k0840j1136J6405
518B301n14r994J1278M226k0126K071K7527l292k2393N148Q976q129P155J1950
$$ plain form
426 -1184 -1583 8672 -8798 -28483 -5212 17295 -1859 -12631 4449 4341 -5506 8186 14313
439 14313 -4123 -3986 14300 4278 -15627 -3988 10389 877 -1460 3712 -11594 -14078 15450
452 15450 19764 -10829 -16071 1606 389 -1754 9839 -451 -20629 -3699 18547 2458 -11292
465 -11292 2670 3343 -3774 8358 6374 -18141 -11625 16394 8438 -14409 -7308 3100 -2780 5776
479 5776 18739 -1331 -16159 6426 17258 -1874 -3376 6569 -5429 -9882 6892 2916 -17654
492 -17654 -4655 16864 -3045 -21402 -530 9851 -2414 4893 9566 -14546 -15169 17469 20348
505 20348 -6903 -7210 5098 -3271 687 19715 3550 -22109 -2472 17872 -2968 -14104 2301
518 2301 1787 -8207 3071 7297 -12829 -10758 16769 13477 -8916 -3768 5208 -2921 4234 16184
532A6184j9812j7427K0937J4867j9039p247J4988l444q496J3766O97j7382J0020
545a388J8717j3749j4808J1023O100n205P589J475k1988l773K6379N266j9441
558c803l522M772l237O909Q562j2530j0746J1837R362q708l535N818j999J003
572A83J1558o605j8578P753J9805m566j5014j22J426j279J0495P264j6761q952
586a3393J6770M794j1386N069M270j2494K705J4438j2358j4402J8635J3078j8635
599b909q200J1896k510j497J6499o106k7383O619K5399m260j1872N694j600r311
613i541J3829J6044j6752j6390J5980J0874j4861o053P846l326m066J0117r39
626B762j7743K092K3078j653j7151N181N904r978P879J6200j5826j6975J8928
$$ plain form
532 16184 -3628 -21055 -118 14749 -4290 -11537 3451 7 -8489 5277 5974 -11408 -1388
545 -1388 17329 3580 -11228 -205 5895 690 8279 9754 -12234 -16007 10372 15638 -3803
558 -3803 -7325 -2553 -5790 1119 9681 -2849 -13595 -1758 7604 -1104 -4639 1179 -820 183
572 183 11741 5136 -13442 -5689 14116 9550 -5464 -5586 -4160 -5439 5056 12320 -4441 -13393
586 -13393 3377 8171 -3215 1854 6124 -6370 -3665 10773 -1585 -15987 2648 15726 -2909
599 -2909 -11109 787 -1723 -3220 13279 7173 -20210 -13591 11808 7548 -4324 1370 -230 -9541
613 -9541 4288 20332 3580 -12810 3170 14044 -817 -6870 976 -2350 -6416 3701 2762
626 2762 -14981 -12889 10189 8536 -8615 -3434 2470 -7508 371 16571 745 -16230 2698
639B698J3134j6963m275J3825m501o776J0991m534j7862J0575J6759j2341j2822
652a2092N095J734J300J2418R41j8391l401J7353P360o777n583l718o42P246L434
667F277p907m343M534M512j825l643k09J793L532L810m265j0575J911J2623L488
682I713q301n480r56L120P638L290j1789o613J0239L453q242J584K729o528M208
697a935J0365r905j1268J4513J1679r948m954L113o545K731J8088n337k3228L063
711i568J6443m376n494O855o254j0873J2267J2366j3954q755J4577N701j1072
724b137Q28M950o715K527J3058o938j9144N980J6865l468r403K979j648o983J0029
739G80J1474j3505j0871J2168P185r850j079O507k963R8R098m114j4041O675J6175
$$ plain form
639 2698 15832 -1131 -5406 8419 3918 -2858 8133 3599 -14263 -3688 13071 730 -12092
652 -12092 -6997 -5263 -3963 8455 9396 -8995 -12396 4957 12317 5540 -43 -3761 -4403 2843 6277
667 6277 -1630 -5973 -1439 3073 1248 -2395 -2604 -811 2721 6531 2266 -8309 -6398 6225 9713
682 9713 1412 -4068 -5024 -1904 5734 9024 -2765 -9378 861 4314 -3928 -2344 385 -6143 -1935
697 -1935 8430 -1475 -12743 1770 13449 3501 -1453 1660 -4885 -2154 15934 10597 -12631 -9568
711 -9568 6875 2499 -2995 3860 -2394 -13267 -1000 11366 -2588 -11343 3234 8935 -2137
724 -2137 -1309 3641 -3074 -547 12511 5573 -13571 -7591 9274 5806 -3597 -618 -2266 -9249 780
739 780 12254 -1251 -12122 46 7231 -2619 -3698 2809 -154 -56 9042 4928 -9113 -2438 13737
754A3737n619j2895J286j035j801J0288M057j6068p490J3169P851n156j25Q6n208
769d923N048J0058q515q991R439N641p512k335K342l036K962R542m360j4086J670
784g056J0737L70l436j897p293K25J1619K579r572j123O792J301j317N99k880
799c52k972P181L837j1123p175P803O647m54j423m974m729O173J2862j524j3780
814d003j753Q057j140r65M291n965p932R139Q532j0768p337J1425M626r074k4
829b891K825p967M504J5732p868j6844Q412J2622m860j320N375p884q232J2702
843D306P666j5165o022J0584L15o111K397m09l698O741P845q731j0126O740J0715
858G047j856m130n86n142P6J1445L523j0538o630N475M812j793j111j790m433
$$ plain form
754 13737 8118 -4777 -3491 -4526 -6327 3961 8018 -8050 -15540 -2371 5480 324 199 285 -4923
769 -4923 125 10183 1668 -7323 2116 7757 245 -2090 252 -2784 178 9720 5360 -8726 -7056
784 -7056 3681 4051 615 -1282 -8575 -8350 3269 5848 -3724 -4847 1945 3246 1929 2528 -352
799 -352 -3324 3857 7694 -3429 -10604 -2801 3846 3392 1969 -3005 -7734 -1561 11301 9777 -4003
814 -4003 -5756 2301 1161 196 4487 -1478 -9410 -271 8261 -2507 -9844 1581 6207 -2867 -2891
829 -2891 -66 -8033 -3529 12203 4335 -12509 -4097 8525 3665 2345 7720 -164 -8396 4306
843 4306 11972 -3193 -9215 1369 1684 -4427 -2030 -2439 -6137 604 8449 -282 -10408 -3668 7047
858 7047 5191 1061 475 -4667 -4591 6854 10377 -161 -6791 -1316 3496 1703 592 -1198 -5631
873e631M196O584o877p138Q876O860n289k860Q09k346K580Q846j655j2690j522
888g257Q375J901n03j182o919j258R798K050q189j355N493P28j525Q62k978j313
904c272P636M311p963o007L750L104L457K015q619q824O292J0969l320q711R40
919d242L142j862L420L903o579l457R626K460r702r67P504n0j925L634n342r776
935a0213Q886J3814r073j3931N639O468l981L407M255r316m351J2564M671j0789
949a950r60Q070k261l837L949l121p776P451R897r054j1891O144Q976j736j279
964F22O38o609k605J1225M888r374l940O029J428q94K700j144n358M125N957p092
980E96q050N052O032k866k761k035l582M451Q630j237p071j656K920L227L739
$$ plain form
873 -5631 -1435 5149 -1728 -8866 10 6870 1581 -1279 -470 -2816 -236 8610 6955 -5735 -7257
888 -7257 1118 3019 2516 1334 -5585 -6843 2955 5005 -3184 -4539 954 1682 157 1019 -1959 -3272
904 -3272 4364 8675 712 -5295 -1545 1559 5016 7031 -1588 -10412 -4120 6849 3529 -5182 -4242
919 -4242 -1100 -2962 458 4361 -2218 -5675 3951 6411 -3291 -4258 3246 3196 1271 4905 -437 -10213
935 -10213 -1327 12487 3414 -10517 -4878 1590 -2391 1016 5271 -4045 -8396 4168 8839 -1950
949 -1950 -2910 5160 2899 -938 3011 -110 -7886 -435 9462 408 -11483 -5339 3637 1901 622
964 622 1260 -5349 -7954 3271 8159 -1215 -5155 874 2302 1408 4108 2964 -2394 1731 7688 596
980 596 -7454 -2402 3630 764 -1997 -4032 -7614 -3163 5467 4230 -2841 -4497 -1577 1650 5389
995E389k352p271J43P254M01n069o12K013J515K662j667p247Q35Q034J953o397
1011d16l673n6R58N236N209o078q964M604Q651j089m897O9l85j612K613J808o071
1028d093j708R330J322q856l22O743j61J103L449o263r119O726J1435m662r760
1043d836J467K538j404M965K149r151k202R152J200o826p60M224n15m69L424l991
1059a035n388Q018Q385n949p572J669L080J238J858k395o804j232P075J834m853
1074b071j584J957O47J909P28m001k21N431L305m193n474J155N228K687j761n392
1090a650l906L054N309M77l340m376n18L986L477j061l725j039M689K948m320
1105Ek428L203K341J157j841n189j309N846M435l835n670j087M57L246N499l350
$$ plain form
995 5389 3037 -4234 -4091 3163 3564 -1505 -2117 -104 1411 4073 2406 -4841 -4006 4028 5981 -416
1011 -416 -4089 -4145 -3187 2049 7258 1180 -7784 -3180 5471 4382 -515 -446 -831 -2443 170 1978 -4093
1028 -4093 -5801 3529 4851 -4005 -4327 2416 2255 3358 6807 544 -8575 -1849 9586 4924 -4836
1043 -4836 -3369 -831 -2235 2730 4879 -4272 -6474 2678 3878 -2948 -3708 516 1 -468 2956 -1035
1059 -1035 -6423 1595 9980 4031 -3541 -1872 1208 2446 4304 1909 -4895 -6127 948 2782 -2071
1074 -2071 -3655 -1698 -1051 858 1586 -2415 -2636 2795 6100 1907 -3567 -2412 2816 5503 3742 -1650
1090 -1650 -5556 -2502 2807 3284 -56 -4432 -4950 -964 2513 1452 -2273 -3312 1377 4325 5
1105 5 -2423 780 3121 4278 2437 -2752 -4061 1785 6220 2385 -3285 -4372 -3915 -669 4830 1480
1121A480r395K341Q080l86k443J046j068l11M173O57o505n57P518L97o503q48
1137b324L66j10M794K257o565n042M112O107K90m066k670M48J847K989l34m578
1153b479o34M941J860m456k743K977K072m47Q31l085o410M457R402k470o791j75
1169c150K194K146L825k33p340o37O215Nm499J136M54k492K725J461o114j125
1185e429P555K795n309l625M62K069M777K106n437n651L435O128L64k590k281
1200f31r56J508K712j49l703k194L030K922l422l514J975K901K090m2l879l669
1216e021M408O425j537n300j328K90J298M384k61o674j212N926J128l454o76M16
1232a188N15K899m35n346j31O480K170l514k122j553K76N058L252o071n817K879
$$ plain form
1121 1480 -7915 -5574 2506 2120 -323 723 -345 -656 3517 4174 -2331 -2888 4630 5027 -1476 -2324
1137 -2324 -1958 -2068 2726 4983 -1582 -6624 -2512 3595 3885 -181 -2851 -2403 -556 2433 2099 -2479
1153 -2479 -3113 1828 3688 -768 -3511 -534 1538 1091 1922 -1163 -7573 -3116 6286 3816 -2975 -3150
1169 -3150 -956 1190 5015 4782 -2558 -3195 3020 3025 -1474 -338 116 -2376 349 1810 -4304 -5429
1185 -5429 2126 4921 -388 -4013 -3551 -1482 3295 5401 -36 -5687 -2252 3876 4240 1650 -631
1200 -631 -1587 -79 2633 2484 -1219 -3413 -383 2539 -883 -4397 -2422 479 2569 2527 -1352 -5021
1216 -5021 -613 5812 4275 -1025 -2353 -2063 -765 3619 3358 -3316 -4528 1398 2526 -928 -1604 -1188
1232 -1188 -673 2226 1791 -3555 -3686 2794 4964 1450 -672 -2225 -1949 3109 6361 290 -5527 -2648
1248b648L562Q3l48k428k729K273M846j316m616J813M915r23k437n3r31R80M244
1265D287Q93p024m074N128N059k300k700j850j803K596N439j465o272R21N183
1280B018q30k412J571O72j331K767J737n738l492P104L820m995l582m76mL501
1296C30M368l756o869J600O658k06k267N53q38o48M375Q3m843k52M221R10k968
1313D51k372j451K193L953K14n426l471L759L976O85j689l427p85L529K950n70
1329B519k891r96K452J627o68k698o44K391K370k145m547p45L271L510j233l638
1345b065j792L96M200M072k844n371J412L383M51K05j529k411N39M070j017n093
1361c394J151M904o75k515J32k303J28O551Q28o601k602L652K361O71M35l173
$$ plain form
1248 -2648 914 997 649 -1779 -4508 -2235 2611 1295 -3321 -1508 3407 2484 47 -6 -937 43 4287
1265 4287 5180 -1844 -5918 -790 4269 1969 -731 -2581 -4384 -1788 3651 2186 -4086 -3165 2018
1280 2018 1188 -1224 347 1019 -312 2455 4192 -1546 -5038 2066 5886 891 -2691 -3167 -3171 330
1296 330 4698 942 -5927 -4327 2331 2125 -142 411 -427 -1075 3300 3383 -1460 -1712 2509 3419 451
1313 451 -1921 -3372 -1179 2774 2988 -2438 -5909 -2150 1826 2511 822 -2605 -3390 139 3089 2519
1329 2519 -372 -1368 1084 2711 2043 -655 -1299 1092 3462 1317 -3230 -3975 -704 2806 1573 -2065
1345 -2065 -3857 -3461 739 4811 1967 -3404 -1992 1391 1842 2047 518 -1893 -1354 2716 1699 -3394
1361 -3394 -2243 2661 1986 -529 -397 -2700 -2572 3979 4807 -1794 -4396 -744 1617 2288 2723 -450
1377d50l744L607M774k953m007J547J790p96m32j109r88J737L489k51m696j086
1393c568M402L710q19k433k990j116M239L786k632o078K38L901j18j483Q13j356
1409a504q11L373O40m165p94M987J433k016j526j390l48N129K564n426m533K781
1425a606L347j51j70k477k667K350L082r44k516J75J756J351k08j776j855K859
1441E50L831j343m666j224K119L016O78k564l634l67L317K416j376k752o06J256
1457a349K413R86k189j699K487K912j767l518K29K981J037j64k379l566J017N064
1473B495J244m788k093O81J359K265J804l234l544L291M297k225l240J988J421
1488A721p38O55j293k899J454M162q48n073j354L218J975N73K4l018k877M040
$$ plain form
1377 -450 -4194 -587 4187 1234 -2773 -1226 564 -232 -664 -1773 -2761 -1024 2465 2214 -2482 -3568
1393 -3568 834 4544 3725 1292 -1698 -2814 1425 5211 2579 -3499 -3261 640 522 -961 -148 -1504
1409 -1504 -2315 1058 1698 -2467 -3261 1726 3159 1143 -383 -1773 -2121 3008 5572 146 -4387 -1606
1425 -1606 1741 1590 1420 -1057 -3724 -1374 1708 764 -1752 -1577 179 1530 1322 -454 -2309 550
1441 550 4381 3038 -1628 -2852 -733 2283 2961 397 -3237 -3604 -287 2129 753 -1999 -2605 -1349
1457 -1349 1064 2050 -139 -1838 649 3561 1794 -1724 -1495 1486 2523 2359 -20 -3586 -2569 2495
1473 2495 3739 -1049 -3142 -2461 -1102 1163 2967 -267 -3811 -520 3777 1552 -1688 300 1721
1488 1721 983 1638 345 -2554 -1100 3062 2214 -2859 -4213 -995 980 1553 1577 -1441 -4318 -278
1504b78M716j981m330J081J899M7j62n37k008N69L272l59m612o10L318J851n48
1521A328j891k619k5L594L396j974m297%L599K033j055j642j127O35J386j98j924
1538g81j329J689K229j534k884k44J558K820J521l407l492J452M196J927j862
1553A859l539k89J777K519r2k223j156M37J396M65k199j676K433K224j579j915
1569a558m86J425K409J744k797l994J156M372R45k922j222o75k14K881J329l472
1585a079k145K368K918j195k393L00J718R27L12j373k881J077M752O66l824k577
1601b429R38J970J012Q18k558m185K433M069j219l361J278J675m71J72j05j199
1617a162L98M125J7m464j803L144K194j41r48l588j353L289L373j301l930p99
$$ plain form
1504 -278 4438 2457 -1873 -792 1107 1154 992 455 -1553 -984 2288 1929 -2683 -3293 25 1876 1328
1521 1328 -563 -3182 -3207 387 3783 1809 -2488 -2488 1111 3144 2089 447 -680 -45 1341 1143 -781
1538 -781 -2110 -421 1808 274 -2610 -2854 -1296 1524 3045 -362 -3854 -2402 1794 3721 1859
1553 1859 -1680 -1969 -192 2327 2235 12 -1144 -707 689 1154 -1045 -2721 -288 1936 357 -1558
1569 -1558 -2044 -619 1790 3534 737 -3257 -2101 2271 3216 294 -928 -1603 -1817 1064 2393 -1079
1585 -1079 -3224 -856 2062 867 -1526 -1226 492 1419 1731 358 -2523 -1446 3306 3972 148 -2429
1601 -2429 -1491 479 1491 2309 -249 -4434 -2001 2068 849 -2512 -1234 441 -30 142 37 -1162
1617 -1162 -764 3361 3378 -1086 -2889 255 2449 2308 1360 -2228 -3581 -292 3081 1780 -2150 -2949
1633b949K435J394O1o87j685M28K439O2k296j59J881J318n76j803k061M58L319
1650A579J306k931l223L01K562K342m38k733j330J834K061J02j291p41Q73J457
1666A730Q0j670j727J510K096l54k478k155O49L108J602j823l074p15K844K579
1682B202q93j610l67J9J863J211j944k309J957K468j905k349L57J072N67J541
1698A880j778m057J121N114L13l055o87k16j03L093K070l307l187K462K718j809
1714E72j293J43j40P27P31k097j666J633L410k31k451j561J444J950J318K1l168
1731f58k198K440L216m16l535p48J336Q86K49q62j926O41K805l71k899m8K183
1748I5Q62Q53o84k837l49L666K070k029k465p50R40K215N83k793k009K197R73
$$ plain form
1633 -2949 -514 880 941 254 -1431 -1003 1436 1498 -798 -957 924 2242 1666 -137 -2198 -1740 1579
1650 1579 2885 -46 -3269 -2968 -406 1936 1498 -1235 -2565 -731 1330 1432 141 -600 273 1730
1666 1730 1810 140 -1587 -77 2019 1665 -813 -2968 -2319 789 2391 568 -2506 -3221 -377 2202
1682 2202 1309 -301 -668 -649 1214 2425 481 -1828 129 2597 692 -1657 -1300 -228 339 1880
1698 1880 102 -3955 -2834 2280 2593 -462 -1149 -1365 -1468 1625 3695 388 -2799 -337 2381 572
1714 572 -721 -578 -718 9 740 -1357 -3023 -1390 2020 1789 -662 -2223 -779 1171 2489 2510 -658
1731 -658 -2856 -416 2800 2384 -1151 -1899 -563 323 572 -290 -2216 -1575 1230 859 -2040 -2088 95
1748 95 957 1810 1126 -1711 -2060 1606 3676 1647 -818 -1568 -628 1587 2170 -623 -2632 -435 538
1765E38p59l45n58K16J732P33k272j546K225K017L69j390k703p66L346K897k273
1782A461l102l77J566R42N87j217j730L92K101O32j956r11K028J410j070o12j135
1799i91j52K597J760k405l771O93L363P86j611r35j536j60L115J532k851k049
1815b615K503J521p78r12M26P3P26J709k168l328J992L299j65k886r68l13R79
1832i05K032J038l416j810J892K647o90r38k40k85J338R70j242j441O81K227m4
1849A814l031p86R86J721J106j596k167o69J932K649N5k653j213J738J507J18
1865A511p71j316K90J352p3j397j101J074J778m48j862j211K07K136J943j222
1881H90k472p67K040K728j7l038n75J100J035O28o91j709j47J969J62k109j105
$$ plain form
1765 538 -221 -566 -1124 -908 824 1557 -715 -2261 -36 1981 2350 960 -1743 -2509 837 3734 1461
1782 1461 -1641 -2018 -452 490 1077 -140 -1870 -1478 623 1255 -701 -1612 416 1826 756 144 -991
1799 -991 -1143 1454 3214 809 -2962 -2269 1094 1880 269 -666 -2202 -2362 753 2285 -566 -2615
1815 -2615 -112 1409 631 -281 145 218 944 2653 485 -2843 -851 2448 2283 -603 -1571 -1884 -905
1832 -905 1127 2165 -1251 -3061 -1169 1478 788 -150 -390 -675 663 1633 391 -1050 -369 1858 1814
1849 1814 -1217 -2003 -1017 704 1810 214 -1953 -2622 -690 1959 2014 -639 -1852 -114 1393 1511
1865 1511 740 -576 -286 1066 993 -404 -1505 -431 1347 899 -963 -2174 -1967 169 2112 890
1881 890 -1582 -2349 -309 2419 2402 -636 -1211 -111 924 1552 861 -848 -995 974 1136 -973 -2078
1898b078J915R70n01k18j716j014L004K955k299l077N45J972J390N9j077k226
1914a396l64K764M48j813j073J102Q74j61j101l80K73J663J108j560k652P47K860
1931A339J008j251j694o56Q52J599J010k269j854J107J292l26l96n88j63J032
1947D2Q20j018j399J186K487p7j917j264M6K006J552p52k624j060P76K071L58
1964A233j341j766O38J238M31n26q97L43J294O85j373j377J014J962L30j369j737
1981a218l58J821J997p92k288j720J291K173M57j827o30L11J110P99q87p26J40
1998c47J331O07j593q11K43J928j02l69k177j101K004K405q92k489r72J257J775
2015F97M57q58j136K9J741N88j473o70J008O81Mj048j045m68J696J934j486k764
$$ plain form
1898 -2078 -163 807 306 88 -1628 -2642 362 3317 1018 -2059 -1514 458 1848 1907 830 -1396
1914 -1396 -1760 1004 1452 -361 -1434 -332 542 381 -720 -1100 -827 836 1944 384 -2268 -1521 1339
1931 1339 2347 1096 -598 -1254 -402 1197 2207 -62 -1916 -809 483 157 -239 -827 -990 42
1947 42 862 -156 -1555 -369 2118 2041 124 -1140 -1094 912 2464 1712 -912 -1972 -1196 875 1233
1964 1233 -108 -1874 -1236 2 433 -93 -990 -647 647 1332 -41 -1418 -404 1558 1888 519 -1218
1981 -1218 -1576 245 2242 1450 -838 -2558 -1267 906 1363 -464 -1094 -783 327 1126 239 -487 -347
1998 -347 984 1591 -2 -813 -570 1358 1256 887 -1290 -2391 -387 2018 1126 -1363 -2335 -1078 697
2015 697 1154 296 -840 -811 930 1518 45 -625 383 1064 1068 20 -1025 -1493 203 2137 651 -2113
2033b113k07K182J461k72j166j401L30K141P76j318j065M18J001n2n39n16l52
2050f92J284O88j740j548O14K139P58p26k255n03J424K256L19k103j109M64J516
2067G86Q03o80j611o6J034K42o25j328N84J313J38j186j042M8J805J758p98k376
2085a201k71J391J873O5j386j767J72K068P05j553j147J93J069M6l81j058K41
2102i41J518L96j068j550N46J751R16j96j471j425J260J893K37j811j236K40J153
2119B12O15o70j139l25J418M67j180n31Q66R94M69m39j802o27K176J941r46k047
2137e48j056R73J309R64j094k383K43J974K54j081k14L08L60K27K33j023o50K209
2155A005J052j672j778N89J232J261n32j765j604R18K236L64j745j110O37Q74
$$ plain form
2033 -2113 -2320 -138 1323 1051 -115 -1516 -1186 955 1731 413 -652 -234 767 715 176 -340 -692
2050 -692 592 1280 -460 -2008 -1394 745 1503 777 -1478 -1981 -557 1699 2018 -85 -1194 -730 786
2067 786 1589 909 -702 -768 266 508 -117 -1445 -861 452 590 -596 -1638 -1590 215 1973 1175 -1201
2085 -1201 -1472 -81 1792 1857 471 -1296 -1124 944 1649 96 -1051 -858 211 257 -124 -1182 -941
2102 -941 577 973 -95 -1645 -1099 652 1568 1372 -99 -1524 -264 1629 1866 55 -1181 -941 212
2119 212 827 157 -982 -1307 111 578 -602 -1133 -267 727 1196 757 -1045 -1672 504 2445 1499 -548
2137 -548 -1604 -631 678 1642 548 -1835 -1592 382 636 -445 -659 -351 9 236 469 -554 -1204 1005
2155 1005 2057 385 -1393 -804 428 1689 1157 -608 -2212 -1294 942 1306 -439 -1549 -912 -38
2171c8N19J62j216k92J357Q27r70j255O92J437l56m99r03j387J647K086q56j791
2189h36p18N51Q27J425r24j446J41J440O69o61o62j51O47Q25n57j622L00J260
2207E08Q17j268j349n63J088J698K7j051j581M24K099P08o92j198m32J034J018
2224A287p91j019q1J194L2q67o80P6N53J181k32j828q98J882J582j34j315q48
2242i06J3J345J424r43j632r1J405J22p79j94k79J47Q09j24j601q3J695J384j108
2261F04j636J47K59J773O82j066k088M01J946K05p70p94l91K02P27L21j525k64
2279a267J464Q72j254j074K31J265J344m01j941n36J005J707K7j098j261j32J358
2296C09O23o81j044l14O12Q92k6j222l7J262M89p86p18N6J051J322m37j740r31
$$ plain form
2171 -38 481 643 -573 -865 492 1319 349 -906 -214 1223 867 368 -535 -1922 -275 1811 955 -836
2189 -836 -1554 -1003 -176 1249 325 -1121 -980 460 1129 468 -194 -345 302 1127 570 -1052 -752 508
2207 508 1325 57 -1292 -1855 -767 931 958 -93 -1674 -1250 849 1557 865 -333 -765 269 1287
2224 1287 496 -523 -604 590 622 -245 -925 -849 -296 885 653 -1175 -2073 -191 1391 1257 -58 -906
2242 -906 -893 452 1876 933 -699 -790 615 737 -42 -236 -515 -368 441 317 -1284 -1367 328 1712 604
2261 604 -1032 -885 -626 1147 1829 763 -1325 -924 1022 1227 457 -337 -728 -526 201 522 -1003 -1267
2279 -1267 197 1069 -185 -1259 -1028 237 1581 1180 -761 -1297 -292 1415 1442 344 -917 -1049 309
2296 309 932 251 -793 -1107 -495 397 371 -851 -888 374 863 77 -641 -585 466 1788 1351 -389 -1320
2315a320J011J344L23j115j517l1J081Q47k47j198l22O62J308m80q41L16Q31N02
2333A154r53q77j40R60J312L5k196r84J348J139l92q3j315q44J649J590r71j287
2351h55K70P46Q3J03m55l91R86O50o36j754k1J422J100l69j608q77L92J278J193
2370A257r89j494L4J087J107o51n23K48j17Q97m47o39p00J278Q78j241q18l98
2388a231N62J331M92j235j690M38J862P85j038r44K73K42J086j83o96j45M07L6
2406C52j32j049J47J023M38l57j331m83R55J370K87j101j501O21J431M35j64j027
2424h6o46Q10P07j88r72j44P08L62p63p48K54N90P99K65j575p06J325J364l1j225
2444A00r09L97R22P20j41j381p29R72O75j61j081l25Q16N43m18q02J2O32J157
$$ plain form
2315 -1320 -309 1035 1358 243 -1274 -1305 -224 623 376 -822 -1144 -482 826 346 -495 -179 652 1154
2333 1154 201 -676 -816 144 1456 1491 -705 -1689 -341 798 406 323 -992 -1836 -187 1403 432 -855
2351 -855 -585 161 244 347 -108 -499 487 1137 501 -1253 -1274 148 1248 879 -729 -1606 -1214 64 1257
2370 1257 268 -1226 -1192 -105 1002 351 -172 76 -41 856 409 -230 -930 348 1226 -15 -833 -1231
2388 -1231 -669 662 1154 -81 -1771 -1333 529 1314 276 -668 -395 -153 933 750 54 -91 316 352
2406 352 220 -829 -682 341 779 422 -909 -1392 -437 933 1220 119 -1382 -761 670 1105 941 -86
2424 -86 -732 78 785 597 -375 -519 189 551 -212 -960 -706 -116 683 948 -627 -1333 -8 1356 1325 100
2444 100 -809 -412 510 1230 1089 -292 -1021 -49 626 465 -616 -941 -125 418 0 -802 -790 -158 999
2463I99J39j989o4Q67J219N4n71r01p32J039J354r95j240MO41K9J86k74j92L02
2483a25O61j43j060j57J056J206n58j270m24M47J252N68q91j381q05J292J089
2500G57p29o14k35L48M29K67m59n10J121O72r17n14j10M85Q90L28j192j278O01
2519f60J469K88p09j074m70Q70O96P7j170j43M58Q89n8n78o0N25P25o91j095k91
2539a002J103L91N37j182j309L79J466N09p88p75m43P07J214J1p95l36N32Q63
2557A082p64n37l04O97N09n01n94n92O76J057M13j516j210Q35Q66M72J50j050
2575c11q19Q21J517j69j184p6M80K02j21m71l18K95J039q42j111l24J121J119
2593H48j27p76o63j79J008J509r10j306K8L96R38j18l03j050L82M87K57j205k41
$$ plain form
2463 999 1138 -851 -915 -48 1171 1225 654 -247 -979 60 1414 419 -821 -817 -176 -147 39 -235 -427 -125
2483 -125 536 393 -667 -824 232 1438 880 -390 -814 -367 885 1453 562 -819 -1624 -332 757
2500 757 28 -586 -821 -473 -44 223 -236 -746 375 1047 130 -384 -494 -9 881 1209 17 -1261 -660
2519 -660 809 1097 388 -686 -1156 -286 410 487 -683 -826 -368 521 463 -115 -175 350 1075 384 -711 -1002
2539 -1002 101 492 1029 -153 -1462 -1083 383 892 104 -671 -1114 -407 807 818 23 -313 219 1082
2557 1082 318 -219 -523 174 683 182 -412 -1004 -328 729 1142 -374 -1584 -749 117 589 739 -311
2575 -311 -1130 -309 1208 1039 -145 -221 259 461 340 -131 -449 -154 885 43 -1068 -1392 -271 848
2593 848 721 -55 -718 -897 111 1620 710 -596 -568 -172 766 648 345 -705 -323 164 421 -784 -1025
2612a025P73N08j94p42j97J72J574K90r89r76J06J059Q97o85j042k81O70R48j05
2631G61j110k43J79O56j14q23j69M39J368M5j498l54O30R67N26q32q27k85J259
2650E75L06l56o36m45J79M79J57o14l16O05M53o05n63N67L51N14K96r02r30M80
2670d05J157M81j165m77l82M45J204K8j373o39Q10N76m2n21p5J96K90L85l48o92
2690e47N39J212l88q49p06J17Q57P54q81j055k29R74Q94k17j133N2K15N53N26
2709F88r50k49K62R91j48p18o06Q58M40L54r74r34LJ297N75o06o79n43O39P66
2729D66J96q41k22K10Q67p2m65o7o0O53m03o35j29L50M77J87o44j188M50J291
2749D21O03m95j267K2N61P27N04o94p94J93N04K36o02k48K48M19l84j41n78P1
$$ plain form
2612 -1025 -252 256 62 -680 -877 -705 869 1159 170 -806 -700 359 1256 571 -471 -752 -82 866 761
2631 761 -349 -592 -413 243 129 -694 -863 -424 944 989 -509 -863 -233 734 1260 428 -399 -684 575
2650 575 881 525 -111 -556 -377 102 259 -355 -671 -66 387 -218 -781 -214 137 651 947 45 -885 -405
2670 -405 752 1233 68 -409 -791 -346 858 886 -487 -1126 -316 260 218 -303 -378 -182 108 493 145 -547
2690 -547 -8 1204 816 -33 -739 -622 235 989 108 -947 -1176 -202 692 475 -658 -606 -391 162 688
2709 688 -262 -511 -249 742 594 -124 -730 128 568 922 -52 -986 -983 314 889 283 -396 -939 -300 466
2729 466 662 -179 -401 -191 676 604 139 72 12 665 262 -373 -502 -152 325 512 -132 -1320 -870 421
2749 421 1024 529 -738 -716 -155 572 1076 382 -412 -219 285 521 -81 -329 -81 338 -46 -187 -765 -694
2769f94J067J50p37r40M85J168N48l30r27m73M23J239k41n56p17L15N00Ll70l09
2789c96N2Q85k86l91p83L57J079L76p68o34lQ61L55K65r69o55M23N75M74q94k95
2810c72P4K17L08l32l44J69N50K64r83l26M87J081L67p29q76j50Q56N95k31o91
2830f6p40N80O09J27q70l5m5N40jj56m77L52O53P4q15n89Q03O17N34m88j128l97
2852i18R62O76k05o10j000N30P45J9l38m87Q5P56L15o89r6L18O79j74n43n22R4
2873d03P20M62m95q46l25P91N22j6p55m75K89P71J57o51r5K71L22N9k50m11J17
2894b41Q60k74l97p85L67P54N33q10q78mO28O87L05r08l32K9P15N03m53l23J2
2915a2L26J70l11m31J32M66J63p35p09J46P04O64k40p59n56O53R32K97j022j27
$$ plain form
2769 -694 373 523 -214 -1154 -669 499 1047 717 -210 -683 -260 979 738 182 -535 -220 280 283 -87 -396
2789 -396 -344 541 255 -136 -919 -562 517 893 125 -509 -512 349 704 969 0 -655 -232 343 817 -77 -372
2810 -372 -298 -81 227 -105 -449 -280 270 534 -449 -775 -288 793 1160 431 -445 -595 261 856 625 -66
2830 -66 -806 -226 383 510 -360 -395 -440 100 99 -57 -534 -182 471 545 -270 -859 -56 561 1095 607 -521 -918
2852 -918 44 720 515 -95 -1095 -565 180 199 -139 -626 -541 215 530 -159 -255 63 742 568 25 -497 -403
2873 -403 317 779 284 -562 -887 -96 426 410 -345 -820 -531 240 397 -254 -349 -78 244 303 53 -358 -241
2894 -241 619 345 -52 -837 -470 284 817 7 -871 -875 -247 440 745 -163 -495 -466 249 752 299 -24 -12
2915 -12 314 484 173 -258 -126 340 503 -232 -941 -795 -91 573 333 -426 -982 -329 603 900 -122 -249
2935b49J21M19K58j39p26L77N06l41m39j50K53L19L62n52p07k12J368M03l72r16
2955d17k82P40O43J50l54q78L00L01N3j16k43k10N27J58n37o29K39P82J46l99
2975b6o31J9Q40Q75m66o36n40L89O76%m25l76k16M00K14j59k29J5L00J45l90m85
2997g06L78O60N27n73o04n6M53P92p6q16q64N89N27M29q56m72M90L32N2l05o1
3018a60j61O99J99p36m39M87Q64R6m51q12k32L57R56l9p73q71M53O70J85k88n87
3039e83rM93M74n13l60M02O14j68o08P3P4N31M00l92j294J31O86M86j29l34p12
3060g38K58P56p8j19m78L8P84j09j22m94K49M59K66o96l71j4N07N58k48p87n19
3081h98N43N72L26k34q46N8O21M31k41l60q0P08m55k14j3q5L44o3m0o32j77R22
$$ plain form
2935 -249 -128 291 549 410 -316 61 567 226 -213 -363 -110 209 571 19 -688 -900 468 871 499 -417
2955 -417 -699 41 684 834 480 -398 -98 203 256 140 -103 -313 214 372 -165 -794 -555 227 373 -26
2975 -26 -657 -638 202 1077 611 -25 -565 -176 500 500 75 -301 -517 -117 97 -62 -291 -276 24 169 -221 -706
2997 -706 -328 332 859 286 -318 -374 79 871 795 -21 -885 -296 231 660 -196 -668 -178 154 206 -99 -160
3018 -160 -321 378 577 -159 -598 -111 753 849 398 -414 -646 -289 667 628 -145 -1016 -563 107 292 4 -583
3039 -583 -592 -99 375 -138 -498 -96 518 350 -258 -185 -111 420 820 428 -866 -735 -49 437 308 -26 -738
3060 -738 -480 276 198 79 -399 -361 423 314 192 -302 -53 406 672 -24 -395 -409 98 656 408 -379 -898
3081 -898 -355 217 543 309 -537 -479 142 573 332 -28 -108 600 145 -69 -82 -167 177 114 74 -558 -735 187
3103A87O11m33r42k53N13P50J81m55o76k18J167m8j00n50Q6o2L73L1o05j97Q66
3124B26L63o37o49K14N30N66k13o45m94Q19O05J13n00n78o3N37L46n56j42k38
3144c96N53j8m46j87PM68M45n17l83j79Q37L68j84k05o85K36O48M92m85o69M2
3165b58M67r0k84r0l2K58L98m10n10J83O24L10m05n55q4O48L32K56p38o08K91
3186b97M42N51l69n43m76P79L20m99k79J0O08j24k14j42j47O97N29o55n51l4M08
3207A4O92k18o53l76M4O58L17l07p00J80O59l27j38k50L12J36M00M6j062L46O79
3228D52J11j77q50J31J77N90R7n81n31oO20K70k04m54J45M64M0j75J04k42J65
3249A46L0k8m07j50P03lJ61q24l11N42N45K00m94p49K68N42L55j83o43J04J40
$$ plain form
3103 187 798 365 -577 -830 -317 433 614 159 -517 -735 432 384 284 -266 -180 -242 131 162 -443 -640 226
3124 226 589 -48 -697 -483 47 613 400 -245 -739 80 685 798 298 -280 -343 194 540 -16 -158 -396
3144 -396 157 139 -307 -494 -487 -19 426 -91 -474 -653 184 552 368 163 -522 -286 362 854 369 -300 -258
3165 -258 209 119 -165 -255 -287 -29 369 -41 -551 -368 256 566 161 -394 -478 170 502 758 20 -588 -297
3186 -297 145 696 327 -216 -692 87 407 -92 -371 -361 247 123 -91 -233 -380 317 846 191 -360 -394 14
3207 14 706 488 -165 -541 -497 161 478 171 -529 -349 310 -17 -155 -405 -93 43 443 489 -573 -227 452
3228 452 563 386 -464 -333 -156 434 531 -50 -581 -587 33 303 99 -355 -210 254 294 119 223 -19 146
3249 146 176 148 -259 -409 294 291 452 -372 -683 -141 404 604 110 -639 -371 171 526 343 -300 -196 -56
3270e6M83j08l56k27M21J64k60j87k62N24L23J79q04p79M75J040J00p92k23l7
3290c82M07N33k12l65k42L69K96k36k95k4J57K14n8n69m90P69N27j12n75LQ2M76
3312B73M17l17r36J57P12L71m28l13j81J10J28j7k82j68N89l81L48n87J42M20
3332E7M70k0o43j93R4P92k4o4r28P6L10L40k35j10j49O2M71l70K17n55N37K88
3354D23j96m64j07N53K37o1o01j53K81N57l6n60k31j44M82J31p7j70k31J62N46
3375C41k91j48J07J11K5J23l96n44Q89J76R9m87l17J27L68L20j86q24K43O4K1
3396a79J94j23l8K48K19k5m47j89L80K96q7n57l78O91O50l41m07m68OM19N21n6
3418C29m14l76L88M28L4k27m14J90M8J08k92j5L71J37n8m13m45OJ137k92l63k40
$$ plain form
3270 -56 427 319 -37 -264 157 321 61 -126 -388 136 459 638 -166 -945 -470 570 670 -122 -345 -382
3290 -382 25 558 346 -19 -261 108 404 168 -127 -151 6 220 162 -407 -897 -128 399 287 -288 -285 -203 273
3312 273 690 373 -563 -406 306 677 249 -64 -245 -135 -7 -24 -306 -474 115 -266 82 -505 -363 57
3332 57 527 507 -136 -329 -235 557 533 469 -459 -383 -73 267 32 -78 -227 -165 306 -64 153 -402 135 423
3354 423 227 -237 -344 209 446 385 -216 -369 -88 469 433 -127 -358 -502 -20 111 34 -136 -367 -205 341
3375 341 50 -98 9 120 145 268 -128 -672 217 393 492 5 -312 -185 183 503 317 -507 -264 -200 -179
3396 -179 15 -108 -146 102 321 296 -151 -340 40 336 249 -308 -686 5 655 314 -93 -561 -555 -136 385 329
3418 329 -85 -461 -73 355 389 162 -252 -62 -14 94 -198 -213 158 295 237 -176 -621 -615 522 230 -133 -373
3440c73k04N86M76j69m53l06K91N95k46k43K4j47L26o4k67m8K72L90l73l00l23
3461e56L58M93L44o98m14j57P73L67j24m58j26J85K64m6l42j75K42K29j40m18
3481c99l2L61L19J61r84j90N97P34j75m25j19JN07J52m1o81l03M67L14k93L2l23
3503c20L23K23j05l82j67M05K17L53p66m31L60O71L71m18p24R5L50L13j51j22
3523I5m08R6M64k72j2j38K06p4R9j77l03L63O14k60k66l62K15K79K87l64q8m77
3545d83L53L09Ll77l0l7J30J5j48M01j33L60j30j81m20M27K76K47m79n37J09M54
3567A29M34n45k42k36M62m6j74K31k75k12Q21m7m25j11K16M11j54o88R4L50L81
3588C74K85o24n25J87M25L94l96n71L4M76j10L06k84k07k4M67o8r5l07N07M1j49
$$ plain form
3440 -373 -577 9 485 316 -137 -443 -152 443 197 -46 -22 -169 157 93 -174 -222 50 440 67 -233 -556
3461 -556 -198 295 639 -59 -473 -630 143 510 386 -72 -198 -13 251 205 -137 -312 -70 159 19 -399
3481 -399 -431 -70 249 410 -574 -764 -167 567 392 -33 -152 -151 356 508 467 -214 -517 -50 264 -29 3 -320
3503 -320 3 226 121 -261 -428 -23 194 547 -219 -650 -290 381 752 334 -390 -295 55 368 217 95
3523 95 -313 -217 247 -25 -37 -175 31 -43 56 -121 -424 -61 553 293 27 -335 -120 159 446 82 -6 -483
3545 -483 -130 179 182 -195 -225 -262 -132 -117 -265 136 3 363 233 52 -368 59 335 582 103 -434 -325 129
3567 129 563 18 -224 -460 2 -44 -218 13 -262 -474 347 300 -125 -236 -20 391 237 -451 -357 -7 374
3588 374 659 35 -490 -303 122 516 120 -451 -417 59 -51 255 -29 -236 -260 207 139 44 -263 244 285 136
3610A36l06k04K47k0P70n10o03J85L52L51L6o30L1p7K58J37j03k37L81N3j62P1
3632A56n35M75K86j89m15j46KO63Q0j45p15N7L72M50K08q34j68J65K77J65k19
3653a0k46J44L76k86m72J74K89K96k14j50k47J4N19L40k77o58kN47L04Q5m76k78
3675b28K9M24J6k34m69N32j44K7r9j33j7M86kk86l83K73N74J56k54n02j73M10
3697CK73J8k60m67K21J81K03r0n41L94M16k46l26m4K4M04L41k09p78K70L08N73
3719F68m39m63k11M59J99o2j83l47J72L65n8J35m39QN40j02j62l21M14K97K0l42
3741A48m14J47l7N85Pn94k47K68L84j47p8j90M0K13M8j2q4O8K51M3m79l59L26
3764a13M07pk35l96P2Q5N32j7o24r3J35M58J06m28k2J20J5J98j52OMJ75j63k73
$$ plain form
3610 136 -170 -374 -127 -147 623 113 -490 -305 47 398 434 -196 -165 -242 16 153 50 -187 194 247 85 156
3632 156 -379 96 382 193 -222 -368 -366 297 377 232 -483 -426 -54 396 604 -230 -398 -233 44 209 -10
3653 -10 -256 -112 264 -22 -494 -320 -31 265 51 -99 -346 -332 187 527 250 -408 -410 137 441 526 50 -228
3675 -228 -199 225 241 7 -462 70 -74 -47 -146 -279 -296 190 188 -98 -481 -208 366 522 268 -234 -407 3
3697 3 276 294 34 -433 -212 -31 172 82 -459 -65 351 105 -221 -265 -241 163 504 295 -483 -213 95 668
3719 668 229 -234 -445 14 213 151 -32 -379 -207 158 100 235 -204 -196 344 242 80 -241 173 470 490 148
3741 148 -266 -119 -156 429 436 -158 -405 -137 247 100 22 -168 -128 85 133 121 37 105 356 399 -80 -439 -113
3764 -113 294 287 52 -344 -272 -187 345 328 -296 -389 -254 204 310 -118 -140 -20 -5 193 41 47 51 226 63 -210
3788b10k53Q5O51o7m10k44O4L86K94k16j09j85J98N03k00k33j86j21M70K63o26
3809a46r1L24K54j24n66r1L7M90K29k63m03m9J83K29L71j62n14J07N56j41k70
3830d0j84J82J6J89J32p16M03oK06k07k89p6O35K11m53j23n03P27K98m0l57k74
3852b69m8L56L90m99J4K25k06J7j21l05J67L22K42l71l9j01L29N04m98m61P8K16
3874e8N00K8n64j90j01M86on7l20k0L10J43k59l32N19L19j39j10k46Q7K99J81
3896D70j87n65k21N73K75p9j31n58QL82M2J31n31L18J56p7N2j01j81J80M65k54
3918A67k75j78M12M9j4m10K3O8N11m16j10j78K47L20o8j62j73L3K31P0l91J39
3940a05K16L58P4l15m95j81P15L26j57q00J1j20M31L51k80l46J12K96m7K32k22
$$ plain form
3788 -210 -463 -378 273 206 -204 -448 -384 2 296 80 -29 -214 -16 487 287 54 -132 -253 217 480 -146
3809 -146 -237 87 341 217 -349 -440 -403 87 316 53 -350 -399 -216 13 384 222 -292 -185 371 230 -40
3830 -40 -224 -42 -26 163 295 -421 -18 -24 182 -25 -314 -390 245 456 3 -120 -623 104 402 362 5 -269
3852 -269 -317 39 429 -70 -56 169 -37 -20 -141 -446 -279 43 285 -86 -125 -226 103 607 109 -352 -274 -58
3874 -58 442 470 -94 -284 -385 101 95 38 -282 -302 8 151 -108 -440 79 398 259 149 -97 -10 289 470
3896 470 283 -282 -503 70 345 266 135 -423 -415 -33 9 140 -391 -73 83 6 58 -43 -224 -44 421 167
3918 167 -108 -286 126 175 161 -249 -226 -158 353 -63 -173 -351 -104 216 148 -14 -187 -154 77 147 -244 -105
3940 -105 111 469 543 228 -267 -448 267 593 436 -364 -353 -473 -42 309 29 -317 -205 91 44 276 54
3961E4M8k2R4j5l38J79K74j21m12n0J05K34J24n2j90n9K5L77J34k76k59k31M33
3984E6j23J17j97K61N4J12m14p0K1L38m4k33M7j64J39M37K4n34k96O36q6K96j82
4007A95l29p4L89Q0k46j93j19M68J23k67m35J56J45M36k49l12j14K92L78n5m78
4028b09J13j01L68L33n28k55L6K73Oj23k45Q6L11j26l3l09J39M22K30k50n25J71
4050b16L25L22Lq2n40k6M76K25n72J38m75L96K24k26k18J68K55J51j57l76P0M70
4072C35L8o4m46n9J16R3J88Pp51P8M10K27k35k32J32K61J80l69k21J59M46n6k02
4095C5l15Q9N36M7l57j46j85k2M75M23p95J11l5J45J06j08k37n5M31J84l32k04
4117b09J94K97K18n22k25k02N40J17K37m76l61j7M58nJ4n84M50K21J35q9l77J93
$$ plain form
3961 54 102 80 174 159 -179 0 274 153 -259 -309 -204 30 154 102 -88 -147 -122 255 389 113 -146 -377 56
3984 56 -67 50 -147 114 168 280 -134 -204 -183 155 111 -122 -75 -239 -100 337 361 -173 -469 167 81 377 195
4007 195 -134 -208 181 261 15 -178 -297 171 294 27 -408 -252 -107 329 80 -232 -346 -54 324 269 -209
4028 -209 -96 -197 171 504 -24 -279 -243 30 36 -87 -332 -246 65 -61 -94 -403 -264 158 388 138 -387 -216
4050 -216 109 431 434 352 -188 -214 262 487 -85 53 -422 -26 198 -28 -246 -78 177 328 171 -205 -135 335
4072 335 373 309 -137 -196 -80 13 201 208 -543 -465 -55 172 -63 -295 -163 98 278 -91 -312 -153 293 237 35
4095 35 -280 -191 345 392 35 -111 -296 -318 157 580 -215 -104 -139 6 112 4 -233 -288 143 327 -5 -209
4117 -209 -15 282 500 -22 -247 -449 91 208 445 -31 -392 -409 49 44 58 -526 -76 145 280 191 -186 7
4139GK8K26k78K4J31q0L2k53r9j26M70J85N5o32Q8k13N97kj20k02j02M85L12m63
4163G0r8J03k78N13m67M0P0M74k32l73j06R9L7K80M8k39j55NO47k51J03o07L03
4186a4M7L1K5l79K67L78l06Rk37j31K33K71nm17q1J80M40J66l07l76J3M8N50l92
4210A3l14M6J39j00M91p35K69K26n8l33l11M68L45J23j73j81rK89L37nn36l66
4232c75J49M8M58j88l96j6L38j8M9l3r9J62k64L79m52O8K38L40o5m50k62K97N35
4255D43j71l75k41Q5K11J51j34N6k93K07j0J67k60j61L85J43jn84L37j20N17j35
4277B17k84k68K49L18j24J45o83m1L64J25k21kj0R2K59o5J49k51J75k1K54l22
4299E5l75K3N79O3n57M3J70K65O0k94n06K14J78L93l43k51K96lK1L35k74k28K71
$$ plain form
4139 7 35 261 -17 7 138 58 90 -163 -262 -388 82 267 322 -310 -222 -435 162 160 40 -162 -264 221 533 70
4163 70 -28 75 -203 310 -157 -117 -47 427 195 -178 -284 -185 -148 132 180 -59 -214 -209 438 187 290 -317 -14
4186 -14 33 64 89 -290 -23 355 49 58 -179 -310 -77 194 189 -228 -309 -129 311 477 170 -206 -193 -145 405 13
4210 13 -301 -255 -116 -216 275 -460 -191 35 -23 -356 -667 -199 146 269 96 -85 -94 195 532 527 -9 -375
4232 -375 -226 -178 280 92 -304 -320 18 0 49 16 -83 79 -185 194 -258 -190 48 388 323 -127 -389 -92 443
4255 443 272 -103 -344 -259 -48 103 -31 25 -268 -61 -71 96 -164 -325 60 203 202 -382 -45 -165 352 217
4277 217 -67 -335 -86 232 108 253 -430 -471 -107 18 -203 -205 -215 -123 136 71 220 -31 144 123 377 55
4299 55 -320 -297 282 345 -212 -169 1 266 326 32 -474 -260 -82 311 -32 -283 13 10 31 366 92 -136 135
4322A35L8k96Qk18N23O7k5k30p38M97M51M1j90m41L32J3k1L93n24L3J8J22j4l72
4346c98L96K74k81K07p98K74K86N7J09l40o0R8K31J67K32n92n1J51K70k84K04
4367A52j19q6J23j45l24J09J62J02jj01j53O7K91K19k88k64J57K39K78l83k27
4388a92L5L9K57j81r0P5k35L75Jk12J24l4N2kk29j53L23L01K7k14k20k23M01L12
4412C37j26l59k03K75m0K6j44o2M60L5j24k76J43M8J88r7j14LmN94l06m0k75k24
4436b85M33j61K21l80l4J50J91K4m47j58O54l4K37o02M2M44j33J3j08l39J24L97
4458B49q8Q7o83N2M90Q5k03r4l1J23J01J41j51l74L24M35n42O2M9J08n9J72j66
4481H7n68M43L09j84k13k19P0p0L86J25j57k23J87K46j80K6j00Q0K32K8l45j83
$$ plain form
4322 135 173 -123 -115 -333 190 257 232 2 -736 -239 212 253 63 -378 -46 -33 -54 339 -185 -152 -134 -12 -26 -398
4346 -398 -2 272 -9 198 -600 -326 -40 17 126 -214 -274 -176 55 222 454 -138 -189 -38 232 -52 152
4367 152 33 -53 70 -75 -399 -290 -128 -26 -27 -128 -281 -214 77 296 8 -256 -99 140 418 35 -192
4388 -192 -157 -118 139 -42 -132 -57 -292 83 84 -128 -4 -38 14 12 -217 -370 -47 254 281 67 -153 -376 25 337
4412 337 211 -148 -351 -76 -116 -90 -234 -296 164 199 75 -201 -58 -10 178 81 -33 -30 -34 560 254 214 -61 -285
4436 -285 148 -13 208 -172 -206 -56 135 159 -288 -446 208 174 411 -191 -149 295 162 175 67 -272 -148 249
4458 249 161 248 -435 -383 107 192 -11 -105 -136 -13 88 229 78 -296 28 463 -79 -17 32 140 81 253 87
4481 87 -481 -38 271 87 -126 -345 -275 -345 41 166 9 -214 -27 219 39 65 -35 45 277 305 -40 -223
4503b23K65K84k90o9m46J52L88K43j74l46p8Q5M68L3m58o4P3J70K30k55j30K29
4525H7Lo3k37j87M01J17Q5k34q1j7J40L02k70m68J25M45L17j24l23k50K70L01
4547C39j38l31O3K84Nl71J80k76P8K41J08L8o30K06N53R3l40r5j29J23j9J06J77
4570B65o47J79K89l23k2J86J51M7j7l29K7m0M93J12j77l57M4M08n9N1m68j59N69
4593B23l52O4P9k75K59K8jj70K97l2qJ50m96O4L06n2J04m15N3l52L89L76J5m54
4617b00j93J26M30l8k11j39J02M44l38j44O6L47Q7j30o8m08O6L78J93l10k96k91
4639e27L94M5K09m47K70Q6K6K14j95j38m9K15P5j65p5j14K49K1l58l7K73K16k7
4662A61j80r2k73N5L40J75n98K65K35K7j55K63j09q2K35j11O0k73J5J48k18n4
$$ plain form
4503 -223 42 326 36 -33 -479 -327 61 304 130 -216 -294 -209 259 292 -166 -230 -157 13 243 -12 -142 87
4525 87 90 27 -210 -397 4 121 206 -28 -109 -126 14 316 46 -422 -297 148 465 341 18 -232 38 339
4547 339 201 -130 -67 217 222 -149 31 -245 -167 74 182 220 -410 -204 349 442 102 7 -122 1 -18 88 265
4570 265 -382 -203 86 -237 -259 -73 78 125 108 -221 -194 -234 259 371 194 -163 -119 289 230 281 -187 -346 223
4593 223 -129 -65 14 -261 -2 26 25 -145 152 120 112 262 -234 -170 136 84 188 -227 -174 -526 -137 239 254 -200
4617 -200 -393 -267 163 125 -86 -225 -123 321 -17 -161 -95 252 339 209 141 -267 -201 177 370 60 -236 -527
4639 -527 -133 -88 121 -326 -56 30 56 270 75 -63 -112 103 178 13 -62 -176 73 94 -264 -301 -28 188 161
4662 161 -19 -111 -384 -329 11 186 -412 -147 88 115 -40 223 114 32 267 156 216 -57 -42 106 -112 -166
4684a66r8p8K94K91m63j17j23K75L68N0m18k15M94J03j01k82k58K73M91k57j86
4705a23J3%j9K31m12R7j94M49J91q0j12j79L32j07K39q2m07J79M7P9k35K9J86
4728A22j51J11k56J43j97J98K83k46n57N29R3L11j60k16k9K7J89L6k09k62N9J31
4750e1K01j7k30nP0j16J74m42K67M72j56j86j98J77K18Q8K51n88M7J46J23J09
4772C54n01R3p4L19l68K44j67N9J01O0k08n9P0K23K6m8l27M6K71K52k10k53N0
4795d7O2J15l0j58m7R0J53l47K49j05J09L47l5m47l7Q7K73n9j25n20L03L15L12
4818D58j81l00k17M00k85L16m22K21j40J37K71l50N5M9K47j93o7q4J65J17k66
4839f9N4j46j50M23L89l40m12j15J95L07J92r1o03L74Q6J16N7n80O31j38j03k6
$$ plain form
4684 -166 -264 -342 -48 243 -220 -337 -460 -185 183 233 -185 -400 94 197 96 -186 -444 -171 320 63 -123
4705 -123 -110 -110 -129 102 -310 -213 -407 42 233 153 41 -138 194 87 326 244 -163 16 63 142 -93 -64 122
4728 122 -29 82 -174 -31 -228 -30 253 7 -550 -21 72 383 223 7 -22 5 194 230 21 -241 -182 -51
4750 -51 150 133 -97 -102 -32 -148 26 -416 -149 323 167 -19 -217 -40 178 266 517 -71 -24 122 245 354
4772 354 -147 -54 -128 191 -177 67 -100 -41 60 120 -88 -147 -77 146 172 124 -203 -157 114 366 156 -97 -47
4795 -47 15 130 100 -58 -105 -15 138 -209 40 -65 44 391 356 -91 -128 -41 232 173 48 -472 -169 146 458
4818 458 277 -23 -240 160 -125 191 -231 -10 -150 -13 258 -92 -37 12 259 66 -1 -85 80 197 -69
4839 -69 -15 -161 -311 112 501 161 -251 -366 -171 136 328 237 -366 8 94 210 267 -313 318 180 77 51
4861E1l87J96K22K18m55l28J93J8J84L20k89l0kL51j29j15j66L65M1k76p3J70
4883G9n3p4N47p64j69K15K60J57k79qK4P7K44j35j72j96M06j04j35J19oP1j58
4906e4J51k77m4K85j92K87k64q0J25J52M04m20l43K54l6l9L73m45O3J2K88L0k50
4929b0Q3m5J00p1q5l90J78N28j54j18k11M1j10L59R7l07q7J13L49j10l99J15p9
4952b23K73j75J15n6p8K36J44l59J11j84K88j0j42K21o6kJ75J25k63m77J77J35
4974c5L04l59p8j4p8M78j86k26L89n3j87m0o5J9M61k16J01j23m75K61L1J59l06
4997b38J02Q6K07N1P7o88L38L3K47l66j14K61J77L4m14K39nL53n2m35j47j09L29
5020c4K09K26n16j9L5J66K26p7k96K01m8K31j66q9q7M5K14l84J02J3K06K0k77
$$ plain form
4861 51 -336 -140 82 300 -155 -483 -290 -272 -88 232 -57 -87 -89 262 133 18 -148 217 258 -18 -91 79
4883 79 26 -48 499 -265 -434 -219 41 198 -81 -89 -65 12 256 121 -51 -247 159 55 -80 39 33 104 -54
4906 -54 97 -180 -224 61 -131 156 -108 -188 -63 89 493 73 -270 -16 -52 -91 282 -163 -100 -88 200 230 -20
4929 -20 63 18 118 47 -38 -428 -250 278 124 6 -205 -164 -274 85 182 -125 -212 -99 250 140 -259 -144 -223
4952 -223 50 -125 -10 -66 -144 92 236 -123 -12 -196 92 82 -60 161 95 93 268 393 130 -347 -170 -35
4974 -35 269 -90 -168 -182 -260 218 32 -194 195 142 -45 -85 -150 -131 330 114 215 92 -383 -122 -91 68 -238
4997 -238 -136 -50 157 208 285 -403 -65 -32 215 -151 -265 -4 173 207 -207 32 27 380 328 -107 -254 -363 -34
5020 -34 175 401 -115 -134 -99 67 293 216 -80 121 73 304 138 49 -38 7 221 -163 -61 -48 158 178 -99
5043i9k86L96J41Rn0j66j06K83k70L90k69J27k30P4K33j17j53J82k34K79j51l04
5065c21L87M6J54j90m17j18P62l55L48k68l40L11K0P4J93m21m4rK39L5k93N5K68
5088A16k48k99L81k46K67J27O1j45m25M82K12n7j96k70l8L11K18k01M5l27J28
5109a04J2N2l00L44Q2p6J0J08j20N2L34j99n05J88J2J28L29l05l29n5O28O7l95
5132d2p6J44Q6Ol5j92J21l7R1p5O8Ln8L25l50Pj44K16k08K34l9j98j4J74R8J17
5158B22l77N8Q6o9K59k15K52j73J40j17J7l52M92n5l0l01j03K95n0K47o7l68J78
5181c1M3n4K3J54m6j14K04j04j57K45j14j2J11m33J95J94r5R2m32R5J70K09j43
5204@J0pk55K86P1j58L8K17j12J06j61j36M6J82rk15l16K09K31k46N48l78j67
$$ plain form
5043 -99 -385 11 152 161 111 -55 -161 122 -148 242 -27 100 -130 -56 177 60 -93 89 -145 134 -17 -321
5065 -321 66 112 266 76 -341 -459 303 -52 296 28 -312 -1 19 93 286 -135 -179 -188 51 86 -207 -152 116
5088 116 -132 -431 -50 -296 -29 98 159 14 -411 71 283 226 30 -240 -278 33 251 50 95 -232 -104
5109 -104 -92 -40 -340 4 86 10 20 128 8 60 394 195 -310 -122 -110 18 347 42 -287 -342 286 353 -42
5132 -42 -118 26 112 118 83 -109 12 -25 66 -9 59 62 4 329 -21 -14 -158 58 -150 84 45 -153 -167 7 105 222
5158 222 -155 -97 -11 -80 179 -36 216 43 183 66 83 -269 223 168 138 -163 -266 29 -21 226 159 -209 -31
5181 -31 12 -42 -19 135 89 -25 179 75 -82 163 49 37 148 -285 -90 104 9 101 -331 -236 -66 143 0
5204 0 10 3 -252 34 105 -53 -15 202 90 196 35 -101 -55 127 118 -97 -413 -204 27 -219 329 -49 -216
5227b16J24K82J14j21k07J91r0m1n7j2M5K15k23o1Q5l89o5N61P4m29p8J59J97
5250E8J32Q1m63K73K4J70k05j70J44j20K69n37J25rL66J9j76j50j05L96J07j52
$$ plain form
5227 -216 -92 190 304 183 -24 167 77 36 -21 -33 12 227 4 -57 28 -361 -426 135 209 -220 -298 -139 58
5250 58 190 271 -192 81 105 275 70 -100 44 -76 193 -344 -219 -228 138 157 -19 -169 -274 122 229 77
$$ [...]
8191c4
##END NTUPLES=NMR FID
##END=
