##TITLE=1H_SAV32-singlet-bat33
 CDCl3, 8 sc, 
 14.12.2020
##JCAMPDX= 6.0         $$ Bruker NMR JCAMP-DX V2.0
##DATA TYPE= NMR FID
##DATA CLASS= NTUPLES
##ORIGIN= UXNMR, Bruker Analytische Messtechnik GmbH
##OWNER= root
$$ XWIN-NMR		Version 3.5
$$ Mon Dec 14 10:59:26 2020 Russian Standard Time (UT+4h)  she@DPX200
##.OBSERVE FREQUENCY= 200.1315066352
##.OBSERVE NUCLEUS= ^1H
##.DELAY= (6, 6)
##.ACQUISITION MODE= SIMULTANEOUS
##.ACQUISITION SCHEME= undefined
##.AVERAGES= 8
##.DIGITISER RES= 18
##SPECTROMETER/DATA SYSTEM= spect
##.PULSE SEQUENCE= zg30
##.SOLVENT NAME= CDCl3
##.SHIFT REFERENCE= (INTERNAL, CDCl3, 0, 15.7039)
##AUDIT TRAIL= $$ (NUMBER, WHEN, WHO, WHERE, WHAT)
$$ ##TITLE= Audit trail, XWIN-NMR		Version 3.5
$$ ##JCAMPDX= 5.01
$$ ##ORIGIN= Bruker BioSpin GmbH
$$ ##OWNER= she
$$ F:/spectra/data/she/nmr/H-F/1/audita.txt
$$ ##AUDIT TRAIL=  $$ (NUMBER, WHEN, WHO, WHERE, WHAT)
(   1,<2020-12-14 10:57:55.54 +0400>,<she>,<DPX200>,
      <created by zg, POWCHK disabled, PULCHK disabled
       configuration hash MD5:
       00 E9 B6 7A A2 85 ED C7 34 08 36 98 17 FE 4E 26
       data hash MD5: 16K
       2B 51 28 00 B1 14 B6 C7 F5 5D 78 44 9D 9B EF 07>)
$$ ##END=
$$ 
$$ hash MD5
$$ 54 8A 5F AA 65 CD AD 49 98 5A D9 81 28 DB B2 7A
##$RELAX= 
##$RELAX= 
##$RELAX= 
##$RELAX= 
##$RELAX= 
##$RELAX= 
$$ Bruker specific parameters
$$ --------------------------
##$DU= <F:/spectra>
##$EXPNO= 1
##$NAME= <H-F>
##$PROCNO= 1
##$TYPE= <nmr>
##$USER= <she>
##$AMP= (0..31)
100 100 100 100 100 100 100 100 100 100 100 100 100 100 100 100 100 100 
100 100 100 100 100 100 100 100 100 100 100 100 100 100 
##$AQSEQ= 0
##$AQ_mod= 1
##$AUNM= <au_zg>
##$AUTOPOS= <>
##$BF1= 200.13
##$BF2= 200.13
##$BF3= 200.13
##$BF4= 200.13
##$BF5= 200.13
##$BF6= 200.13
##$BF7= 200.13
##$BF8= 200.13
##$BYTORDA= 1
##$CFDGTYP= 0
##$CFRGTYP= 5
##$CHEMSTR= <none>
##$CNST= (0..31)
1 1 145 1 1 1 1 1 1 1 1 1 1 1 1 1 1 1 1 1 1 1 1 1 1 1 1 1 1 1 1 1 
##$CPDPRG= <>
##$CPDPRG1= <>
##$CPDPRG2= <>
##$CPDPRG3= <>
##$CPDPRG4= <mlev>
##$CPDPRG5= <mlev>
##$CPDPRG6= <mlev>
##$CPDPRG7= <mlev>
##$CPDPRG8= <mlev>
##$CPDPRGB= <>
##$CPDPRGT= <>
##$D= (0..31)
0 1.2 0 0 0 0 0 0 0 0.06 0 0.03 0 0 0 0 0.0002 0 0 0 0 0 0 0 0 0 0 0 0 
0 0 0 
##$DATE= 1607929074
##$DBL= (0..7)
120 120 120 120 120 120 120 120 
##$DBP= (0..7)
150 150 150 150 150 150 150 150 
##$DBP07= 0
##$DBPNAM0= <>
##$DBPNAM1= <>
##$DBPNAM2= <>
##$DBPNAM3= <>
##$DBPNAM4= <>
##$DBPNAM5= <>
##$DBPNAM6= <>
##$DBPNAM7= <>
##$DBPOAL= (0..7)
0.5 0.5 0.5 0.5 0.5 0.5 0.5 0.5 
##$DBPOFFS= (0..7)
0 0 0 0 0 0 0 0 
##$DE= 6
##$DECBNUC= <off>
##$DECIM= 32
##$DECNUC= <off>
##$DECSTAT= 4
##$DIGMOD= 1
##$DIGTYP= 9
##$DL= (0..7)
0 120 120 120 120 120 120 120 
##$DP= (0..7)
150 150 150 150 150 150 150 150 
##$DP07= 0
##$DPNAME0= <>
##$DPNAME1= <>
##$DPNAME2= <>
##$DPNAME3= <>
##$DPNAME4= <>
##$DPNAME5= <>
##$DPNAME6= <>
##$DPNAME7= <>
##$DPOAL= (0..7)
0.5 0.5 0.5 0.5 0.5 0.5 0.5 0.5 
##$DPOFFS= (0..7)
0 0 0 0 0 0 0 0 
##$DQDMODE= 0
##$DR= 18
##$DS= 0
$$ [...]
##$SUBNAM2= <"">
##$SUBNAM3= <"">
##$SUBNAM4= <"">
##$SUBNAM5= <"">
##$SUBNAM6= <"">
##$SUBNAM7= <"">
##$SUBNAM8= <"">
##$SUBNAM9= <"">
##$SW= 16.9725356469052
##$SWIBOX= (0..15)
0 0 2 0 0 0 0 0 0 0 0 0 0 0 0 0 
##$SW_h= 3396.73913043478
##$TD= 16384
##$TD0= 1
##$TE= 0
##$TE2= 300
##$TE3= 300
##$TEG= 300
##$TL= (0..7)
0 120 120 120 120 120 120 120 
##$TP= (0..7)
150 150 150 150 150 150 150 150 
##$TP07= 0
##$TPNAME0= <>
##$TPNAME1= <>
##$TPNAME2= <>
##$TPNAME3= <>
##$TPNAME4= <>
##$TPNAME5= <>
##$TPNAME6= <>
##$TPNAME7= <>
##$TPOAL= (0..7)
0.5 0.5 0.5 0.5 0.5 0.5 0.5 0.5 
##$TPOFFS= (0..7)
0 0 0 0 0 0 0 0 
##$TUNHIN= 0
##$TUNHOUT= 0
##$TUNXOUT= 0
##$USERA1= <user>
##$USERA2= <user>
##$USERA3= <user>
##$USERA4= <user>
##$USERA5= <user>
##$V9= 5
##$VALIST= <valist>
##$VCLIST= <CCCCCCCCCCCCCCC>
##$VD= 0
##$VDLIST= <DDDDDDDDDDDDDDD>
##$VPLIST= <PPPPPPPPPPPPPPP>
##$VTLIST= <TTTTTTTTTTTTTTT>
##$WBST= 1024
##$WBSW= 4
##$XGAIN= (0..3)
0 0 0 0 
##$XL= 0
##$YL= 0
##$YMAX_a= 273539
##$YMIN_a= -407274
##$ZGOPTNS= <>
##$ZL1= 120
##$ZL2= 120
##$ZL3= 120
##$ZL4= 120
##$ABSF1= 10
##$ABSF2= 0
##$ABSG= 5
##$ABSL= 3
##$ALPHA= 0
##$AQORDER= 0
##$ASSFAC= 0
##$ASSFACI= 0
##$ASSFACX= 0
##$ASSWID= 0
##$AUNMP= <proc_1d>
##$AZFE= 0.1
##$AZFW= 0.1
##$BCFW= 1
##$BC_mod= 2
##$BYTORDP= 1
##$COROFFS= 0
##$CY= 11.3945322036743
##$DATMOD= 1
##$DC= 2
##$DFILT= <>
##$DTYPP= 0
##$F1P= 15.9154993809931
##$F2P= -4.1035820241983
##$FCOR= 0.5
##$FTSIZE= 0
##$FT_mod= 4
##$GAMMA= 1
##$GB= 0.15
##$INTBC= 1
##$INTSCL= 1
##$ISEN= 128
##$LB= 0.24
##$LEV0= 0
##$LPBIN= 0
##$MAXI= 10000
##$MC2= 0
##$MEAN= 0
##$ME_mod= 0
##$MI= 1.114404
##$NCOEF= 0
##$NC_proc= 0
##$NLEV= 6
##$NOISF1= 3.799351
##$NOISF2= 2.8
##$NSP= 1
##$NTH_PI= 0
##$NZP= 0
##$OFFSET= 15.70392
##$PC= 1
##$PHC0= -10763.11
##$PHC1= 20.00089
##$PH_mod= 1
##$PKNL= yes
##$PPARMOD= 0
##$PSCAL= 0
##$PSIGN= 0
##$REVERSE= no
##$SF= 200.130013532006
##$SI= 16384
##$SIGF1= 3
##$SIGF2= 2
##$SINO= 400
##$SIOLD= 16384
##$SREGLST= <1H.CDCl3>
##$SSB= 0
##$STSI= 0
##$STSR= 0
##$SW_p= 3612.71676300578
##$SYMM= 0
##$S_DEV= 0
##$TDeff= 0
##$TDoff= 0
##$TI= <>
##$TILT= no
##$TM1= 0
##$TM2= 0
##$TOPLEV= 0
##$USERP1= <user>
##$USERP2= <user>
##$USERP3= <user>
##$USERP4= <user>
##$USERP5= <user>
##$WDW= 1
##$XDIM= 8192
##$YMAX_p= 0
##$YMIN_p= 0
$$ End of Bruker specific parameters
$$ ---------------------------------
##NTUPLES= NMR FID
##VAR_NAME=  TIME,          FID/REAL,        FID/IMAG
##SYMBOL=    X,             R,               I
##VAR_TYPE=  INDEPENDENT,   DEPENDENT,       DEPENDENT
##VAR_FORM=  AFFN,          ASDF,            ASDF
##VAR_DIM=   8192,          8192,            8192
##UNITS=     SECONDS,       ARBITRARY UNITS, ARBITRARY UNITS
##FACTOR=    0.0002944,     1,               1
##FIRST=     0,             0,               0
##LAST=      2.4114304,     0,               0
##MIN=       0,             -407274,         0
##MAX=       2.4114304,     273539,          0
$$ Real data points
##PAGE= N=1
##DATA TABLE= (X++(R..R)), XYDATA
$$ [...]
2877A048l615K123K452k353j385J847J965j951k503L323Q36l930O59L039p29k700
2893a874N40L431j719l356L147J934l305p70K524J026k562j626L764N31m274J517
2909a072L703k596k283K066K351j760k937L034J811l395k67K575J03k435m4L261
2925B115o55l752K395K520k692j633K574J466k966j365L660K22l098l44L281l0
2941A698l675R50L545k335k034K072J783k260k017K836J656l841Q3L281r11k396
2957a565O05K346m37l484K153K852l177j581L213N20k810m44K593Q02l649M28
2973a635L859k106k496K135K101j925k522K507K552l568j118L502J57k832l8K985
2989A558k45l402J507L000k429j932K456J749k520j442L267L12l147J30L179n96
$$ y = [1048, -2567, -444, 2008, -345, -1730, 117, 2082, 131, -2372, 951, 1787, -2143, -1484, 1555, 826, -1874, -1334, 2097, 378, -2978, 169, 2103, -1202, -1972, 552, 1578, -984, -2610, 1154, 1685, -2589, -1072, 2631, 35, -2248, -182, 2169, 409, -2528, 506, 2317, -1078, -1345, 1230, 1333, -1102, -1146, 2115, 1460, -2292, 103, 2623, -69, -1702, 872, 2338, -628, -1993, 1667, 1889, -1209, -1553, 1728, 1698, -1977, -1027, 2518, 183, -1851, 221, 2004, -256, -2273, 563, 2219, -1622, -1539, 1742, 831, -1565, -960, 1386, 949, -2535, -382, 2470, -707, -2288, 925, 1445, -1365, -1809, 784, 1586, -2063, -1635, 2224, 118, -2378, -243, 1858, -67, -2589, -82, 2470, -1098, -2216, 1286, 1443, -1389, -1427, 1558, 1313, -2089, -582, 2418, -11, -1943, 513, 2262, -258, -1700, 1567, 1879, -1268, -1138, 2041, 1445]
3005A445l283J094L261j882k822K504K302l117j398L004R39l449l01L493m65l001
3021a676R04K319r85k598J520K690k374j899L252O79l070m28K815K63l010L88
3037a210L281j347k801K051J546j897j932J871K697l187j536L843K00l614J315
3052g20J812l88l049J383L034k104j885J942J665k377j105K485J253k821n02L172
3068A795o85k833J200K374j286k214J881J941k005k085K736J334l211n74L472
3083A840Q1l644R65K839j424k454J514K391j945k031K731J144k628r78K780K11
3099A392k976J23L191q59l106J987K140k126j609K019J588k472j588L306L52l131
3115a769J66K931n86k563Q71K599j441k611K430J945k911j061K847P25k480q97
$$ y = [1445, -1838, -744, 2517, 635, -2187, 317, 2619, -498, -1896, 1108, 2047, -1402, -1703, 1790, 1325, -1676, -772, 1547, 562, -2036, -516, 2174, -200, -2099, 1153, 1832, -1238, -1666, 1149, 1412, -1598, -1210, 2071, 724, -2077, -26, 1520, -377, -2309, -438, 2259, -928, -2464, 1379, 1579, -2035, -720, 1092, 704, -2345, -962, 2072, -32, -1917, 25, 1690, -687, -1792, 693, 1946, -875, -1377, 1795, 1110, -1723, -523, 1851, 565, -1649, 232, 2173, 168, -1917, 819, 2153, -1058, -1632, 1840, 1921, -1723, -758, 2081, 657, -1797, -283, 2108, 163, -1868, 863, 2007, -621, -1599, 1181, 1392, -1584, -1461, 1730, 871, -2235, -248, 1892, -234, -1843, 176, 1764, -708, -2296, 1010, 1362, -1769, -1603, 1328, 742, -1821, -950, 1649, 208, -2403, 27, 1972, -939, -2000, 847, 1572, -908, -1805]
3131a805L182k1l163J110K737j918j700J474J928k243j390K641J127k869l94K656
3147A352J48k898L23L587j562l164K086K131k177j501K335J334k625q45K696L64
3163A584k597r1L113r65k987J996K206k335j826K692J506l133p81K389P21l029
3179a537o0L102o99k438P40K271j059k346J994J864k806j115L109K67k533l67
3195a613K627L60l285O22L234j665k417K003J932k135j825K543J289k958j71K691
3211A232j41k287J23K905j063k529J254K746k121j864K452J311k649j017L037
3226A389J46k828K78K590n22k627J350K103j483k096K000J992k852j133K631Q02
3242A740k994O7K890q81k394P51K409j050k505J710K392k757j406K694J041k760
$$ y = [-1805, 1377, 1356, -1807, -697, 2040, 122, -1578, -104, 1824, -419, -1809, 832, 1959, -910, -1304, 1352, 1500, -1398, -1075, 2512, 950, -2214, -128, 2003, -174, -1675, 660, 1994, -631, -1476, 1220, 1584, -1013, -1104, 2009, 1044, -1943, 53, 2259, -76, -1902, 790, 2296, -837, -1618, 771, 1492, -1537, -1597, 1505, 806, -1632, -892, 1379, 320, -2026, -32, 1832, -974, -2089, 1020, 1287, -1246, -1613, 1014, 1374, -1911, -1289, 1945, 280, -2137, -134, 1798, -337, -2162, 381, 1670, -1288, -1459, 1232, 1091, -1196, -1073, 1832, 769, -1760, -506, 2240, 119, -1745, 707, 2018, -631, -1648, 1389, 1535, -1293, -1015, 1575, 1053, -1574, -224, 1879, 396, -1700, 300, 2292, -560, -1693, 938, 1740, -1254, -1187, 1703, 822, -1572, -821, 1588, 538, -1967, -257, 2135, -622, -2028, 666, 1707, -1053]
3258a053n15K665j75k744Q96K316j008k522J591K235k219j456K424J201k635q45
3274a844L085pl283R90K244o33k167J114K397j704k485K919J198k811l56K473
3290A130M97k763J1K847p66k648J672K077j756j880J660J815j868j796K800R68
3306B000k951n9K638k71k691P49K509j415k034J501K353k462j835K399J316k631
3322h84o94K925J57k926N54K485j247k055J348J739j651j493K126Q62k442l64
3338a560K662K58l171L32L104j297k191J059K296j315k419K106K023k707j027
3353a847K555P63k643m20K912J00l390J589K148j691j598J672J545j798j786K788
3369H99Q04k773k46K654j87k348N88K525j145k785K292J910k321j155K388O45
$$ y = [-1053, -1568, 1097, 922, -1822, -926, 1390, 382, -2140, -549, 1686, -533, -1989, 435, 1636, -999, -1844, 1241, 1234, -2049, -1059, 1185, 552, -1615, -501, 1896, 192, -2293, 626, 1824, -987, -1343, 1130, 1627, -1136, -1125, 1722, 956, -1692, -20, 2057, 301, -1579, 81, 1896, 28, -1768, 1032, 2000, -951, -1010, 1628, 1357, -1334, -585, 1924, 509, -1525, -24, 2329, -133, -1968, 431, 1747, -884, -1578, 1347, 1504, -1422, -868, 1617, 370, -1685, -337, 1402, -249, -1742, 384, 1246, -1196, -1560, 1102, 1360, -1811, -1479, 1625, 328, -1863, -804, 1492, 177, -2242, -136, 1887, -820, -1847, 708, 1471, -1172, -1592, 1320, 1420, -1970, -381, 1767, 76, -1522, 150, 1695, -103, -1889, 899, 1703, -1070, -1316, 1338, 1151, -1197, -609, 1916, 771, -2014, 278, 2188, -133, -1288, 1100, 1745]
3385A745k355r40K914K73l215O61K705j246k049Q85K611j911j797K141J143k293
3401g28k94J909L62k595M7K648q29k541J767J894j705j918J886J614k584r81K820
3418G72M32k366l47K282O2k962R30K978j627k145K189J229j954j038J948J051
3434A434k375p29L202o41k096O79K018p32k691J720K469k635j100K522L93k024
3450e86p51K279N98k794N23K675j015k397J343J707j287j867K040J585k647r26
3466a520K468L4j759j35K121j06k505R80K026j404j974J743J537k199j342K923
3482H88N14l015L65K539p17k074P15K104r67k394J625K030k084j412K088J126
3498A331k144j168K988K41k804J055J553q65j629J003K352k121j612K789N67k392
$$ y = [1745, -610, -1550, 1364, 1637, -1578, -917, 1788, 542, -1507, -622, 1989, 78, -1719, 422, 1565, -728, -1022, 887, 1249, -1346, -1299, 1349, 520, -2021, -254, 1640, -65, -1983, -97, 1517, -1067, -2048, 772, 1204, -1162, -1509, 773, 835, -2127, -1197, 1781, 154, -1991, 198, 1427, -527, -1565, 383, 1434, -941, -1670, 1532, 891, -1205, -526, 1492, 760, -1931, -211, 2258, -377, -1477, 1045, 1438, -586, -1337, 942, 1540, -1254, -731, 1944, 929, -1468, -125, 1582, 295, -1572, 468, 2053, -594, -1520, 948, 982, -777, -912, 1209, 1103, -1402, -422, 1604, 200, -1774, -31, 1506, -693, -2035, 888, 1402, -1613, -1248, 1291, 574, -1500, -785, 1319, 352, -2042, -417, 1613, -471, -1883, 205, 1331, -813, -1981, 1007, 1248, -1556, -501, 1052, 187, -1442, -439, 1913, -208, -1820, 969, 1536, -856]
3514h56k84K166K90k451j60L023j020k355J732J835j849j423J586J618k038j374
3530a560L166L9k777L81K209n84j911M86K252j134k238J895J479j911j257K101
3546F36J068k658J11K424n84k590P80K125r86k052J395K139k316j251K102Q42
3562A185j879j112K737K62l027Q39K248j034j851J074K025j635j921K203J569
3577A683k465p65K539j50k088J6K631m09k723J348K197j646j849J892J355j740
3593a74j504K330J114k365m57K742q71k209Q99K404j263k120J834J307j942r57
3609a232J878J102k573n13K608J49k796N90K754j309j968J069K231j999j610J809
3625A90J473k533k83K527J82l044J93K837j042j886P95K318j722j635J861J034
$$ y = [-856, -1140, 1026, 1316, -1135, -1295, 1728, 708, -1647, 85, 1920, 71, -1352, 234, 1852, -186, -1560, 1606, 1645, -1132, -751, 1458, 874, -1037, -551, 1701, 567, -1671, 224, 1703, -208, -1465, 636, 1704, -954, -843, 1581, 997, -1593, -813, 1312, 326, -1726, -331, 1808, -508, -1759, 343, 1185, -694, -1806, 931, 1193, -1834, -995, 1253, 219, -1632, -558, 1467, -168, -2089, 114, 1683, -782, -1547, 992, 842, -1246, -1230, 1401, 992, -1731, -383, 1814, 168, -1681, 211, 1566, -174, -1678, 652, 1766, -599, -1056, 1686, 815, -1394, -495, 1909, 646, -1474, 360, 1667, -275, -1232, 646, 1748, -825, -1338, 1270, 1419, -1377, -787, 1967, 658, -1310, -241, 1990, -9, -1619, 190, 1663, -870, -1153, 1374, 1556, -1488, -1295, 1542, 500, -1386, -591, 1727, 5, -1630, 231, 1265]
3641A265j836j017K322R5k731R01J689N03l161J657K181k380j000J293J585j765
3657c99l75Q43J214j838p75K471k16k372J117J992j041k308J663J500j640j367
3673a531K261P21k221k68K261J27k582P07K314j202k114J397K277k130j322J846
3689E41J089k342n76K162K89k203K75K354r04k461J301K381k023j582J880J415
3705A596k135j117K237L24k144R8K147k00k337N91K298j015j986J589J516j935
3721d73j124K149P81k538J76J915p3k239M28K195o73k047J523J532j744j351K142
3738E79J034k316k29K092j23j981M75J892p39j999J355J816j451j950J965J237
3754A657k050r51K511M15k662M15J890l03k029Q13J772j244j670J861P44j498
$$ y = [1265, -571, -1588, 734, 829, -1902, -1001, 688, 1191, -1970, -313, 1868, -512, -1512, -219, 1366, -399, -774, 69, 1283, -555, -1330, 1141, 925, -1447, -330, 1662, 621, -1687, -24, 1476, -164, -1531, 730, 1451, -770, -1038, 1223, 1350, -1232, -525, 1789, 587, -1527, -130, 2147, 17, -1305, 541, 1630, -712, -1288, 874, 1163, -1040, -765, 1589, 685, -1776, -475, 1906, -117, -1699, 181, 1596, -539, -1656, 581, 905, -1239, -1141, 1006, 806, -1531, -940, 1358, 343, -1643, -54, 1462, -473, -1597, 552, 1333, -1205, -1029, 886, 813, -1426, -998, 1197, 524, -1523, 0, 1532, -212, -1563, 579, 1613, -703, -932, 1160, 1037, -944, -469, 1423, 684, -1315, 40, 1856, 405, -1545, 420, 1657, -393, -1344, 1167, 1582, -1080, -665, 1225, 922, -1107, -294, 1478, 234, -1436, 425, 1169, -329]
3770c29r26K189N68k500P2K458q11k217R37K066j375j804J724J396j978j384K502
3787E88O80k242l12K232q4k369O96J979j057j784J574J233j267j407J715J162
3803A337k105n39J995L1j756J82J703k67j824J123J409j322j254J497J481k243
3819e52p56K420j9k117K35K356r01j979J230J564q57j880J308J630j698j308K104
3836G80O53j959n23K059j2k510J107J960j404j339J272J205j547j445K252J093
3852A642k706J43J907l22j874J77K541j052k275J626J417j579j003J370J332k021
3868f77r95K471K56k435J72K267o19j991J123J588j268j498J688J149j708p50
3884a227J809M36j649o33K356k97j990Q47J983j459j762J670J606j857j331K233
$$ y = [-329, -1255, 934, 1502, -998, -926, 1532, 721, -1496, -559, 1507, 132, -1672, 52, 1448, -530, -1914, 588, 1268, -974, -1286, 946, 862, -1507, -811, 1168, 111, -1673, -99, 1134, -133, -1540, 175, 1337, -768, -1307, 688, 719, -1037, -855, 848, 581, -1243, -120, 1289, -33, -1287, 210, 1691, -552, -1308, 1112, 1093, -1024, -789, 1567, 666, -1313, -83, 1481, 624, -1256, 52, 1682, -16, -1324, 780, 1433, -526, -1049, 1010, 998, -1512, -405, 1555, 151, -1188, 84, 1289, -258, -1703, 549, 1642, -1064, -921, 986, 664, -1210, -1033, 1508, 456, -1819, -193, 1224, -355, -1358, 12, 1344, -677, -1672, 799, 1055, -1380, -1208, 1059, 440, -1551, -428, 1160, -108, -1606, 82, 1231, -477, -1227, 582, 1018, -631, -1264, 1092, 795, -1195, -348, 1635, 176, -1586, 84, 1690, -167, -1498, 735]
3900G35P82k023m13J724M85k091l09K850j244j903J810Q00r69j404J705R24k448
3917i89J05J908m8j743K3J862m32k159J077K274k018j305J883O88j677q67J812
3934C94R45k420L3K156p21j587O15J876j083j762J155J787j905j146K406K45j720
3951g32k51J628K1k000O17J903j210j314J568N38j556n10K118M26k479J298O61
3968G26O73k469M85J846k53k618J255J943j454j445J674R43j500p44J955P6k214
3985a121O30J858r14j466J036J365q71k110J845J269k233m79J975K4j640l18K365
4002A215m41k281J112J674j224j038R23J507j747j337K344M39k229K84J377K04
4018G82j833J83K054o88k050J252J231j231r73J280J259k082n22K222j72j842
$$ y = [735, 1517, -506, -919, 805, 1290, -801, -1110, 1740, 496, -1407, 403, 1203, 234, -1170, 535, 1459, -989, -884, 1024, 976, -767, -744, 1118, 686, -1473, -396, 1878, -140, -1445, 438, 1126, -551, -1418, 394, 1339, -1081, -1048, 1108, 387, -1200, -585, 1291, 208, -1554, -399, 1388, -517, -1663, 743, 988, -732, -983, 645, 666, -1334, -717, 1186, -24, -1338, 230, 768, -788, -1298, 820, 1246, -1233, 65, 726, 1399, -1070, -585, 1261, 1008, -1610, -355, 1588, 134, -1311, 363, 1306, -194, -938, 1017, 1093, -1121, -491, 1367, 453, -1013, 23, 1388, 517, -1593, 252, 1521, -712, -1191, 784, 808, -832, -1150, 1215, 774, -1507, -395, 1279, 55, -983, -60, 1447, -300, -1637, 707, 1146, -1083, -799, 578, 782, -1051, -868, 1186, 498, -1552, -300, 931, -300, -1273, 7, 1266, -816, -1338, 884, 712, -1130]
4034a130N68J885j084j546R29J582r29j713J825J035j955m71J925M55j930m0J923
4051A329n87j787O61J851j189j259J230J333j866j006K330K12k115J90J748k28
4067H47j796K97K198j289j439J293J015j258j189J708Q46k033j95J773nj843L37
4084g33J784n32k010J496J225j388j134J554Q47j763o86J978L60k038K8K133o13
4101E08j775R09J387j104j225J302J228j811m60J594L14j908P9K235q31j680Q16
4118d22J780j271j382J464J510j697r50J721O40k100k79J976L4j822M98J813j274
4135B39j378R19J542j621o93J515N60j434p73J973K09j906P6K069r38j723J003
4152c61J698j387j098J179J140j923l95J778M10k301M09J756k28k462J345J762
$$ y = [-1130, -562, 1323, 239, -1307, -378, 1204, 275, -1438, 387, 1422, -533, -1004, 921, 1376, -554, -594, 1329, 742, -1045, -384, 1467, 278, -981, 249, 1582, -284, -1290, 1040, 1252, -863, -673, 1075, 847, -949, -652, 1546, 257, -1182, 111, 1126, -132, -1321, 387, 1233, -800, -995, 778, 773, -1070, -733, 1051, 519, -1491, 5, 1230, -158, -1292, 262, 1109, -654, -1340, 638, 998, -1040, -1012, 1121, 508, -1267, -358, 1029, -75, -1300, 2, 1230, -581, -1041, 553, 867, -1041, -962, 1273, 442, -1238, -422, 1358, 87, -1295, 169, 1679, -18, -968, 753, 1393, -707, -986, 990, 1024, -798, -300, 1513, 239, -1139, -220, 1322, -299, -992, 523, 1083, -351, -1124, 849, 1058, -848, -772, 1297, 359, -1364, -361, 1337, -50, -1148, 31, 1171, -752, -1147, 631, 1041, -1260, -851, 905, 677, -1785, -440, 1322]
4168A322j196j984J839J296k068l42J788K75j869m9J872j62k000P77J449q17j630
4185a499J507J199j484q89J684M44j506n32J992K42k126M26J834q17j542Q66J433
4202A232j296j218J951P89j957k76J861j45j615K6K096p36j663N25J502q58j214
4219i96J283J013j790m31J615K22j706K3J572j69j780N05J829j110j456J312J138
4236A074j491q47J729M62j802j28J703l8k035M93J776o89j735J280J567j671p39
4253a091J176P70j599l24K026l04j662L57J634r02j122O91J571q86j742J690J081
4270A364j797n98J987M8j728O8J920n85j735Q83J641j129j518J391R42j420j010
4287a276J947O71j898k99J908m04j663O96J733j431o55P87R55j300j060J822L70
$$ y = [1322, 126, -1858, -19, 1277, -791, -1133, 655, 930, -939, -988, 884, 722, -1278, -501, 948, 131, -1499, 8, 1207, -277, -1166, 518, 962, -544, -1076, 916, 1158, -968, -542, 1292, 475, -1067, -201, 1232, -64, -1282, 669, 1458, -499, -775, 1086, 941, -674, -648, 1448, 712, -951, -426, 1076, 218, -996, 287, 1300, -490, -921, 694, 916, -790, -767, 805, 636, -1144, -639, 1190, 80, -1376, -64, 1074, -417, -1264, 465, 927, -875, -1003, 700, 662, -1373, -880, 896, 207, -1528, -248, 1319, -352, -1091, 85, 855, -744, -1068, 958, 654, -1008, -651, 983, 81, -1041, -350, 1221, 335, -1407, 283, 1364, -433, -1031, 956, 1004, -724, -656, 1264, 679, -1056, -173, 1468, 339, -1179, 212, 1154, -266, -1276, 671, 1342, -556, -855, 1053, 649, -1014, -318, 1415, -16, -671, 116, 1071, -229, -1289, 533, 903]
4304I03j758k02K024l08j826N86J653n95j934R59J658j352j196J649P36j440o76
4321a119J642J87j596L12J774j199j167J036J014j006r96J188J085j684p97K157
4337H31K05j678m8J722m25j596O57J407o87j327R70J172j558p10J586P00j867
4354f46MJ548N1j705L28J601n41j830J352Q59j108q94J478O04j686n83K337k60
4372I09j865M62J566p83j474R15J521j263j398J748O16j190j007J626O22j884
4388h79j52J642Q0j997J161J136r82r46Q52J247j779m83J533K83j733L2J807l47
4406D75j720N76K085j293j597J629Q68j304p85J360P61j783k66J902k4k232O40
4423g08J744o06j460J007J497j624o14J344L82j063n62J458K85j721J15J778r56
$$ y = [903, -855, -1057, 967, 659, -1167, -581, 1072, 477, -1457, -498, 1160, -192, -1388, 261, 997, -443, -1119, 523, 710, -886, -574, 1200, 1, -1166, -130, 884, -122, -1118, 70, 1155, -529, -1326, 831, 1036, -642, -690, 1032, 607, -989, -332, 1075, 388, -939, 31, 1203, -355, -1065, 521, 1221, -646, -642, 906, 957, -748, -420, 1181, 640, -1190, 162, 1021, -87, -981, 497, 1101, -585, -1168, 1169, 909, -956, -494, 1072, 289, -1185, -270, 1251, -12, -1410, 338, 954, -236, -1243, 383, 1005, -879, -1031, 611, 691, -1306, -145, 991, 9, -937, -85, 1162, -617, -1100, 433, 716, -1017, -985, 822, 475, -1245, -669, 1416, 123, -1474, 155, 1023, -281, -1066, 294, 1055, -728, -994, 908, 884, -1348, -708, 1036, 430, -1030, -23, 1474, -150, -764, 580, 962, -101, -663, 795, 1080, -641, -526, 1252, 296]
4440B96j492J132J269j011j472J582R80j630n81J586K06j598r9J703k85j722M87
4457f49J656j041j185J033J000j254p82J383Q23j814Q1J399k02j471N36J389p89
4474A13j775J356J398j543p64J568K26j170m01J688m3j948O96J507n05j502P74
4491c25J295q70j212J631K89j406OJ440J04j619J92J441l93j567R16J292j043
4508A71r99J132R73j349p76J647p8j655N14J313j29j585L26J669r82j376J361
4525A77J229j492j142J663P69j798m19J920l71j491M86J168l02j339M14J687j422
4542b63j213J728P46j843k78J969k83j620L31J533k84j431P62J097p62j302J064
4559d9J278j648p13J822J00j704M95J507o19j958J002J785p80j667J120J005j270
$$ y = [296, -1196, -64, 1205, 194, -1278, 304, 1284, -346, -927, 659, 865, -733, -832, 871, 586, -1136, -649, 1007, -34, -1219, -186, 814, -440, -1222, 161, 984, -830, -749, 650, 448, -1023, -487, 902, 113, -1662, -306, 1092, -451, -1215, 353, 579, -591, -992, 696, 653, -1295, -599, 908, 403, -1099, -325, 970, 100, -1112, 519, 808, -598, -592, 848, 952, -667, -475, 966, 573, -994, -78, 1214, 171, -828, 304, 1277, -72, -848, 799, 721, -934, -420, 893, 764, -821, -495, 1174, 192, -1184, 177, 1406, -86, -1228, 435, 1204, -594, -1013, 907, 536, -955, -469, 699, 397, -942, -528, 1159, -263, -1476, 252, 998, -845, -1123, 846, 563, -1057, -726, 807, 523, -908, -146, 951, 189, -1113, -49, 1229, -419, -1132, 690, 790, -914, -419, 1088, 469, -1489, -487, 1298, 518, -1149, -29, 976, -294]
4576b94l96J485J29j424k43J577k31j093L96R45p42r37J042O40j016p67J456M66
4594I93j698j35J461N9j512N05J361r30j198R15R38r06r32J153O85j494k36J511
4612E40k55j247K19J892p35j726J336O37r40o05Q27J470k166p41J609M58j324
4629g51J1J597q76j419Q02J615n37j274J286O66j230p78J251J079j547n10J649
4646A034P5k313O44J125k08j553R50J770j598q14J709p1q12p45J429%j291m44
4664a113J919n15j610J671P17j442r12J358L48p30j85J728l68j733q5J061J40
4681B49j105j39J544k09j765J060J654j907m20R28N33j124n7J157L5k023R09J910
4699A230j467p36R52P45j689k82J344O62j456l59J278o35l53R40Q32j542p78O06
$$ y = [-294, -690, 795, 924, -500, -743, 834, 603, -490, -94, 851, 109, -828, 214, 854, -162, -929, 527, 993, -705, -840, 621, 680, -832, -327, 1034, 104, -1094, -179, 759, -147, -1079, 74, 759, -735, -971, 540, 285, -962, -743, 1149, 414, -1312, 24, 661, -279, -884, -57, 1413, -753, -1494, 115, 573, -751, -740, 857, -19, -1438, -636, 979, 442, -832, 454, 1120, -110, -888, 363, 1442, -105, -615, 1034, 1109, -1204, -560, 565, 357, -1196, -246, 1524, -74, -888, 821, 750, -62, -807, 622, 622, -669, -1113, 806, 291, -1319, 352, 1069, -373, -1285, 73, 421, -309, -494, 1234, 866, -867, -952, 109, 249, -856, -995, 549, 340, -1425, -365, 1289, -618, -1038, -110, 423, -701, -758, 399, 434, -1589, -680, 1230, -237, -973, -21, 724, -965, -1247, 97, 759, -697, -1056, 222, -413, -766, 174, 1006, -536, -1314, -708]
4717g08J075k44q91R74J058j750m90J466k90p18l23J544q45n15M90R47j254m87
4735i61J239Q63j646M92J329p57j562N71J532n46j450L65Q60o26p08J368L33o13
4753H3q06J048N37j334l78J604m06j550R69P15o99j145J054J479j529r64J850
4770E28L82j397k39J362k91j312L31J470m39j490Q83R84j095o03J206N91j303
4787d32p81K006J29j549K10J338n84j380J067J061r75j166J258P22j118m56J105
4804D55L44j709N63J567o77j012M40R84o49j267Q71J268j268o87J257L43j323
4821e00k17J379R1j753O92J294j06j187K52L95n55r41J447O95j503k27J354k68
4839C42j293L75J289m61j010Q30O59j100o27Q91O34j016o17J498K86j472M26J401
$$ y = [-708, 367, 123, -768, 206, 1264, -486, -976, 490, 200, -518, -841, 703, -142, -657, -167, 780, -474, -961, 278, 1141, -505, -13, 1316, 559, -1003, -432, 1100, 554, -896, -531, 329, -297, -1005, 363, 696, 83, -723, 325, 862, -472, -850, 754, 348, -1202, -233, 482, -217, -1362, -308, 1171, -358, -1322, 528, 910, -487, -726, 636, 345, -967, -636, 834, 395, -1095, -212, 772, -323, -926, 280, 871, -432, -1213, 793, 922, -627, -417, 921, 337, -1043, 24, 1085, 110, -1056, 202, 924, -194, -650, 455, 799, -910, -347, 1220, 543, -469, -29, 955, 306, -961, -90, 1178, -90, -777, 480, 823, -500, -717, 662, 753, -1000, -308, 986, 880, -307, -55, 340, -215, -1156, 291, 986, -517, -744, 610, 342, -951, -576, 713, 252, -758, 72, 731, -369, -996, -105, 529, -487, -1104, 394, 680, -792, -366, 1035]
4857A035p34j272O86J262r28j065J076P76j150l97J231M67j198n98J491l16j179
4874h13N72J233r45o92P16J091j243p11J471J40j069m36J214L15j610K13J850
4891A296r81j156P54J172j269o12J052N83j026q11J671j55j189J68J103j10j549
4908a059M92J598j012q45R88N06j057n29J295J04j273p4J441k92j098L75J282
4925H42p75j138J107Q79j337n29J347L27j075m48J120M78j717N16J374q23j024
4942h76P21Q89p42p12J069O40j570l8J541k82j169L76J428q24j229P73J082r15
4960A62j005J307N51j214m26J222K45j291j96J367k24j261N44J418r46j140J062
4977A75N37j240k21J387J10j486J40J079m05j052L61J269m80j000Q16Q73j146
$$ y = [1035, 301, -971, -285, 977, 49, -1016, 60, 836, -314, -711, 520, 987, -211, -809, 682, 366, -813, -241, 992, 47, -645, 71, 1162, -81, -792, 679, 819, -250, -686, 528, 843, -767, -554, 1296, 315, -841, -87, 1085, -184, -796, 256, 839, -187, -998, 673, 518, -671, -503, 600, 490, -1059, -567, 1031, 19, -826, 162, 668, -389, -918, 377, 481, -792, -866, 575, 283, -815, -440, 842, 67, -1071, 36, 915, -422, -951, 396, 723, -352, -800, 320, 798, -919, -403, 971, 148, -876, -155, 734, -8, -720, 349, 989, -581, -619, 922, 640, -529, -153, 1275, 451, -778, -5, 1077, 162, -843, 464, 1015, -199, -625, 597, 842, -449, -645, 722, 498, -763, -219, 1199, 253, -887, 175, 712, -528, -749, 638, 748, -738, -598, 481, 76, -976, -615, 654, 174, -826, -10, 863, -283]
4994b83p71J234N72j486k4J328l57r90J18J391n45j135P87J185r63r50J031P18
5012H60j288m08J473q6j140K18J066l83j169N95J200n80j049J242M16j331j36
5029e00P15O13j343l46J773l09j332O25R90p40p85P29R16j060o55J371q9q83j11
5048d21J336j66j687O00J306n61j092L75J211r03j056J260P05j474m12J749j89
5065E81j162j41J413m40j337P86Q38q81m51P36Q13j260m96J162M69j333q4J687
5083I00n47j195P35J054j184o71J032P98j013m92R73L99j335l1J352k38j256N38
5101a81J171q37r92R55J002j232m59J026L59j141l16J251J58j379K72J232p16
5118A73q62N82J073j206n64J134M31j451R1J191J29j608K09J491p05j185Q25R19
$$ y = [-283, -1054, 180, 752, -734, -758, 570, 213, -777, -659, 732, 187, -948, -161, 1024, 61, -889, 142, 860, -428, -836, 637, 551, -589, -371, 695, 312, -857, -262, 938, 358, -691, 551, 967, -364, -500, 215, 828, -515, -861, 912, 603, -729, -104, 886, 146, -639, 90, 1006, -54, -709, 662, 573, -310, -421, 915, 749, -938, -338, 968, 407, -685, -310, 901, -2, -1058, 202, 907, -567, -979, 770, 581, -581, -722, 691, 251, -1086, -300, 538, -343, -794, -58, 755, -505, -1001, 161, 630, -703, -787, 900, 353, -842, -107, 947, -237, -908, 124, 922, -91, -583, 390, 789, -546, -577, 775, 537, -719, -181, 990, 153, -839, 116, 1118, -114, -573, 453, 812, -329, -645, 606, 764, -615, -343, 889, 173, -689, -107, 966, -240, -804, 330, 761, -690, -599, 592, 721, -887, -678, 813, 108, -1077, -252, 667]
5136F67r22p03J066M07j240K7J039P2j218L39J090k71j405Q02J002q32o85R22
5154A57P55j169l79O09P56j075lQ46j4j113M46J009n31j116O91Q54q04k62N65
5173B22N41j197k10J372J13j425L42J040n04r87N90R59p91n78P61M35j074k05
5191e96J326R7j372J91J039k64r31N28Q43r39r56J324M45r71o75J156J43q40j56
5210f08J475n40j197L39J032n57n76N16Q41j012j088J648M53j342k76J619n10
5227B17j197N06J064p44n29P53O30n25m23M46L16j501q2J958j88j124J60J018
5245G55l15j158N32J046o27j022R74O90j166j52J175j05r96J16J135n03p46L58
5263iP42n75q11P95Q48j076n67R36N31j494K24J144j47j162K96J055m99r57R29
$$ y = [667, -255, -958, 108, 515, -725, -698, 341, 413, -805, -466, 624, 353, -1052, -250, 752, -80, -765, 157, 912, -257, -636, -27, 729, -346, -349, 497, 483, -630, -184, 825, 294, -822, -131, 723, -81, -343, 222, 763, -434, -644, 728, 841, -584, -242, 798, 294, -693, -103, 856, 65, -513, 248, 683, -391, -596, 730, 827, -545, -354, 685, 421, -510, 18, 861, -78, -1034, 290, 735, -236, -911, 245, 388, -452, -608, 867, 327, -870, -531, 501, -56, -632, -116, 725, -287, -1375, 273, 726, -616, -892, 727, 217, -980, -474, 590, -154, -683, 70, 700, 175, -248, 198, 514, -987, -1069, 889, 701, -423, -263, 755, 440, -718, -186, 860, 233, -789, 185, 875, -291, -443, 732, 627, -369, -253, 882, 379, -367, -9, 733, 158, -653, 142, 990, -86, -653, 283, 814, -680, -456, 688, 541, -621, -325, 730, 231, -726, 203]
5282B03K10p56l72P82M13j076q6J075j0j088L57J006o28r81O50Q78o72q12J306
5301C99on55p33J441kj297N09Q46n63o70P84M98n40j118J313N75j194j29P24L18
5321F00q82j03J338n22q26N26O45p52m23N03N58p77o71J130N91j611J84J432p79
5340A61p15L68J028o84r35Q23P25r89o41J016N19r60k11R75J46j327K70J148n03
5359B14p30K64R15p59o88J143J33p26j43P39J68j243R7J192m15j265J036L40k37
5378C5o11O13Q10j183l92J251l33q35L7J058l0q97M22J096p63r36J052L63o00
5397A57n77O58N73r53m14J300l67j161M92J262q28q03P23Q36q99p06J221op18
5416b10r4P49J63j094K1J116m59p61N85O90m77q48J038J68j239J84J091l16p55
$$ y = [203, 413, -343, -715, 67, 480, -596, -682, 393, 383, -705, -348, 658, 30, -951, -301, 577, -95, -907, 399, 393, -162, -895, 546, 544, -753, -244, 602, 39, -631, 153, 651, 111, -1007, 306, 881, -313, -442, 282, 600, -282, -385, 953, 431, -395, 131, 776, 24, -399, 104, 662, -115, -786, 344, 935, -676, -492, 940, 161, -554, -186, 842, 158, -777, 46, 771, -218, -859, 157, 676, -284, -495, 480, 626, -701, -431, 717, 214, -516, -252, 663, -96, -784, 359, 492, -234, -377, 362, 530, -713, -616, 576, 161, -1104, -68, 272, 35, -576, 37, 847, -336, -728, 523, 190, -645, -608, 450, 420, -477, -55, 1041, 278, -658, 394, 757, 157, -420, 238, 811, -142, -556, 744, 377, -784, -292, 970, 142, -661, 62, 898, -1, -707, 514, 508, -210, -304, 445, 608, -486, -465, 651, 192, -569, 16, 706, 229, -619, 419, 587, -652, -468, 623, 307, -448]
5435d48m6J014j31j313O41R88o07r81R18O11p57o04R78L82j102j7J003k30q37
5454e38j67J346o55j007J111N04j024k16J121k39n24m90J303j50q61J88R42l29
5472C15q27L91J303j248o50J088K53j036J46Q66p0q88j2R13q8j024N85Q69o10
5491B76j052J150K78r95l08J070n0q40J38J067l64j161M55J016n44q08N56Q84
5509G68q62p23J122L0p77n2J240l75j281O74Q44o52q01P81Q21j160o53J044Q96
5528H84j349L24L66L86j323L57J254p37r99N77Q06n26l48R58M45q15j035J826
5546A051o77j30l85P99m3o53J2Q85j159k84R76K35p80n00M37J631k108L50N79
5565B36k27m94J95P33n24l37O76M67n83r29J230K77q95m31J181l05p69J25J080
$$ y = [-448, -494, 520, 389, -924, -283, 705, 98, -883, 35, 646, -111, -715, 263, 645, -457, -474, 529, 299, -538, -705, 641, -14, -1021, 90, 594, -430, -646, 475, 236, -288, -778, 525, 375, -486, -298, 644, 315, -512, -121, 1182, -66, -716, 372, 625, -411, -265, 601, 531, -357, -369, 544, 456, -568, 17, 886, 276, -776, 374, 652, -343, -651, 419, 369, -471, -333, 734, 370, -791, -336, 680, 136, -672, -116, 768, -94, -817, 305, 335, -442, -494, 746, 371, -910, -236, 608, -44, -845, -64, 757, -403, -1056, -12, 884, -465, -141, 225, 611, -712, -355, 899, 162, -837, -260, 546, 20, -328, 630, 1075, 260, -775, 1051, 374, 244, -141, 658, 615, -38, -26, 859, -300, -584, 392, 627, -153, -653, -216, 1415, -693, -343, 236, 9, -485, -290, 443, -81, -418, 258, 725, 142, -787, 443, 720, -175, -606, 575, 270, -499, -374, 706]
5584G06o83o56Q51K68n12r44J150P32j417m56J362J69p90J56K61m5j088O43R55
5603F62j629O84L77L59j07r52J005j26r51L53R00K37j660P83J101l04j119L77
5621a0J236j185n77J124J42j536j5J143J53j029J44M20K27j250O08R75l05j049
5639g84J301M29j202l58J138L4j035L62P93n30r93R30P11q89o35Q01O15r05m61
5658f78J089Lq88j89J525o44j067N97R35r38k28O31M41o06n22O89M62r51k08O83
5678A36P8q27K59R11o30l28J99Q75o92p08R86K55o56l85Q89N3j036L56R82o22
5698I5q68R80M28n94n80P71M38j092k25J369m17n44p4J153j22j201M87N32o02
5717f6o82Q33M10p37k69Q70M35j428K64P02j29p16J42J209p92r71Q66Q46j290
$$ y = [706, 23, -633, 218, 486, -26, -970, 180, 912, -505, -961, 401, 570, -220, -64, 197, 152, -936, -293, 662, -967, -283, 94, 453, 346, -606, 399, 273, -678, -325, 575, 812, -848, -65, 1036, 732, -387, -10, 1226, 41, -536, 588, 730, -806, -821, 322, 475, -554, -410, 10, 237, -1013, -405, 570, 265, -784, 517, 946, -256, -614, 524, 558, -477, -115, 678, 148, -845, 85, 796, -93, -728, 73, 688, -217, -678, 411, 414, -474, -663, 862, 218, -849, -252, 683, -255, -483, 148, 589, -17, -539, 150, 612, -339, -547, 136, 214, -613, -354, 557, -73, -401, -202, 673, -19, -727, 259, 514, -142, -527, 362, 415, -621, -265, 717, 95, -773, 207, 635, 41, -539, 232, 670, -422, -647, 722, 305, -239, -313, 840, 718, -483, 4, 536, -66, -748, 85, 495, -242, -511, 359, 794, -634, -370, 332, 203, -513, -371, 838, 46, -925, -59, 787, -503]
5736e03j08Q71P28j475j58M17O20j181M97P38k6j012J46J155r43r10J577n76q3
5755b26k18R14pp68K20L48M03j256K85J066p08r92J147M39r16k16J316o67p35
5774e71M82P27p83l07K95P77k48j139Q37L48m58l78P53M71j371L87N30m13k67
5793c28M59N15n61n18L37R08r01n20Q78M27j054q1P36K13j437L12J098n02m85
5812e04O26K00n26o60R59J65q15m0Q96N3n28j74Q93n27q49O56K75j50k00L00K22
5833B72o27K06O81l81q34J21J079k80p12nQ99m35q66J027P77j381j38R70l9q50
5853e16J56J000m59q11M52N00k50m80K38Q01p61m90Q01K76p71L9P42j31q63K04
5873c23J009q06p63R42L13n43m22M43O01q36l32J238o8j250L21P31k11p80M93
$$ y = [-503, -611, 260, 988, -487, -645, -228, 392, -789, -292, 446, 420, -592, -446, 709, -234, -1144, 433, -143, -226, -444, 470, 463, -305, -85, 263, 666, -590, -305, 761, 53, -939, 208, 647, -269, -485, 831, 164, -571, -89, 638, -145, -452, -157, 620, 372, -767, 70, 418, -40, -418, 335, 806, -565, -178, 352, -61, -328, 131, 646, 85, -433, -96, 812, -89, -609, 269, 696, -358, -439, 297, 510, -927, -615, 483, -19, -504, 122, 322, -204, -864, 95, 260, -555, -595, 301, 354, -174, -348, 545, 18, -831, -175, 100, -50, -250, 50, 272, -355, -149, 532, 151, -683, -562, 517, 237, -475, -480, 419, -16, -882, 145, 922, -459, -597, 373, 334, -516, -360, 640, 181, -630, -178, 322, 72, -408, -170, 631, -130, -620, 181, 457, -314, -275, 467, 336, -527, -323, 686, -120, -883, 59, 372, -171, -593, -150, 451, -385, -717, 521, 453, -797, -476, 255, 44, -736, -243]
5892b43Q17r31k64P53K81n71l95P96Q3o03J1Q47l86p85L31O45j65q70P71K45o64
5913b97l85R98l4n43r4P01J21j388P83Q34m77r67Q97O81p76o44P69L28o25l47
5933d65R12J08p38j28Q47j59r49N10R04q79o54J143Q5q61k16J006M3j029J70O95
5953C45Kr17K82N12l20m36N48L39l48l42P18l33K07o76R77q9j266J68Q26j48q13
5974g64Q62Q4m49J39O76p16N5m30N39N72j075N38N55n23o52M17R94j037k05Q11
5994C91N29j657O04N35K78q26m4O39j69q15M26O10k71m59N40kp26J76O86m2p41
6015c38R4O10n5p21L81N06k46p34P33M11j053p6J059j6j339K75P23j00o57K12
6035c31J044n35p10M22O06n55m85O79K72r48M81N02l80n74K05P77m34o18M57P28
$$ y = [-243, 574, -357, -621, 132, 413, -158, -553, 243, 326, -277, -266, 581, 195, -590, -259, 386, 221, -649, 122, 367, -297, -682, 316, 282, -261, -355, 346, 467, -921, -138, 696, 219, -748, 149, 830, 54, -590, 179, 507, -118, -465, 447, 555, -183, -311, 536, 377, -572, -62, 842, -37, -691, 452, 537, -324, -540, 466, 509, -520, -350, 345, 347, -570, -288, 224, -96, -532, 16, 355, 7, -335, 383, 50, 257, -419, 558, 469, -797, -629, 197, 49, -764, 98, 182, -267, -128, 548, -168, -113, -543, -4, 568, -507, 31, 586, 63, -589, -172, 822, -215, -420, 391, 920, -737, -133, 402, 680, -146, -190, 449, 280, -535, -109, 501, 230, -229, 311, 309, -417, -241, 445, 403, -338, -244, 366, 311, -410, -29, 477, 231, -503, 230, 641, -412, -488, 571, 555, -784, -509, 214, 114, -543, -331, 713, 178, -532, -110, 496, -59, -544, 135, 407, -541, -60, 442, 62, -512, -307, 470, 36, -582, -125, 603]
6055F03q25l38O63K31p50O6N86J44q06K13O50k61p40M57O99n68m08P67J98q42
6075b61J21M73K89j147L57P42j60p88L76O06j92q42O47J58j96m62M81M42j181
6094e37K63N78P5p62J48Q80n81k58N7O83q53l01R82L5n72m42J014j37o42M3Q24
6115D97m15r50Q28N83n71o30N18Q47j157l9P36jr29L70P21l05o59O29K55m53m92
6136f17N30P01r98j70P27O14r68L2M38J11o75R9Q41o19l02K65N18m60m00M19L23
6157D09n83j38Q64n4p85K49O37l02q48O46O22n32n64O44l3m84l79Q63K83r11R6
6178c00Q64n66n15M99L73l62p05N87O30p88j99Q50M53r65j16O43p7p64J88M67
6198A97j95n80O62L90p11k17O89J69p17j25N32M0m55R8O14l07k10K99N64q16l29
$$ y = [603, -222, -560, 103, 334, -416, -350, 236, 380, -426, -213, 437, 176, -564, -107, 592, 24, -384, 383, 581, -261, -140, 333, 622, -525, -168, 574, 414, -374, 2, 608, 416, -426, 221, 379, 183, -279, 202, 644, -537, -274, 304, 379, -383, -235, 645, 64, -194, -137, 546, -307, -608, 374, 409, -163, -605, 409, 272, -370, -327, 497, 82, -868, -40, 543, -28, -658, -140, 707, -450, -489, 247, 246, -683, -313, 408, 103, -556, 73, 328, -125, -617, -87, 614, -384, -554, 173, 787, -181, -149, 289, 400, -275, -176, 665, 46, -256, 9, 527, 67, -333, 86, 409, -174, -312, 552, 498, -287, -38, 599, 297, -551, 95, 717, 185, -379, 265, 232, -252, -631, 232, 515, -396, -300, 564, -2, -517, -18, 355, -7, -712, -125, 505, -283, -482, 368, 821, -144, -260, 383, 306, -458, -270, 197, 2, -578, 84, 474, -237, -454, 235, 404, -313, -438, 94, 134, -321, -223, 391, 84, -126, 173, 737, -79, -408]
6219d08P08M2n89j84P26P6p34J05Q86k59o92M73M02n14m68N35J00m11p4L79N55
6240F54r98K13O34k38n03J40N07j63q41P22J58n23j04P09j07n66j68R07n4r96
6260f17M15O99k63r74O71L27m68l17O92L10q39j10R10j42n79K50N37n02n85M65
6280a20O43q35m58J129K93r13o7O28l8n40K57N46m02o69M54O81m16p27P31N70
6300G47r15j85O04M73j225N1J162m15o22J72Q15p82k95Q94k18k46m29Q50J51r01
6320c14K58N47j73n47M9O14j49q20N52L99p17N4Q98m05m34m6J46N28o87j67N92
6341A78l99j158J026j38J93L5K18L4p91K57O83J23p64L84O35j32j127N37P13k54
6361B53r96R35J14k61m22O84O9n37qO97k47o07J08P05m45p00Q37L83m60m16N92
$$ y = [-408, 300, 342, -247, -431, 295, 371, -363, -258, 628, 369, -323, 150, 552, 38, -430, 105, 205, -206, -280, 99, 654, -344, -131, 503, 265, -238, -98, 409, 246, -595, 127, 285, -238, -342, 367, 260, -306, -474, 433, 379, -617, -202, 497, 234, -740, -69, 258, -210, -527, 165, 475, -364, -474, 436, 294, -285, -35, 502, 0, -585, -120, 523, -312, -770, 359, 652, -261, -328, 300, 262, -278, -21, 525, 123, -546, -92, 589, 173, -554, 177, 747, -168, -353, 251, 724, -501, -450, 712, 297, -325, -153, 662, -120, -415, 479, 261, 15, -414, 436, 587, -314, -56, 491, 318, -229, -180, 434, 285, -535, 17, 416, -301, -247, 651, 246, -188, -234, -88, 440, -247, -414, 178, -221, -1379, -353, -491, -298, -263, -45, -11, -802, -545, 138, 261, -503, -119, 516, 384, -743, -206, 507, 253, -743, 192, 306, 45, -377, 307, 376, -161, -169, 528, 281, -326, -218, 487, 42, -658, 179, 562, 102, -314, 278]
6382B78J95n38l4N90j42o02J78M20q5p74P26M01n30m23K96L89n31l46P52j5m16
6403b11Q6O53k22p59M01L92k10o89N51L27n43j01K69K24o90K75N10P9p72K85L28
6424A83k04n27O27M69o38k99N43K33n12o7N04M9r20L87O40l58m21L80K60k77m89
6445d37O41M74r24l92J112M3p60N00M39p20o75M08M67m17j84M07R53j105m63N84
6465d9O44j000L73J52K32o27P23n28J16O8O4R06o70j063N68Q34j284J01O43l3
6485A70m08J12N36k67p20O41K09n92j6K49M89p32k14P76pq41O58N03m65l86L42
6506C7K43l93k25M65L70p41l9O39j31p39L5R36k9o98M15K27m22m98P33M13o61
6527f3k15Q05k01n65M1O52j35m33O0N99n24k52L69K62m64k51M89J27l60k18Q28
$$ y = [278, 473, -65, -99, 491, 349, -253, -75, 345, 260, -514, 212, 613, 83, -340, -44, 345, -186, -532, 220, 205, -211, -125, 528, 306, -453, -52, 340, 130, -559, -8, 319, -224, -325, -56, 168, -522, -247, 263, 342, -430, -145, 183, -21, -548, 79, 548, -90, -389, 154, 387, -125, -192, 312, 361, -559, -172, 468, 110, -311, 69, 329, 52, -437, 204, 678, -246, -638, 474, 517, -243, 257, 696, -24, -699, -291, 176, -241, -425, -18, 935, -170, -633, -49, 595, -405, -32, 120, 352, -275, 448, -80, 36, 104, 168, 1074, 404, -659, -91, 743, -541, -440, 203, 170, -238, -126, 410, 143, -577, 64, 273, -319, -335, -86, 403, -329, -543, 233, 226, -615, 43, 546, 81, -305, 37, 280, -113, -338, 127, 497, -244, -283, 356, 225, -514, -479, 457, 428, -270, 145, 372, -50, -548, 185, 598, -63, -278, 527, 326, -239, -198, 454, 319, -114, -54, 545, 21, -231, 138, 400, -64, -315, 174, 301, -59, -277, 551]
6548E51n38p40O39O21l93p42J068k5l69m29Q21n65o0l25N61M3l85M30N93o64o66
6569e74O28N70p89m23Q76j04o04J15O29Kr30K49N38k46l17L61M78m78n50N86L60
6590C77l60j80N30j09o98M67j05l06j34N04P66o26q02R70P42j061o08J214m8r10
6610c77O03K14o28J62P34j05j065J33M92J8l63n42Q95K37o19O6K42N01j332N81
6630a53M35k01q68Q38K20k89o88N67O74j189J66Q25L9j026R40O26j066n71R37
6649B16J81k11j142M47M88j74j06N07Q24j124j22K97N7l01k34J032m74n36N07
6668A32M53p52l01R02O7q40n4O43j05n42L35N49l06n36M95J90l49k15O40q2l31
6689gn6N60j74p30K51O10l18o44N51L99m94k83N54L7n27j94O70j09o67J28P33
$$ y = [551, 13, -727, -88, 533, 140, -602, 466, 441, 72, -357, 464, -101, -161, -486, 75, 118, -267, 163, 756, 92, -574, 54, 624, -165, -588, 288, 184, -420, -305, 324, 326, -604, -355, 183, -63, -380, -19, 459, -19, -569, 17, 377, 17, -163, 367, 258, -440, 27, -78, -384, -518, -14, 752, 126, -676, 294, 1036, -25, -633, 581, 533, -377, 226, 440, -188, -26, 708, 603, -462, -329, 163, 181, -182, -724, 171, 408, -211, -145, 97, 598, -734, -153, 282, 81, -787, 51, 271, -18, -706, -139, 535, -654, -488, 337, 376, -650, 290, 916, -150, -721, 216, 397, 186, -956, -509, -21, -195, -301, 206, 1030, -94, -216, 81, 138, -163, -397, 635, 161, -375, 132, 585, -167, -468, 434, 501, -339, -393, 250, 145, -397, -62, 487, 181, -355, 140, 330, -19, -234, 406, 324, -7, -63, 497, 323, -407, -156, 454, 136, -508, 43, 442, -52, -335, 219, 256, -271, -465, 205, 96, -571, -443, 290]
6710B90m3r00O15M68m16p70P55L01o98J29L86J40r12P00N9J76q57M37N29p0q72
6731e53Q00R1n82j57N96N1n12j60P22J36q59L10P29p43k70L52P65n94k21J07P07
6752G15n41m92N09J11p44M73J88K03p34K63O89r24j08M74K95p00J78M62j41m53
6772b77j60Q04R9q56L84N61o99k82M33M03m69n32O58J54n99o4P60k35o25L76M71
6793C05m58r0L53J32k13l24M61L55p34j15P79k18o64L06O91m98m71N49L51m28
6813F9n56P27K50n62l04N32M57r85L80M76k90o95M90L77m22m71R18j23m37m62
6833f31P08L88P8q85N59O4p87K78P59r56M97O33j38j598N01P51k8n60K43R20r22
6854a26l13J05N89o31k2N6O22o96J41N1N09p03J21P79l78k75J2O41l09n17J14
$$ y = [290, 247, -653, -38, 430, 14, -756, -1, 300, -398, -269, 117, 257, -655, 45, 104, 280, -577, -140, 389, 319, -553, 247, 338, -244, -401, 195, 246, -266, -426, 296, 432, -427, -117, 612, -131, -401, -49, 716, 122, -99, 8, 715, 174, -318, 191, 302, -442, 31, 219, 422, -312, -49, 640, -284, -392, 82, 377, -323, -145, 317, 176, -277, -437, 367, 466, -390, -6, 555, -144, -426, 7, 410, -59, -591, 67, 221, -378, -442, 318, 83, -542, -166, 305, -153, -243, 110, 242, 29, -295, 166, 521, -213, -328, 451, 233, -431, -125, 566, 68, -403, 146, 497, 69, -487, 240, 490, -72, -376, 156, 613, -372, 8, 484, 194, -501, -11, 366, -56, -527, 391, 268, -169, -631, 77, 465, 543, -342, 217, 281, -506, -228, 531, -425, 72, 705, 567, -1031, -530, 221, 193, -367, -124, 796, -126, -439, -334, 255, -376, -398, -342, 280, -416, -275, -224, 285, -418, -297, 482, 104, -171, -159, 482, 173, -344, -230]
6875b30P27q14k55M57N60n55j63O77j96l20M5N86n19k76K54M56n94j19N44j04
6895A61r1m15N44J41p10K35L87j02m89J94Q12o89k38N01N9m37l62N84L20m99q5
6916a79N81j27n55lP45k80n67M05J85m88q1M61J26m47N3L89J78o93j73P23l03
6937e0o67N57L70l07n07P34L03p05O0J50L06p18J05R09m38n00L29O37n14k04K14
6958F4Jr0l65M84J92l80p2L39Q9n17oP85p19k09N15N41n64m85O57Q9m49l62Q17
6981C55j0o82K29N19l43l20J26M94k93k84M33L32q43kN57J26o59J51L62k84k50
7002b86K04M37n24j97L82M85q12k67O40m5j26q9N79m38l59P6P27m54n87O19K56
7023B21k88m82N72M51o47j71L94J01m29k39R50n01l11L26O73p42l15N70M18o36
$$ y = [-230, 497, -317, -572, -115, 445, -110, -273, 404, 208, -112, -67, 519, 0, -276, -22, 434, -160, -279, 265, 161, 70, -345, 199, 340, -370, -135, 252, 150, -339, -145, 667, -22, -260, 241, 300, -137, -499, 85, 405, -94, -179, 402, 275, -280, -283, 462, 182, -385, 20, 205, -283, -364, 97, 223, -224, -171, 218, 396, -297, -470, 253, -50, -717, -160, 210, -97, -604, 130, 433, -272, -212, -62, 244, -474, -369, 540, 102, -398, -69, 568, 54, -150, 64, 65, -25, -390, 94, 286, -94, -166, 173, 262, -255, -261, 524, -195, -404, 111, 652, 88, -397, 260, 349, -100, -462, 355, 345, -337, -108, 411, 68, -252, -126, 368, 75, -209, 224, 556, -287, -289, 268, 394, -265, -114, 248, -36, -286, -82, 355, -169, -366, 16, 501, -311, -578, 62, 17, -109, -198, 381, -57, -416, -340, 387, -67, -654, -35, 221, -67, -549, 23, 474, -173, -344, 50, 151, -278, -517, 433, -68, -379, -53, 620, -122, -437, 133, 551, -85]
7043h5n9L19Q1n87J32N83k72m65L90J53n8n68O80J97p05L17K77k16j88m8P22n74
7065B6l11J82M02k79n85Q79N1o05l34Q69L6n64J9P99l32o10L04K68m29j79M40
7086D7M81o07k25M65L2m24j39Q16k97o59L12O18l62m65L68K63k27l63N18K75p40
7107c13O7N90k30k31pL37k56m96N79L61m70k32M25Q0l82j81P41J57o73L2N49l06
7129A41n03j5P68l85p2J64N16m09n00P20K55r22N5N08l39j87N5K67j48l28N90
7150B31K48n50j91J63J34j87o1M1L47m61L0J318j021o35M79M66r49M73L11p17
7170e31%K25P40j59l47N65m78j0j57j76L41l53j52O40N2l27l07P79J06q74P7N07
7192A61K5n59K66M84k31m75L95L25m48j81K74K52m71k51O13N6o07L63O27n60l30
$$ y = [-85, -144, 175, 256, -331, -199, 384, 112, -353, 37, 190, 132, -436, 244, 441, -264, 53, 330, 114, -74, -122, 600, 26, -285, -103, 299, 20, -565, 314, 365, -240, -574, 295, 331, -233, -214, 585, 253, -357, -53, 215, -214, -393, 47, 528, -79, -304, 161, 193, -231, -370, 446, 149, -510, -198, 420, 58, -407, -39, 224, -3, -366, 152, 427, -313, -246, 344, 114, -117, -124, 213, -43, -539, 40, 401, -69, -301, 124, 204, -178, -359, 382, 539, -134, -102, 447, 141, -362, -377, 391, 6, -66, 98, 614, 205, -295, 425, 680, -242, -187, 321, -18, -205, -150, 117, -31, -359, 231, 479, -71, -262, -99, 35, -152, -213, -172, 175, -286, -256, 1062, 41, -594, -115, 351, -598, -125, 186, -531, -531, -306, 434, 275, -72, 493, 15, 5, -152, -328, 13, -340, -492, 148, 200, -127, -434, 345, 451, -423, -346, 161, 186, -373, -107, 377, 146, -329, 66, 391, -57, -238, 36, 288, -183, -434, 179, 235, -372, -9, 618, 58, -272]
7213b72M51J26k27l83M45J88n77j05P79J16q04J71M67l54k57M6O32n85j26M81
7233B12J54m00k09L91l2k14j06M46q7m59J29N04k40p54O36L45n37n4L36J75m10
7254a74M7L17j27l58L09K01P7n92J90M18l97o8J63K31k59k85N73k08k05K17L18
7275C88k99l36K85M59m50m42M93K33n40j04O06j67k79kL29j88l37L15N62n77m75
7296e26N08M08k71l09K80J83n41K87K44l64K0k75P46m32k62K79N27p77L6M31J06
7317B98n42J27N2L23n94K21N39k76j82j63O54m48m94O10K93m02m95P15q3l91K5
7338b13M70l06l32M56L28l92k00N29r0m42k80O09j12k63J44M64l9o10L40J39k49
7359d9l12M46K89m51k47N86J37o14L0N02j91n86J97P03k72l17L85J44k89l03J92
$$ y = [-272, 179, 305, 78, -305, 140, 328, -249, -354, 425, 541, -263, -92, 375, 21, -236, -190, 442, -143, -269, 212, 366, -34, -243, 148, 116, -98, -204, 242, 155, -304, -175, 329, 89, -665, -29, 316, -221, -275, 61, 236, -174, -127, 190, 63, -295, 14, 215, 292, -300, -110, 308, -89, -157, 6, 237, -22, -307, 266, 58, -147, 70, 388, 89, -247, 38, 497, 47, -395, 98, 331, -209, -313, 293, 126, -153, -155, 174, -14, -351, -36, 526, -51, -526, -18, 390, 119, -190, 90, 273, -268, 19, 263, -101, -81, -356, 390, -42, -304, -25, 502, -275, -239, 192, 298, -244, -117, -65, 258, -336, -115, 424, 148, -34, -197, 457, 9, -485, 125, 418, 16, -479, 236, 153, -238, -213, 257, -49, -381, 75, 403, 11, -189, 340, 250, -192, -472, 137, 25, -238, -94, 370, 331, -279, 61, 200, -49, -361, 85, 374, -77, -324, 262, 399, -215, -185, 317, 126, -460, -263, 440, 168, -149, 236, 380, 91, -212, -20]
7380b0M64o66m7N94j03p52L92M08j73n98M22M00m92m97P96K02n76O4L20n2j12
7401b6l05N13j96j86k4N28k33l57L69J35m94j68P36M8p74M62L10k57n58K96N63
7422C82l05m15L45L05l43k50O04o0o73K29L97j05l72K39M82l23o44O49L12o13
7442a59m8K37J72n14j07O08J15l77k31N54n59m1P76j00k89l29K21K00m15MN39
7463B57l3m52K0K63j23l77J25M96k46l56M96J54k90k40M36K1n11J6O71l36l87
7484c96M69K56j50l36L87J00m34j96O70k41l33p4M52n8l28K77L42j29l34K3L48
7505C15m29r6L78L31o20j94M06K89m35j8M62m00j51J51L52m22j24J52J81m05R5
7526a82L19K48q25j5P30j71n21L32M84k62l18J29L48p29R7N57J5k95j95M80k09
$$ y = [-20, 444, -222, -269, 325, 222, -530, -138, 270, 97, -501, -79, 321, -171, -668, 128, 330, -246, -182, 138, 86, -26, -331, 182, -14, -200, -224, 304, 71, -286, 83, 218, -276, -444, 292, 340, -434, 28, 338, 81, -477, -181, 382, 77, -338, 7, 312, -31, -281, 323, 263, -410, -181, 216, 111, -261, -22, 460, 137, -507, 142, 454, -159, -207, 30, 202, -312, -419, 189, 304, -73, -304, 250, -309, -350, 426, 326, 37, -292, -71, 129, -286, -282, 257, 224, -228, -208, 55, -68, -445, -320, 176, -70, -426, 70, 224, -66, -306, 130, 151, -360, -344, 327, -9, -396, 73, 329, 179, -157, 230, 330, -104, -300, 370, 129, -204, -278, 174, 116, -212, 65, 407, 278, -56, -33, 315, -114, -210, 168, 499, -121, -315, 91, 380, -55, -73, 389, -11, -162, -11, 341, -81, -205, -53, 128, -277, -182, 137, 385, -440, -455, 275, 104, -417, -85, 399, 137, -181, -52, 296, -433, -336, 221, 236, -59, -254, 226, 17]
7547A7j66p1N63o17l6L62K49l86k78K87M04m12k03O08j93o12M23L80j50l09rL85
7569B36j66m29K55M69m77k03N77R4m61K21L22l09l57K91K39o2n71N55K63p99K1
7590b91K86J30m52J47N60J03o37j32P08m11j44J50M08l81n83O97K6j96n70O50
7610F8K46o35%N60k45j22M23k6k74m57N14M5k47j27L27M03p53J82J84Jn01L73
7632f1K47m4l55J0M83k82m09O39K5k77j81K71K07m71K27L72m19k64M90K43m42
7653Ik06J64L33o02J49L95M4o41J54O19k88k79J96L23k43j29K37K25m67j99M78
7674B72p0n43J55K97J26n13K41N92o63k36K06L45m15k29N49r6k36J73K7J53k41
7695a06j72N56k34l93L70K66m93l88Q88j66l38l68Q30k0n30J74M38k78k50K28
$$ y = [17, -149, -220, 343, -274, -310, 52, 301, -85, -363, -76, 328, -84, -287, 321, 128, -484, -61, 319, 169, -140, -149, 236, 70, -359, -104, 365, -112, -315, 262, 356, -105, 116, 438, 129, -228, 63, 302, 240, -331, 224, 487, -312, -291, -5, 125, -327, -180, 380, 483, -154, -286, 422, 11, -133, 17, 425, 44, -539, 158, 184, -12, -582, 68, 314, -321, -321, 239, -6, -128, 295, 269, -5, -462, 52, 97, -150, -277, 50, 453, -300, -118, 66, 67, -434, -61, 186, 142, -213, -203, 280, -2, -411, 228, 253, -24, -205, 66, 273, -198, 29, 401, -18, -282, 208, 451, 9, -197, -33, 300, -302, -153, 242, 286, -355, -201, 418, 130, -149, 47, 370, 127, -2, 235, 460, -7, -206, 272, 202, -341, -186, 111, 237, -276, -35, 557, -106, -342, -136, 209, -206, -435, 114, 18, -218, -45, -18, 135, -106, -278, 278, 44, -349, 21, 287, -206, -594, 294, 128, -210, -578, 252, 232, -298, -124, 314, 36, -214, 14]
7715A4K37k90j79J46J66l85K38J97L03r57L19R11p60k16L88K86m99l52m13O85
7735a61M07q4J02q9l69J14L72l32j33K31J1J60k92J70J09l79k41P29n5n92j15
7756d37O79j25n06M21M17l47m04P4P99o19o9N29k28p68K52O22J42p67J59M02p3
7777A53m41J90J29n1n43R34k15n37K6O26j87j27j67M55k39n7J19L17k46m03O52
7798C88j39l57l20O89k45j59N0M48l09k86L12L13k80m11L94nr6l50N68p1k39q6
7820a91L85j79j30M2L62j00l37L71Jm07p6K99L2j53j50M08L6o81L37L70J40n67
7842a88k43N62r1m35O09P1o57J93L43k56k81K11L11P0p88N09L10m93Q6Q0L10l82
7864a49k38M50J46l93j76N76k25k85N09j28p6j83K94L88k65k91M44j62m34L42
$$ y = [14, 251, -39, -218, -72, 94, -291, -53, 144, 447, -510, -191, 720, -40, -256, 132, 418, -81, -433, -846, -161, 246, 162, 264, 175, -194, -80, 292, -40, -173, 58, 69, 229, -63, 107, 216, -163, -404, 325, 270, -322, -437, 242, 117, -389, 32, 449, 102, -302, -228, 571, -48, -117, 412, 184, -584, -332, 290, 432, -335, -176, 226, 153, -288, -98, 31, -20, -563, 371, 156, -381, -355, 271, 84, -43, -210, 245, 6, -51, 68, 385, 139, -264, 388, 249, -108, -428, 261, 16, -143, -93, 355, 46, -240, 72, 385, 105, -306, 88, 83, -13, -363, 205, 134, -105, -191, 194, 15, -115, -73, 289, 189, -148, 223, 224, -183, -259, 40, 72, -81, -231, 177, 213, -468, -131, 239, 379, -188, -431, 131, 40, -395, 214, 285, -372, -179, 164, -92, -373, -162, 149, 219, -569, -60, 250, -243, -157, -77, 233, -149, -387, 63, 209, -184, -360, 216, -9, -294, 215, 87, 11, -172, 122, 510, 245, -46, 398, 236, -198, 144]
7884A44K43p8m40J16M42k82l55M38J64l95j97K28K14n81J30N71L2n90J45J51N1
7905A51k62MM18l44k17K24J32j16k69M28j1n33J58N36j84k57K52M3j2l21K97J66
7927B83p09K26L19J2m54O5M33N1m29p9N77n24k51L23N93n33n0K15K85l45r3L43
7949B58j55k00N7M68j98n77L80J01j41k22L13K00n17J51J92N4n23J33N93k72l22
7970b27J47M31l01k18J16J72k85J29N26o99k39L59K54k2n61N88l3r2k29K62L9
7991A17m43j7N49J29o50J27L11l0k03j72N13m98K04J11J46k73j10L40O7l36r1
8012b09K75L9k64N7K99j23l61K01K55j04n38M58O04p39P1N87l33j09q3K76k40
8033A9l54K55L82l33j16K16M39l01l80J83J10m20L40r7L13n20L38P9r1k91O18
$$ y = [144, 387, 309, -131, -15, 427, 145, -210, 228, 392, -3, -200, 28, 242, -339, -209, 362, 394, -196, -51, 100, 151, -111, -107, 311, -33, -250, -26, 106, -10, -279, 149, 138, -395, -237, 299, 115, -142, 110, 153, 141, -180, 117, 283, -426, -200, 119, 131, -323, -258, 175, 226, -203, -282, 295, -229, -480, -157, 436, -97, -147, 68, 353, 8, -85, 258, 103, -97, -40, 428, 230, -347, 33, 134, -7, -229, 84, 284, -233, -82, 110, 164, -359, -226, 367, 95, -227, -80, 351, 50, -168, -52, 120, -165, -36, 490, -209, -448, -89, 165, 143, -418, 170, 137, 45, -184, 78, 117, -326, -343, 206, 335, -315, -188, 123, 93, -110, -282, 231, -267, -63, 48, 194, -79, -189, 151, 218, -118, -209, 66, 105, -159, -102, 197, 74, -287, -86, 169, 65, -473, -15, 589, -150, -79, 508, 175, 66, -17, 259, 19, -335, -80, 302, -31, -147, 69, 508, 207, -173, 10, 120, -300, 40, -57, 256, -264, 74, 153, 62, -229, 389]
8054C89k37k40p4L59J16n09J31J88K09o32L34Q2J7l75J02N81m95l53K20J83J0
8075Fk28M35m7p80O86N0k24n3j17M98l85k34N67l0P0n69N66K25m88Q8R2O6n62
8098c68M29L64k37m03M64J6k70L7O7N6k52j20M31O3l84j32N53j07n15N05M49o08
8120C8l12O51o4l74P9J57K6l06o9M13j76k67P1N15j95j90P1q9j91m3L55K3l68
8143b45L1M25j87m03N17K14m05m70M50L29l20k31O54j93l56q5M56l4m59K23M08
8164C19j86l12K18L10m88m9K40N1j08j60N07k26m05N8L04L4o38Q04k54q0j79N76
8186C36j16m08J08L81p7
$$ y = [389, 152, -88, -162, 197, 313, -196, -65, 123, 332, -300, 34, 116, 133, -242, -140, 441, -54, -407, -187, -4, 6, -222, 213, 166, -614, 72, 122, -102, -155, -272, 226, -159, -393, 174, 144, 214, -355, 211, 436, -52, 36, 128, 194, -368, 61, 425, 188, -215, 249, 265, -5, 32, 99, 155, -97, -217, 214, 277, -107, -239, 314, 207, -308, 197, 646, 38, -274, 377, 313, -61, 18, 175, 201, -105, -174, 239, 63, -204, -133, 382, 187, -3, 68, -21, -212, -255, 100, 123, -245, -214, 211, 24, -379, 138, 352, -53, -523, -73, 256, -64, -295, 359, 166, -190, -275, 181, 147, -312, -89, 319, 133, -179, 39, 349, -139, -188, 52, 103, -5, -165, 342, 116, -289, -231, 73, 107, -531, 273, 19, -61, -240, 336, 220, -188, -80, 301, 224]
8191B24
$$ Imaginary data points
##PAGE= N=2
##DATA TABLE= (X++(I..I)), XYDATA
0@%%%%%%%%%Qj6J6j6K4l2M0n6O9q2J01j20J43j72K04k39K80l28L81m42N12n89
31c14O71p66Q72r87J115j258J416j587J772j977K203k449K716l006L326l675M057
48B129m474M928n428N980o587P259q008Q843r783J0849j2068J3479j5138J7117
62I098j9524K2528k6396L1593l8997N0533p1888J79595m91883L52025K54196n68701
74c17821M96542k28383n5864L61571l87501P0665J99066k53020J71680r0007j1497
85d4569J62495j93466M7423J07648j47638Q9159J1070r4728O5624K2026n7836
96c2792L6316r418Q271M7947j10626J2796J31467j16984j4662O8630l36L3987
108E4596j36707M8168J46280j80472K3038Q0290m0498N4390j23902N8703J29634
$$ y = [0, 0, 0, 0, 0, 0, 0, 0, 0, 0, 8, -8, 8, -8, 16, -16, 24, -32, 37, -45, 56, -64, 79, -93, 111, -128, 152, -176, 205, -237, 275, -314, 357, -409, 463, -524, 591, -667, 749, -838, 934, -1043, 1160, -1289, 1427, -1579, 1747, -1928, 2129, -2345, 2583, -2845, 3135, -3452, 3807, -4201, 4642, -5141, 5708, -6360, 7119, -8019, 9098, -10426, 12102, -14294, 17299, -21698, 28835, -43053, 136542, -355341, -3316, 250880, -317821, 178721, -49662, -105526, 256045, -131456, -60791, 138275, -114745, 56935, -33072, -44569, 117926, -75540, -28117, 79531, -68107, 21052, 32122, -62606, 3018, 25044, -32792, 3524, -5894, 2377, 50324, -60302, -47506, 83961, -33023, -47685, 20945, 20609, 54596, -82111, -33943, 112337, -68135, -45097, 35193, -5305, 49085, -74817, -16114, 113520]
119A13520j78794M3430N7083m2373M4065j05623Q5110N5634j52022J17670j5511
130B2189o8479R8432r4596M6812M0165j04388J24881n5443o8073J29541r6766
141b5725O257M6738p8255J18386o0781q3931J66974q2957p1455R2393m0725L3431
153B0350k3663n8014J41911n5554j05850J18260j6640m3346K5463m2201P8809
164C9525o387j23967J17055K3374j13817P8145n363k2390N2438r2959N4192N6609
176E6455j23626Q7994J2063r4941R9994n0428k0140Q1022r3620O2894K2341j18792
188g8784J12662p088p5092O7235k6029L3780k0222o9576J14123k7198o7823N6696
200A2684r909K5542m8123l8312J21183m8628n9349P0350j0318J202l8745j1610
$$ y = [113520, -65274, -21844, 35239, -7134, 36931, -68692, 16418, 72052, -79970, 37700, 22189, -46290, 52142, -42454, 4358, 44523, -59865, 65016, 9573, -58500, 71041, -25725, -19468, 27270, -50985, 67401, 6620, -77311, 89663, 6706, -64749, 27644, -13081, 20350, -3313, -61327, 80584, 25030, -80820, 37440, 20800, -22546, 2917, -39284, 39525, 33138, -90829, 26226, 49600, -64217, 13928, 8565, -13825, 38613, -54346, -154, 56455, -67171, 20823, 32886, -62055, 37939, -12489, -32629, 48393, -45227, 17667, 40008, -78784, 33878, 26790, -48302, 18933, -7096, 26684, 6462, -63114, 51009, 23811, -44012, 12684, 2775, 28317, -19806, -58118, 63065, 14437, -44912, 25438, 15120, 16322, -22423, -34033]
212c4033Q8363n5940k9207O6282l2347l433m957k0588N4341k8291k4685O0350
224C5855l7103j9788M8975l7580n997K9322k0135K0764k5657j6168P8097n8508
236g923l8578Q3425l4780j1311Q2k2286Q6862o6663n5163J23903n0847l6272L9157
249I606l0965O5234n3328n5052J26126o6356m2380P4924m7042L9166j3016n5801
261d8884J02939n5144m8934R4645n9918o20M4641n6964M5726r899l8962P1597
273D0223n3153j9810P8183n6459q398L9118k7249K9370l2737k4616Q8415m7755
285E132m6827P0409j1430k1045j2962o96O0021m7629l4835P5672k3091k7668R596
298e353l180M4038l9989k7955O9122l3822k8137K9555o589J8399k4911n932M4561
$$ y = [-34033, 54330, -1610, -30817, 35465, 3118, -315, -5272, -25860, 28481, 190, -24495, 35855, -1248, -21036, 27939, -9641, -15638, 13684, -6451, 14313, -11344, -27512, 50585, -7923, -46501, 36924, 2144, -9167, -9085, -31371, 55491, -11172, -66335, 57568, 6721, -29551, 9606, -21359, 43875, -9453, -64505, 61621, -4735, -47115, 27809, -19233, 19933, 6917, -48884, 54055, -1089, -50023, 44622, -15296, -15916, 28725, -28239, 17487, 7588, -31374, 40223, -12930, -32740, 45443, -11016, -19414, 19704, -7545, 21825, -10912, -35528, 52887, 5132, -41695, 28714, 17284, -3761, -16723, -17419, 42602, -5027, -39862, 35810, 12719, -14949, -5353, -8533, 35505, -4484, -32439, 36683, 2861, -25276, 4279, -2310, 16089, -8822, -14754, 29807]
311B9807n0755L905M1434m3943K3386J0330k7049K9275l7074N388M9208o0994
323b7082R038N0251l4448p147m578K0157K1913o9228K4513N7786n8500j305K5064
336F434J820J7454n1218J0053N6246o0174r811M4637p206J551k5977J5098L4716
349C3623o2459J5720M1869m3957K4074L926k4697L3993l7078J990M3007n4052
361b4041K1135L5336m9171J5957O157m504J7058m7846L2259L9012p6402K5166
373i884L9970l4810J2458k1562J1775M1493p5465J0118O7917n1213o561J9784
385D020O33J7026m7765J2092M9550n5052K741L2154j9860J4831j8581j203L0667
398B1253m2433O967L1360l0256J1651J0057p462M241k3796K4859Q352m7272L4811
$$ y = [29807, -20948, -17043, 24391, -19552, 3834, 14164, -12885, 16390, -20684, -15296, 33912, -27082, -18044, 32207, -2241, -9388, -13966, 6191, 28104, -41124, -16611, 41175, -17325, -18630, 6434, 8254, 25708, -25510, -15457, 40789, -19385, -29196, 15441, 8235, 9786, -16191, -1093, 33623, -28836, -13116, 28753, -15204, 8870, 12796, -11901, 22092, -14986, -12996, 30011, -24041, -2906, 32430, -16741, -784, 5373, 869, 17927, -29919, 2340, 41352, -35050, -9884, 30086, -4724, 7734, -13828, -2053, 39440, -36025, -25907, 42010, -9203, -15764, 4020, 4653, 21679, -26086, -13994, 35556, -19496, -16755, 15399, -4461, 10370, -8211, -9414, 21253, -21180, -14213, 17147, -13109, -1458, 8599, 1137, 5378, -18418, 6441, 14793, -32479, 2332]
411B332J8189l3028J1750k465J4384K579m9245M0519K3024n5224K0801J9650k593
424A0673r97l7409M0980J6680o8732L6408L0139l2505J0390j5357J3538J7119
436B0927n2444K8460L2290m0696J3638O148p798R555k5970K1092J0911m0040L3184
449I257N987l6171K6918j12n508O963k6871L0408M835m9245L6204J6481k4497
462e351M939j2019L0856o270n7748N7146J3802n3981K9126O73L274N268m4138
475c4423M6863J4442n8898L1223J0506j3066P699k2898L2353K275m5137L6284
487G223n43k6543K7810p155o74Q302j6884J6878o345k2116K8939L890k0971L656
501d533J0643R848k5428j2561M5374j0804l7855L0613J0681j4051p596q471L5847
$$ y = [2332, 20521, -12507, -757, -3222, 11162, 13741, -35504, 5015, 28039, -27185, -6384, 13266, 10673, 9676, -27733, 13247, 29927, -38805, -2397, 27742, -4763, 5627, -9730, 3808, 20927, -31517, -3057, 29233, -11463, 2175, 8323, 525, 10080, -15890, 5202, 16113, -23927, 9257, 15244, -20927, 5991, 5879, 371, 7334, -19537, 10871, 15706, -33539, 2665, 19146, -5351, -412, -12431, 18425, 12155, -45593, 11553, 25355, -28626, 500, 1173, 4447, 9715, -34423, 12440, 26882, -32016, -793, 9713, -3353, 4346, -18552, 13801, 16076, -29061, 7223, 6680, -19863, 7947, 792, 118, 8420, -8464, 8414, 2069, -20047, 8892, 12782, -8189, -4533, 6110, 15958, -9470, -22031, 23343, 12539, -25316, 5297, 15978, 1927, -5669, -14140, 21707]
514B1707r281m2248M0624Q344k7392P379n903K3053j0279l7284M9824n468l5468
527b2392L3589j1329k66R175k5090L0581q398k6579L8052j8824j4588K3347j0854
540c576J1006j1894j0134L9882l1414k1969M3940r154j6609K831N795K0464k8864
553i696j2127M0336j2619k1186R676P708J0368k4406m642M1883k2908k5114L0510
566G783k643r361J416p11J9914j6894j6104L1115j4419j4501K3300o421J350j643
580B181j2019K4069j5161j8583M0732j2651k2535K2802l741k433r338n049L3782
593B2056j9464k1119L2042n108j2712m001L340K7577k9258j4516M3079j5777j9352
606a3213J2742M473P206k2528R26K8502k2066p398J4874j121P48j5160Q568J8571
$$ y = [21707, 12426, -29822, 10802, 19146, -8246, -867, -6770, 16283, 6004, -31280, 18544, 13076, -22392, 11197, -132, -398, 8777, -16313, 14268, 5870, -20709, 17343, -1481, -16069, 7278, -3576, 7430, -4464, -14598, 25284, -6130, -28099, 15841, 6687, -9922, -7091, -1296, 19168, -9696, -21823, 18513, 5894, -15292, -5616, 2092, 12460, -11946, -16588, 25295, 2387, -22727, 7783, 5140, -4221, -2805, -3516, 16398, -496, -16600, 14515, 96, -14405, 8895, 2474, 3824, 2181, -9838, 14231, -930, -19513, 21219, 8568, -13967, 8835, 5094, 2661, -6677, -11726, 22056, 2592, -18527, 13515, 8407, -4305, -8306, -4966, 22611, -6647, -21163, 21916, 6139, -13213, -471, 4002, 11208, -11320, -10394, 18108, -3958, -11356, 3518, 2397, 3145, -12015, -3447, 15124]
620A5124k6634M385K2726j7698p508R868J850m383q156J1013J2115j9393l716
633a0407K1795r620j4096Q963P891L246j8849J397L3499k5453j9271L3162n813
646F444j0499l257K634K5025k7613j0940L6959j4192j0560M986Q63J5620k7072
659a1602J570L2667k8543m83J8570j2809L897j0837N882J4735k6298J2826J8182
672A7757k2267K565M073j072K832j8200J5556J8984l0821J041K4694j4562j2027
685a1447O152J1586K827k3582P413K6614k2346j1730J8980J113n464j3785R156
698d513K2886k6243l993K6204j3796q983K038M004R067j6760R805J6486k4012
711g810M549P247q531O060j1205J2695J2850l2514J4446J9299k6226L890Q743
$$ y = [15124, -11510, -7125, 15601, -2097, -9605, 263, 2113, -2270, -10426, 587, 12702, -6691, -10407, 11388, 1768, -12328, -3365, 4526, 7772, -11077, -9680, 23819, -1634, -20905, 12257, 6444, -4055, -7312, -4678, 20347, -7266, -18206, 18753, 4561, -5999, -1013, -150, 15470, -11602, -10032, 22635, -5908, -6391, 12179, -630, 3267, -7570, -1688, 13047, -13251, -425, 17757, -4510, -1945, 2128, 1056, 3888, -14312, 1244, 20228, -10593, -9552, 15142, 580, -11447, -5295, 6291, 9118, -14464, -7051, 19563, -2783, -14513, 4467, 5580, 116, -13669, -4513, 18373, -7870, -11863, 14341, 545, -8438, -6400, -2396, 6671, -10089, -284, 16202, -7810, -3261, 3986, -4545, 1515, -9690, 3005, 15855, -16659, -2213, 17086, -9140, -5250, 3493]
724C493K168j079k1226K0695J3922l2495J2258J6592j2551k204j0178J4479J1469
737A5343l3021J4007K6344k6490m432J1975j0m80j3661J1935J4118k2218J947
750d643J3966r111k614k208P508L923j9024J2163J4107k3079L726J4253q472o297
764e802j616J3472J047k0281J3760J1755j7728j952L120J0228k837k1741K3092
777D517J3104l1215O461J5358o778o591o060J8796J925k4834J6878R151j4918
790d206Q54j455R871p33j8528J9622O308k2485J0398P743o881k495r24J1052n882
805B259j4508J8148K809j6020P211O370j060q213o986J9342r41k2482J6177J2568
819A4674j6212m903L578J2392o819j9226K4087P192k6383Q396Q128l564j780r711
$$ y = [3493, 5661, 4582, -16644, 4051, 17973, -14522, -2264, 14328, 1777, -427, -10605, 3874, 15343, -17678, -3671, 22673, -3817, -8249, 3726, 3716, 3236, -10425, 1510, 15628, -6590, -4643, 9323, 212, -2402, -4610, 2898, 6821, -12203, -40, 14067, -9012, -5286, 8967, 495, -5802, -7418, 6054, 7101, -13180, 580, 12335, -5393, -7345, -4225, 6003, 3166, -18575, 4517, 17621, -13594, -7133, 8225, 1447, -5144, -11204, 7592, 9517, -15317, 1561, 10712, -4206, -3352, -4807, 5064, 4331, -14197, 5425, 11733, -10752, -354, 7389, 508, -1987, -2911, 8141, 2259, -12249, 5899, 8708, -7312, -101, 6269, 5209, -3004, -9990, 9352, 8411, -14071, 2106, 14674, -1538, -6441, -2863, 9529, 2710, -16516, 7571, 14763, -11620, -3224, 4904, 1340, -440, -10151]
833a0151J7065K807k3684J4886R170j5042K092Q46O458m092j3625J8820J049j7173
847a0574J2026L721q078j948l10J1287n271j1060J5659L433j6198j001J2255K845
861F786j6164J027K1832j0521j5716J3039O310m692p978J402J7549j1617j6110
874a4853K1497J500j4038M546L713N241j0655p051K2238j0231j3422K0221n366
887C340n275M429o383J3254p874j3830K3442n889j5770J3959J611l785n795N08
901d058J6680j4923j0974K3911m543j3815N425L468N602j0986p372K3314n690
914F039j9399J2988O973o847p164K323J5501j1471j0617J7929k186j0154L642
927b443K060N044r004l470J7304r041j0062J2800L20o461l054O897P783j4354
$$ y = [-10151, 6914, 9721, -13963, 923, 10093, -4949, -2857, -2011, 4447, 355, -13270, 5550, 6599, -10574, 1452, 5173, -2905, -4853, -5163, 6124, 853, -10207, 5452, 8885, -7313, -8314, 3941, 6786, -9378, -8351, 13481, 2960, -12756, 283, 6593, 1901, -6077, -4675, 12874, 1257, -14853, 6644, 8144, -5894, -1348, 2365, 7606, -3049, -10100, 12138, 1907, -11515, 8706, 3340, -1935, 2494, -3889, 9365, 1491, -12339, 11103, 5214, -10556, 3403, 5014, 1229, -4566, -4058, 12622, -2301, -13275, 10636, 6093, -7722, -2297, 1171, 6773, -4213, -11585, 11729, 6039, -13360, -372, 6601, -246, -7410, -5087, 10414, -1057, -11674, 6255, 4069, -6085, -2443, -383, 4661, -4343, -7813, 9491, 450, -9612, 3188, 3508, -2953, -6007, 890, 8673, -5681]
941e681M17J5415j0359q119P663O007j274j0915O794J2811j6830o982J5627K091
955F665q595m242J1811O341k0129P33J8182r612p285P018L763J094j2030L667
969b619J4554j5047l217J3077o231k544l86L924P126j5673M226J5609j8549k598
983h348J4880n208l068j858M714P614j6253j403J8437p403j0928O758P751k298
997C387j3723O361J5959j5172p655J6870k327r379J064N485N341j0092k831J2935
1011F223m618r379N623P969l770r205R113O521j4942R31J1314m527n047K110P666
1026E982j397j1459O131Q680r524n461P990P974r273p161J4764J331j6591L869
1040d145J0969n202o555L748Q044k632j1102O060J0111j2218l914J0616J345p121
$$ y = [-5681, -5264, 10151, -208, -8327, -664, 5343, 4069, -6846, -52, 12759, -4071, -11053, 4574, 6665, -1930, -6172, 5639, 11980, -8149, -7416, 10766, 1154, -6131, 887, 4650, 5744, -6286, -2619, 11935, -3112, -6329, 6748, 517, -2027, -2413, 1511, 8637, -7036, -2810, 12799, -5750, -8348, 6532, 1324, -1744, -3602, 1112, 8726, -7527, -8930, 9507, 2104, -8824, -2066, 5685, 3387, -10336, -3975, 11984, -3188, -10843, 6027, 3700, -5679, -4615, 870, 6211, -3881, -6712, 6223, 1605, -7774, -2151, 5818, 2048, -7157, 1956, 8477, -6465, -5534, 5780, 1253, -3794, -1684, 5982, 4585, -6874, -743, 7937, -1587, -7048, 942, 8916, -357, -7518, 7246, 8577, -8014, -4145, 6824, 1622, -4933, -1185, 6859, 4227, -6875, -815, 9296, -2922, -6836, 3780, 5125, -1996]
1054a996l894J0589L152j6983O075J2181j1680k590M552L706O22j2018Q413Q952
1068I081j6265K214J0269m869l081j532P776J61j4757J0426J0123j5164k70R613
1082C725j454m906m139R427O061j5415Q70J4245q056q105O107O936q58j1978O490
1097a050J1746j5782l582J4176j942n271n02N746L630j2632J134J1599p127m688
1111d545N895L750l889n960P659L866j2020J758R745m184p608M290R748o030j0154
1126g679Q672O498j0510l608Q061O150q951p134J3811J269j5274N083R818n350
1140H56m968N09Q536k567j1782J0526M907j0330J230K997L446m538p708J5051
1154F165j760j4948J2515L223r400J673J276N912m386q826J3583L49j2751N045
$$ y = [-1996, -5890, 4699, 7851, -9132, -3057, 9124, -2556, -5146, -594, 3112, 3734, -8284, 129, 9081, -7184, -4970, 5299, 430, -2651, -4183, 3593, 3754, -11003, -577, 9546, -5618, -5888, 3725, 2271, -2635, -6774, 2653, 8714, -6701, -5831, 8414, 358, -7747, -1640, 5296, 4438, -7540, -1050, 10696, -5086, -8668, 5508, 3566, -1705, -2207, 3539, 7169, -5463, -4329, 7270, 143, -4545, 1350, 5100, 1211, -4749, 2910, 6776, -5244, -3486, 6259, 2075, -5533, -1243, 8505, 2475, -7679, 993, 7491, -3019, -6627, 1434, 7584, -1367, -8501, 5310, 6579, -8695, -3612, 6206, 856, -4112, -3603, 4933, 2366, -9416, 1110, 6017, -4313, -3083, -86, 3360, -1178, -8886, 6165, 4405, -10543, 1972, 5195, -4205, -2532, -1256, 4656, 270, -8556, 5027, 5376, -7375, -2330]
1168b330O658j951o375p91J3311m257j4080J1392O469j2287m15O807L121m479
1182G93o738J0096L076j4514L894R902n247m229J682P282k964j0769J0580M417
1196G261j2208K261O429j447m238k341R915k011j0505P305N299o505m216N050
1210D9O827q647n905J2735r07j0301L296P859j787r586K246J0595o964p375Q893
1225A028M191n011o433N557P299j1524k536J3432k789q498L741M288j194o812
1239e261K394J0319q514m680J0115k080n479N80L645M908r699j215J4002p649
1253A386r227J0322K767n709l286L719P764r207n179J3679k278r940M895L313
1267C019O04o436k010J3715o470j1818J2832K842r463K41L387M471o321m964J1285
$$ y = [-2330, 4328, 2377, -3998, -4789, 8522, 4265, -9815, 1577, 8046, -4241, -4656, 2151, 5272, 793, -5945, 4151, 7227, -7287, -3393, 6509, 1262, -2967, -1285, 5997, 3033, -7736, 2844, 7261, -4947, -2686, 3743, 2296, -1942, -4283, 5632, 3621, -6884, 421, 5720, -785, -5001, 49, 6876, -1771, -7676, 5059, 4152, -6149, -2853, 5006, 3219, -6367, -4121, 6474, -490, -7865, 1028, 5219, 208, -6225, -668, 6631, -4893, -7429, 6003, 3214, -5284, -1543, 2745, 1551, -5261, -2867, 7452, -1062, -5742, 4373, 2293, -3186, -2606, 1039, 5947, -3752, -4967, 9035, 1386, -7841, 2481, 5248, -461, -3747, -28, 7736, -1471, -6650, 7029, 4751, -5189, -294, 3019, 3623, -2813, -4823, 8892, 2422, -9396, 3436, 6278, -3185, -2944, 443, 4914, -1407, -6371, 4914]
1282D914j559q371M651L704j733o373K532Q289q093m614J0673L84q941P32P620
1297C815j603r168M084Q036m855n140L653P147o047p650Q519N160j0178j301R776
1312D248K68r291J012Q357k303q695N329P400o709m307N508L121l628n586O398
1327A122N872j1181O18J0312o110m041L685L232p93q501O409P495j2312J164Q230
1342E201l393k357l560O832M281j4443M686J1769j0110l577O109K573l390o614
1356e993O841O183j1732n42J0194k615n627Q74N298K11q806J381J0345o733n573
1371f294R057J640o893k152M915K316p276J074Q939m525n566M691K947l389m810
1386e326N229N365p572l023Q542J547r341M5J0175k878q572N131O043m196n560
$$ y = [4914, 3355, -5016, -365, 3339, 1606, -4767, -2235, 6054, -2039, -6653, 4020, 4404, -4537, -3805, 3815, 2212, -6956, -2872, 5164, 309, -4831, -1178, 5969, -78, -7728, 791, 5951, -4227, -5528, 4248, 4516, -4775, -3763, 4594, 2291, -6404, -1075, 6325, -384, -4691, 817, 3938, 310, -5276, 1122, 6994, -4187, -3569, 6743, 633, -3408, 277, 3509, 2716, -5785, 624, 8119, -4193, -3029, 5201, 1808, -549, -4109, 2723, 7004, -7439, -2753, 9016, -1094, -4671, 1438, 4011, 621, -5993, 848, 7031, -4701, -5243, 4951, 2336, -3291, -2417, 2881, 3092, -5714, -4333, 6012, -721, -6294, 2763, 4403, -2490, -4642, 273, 2589, -4687, -3613, 5326, 801, -4765, -74, 2873, -516, -5326, -97, 5268, -2304, -5327, 3215, 4762, -4579, -4534, 5641, 2763, -5809, -678, 5365, 1169, -4391]
1401d391L611O715n721o567Q606L614q620l34O869K29p018Q7Q402l428o949O468
1417A573L210n714j600M329K147m399l747P381Q63r015L242P012l709n452L110
1432g69O678n629o539Q548K068p999M7O304Q73n184l540R117q16j0313M885P562
1448E293n160m450M101M244m528n412O562L506r164K468P288m218l647J222M168
1463B273m89q000N253Q384j0034k362Q533j133m306j976O241K681r457J342Q925
1478E875m858m843M395L115k739n016N056M945p720k011Q725j450p462J440P173
1493D625k043p151L412P351n569n203N923L501o127k937O439J824p523j44P649
1508D027j556o376J853O821m292o258N648L719o163m09M867J909n829k561P205
$$ y = [-4391, -780, 5935, 214, -6353, 2253, 5867, -2753, -3087, 3782, 4011, -3007, -2920, 5482, 2054, -4895, 1573, 4783, -931, -2531, 1798, 3945, -454, -4201, 3180, 4043, -4972, -1730, 5282, 1573, -3879, -769, 5909, 280, -6259, 2289, 4357, -3642, -3595, 2709, 3582, -1602, -5142, 3975, 3159, -7154, -2269, 5293, 133, -4317, -216, 4028, -500, -5912, 650, 4156, -5008, -2540, 4748, 530, -3117, -1895, 2273, 1784, -6216, -963, 7421, -2613, -4975, 3558, 2425, -1881, -3857, 2384, 5065, -4392, -3050, 5875, 1017, -3826, 569, 3684, 945, -4071, 985, 5930, -1790, -3801, 4924, 3474, -3988, -2548, 4625, 2582, -4569, -1157, 6194, 625, -4578, 1345, 4846, -1281, -4218, 2221, 4045, -3478, -3622, 4027, 2471, -3905, -2052, 4769, 477, -5781, -133, 3586, -2577, -2986, 1881, 3790, -2039, -4600, 2605]
1523B605p53p249M181N010l450m220K318O362o318n324R375J528q270J459M977
1538B231O36n517j794Q873j180r352N700N020m818k843J926N744m950n658J0183
1553D201o70r141O444J970q86k989j612P748l833o921R055K604q462K86L458K088
1569C340n372k784R533j510r005N878N370n309l383K534M339k161p092O901N015
1584F294j0013l92P305j170m608K53N354j841o974N027M782n233k072M040K699
1599C451n691k155P614j344o199K213M958p21q301M444Q390r025k547O794K60
1614B141k571l607M494N311r831L8R163l763m798K408L811l40p140L881P068q048
1630a783k260P738r18m738m16M567J270o521R16Q097m971m793M786K511l522l432
$$ y = [2605, 1852, -5397, -1216, 3794, 344, -3876, -1558, 4804, -1514, -6838, 2537, 4065, -4205, -2746, 2231, 2867, -2650, -4444, 4429, 3249, -6103, -403, 4617, -201, -3044, -1118, 4626, -324, -5982, 4201, 3531, -5610, 834, 2804, 1918, -1071, -2683, 5065, 1232, -5689, 3366, 5970, -2492, -2206, 1252, 3340, -2032, -4816, 4717, 3207, -5798, 80, 5450, 141, -3242, -708, 3631, 1470, -5622, 1279, 6294, -3719, -4111, 3194, 2024, -2584, -2331, 3023, 1182, -5792, -765, 4017, -1216, -3288, 752, 3451, -2240, -4395, 3219, 1875, -4324, -2111, 2847, 2126, -6175, -1731, 6659, -2366, -4913, 1881, 2141, -430, -4037, 457, 5768, -4063, -4025, 5138, 1375, -3423, -1015, 2796, 2456, -4684, -803, 6265, -1783, -4043, 3695, 2777, -1961, -2377, 2190, 3460, -3061, -2145, 5952, 981, -3812, 974, 3485, -37, -3469]
1646c469L600N557q062k553J0568l672o274L748L007j58o687K327Q178o709n824
1661f423Q280J332m940j372L793L768p297k429R883l460o589N684K495k930l618
1676c823L592L435m289l965O684J614o098j209Q054j878o616L052N273l777m222
1691d173L868M902o072l285P462N49n545L48M161N36n267j613R167k939q178P570
1707A491L845o504j617M199K431m538k621N852J478p451J471O461l407m220J892
1722a238M587k579n877O181M567q996M97O129k130l312k70M459J865q481K818
1737a780O837o125k728M124K506k995m651O855K234q966J597O583k845m461J427
1752b388O052k519n953M544M268m807l395N258K466n981j177N850L98n505P41
$$ y = [-3469, 131, 5688, -2374, -4927, 5641, 1969, -4305, -557, 2450, 2292, -4395, -2068, 6110, -599, -6423, 1857, 3189, -1751, -3123, 670, 4438, -2859, -5288, 4595, 1135, -5454, 230, 2725, -205, -3823, -231, 3204, -1085, -5050, 1634, 3248, -2850, -4059, 3995, 2117, -4499, -1447, 3826, 49, -4173, -305, 4597, -1475, -4760, 2702, 3251, -2294, -1946, 2215, 2751, -2516, -4129, 5038, 2099, -6079, 1491, 5336, -1168, -2785, 1414, 3845, -693, -3314, 2538, 4016, -3435, -1964, 4497, 1090, -3130, -1238, 3349, 770, -5107, 1074, 5641, -3355, -2858, 3271, 1141, -2171, -2441, 2018, 3883, -4598, -1780, 5057, -1068, -3796, 328, 2834, -161, -4812, 2043, 4277, -4689, -3092, 3491, 646, -3815, -2388, 3664, 1145, -4808, -264, 4004, -803, -4198, 1060, 3526, -2455, -3632, 2218, 2616, -2889, -2148]
1767b148O543l022o002N205L054m544k096L338M097n770k488P878j177n841J738
1782a235M526j187n318K204O166m641m619N360L402o138k093P103Lo315J285M068
1798B571J86n661p9Q251m152o281O495K184m550j890L685L225o330j808P881k096
1814A631n881L759K593j585l365J026N463l826n200O762K361p394K96O316j508
1829A448m655M83N661j379o170L904N056n411k828M637J847l973k946O283K548
1844D505q313J393P010l764l981K432L995k300m993M476M256n485k111M828J236
1859C184m753j430O116m2o554L296M570m205l272L975K567m383k549N561J928
1874D009o404m72N989o04o077J456O525l067n099L199M394m309l728N222K194
$$ y = [-2148, 4395, 1373, -4629, 576, 3630, -914, -3010, 328, 4425, -1345, -3833, 4045, 2868, -2973, -1235, 3291, 2104, -3214, -1010, 5156, 515, -4104, 1256, 4658, -1480, -3573, 3530, 3533, -2782, -1497, 2571, 2757, -2904, -2983, 5268, 1116, -5165, 1330, 3514, -1036, -2926, 759, 3984, -2346, -4154, 3727, 1631, -4250, -491, 2102, 517, -2848, -1822, 3641, -185, -5385, 1377, 3738, -3656, -3360, 2956, 1448, -3207, -2724, 2937, 1558, -4612, -708, 4348, -1063, -3891, 746, 2593, -1380, -4326, 1957, 4505, -3808, -2415, 4595, 831, -3150, -718, 3277, 977, -4016, 460, 4716, -769, -2880, 1948, 3184, -1569, -2999, 3117, 3075, -3479, -183, 4387, 182, -3090, 885, 3452, -931, -3480, 2081, 4009, -2395, -2867, 3122, 2518, -3559, -2103, 4422, 1355, -3744, -545, 3849, -460, -4188, 1034, 3228]
1889C228n240p59M532O12n044n82O210j436n971L418M639m416l295M672K392m993
1905b033j428M645J443n124j044P204k567n528M350K911k687l109J871N544m897
1920d49m851Q352M35o709J852L595Q9m416j019P163k688o030O335K148m936o14
1936a743K763J957l912k421O584J43p023K563N649l507m348L199M318l828m140
1951c746M723L008n585j274M616J133n021n77O206k026n467L684L499l518l460
1966c805M305L068n712j390O248j062m193L18L908M80n946J168O895m462m731
1981d911N488K468m039k525M723K346o018q55O103j027m415J203L943l33n854
1996c703K623N477n021k598N258M30l728q11M207R03n965J459N899m145k931L253
$$ y = [3228, -2012, -2771, 1761, 2373, -2671, -3253, 2957, 1521, -4450, -1032, 3607, -809, -4104, 568, 2960, -2033, -3461, 1184, 2627, -2497, -3541, 3663, 1096, -4432, -82, 2829, 142, -2967, -1096, 4448, -449, -5300, 3052, 3487, -3222, -1370, 2225, 2314, -2102, -3121, 4042, 1354, -4676, 1659, 3807, -1129, -1743, 1020, 2977, -935, -3356, 3228, 3371, -3652, -1089, 4560, 1053, -3295, -96, 4222, 394, -3746, 977, 3985, -1600, -2874, 1742, 2875, -2146, -2723, 3483, 1457, -4010, -326, 3173, -345, -3805, 500, 3568, -2144, -3534, 2714, 1652, -2541, -2223, 1685, 2165, -3781, -2613, 4282, -180, -4911, 577, 3045, -994, -3519, 1204, 3550, -2468, -3323, 2780, 1753, -2662, -1459, 2484, 2151, -3703, -1080, 4397, -624, -3222, 2036, 2466, -1262, -2073, 2134, 3037, -2928, -1469, 4430, 285, -2646, 607]
2012F07K628k015n131M511M801p793j032O690o30m628k15N157J33o420K170N551
2028D384l953l861L793K321l177k535M107J872m850k46M894j561m708K279M017
2043B776k920m024M456L148m923k307N061J518n181p95N608k78o197K190M883
2058C015k725l172J785M689l000m940N829K283o834R37M072l09k860j406N322
2073B686p0o678L835L955m245j746K876K592l870k693N637Q70o265J639N029j982
2089A570m120J636M737k925m522L898L496m222k812M614K381n597r24O040j493
2104A757m747K159L590k171l529K365L758l735l114N126J509n109p80M851L54
2119B284n585P20N623k312m483L198L499l663k369L437J910l280k354M963J008
$$ y = [607, 3235, 1220, -3911, 600, 5401, -2392, -3424, 3266, 2636, -1992, -2207, 2950, 3083, -3337, -1167, 4384, 431, -3430, 363, 2684, -493, -3028, 1079, 2951, -1899, -2145, 2749, 1188, -3520, -1241, 2776, -144, -4168, 288, 3436, -1487, -3794, 1267, 2785, -2396, -3191, 2417, 2139, -4058, -1868, 3015, 290, -2882, -1097, 3592, 592, -4348, 1481, 3764, -3070, -2133, 1939, 1630, -1230, -2636, 2686, 2616, -4062, -227, 3728, -517, -2263, 613, 3205, -665, -3358, 2279, 3149, -3116, -1477, 3552, 1570, -2550, -914, 3823, 898, -3624, 274, 3770, -452, -3264, 1350, 3731, -1866, -2790, 3250, 1757, -2990, -831, 2759, 588, -2941, -576, 3182, -553, -3667, 1459, 2968, -2141, -2921, 1930, 2284, -3301, -2581, 3042, 730, -3753, -555, 2944, -719, -3088, 349, 2259, -1021, -3375, 1588, 2596]
2134B596n990J204N168k289l713J958M666l467l894M925J813m405j168L891K014
2149C309n257l90O124k358m279K476L493k217l919L097M263n257k369N560N22
2164B798m294m89M365J48m724O44M980j908m577K630M145m134k682M927O40l575
2180a106j269M059Q53n579J361N085l116l836K551L691k729l401L943K697m765
2195a561j865M473J609n503k59N987j743m717K646L379k297l724L472L353n094
2210a844j138M259K38l113r55M168J044n821J762N293l833l576L812K453l328
2225e79k141L889J692m183j028N036l0n484J488M819k319l975K507M423l950l773
2241c608N270J936n229j65L737K42l797k69M580q87m685K274M082l207l299L822
$$ y = [2596, -3394, -2190, 2978, 689, -3024, -1066, 3600, 133, -3761, 1164, 2977, -1428, -2596, 1295, 3309, -1948, -2338, 3786, 1428, -2851, -375, 3118, 901, -3018, 79, 4342, -915, -3284, 2276, 2798, -1496, -1985, 2380, 2528, -2196, -1552, 3428, 1520, -3057, -427, 3718, -416, -3098, 1829, 2469, -1106, -2375, 1684, 2537, -3042, -1681, 3404, 288, -3548, -997, 2694, -35, -3436, 507, 3204, -1561, -3426, 1047, 2656, -2847, -3106, 2881, 1138, -3579, -933, 2446, 149, -3575, -103, 3250, -1844, -2982, 1277, 1515, -1598, -2553, 1615, 2659, -3162, -1400, 3893, 60, -3516, 296, 2749, -579, -2720, 1169, 2861, -1322, -2350, 2686, 2656, -2828, -1340, 3479, 1160, -2815, -308, 4115, 165, -3608, 1662, 3598, -1631, -1796, 1941, 2183, -1614, -1883, 2697, 1810, -2875, -601, 3481, 274, -3025, 797]
2257G97K566m988j314M932j31m236K91M022m62m591J590M881l320l400L233K711
2273B581l738k476M551J765n150j16N331j489m485K058L699j989l874K688L915
2288C271l918k786M445K003m382j142M813p7m412Q81L925j735l776K674L794l453
2304A25l154M322K240m984p05M559l38m324R42L728o75m215J437M932l670k943
2320b723L897J649l375j941L576J975n373l3N799k148m063K206L090j715m173
2335c352K699M085m189k624M781R86m588l10M374p21l815J194L615j674l951K993
2351d97L295l916k025L818J943l936j660N016K92n191R20M348j318m137K189L940
2367C081l533k266L497J758l279j848M066J715n992R79N212k628l160J922L442
$$ y = [797, 3363, -1625, -2939, 1993, 1862, -2374, -2083, 1939, 1477, -3114, -1524, 3357, 37, -3363, -130, 2581, -1157, -3633, 918, 2683, -2467, -2583, 2748, 1259, -3226, -1168, 2531, 542, -3332, -644, 3271, -647, -3433, 1012, 3015, -1367, -2509, 2304, 2227, -2185, -1304, 2621, 886, -2890, -216, 3578, 125, -3029, 1293, 3533, -1451, -2156, 2403, 2065, -2259, -1317, 2411, 1736, -2479, -1042, 3890, 220, -2723, 1174, 2823, -552, -2493, 1083, 3058, -2315, -2348, 3451, 1303, -2760, -554, 2536, 821, -3352, -653, 3432, -757, -3381, 1400, 2386, -2202, -2512, 1862, 1141, -2674, -1480, 2135, 461, -3490, -497, 2798, -1118, -3143, 675, 2618, -1318, -2978, 2038, 2330, -2861, -1941, 2407, 1089, -3048, -859, 3081, -452, -2718, 779, 2537, -742, -2590, 1476, 3191, -2801, -1822, 3390, 762, -2398, -476, 2966]
2382B966j962m005L364L442m890j163L811J014l824r89M683k00n093K348L945
2397C447l069l139K956K910l631k494L927J553m144l43M094j56m031N71M052j945
2413E58m058L285K928l817j663L557J559l612j993M929O02n476J078M642k130
2428C89l261J198M277k110m212M363K490m765n76L154O09k836j160M469l65m543
2444b879K400L013k344k440K515K646l760k041M959L69m691O49L988n40m118Q91
2460a383N119k783m166L814K308l460j456K471K617l637j923N104p66m203J771
2475e73L197j292l608J639L555l343k757M087J460l855l02L311K43m082N88M179
2491B447j574m217K821L530l090l298L928K321m667j144M461J19l580k31L504
$$ y = [2966, 1004, -3001, 363, 3805, -1085, -2248, 1563, 2577, -1247, -2236, 2447, 2247, -2846, -498, 3447, 378, -2761, 195, 3105, -526, -3020, 907, 2460, -1684, -2027, 2067, 1911, -2120, -1549, 2503, 558, -3500, -215, 2713, -1104, -2767, 790, 2349, -1263, -3256, 1673, 2275, -3201, -2123, 2519, 389, -2872, -1674, 2603, 493, -3719, 644, 3134, -1631, -2207, 947, 1556, -1280, -2440, 2029, 1664, -2879, -479, 2534, 190, -2250, 265, 2911, -849, -2890, 2069, 2438, -2253, -1604, 2384, 1844, -2274, -1383, 3736, 953, -3213, 601, 2909, -551, -2007, 464, 3081, -556, -2479, 2625, 1859, -2344, -573, 2624, 1332, -2276, -637, 2918, -425, -3182, 905, 2365, -1490, -1792, 1519, 1762, -2320, -1732, 2447, 873, -3344, -523, 3007, -83, -3381, 547, 2868, -1799, -2943, 1518, 1637, -1943, -2174, 1330]
2506A330M79m280Q89M437k799l045L057J800k334k333L429J877m921O32M480k262
2522D36k510J521K594p50m162K572L816l994k325M093J476l959j018M346Q6m188
2538a966J078L635j695l328K099L072k521k863L098K503l921j662M120N21m037
2553a867L91M004j134l956K110K939k831k167K830J782k627k069L762R61m719
2568b591M56M212r01l869J530L692j989l683L188K258k985k123L459J613l890
2583a623o07M157r22l281R29L599j633l306K366L280l647k081L908J471l741p22
2599a853L929N38m563M22M291j316m138K531K864k781j725K127K405l211j964
2614b444M194Q30m826J231L771j631l212J276L493k135l029L141K240l579j336
$$ y = [1330, 1809, -2471, -1582, 2855, 56, -2989, 68, 1868, -466, -2799, 630, 2507, -2414, -1782, 2698, 436, -2074, -553, 2041, 1291, -2871, -299, 3517, -477, -2802, 1291, 2767, -1192, -2210, 2136, 2222, -1966, -888, 2747, 1052, -2276, -177, 2895, 374, -2489, 609, 3112, -809, -2471, 1649, 2170, -1867, -1476, 2528, 1394, -2562, -452, 2487, -344, -2511, 319, 2101, -526, -2595, 1167, 2128, -2591, -2135, 2077, 1176, -2693, -1163, 2529, 540, -3143, 45, 2303, -682, -2805, 654, 2267, -1623, -2230, 1927, 1005, -2276, -1347, 2252, 619, -2687, -321, 2959, -688, -2769, 1139, 2610, -1131, -1853, 2076, 2614, -1949, -1527, 2764, 1448, -2690, -159, 2705, -76, -1801, 326, 2731, -480, -2444, 1750, 2580, -2246, -1015, 2756, 1125, -2087, -811, 2682, 547, -2482, 659, 2899, -680, -2016]
2629b016L019J340m140j69L934n83l827J123L837k268l159L200J913l168j449
2644b413K641J780l497j248M284J25m452J199L438j225l421K349K975l147k298
2659b910L537J216l108p92L491L90l800K45M049j073m187K455L174k965k242K991
2675D71K287l323j617L752R03l972J52L457q16l221J206L618k443k995L215K168
2691B842l424j328L455O38l473l85L236K93l898R53L873j999l295K529K256k608
2707c35k028L231J584m143l83L925p31l568J245L326j622l023J738L369k496l216
2723c127L608J601l698n06L321J27k841m00L615n50m141K098L485l250j974L012
2739C80J695k653j957L902J191m560O62L267o70l102P65L280j186l330K613K610
$$ y = [-2016, 1003, 2343, -1797, -1966, 1968, 1385, -2442, -1319, 2518, 250, -2909, 291, 2204, -964, -2413, 228, 2008, -1489, -2737, 1547, 1672, -2780, -1581, 1857, 632, -2789, -440, 2535, -612, -2910, 627, 1843, -1265, -2057, 1434, 1824, -1976, -1731, 2318, 1245, -2942, -487, 2687, -278, -2520, 471, 2758, -565, -2182, 1570, 2473, -1499, -1347, 2110, 1294, -1927, -721, 2897, 454, -2541, 674, 2842, -582, -1910, 1545, 2183, -1290, -1675, 1561, 1854, -2044, -1091, 2782, 783, -2512, 17, 2273, -335, -2363, 868, 2452, -1691, -2074, 1851, 1120, -2448, -1203, 2123, 501, -2522, -784, 2585, 89, -3127, 481, 2082, -1616, -2122, 1199, 1326, -1515, -1915, 1700, 1150, -2991, -893, 2592, -658, -2632, 380, 2075, -578, -2535, 1367, 2558, -2002, -1340, 1927, 1257, -1845, -1080, 2200, 1014, -2316, 297, 2907]
2755B907l520j544L812M30l536K77K801L16l383O44L643j511l928K681K621k786
2771g6k148L118J572l421r68L890m67l408R66K902j033l299K048K678k843k044
2787b533K834K261l919j271M038J33l835J031L046j050l015J195L505k751k468
2802b799K992J512k356j552L098R79l793j14M102j161l636K162K523j720k081
2817a844J568K766k561k653M126J002l947J15K976k09k744j64M427j952l768L102
2833B40L024l644j116K450J313k460j913L992K93l719R13L102j566k833J905J973
2849A954j816k398K845J670l777k09L335M1l330N55L153j206l160J455L203k253
2865F2k860K927K152l261j089L004M82k780q69L555J15m174J738L279k652j639
$$ y = [2907, -613, -2157, 1655, 2085, -1451, -1174, 1627, 1943, -1440, -796, 2847, 1336, -2592, 89, 2710, -76, -2224, 894, 2466, -955, -1923, 1967, 1500, -1908, -942, 1960, 927, -2372, -324, 2354, -489, -2533, 301, 2562, -1357, -2628, 1410, 1543, -2292, -1261, 1785, 735, -2280, -1085, 2420, -331, -2799, 193, 1705, -651, -2203, 895, 1874, -1919, -2033, 2069, 908, -2728, -566, 1957, 237, -1844, -276, 2490, -71, -2724, 1402, 2404, -1543, -1428, 1548, 1339, -1405, -1569, 2858, 906, -2862, 240, 3264, -380, -1496, 954, 2267, -193, -2106, 1886, 2179, -1540, -627, 2475, 909, -1924, -19, 1954, 138, -2260, 585, 2255, -1522, -1731, 1604, 1645, -1685, -1130, 2023, 817, -2343, -888, 2315, 62, -2798, 129, 2281, -980, -2069, 935, 1417, -1363, -2232, 1323, 1438, -2736, -998, 2281, -371, -2010]
2881b010J946J704j768k246K967J663m189J76L517n95k960L64L475j217l298K579
2897A08K511l356j172K711J068k495j109L269O44l981M51M114j933k338J310K308
2913B110j396k814K142K591l246q88K725K83k451m31L011p9l699J639K980k706
2929b29j829K583J382k856r51L317K52l315l37L360n0l564N29L945k069k814K514
2946a32J827k006k097K514K016l606n06L841r40k764R55K156p13k901J550L273
2962B467k408k583L568O38k947k77K566N43l103l6M241j670l415K559K077j951
2978B69k131K069K623l164k012M035P9k843p1K569K43l150O20L152j836k354K110
2995B08J716j913j618K946O28l422J20L070n68l069P83L056j095l168J851K738
$$ y = [-2010, -64, 1640, -128, -2374, 593, 2256, -1933, -1757, 1760, 1165, -1795, -1431, 2044, 827, -2471, 108, 2619, -737, -1909, 802, 1870, -625, -1734, 1535, 2179, -1802, -1351, 2763, 830, -1508, -198, 2110, 714, -2100, 42, 2633, -613, -1501, 1224, 1507, -944, -1375, 1636, 1557, -2142, -503, 2477, -229, -2058, 525, 1907, -949, -1900, 1417, 1669, -1646, -1983, 1377, 1327, -2237, -1708, 2237, 168, -2646, -132, 1695, -311, -2408, 106, 2122, -1484, -1990, 1851, 911, -1853, -898, 1258, 545, -2356, -806, 2467, 59, -2524, 1044, 1682, -1265, -1542, 1024, 1567, -1536, -1572, 2669, 999, -2416, 143, 2220, 269, -1862, 207, 2830, -334, -2346, 1689, 1768, -1075, -1146, 1423, 1666, -1484, -864, 2288, 452, -1902, 208, 1924, 11, -1607, 1339, 1967, -1455, -1335, 1735, 1167, -1902, -1119, 1937, 842, -2326, -475, 2263]
3011B263k781j841L105J123k937j339L662P6l369R41K694r81k353P49K733j748
3027ck399K905J350l545k55K995N6k562PL246o27l128J617K301k162j499J804
3044A01K201k610j694L613N45l897O75K587k07k456L44L218j128l265J562K819
3060B408k633j454K743J042k891l92K836j42l109R18K546j408k239J815K098k413
3076b75j759K568J548l111j068L242O32l708P70K964j318k501J384K159j745k217
3092b435K658J520k843r00K874L68k952M55K789p17l151J676K583k044j915J987
3108d7J774k198j682L022J038l610L44L015p78k494P17K948j409k570J931K341
3124B342k563j554K669Q67k540p77K974M81l370P82L009j884k081J812J932j697
$$ y = [2263, -518, -2359, 746, 1869, -1068, -2407, 1255, 1331, -2038, -1097, 1597, 616, -1737, -988, 1745, -3, -2402, 503, 1853, -1692, -1947, 1048, 1104, -1458, -1451, 1795, 1168, -1960, -343, 1958, -204, -1703, 101, 2302, -308, -2002, 1611, 2156, -1741, -1066, 1521, 1314, -1142, -798, 2420, 1292, -1973, -411, 2408, -225, -1679, 1064, 2106, -785, -1177, 1659, 1517, -1592, -674, 1872, 464, -1775, 40, 2138, -275, -2034, 534, 2082, -1029, -2097, 1145, 1777, -1931, -1161, 1803, 485, -2016, -632, 1527, -218, -2435, 223, 1743, -1100, -2000, 874, 1242, -1710, -1255, 1534, 817, -2334, -658, 1925, -119, -2034, -47, 1727, -471, -2153, 869, 1907, -1703, -1359, 1656, 878, -1616, -899, 2049, 640, -1930, 1, 2342, -221, -1775, 894, 1761, -779, -1556, 1418, 1899, -1471, -689, 2320, 436, -1645, 167, 2099, 402]
3140D02k235K691J156k686o37K712K27k952oL399j111l072J988K240k070j935
3156a889K167J672l007p68K405P25k588l04L055n45k901J487K156k032k041K431
3172B3J363k222j187K656Q38k654o08L016n21k779P87K959j319k689J957K492
3188B112k653j429K718Q47k415n12K359M95l258L72L327r94k969K029J878j910
3204cj710K064J583k452q35K854p5k434L19K542p84k557J077K449j446k393K677
3221H76J539l163r76K789M19k770N2K799l96k678P75K666j872k082J937J935k321
3238d71j669K797P14k752l36K994m14k764P44K567j232j990J311K200k171j684
3254b156K473R94k821MK278K53k692L83K728p36k621J598K364k081j676K263J440
$$ y = [402, -1833, 858, 2014, -672, -1309, 1403, 1630, -1322, -1328, 2071, 960, -2112, -124, 2116, 46, -1889, 278, 1950, -1057, -1825, 580, 1305, -1283, -1587, 1468, 923, -1978, -491, 1665, -367, -2408, 23, 1386, -836, -2023, 633, 1471, -1183, -1791, 1225, 704, -2075, -1288, 1671, 352, -2337, -380, 2112, -541, -1970, 748, 1595, -820, -1332, 1027, 1522, -1736, -1364, 1963, 969, -2000, 29, 1907, -3, -1713, 351, 1934, -518, -1353, 1501, 1426, -1008, -689, 1853, 1069, -1488, -411, 2038, 592, -1801, 876, 2415, -748, -1724, 1065, 1484, -1286, -1234, 1565, 1169, -1509, -734, 1932, 60, -2022, -85, 1850, -471, -2140, 657, 1371, -1381, -1717, 1277, 863, -1901, -1157, 1410, 178, -1812, -501, 1699, -472, -2156, 317, 1311, -1510, -1506, 772, 1025, -1667, -1284, 1444, 708, -1913, -315, 2049, -32, -1708, 555, 1995]
3271A995k404j433L002M85l054O08K595j134j914O76K028n86k855K381J770k814
3287f54p91K582L01k489k38L006l58k953R70K426j378k141J627J895k047j714
3303a956K773J016k618p09K792j18k758P57K189r30k185J313K326j995j903K333
3319C27J430k688q77K643P00l006Q5K739r03k195J142K067j568j626J589J585
3335A444k195j022K213J050k945J13L169r36k818J618K012j588j990J857K170
3350B152k369j367K565O32k280o47K414M70l193R39K931j798j976J751J526j682
3366F8j567K139J435k804n42K644j18k675N54K306m24k749J649K035k310j465
3382a824K114J176k166j107K904L36k791J51K668j017k148R63K402j351k190J704
$$ y = [1995, -409, -1842, 1160, 1645, -1409, -801, 1794, 660, -1254, -578, 1450, 864, -1991, 390, 2160, -654, -1445, 1137, 1438, -1051, -1289, 1717, 1359, -1594, -624, 1802, 424, -1717, -90, 1805, -242, -1956, 817, 1833, -785, -1494, 1298, 1180, -1578, -821, 1368, 438, -1747, -434, 1892, -103, -2006, 327, 1757, -931, -1808, 835, 1535, -1471, -1386, 1353, 450, -1745, -603, 1464, -104, -1730, -141, 1444, -751, -1773, 440, 1490, -1455, -1342, 1827, 891, -1927, -309, 1703, 115, -1875, -18, 2152, -217, -1584, 981, 1613, -667, -1314, 1100, 1570, -1623, -684, 2247, 449, -1527, 224, 1750, 68, -1499, 640, 2075, -729, -1271, 1373, 1255, -1420, -866, 1440, 1016, -1733, -84, 1951, -359, -1824, 290, 1466, -700, -1807, 1097, 1433, -1358, -1207, 1461, 444, -1704, -741, 1661, 310, -1880, -176]
3398a76J568k279o05J995L54j882l36K783m55l137J583K404j866k007K084J782
3414A810k365j307K651J039k927k31K096O83k863K35L030r32k583J719J602j908
3430b51r33J568J270k146q64K752M8k774O97J670j07k507J397K373k168j932K906
3447I99Q29k800k77J993P77k722k00L167r10k582J455J671q98k529J975J781k419
3464f90j267K713J98k239m3K000J55k254N07K333j209k075J562J731k034j441
3480b053K685P21k804J22K535n54k137O52K380j050k390J347K754k467j417K181
3496E05Q30j647j146K448O60k973O86K132j069j569Q55K028j304k264K553J169
3512A894k538r11K551P23k653p6K565r6k826R26K201j572j577J419J779j948j535
$$ y = [-176, 1392, -887, -1492, 503, 857, -1025, -1361, 1422, 967, -2170, -587, 1817, -49, -2056, 28, 1810, -555, -1862, 789, 1828, -1099, -1330, 766, 1449, -1414, -1179, 1851, 919, -1664, 55, 1657, -251, -1184, 384, 1654, -492, -1356, 1396, 1444, -1330, -633, 1037, 930, -1577, -180, 2193, 25, -1907, 999, 1828, -972, -1249, 744, 1521, -1201, -1401, 1766, 856, -1726, -271, 1400, 502, -2027, -52, 1729, -690, -1957, 756, 954, -1285, -1328, 672, 827, -1427, -920, 1413, 204, -1871, -309, 1422, -612, -2053, 632, 1353, -1451, -1329, 1206, 652, -1485, -833, 1547, 497, -1893, -546, 2208, -259, -1676, 505, 1335, -312, -1458, 990, 1650, -1323, -637, 1495, 426, -1143, -288, 1740, 436, -1828, 725, 1894, -644, -1555, 996, 1719, -934, -1010, 1555, 1459, -1367, -441, 1760, 188, -1389, 30, 1809, -139, -1674]
3529a674K761N36k841K65J986k14k321O96K268p32k607J535K005k107j369J967
3545A54J137k227q21K825l35k398Q52K034o52k436J364K237k235j454K318J130
3561A493k250j089K889N09k784M1K464n47j828O96J624p04j990J521J552k022
3577d25j309K888L66k498Q1K444m38k515J112K256j499j704J499J289j557j283
3593a293J828J217k582o97L267o46k501J122J925j081j944J332J823k335j000
3608a565K236Q48k139j104K640N74k749J51K345q70k262J534J513j470j553K177
3624C06Q16j919m03J809O92k396q5K306k79k714J517K287j751j741J760J299j753
3641b49j487K804K44k760L03K350P4k651J078J856m54l041J782K071k274l76J296
$$ y = [-1674, 1087, 1623, -1218, -953, 1033, 819, -1502, -806, 1462, 730, -1877, -342, 1663, -444, -1813, 154, 1291, -936, -1757, 1068, 733, -1665, -813, 1221, 569, -1867, -503, 1734, -501, -1955, 363, 1493, -757, -1846, 1043, 1552, -1232, -1191, 1273, 726, -1102, -406, 1218, 514, -1476, 45, 1597, -425, -1734, 1154, 1520, -978, -897, 1547, 1109, -1406, -294, 1962, 463, -1241, 258, 1547, -10, -1293, 535, 1752, -830, -1527, 1740, 1094, -1407, -285, 1640, 559, -1385, -53, 1770, -565, -1565, 671, 1519, -620, -1724, 916, 1490, -1259, -1108, 1237, 367, -1895, -361, 1152, -318, -1871, 306, 1122, -797, -1200, 609, 1301, -1095, -1180, 1126, 847, -1867, -350, 1937, 186, -1555, 205, 1504, -249, -1736, 1068, 1312, -1448, -1145, 1205, 1279, -1372, -294, 1562, 1108, -1933, -151, 1920, -354, -730, 566]
3658E66J458k371q65K487K10k493J12K415o67k506J633J862j895j371K075O58
3674A308j882q28K344K56k520J75K490o23k361J209K047j681j546K020J015k184
3690g61m01J827N94k487j40K417m54k014O67K200j342j921K044J175j911p93J906
3707F06M89k325j84K477j87k211M49K369r68k027J251J936k103j067K183Q14k374
3724h72j03K035L1k316L99K083j45k531J332J991j873j344J791J164j942r76K349
3741A073L00k376M51J735m16k015O77K251j407j960J827J456k149r07K375M19
3757A334k493k41K653n84j971N96J866j192j737J708J448k145r86K210R57k236
3773h13o26K227rk458Q54J888n23j912R27J823j520j649J974J197k232l20J946
$$ y = [566, 2024, -347, -1212, 1275, 1485, -1008, -896, 1519, 852, -1654, -21, 1841, -54, -1425, 650, 1308, -574, -1402, 942, 1198, -1322, -1147, 1343, 720, -1641, -432, 1615, -66, -1612, 408, 1423, -761, -1162, 665, 1259, -1228, -1368, 1049, 595, -1419, -752, 1448, 106, -1815, 229, 1404, -507, -1300, 606, 1095, -1230, -1414, 1063, 876, -1335, -886, 1483, 515, -1512, -261, 1675, -428, -1495, 688, 1502, -872, -975, 1060, 1091, -1225, -826, 1257, 1112, -1419, -87, 1904, 31, -1313, 478, 1642, -300, -1276, 1073, 1373, -1003, -552, 1183, 767, -1248, -571, 1680, 273, -1687, 140, 1596, -553, -1460, 915, 1334, -1159, -1400, 1253, 669, -1302, -706, 1160, -32, -1769, -61, 1387, -758, -1744, 466, 1423, -813, -1439, 788, 779, -1679, -825, 1063, 540, -1372, -445, 1378, -142, -1791, 183, 1380, -852, -1172, 774]
3790G74M20k387L90K096r66j701R23J838j124j717J695J405j869j121K378K60
3806A294k369K93J935j59k133R81J785j443j556J717R96j561j167K116P07k233
3822g97m26K487k06k474R01J783r52j617J164J696j586j380J838N16j680n50J773
3839D90N02k224M72K107j039k034J633J000j150j342J754J291k454n01K365n8
3855H12k013K74K055l37k541J219K222j934j071J165J503j566j198J922R11k320
3871h97J48J991k95k407Q06J889r11j753J352J727j680r35J681M43j855l40K098
3888A062O7k393Q85K134j506j630J253J750j471j580K049Q71k332k29J923K23
3904A076j828j32J799o5k381J126J810j718q67R38J320j444j085K423l35j870
$$ y = [774, 1194, -1193, -803, 1293, 327, -1374, -451, 1387, 263, -1454, 241, 1646, -223, -1344, 1034, 1294, -1075, -782, 1153, 994, -1139, -158, 1627, 184, -1372, 345, 1341, -220, -1387, 729, 1436, -797, -1223, 1264, 1058, -1416, -515, 1268, 316, -1301, -137, 1559, -27, -1407, 431, 947, -733, -1283, 490, 992, -1232, -760, 1347, 308, -1726, -93, 907, -243, -1585, 169, 1460, -994, -1495, 870, 812, -1201, -927, 1128, 791, -1750, -531, 1691, -243, -1314, -149, 1354, -212, -1410, 512, 1423, -897, -749, 1242, 947, -1460, -654, 1235, 324, -1429, -77, 1650, -30, -965, 716, 1159, -696, -1036, 1062, 1129, -1264, -379, 1755, 249, -1381, -128, 1622, 151, -1429, 620, 1491, -841, -1070, 853, 1076, -752, -884, 915, 850, -1531, -405, 1405, -313, -1180, -242, 1078, -366, -1451, 972, 637, -1233]
3920a233M27J386q6k020P27K262j290k007K057Q68j830m34J396J109j877q16K434
3937A073m16k099Q86J895q73j980J345J526j634j285K523M10k058j51J657n9j859
3954a099K54K263j033j604J737J137j813j068J779J242k144j84J624M34k551J87
3970h39K118n00k132J084J775j310j600J648R64j438j038J858M43k029K0K088
3986A112n87j675Q28J296o12j972J761J448k236p17J844L49j768k49J781L28k459
4003a528P40K044j264j289J070J293j175j488J944P87k234N7K035m37j656M77
4019f24J893m12k143J023J553j310j127J301J126j787p05K111K32k310N55J764
4035A140o81j720J045J716j278j687J938J005j583j099K087L07j885l65K027M7
$$ y = [-1233, -806, 580, 494, -1526, -799, 1463, 173, -1834, 223, 1091, -739, -1173, 223, 1332, -545, -1361, 1073, 657, -1442, -556, 1339, 466, -1514, -169, 1357, -277, -1562, 961, 1371, -687, -838, 819, 760, -1099, -845, 1418, 385, -1219, 518, 1655, -158, -1226, 553, 1795, -349, -533, 1091, 1525, -1026, -839, 1279, 779, -1353, -269, 1506, 196, -1404, 244, 1208, -230, -1268, 590, 1033, -996, -976, 1112, 525, -1150, -322, 974, 362, -1610, 151, 1599, -637, -1354, 490, 839, -929, -1178, 603, 931, -1528, -788, 1256, -8, -1297, -227, 1066, -109, -1597, 347, 1134, -1100, -1043, 992, 555, -1101, -624, 1269, 857, -1286, -263, 1290, -20, -1147, 154, 1280, -507, -1212, 899, 1131, -1179, -624, 1140, 459, -1261, -216, 1500, 222, -1465, 473, 1478, -105, -1204, 883, 1190, -695, -1060, 967, 1014]
4051A014k169P97J647r78j431R69J657j813j240J964P20k079r7K040j30k168M57
4068h40K072j172j479J355J192j299j552J773J381k151o78K097l1j819K49J689
4084G87l69j671Q07J755j409j416J609Q61j335q13J904O69k235l37K508n23k035
4101a243J021J338j019j005J056J206j624p32J740P48k058n14K341l97k035O95
4117d82J685n23j847J257J130j273j256J719R92j896n21K053k2k134K45K175r62
4134C40j490J210J180j341j336J636R74j634p97J739M64k021J34J811l79j709
4150a219P07J423r86j238J470R52j521p46J845K91j805l42K101l86j916N17J884
4167A031p59j561J499R51j529j019K338O9k034K39J817l42j406l4K139q17j786
$$ y = [1014, -1155, -358, 1289, 311, -1120, -151, 1506, -307, -1547, 417, 1137, -942, -1039, 1001, 871, -1297, -840, 1232, 60, -1419, -64, 1128, -171, -1723, 50, 1431, -720, -1398, 699, 668, -1151, -902, 787, 418, -1253, -446, 1309, -100, -1516, 93, 954, -381, -1194, 710, 1379, -856, -1193, 1315, 792, -1243, -222, 1116, 97, -908, 148, 1354, -270, -1002, 738, 1486, -572, -1086, 1255, 858, -1177, -482, 1203, 680, -1167, 90, 1220, -53, -1309, 410, 1402, -494, -1015, 1038, 1016, -1118, -873, 1302, 340, -1150, 60, 1240, -101, -1437, 199, 1173, -461, -1258, 481, 945, -1076, -942, 869, 490, -1219, -512, 911, -75, -1313, 157, 1109, -412, -1158, 687, 978, -827, -1169, 932, 546, -1370, -853, 1031, 272, -1289, 210, 1161, -368, -1387, 951, 1020, -1014, -775, 1042, 700, -706, -740, 1399, 582, -1204]
4184a204J247J583j583j186J712Q20j817m79J745L9j679K03J982r26j638J068
4200a13J512j294j483J806Q89j899m55J726Q3j697k6J938l19j731N05J603q35
4217B10j663J241J333j742q97K067L91j707l82J874j65j979N31K001q23j608J190
4234a28J335j525j075J715N45j622k43J727k29j116j56J542j81j699R96J459j312
4251C3j156J421J151j523j004K235Q6j984K87J546k12j985Q98J378o86j578J309
4268B16J053j729n65J941K80j930J51J519k79j793Q92J536r23j499J006J508j876
4285d92o80J420P87j784n83J914J63j611K60J587r58j084R75J217j237j077J311
4302A28Q72j802l27J745J28j767K78J677n14j528N04J887j225j359J090J127j172
$$ y = [-1204, 43, 1626, 43, -1143, 569, 1389, -428, -907, 838, 877, -802, -599, 1383, 457, -1181, -113, 1399, 105, -1378, 428, 1317, -582, -1037, 689, 772, -925, -951, 987, 668, -1063, -558, 1045, 210, -1453, -212, 1121, -621, -1518, 549, 940, -767, -1149, 725, 560, -1419, -888, 1113, 290, -1318, -128, 1207, -318, -1393, 322, 867, -755, -998, 729, 500, -616, -772, 770, 589, -1110, -114, 1345, 33, -1123, 298, 1449, -74, -1078, 1157, 1243, -741, -454, 1092, 880, -1105, -207, 1171, 485, -1093, 216, 1269, -460, -1025, 916, 1196, -734, -583, 936, 657, -1136, -244, 1292, 369, -1130, -124, 1384, -492, -1172, 248, 1035, -749, -1332, 582, 745, -866, -606, 981, 23, -1061, -86, 1131, -106, -1183, 128, 1000, -802, -1129, 616, 744, -1023, -745, 932, 418, -1110, -606, 1281, 56, -1303, -213, 914, -258]
4319b58o19J322P38k154J34K030q14j343J106R79o72j314J218Q98j519q72K019
4336H79K29j804j47J882J9j863M70J707j131j359J222J248j429j168J704Q07k065
4353g99n7J892l18j473K09J403m18j715J077J360j478p32J316Q34j683o85J895
4370F28J66k047O61J463p04j382P55J546j081j371J428J097j600p15J375O90j566
4387f57k86J836j80j714R47J174j390p42R82R81j332o49J838K26j769J35J338
4404G38N7j575o8K178n98k171J562J547j792r42J388O31j294m01J518K90j956
4421h88M82J509n19j762J150J247j090j055J359L26j203n50J460N43j858l4J916
4438A033r32j199R15J054o76j691J576R11j611p47J642N24j734J71J376J25j867
$$ y = [-258, -877, 445, 1183, -971, -837, 1193, 379, -964, 142, 1121, 449, -865, 353, 1251, -268, -1140, 879, 1108, -696, -843, 1039, 1058, -805, -335, 1372, 241, -1118, 104, 1352, -77, -1245, 459, 1266, -799, -856, 1036, 718, -755, -546, 857, 439, -1276, -199, 1161, -317, -1049, 267, 1101, -582, -1267, 628, 794, -1253, -592, 871, 167, -1215, -460, 1086, 5, -1366, 62, 1159, -441, -1156, 219, 909, -657, -943, 893, 713, -1001, -54, 1120, -270, -1012, -30, 951, -381, -1030, 808, 1034, -735, -600, 738, 795, -780, -848, 1330, 732, -1439, 123, 1670, -122, -1064, 324, 955, -339, -740, 778, 1068, -888, -406, 1103, 584, -1178, -28, 1219, 129, -926, 433, 759, -444, -994, 466, 1009, -849, -883, 1033, 101, -1098, -183, 871, 195, -1496, 80, 991, -620, -1367, 275, 799, -935, -764, 612, 737, -1130]
4455a130L92J756r55j476J599R25j421n38J237P07j988N4J521r7j400K73J443
4472I02l53j633R25J499j399r71J387N57j475m81J918l3j542O3J669m85j553P87
4490b18J060m19j284J090R97j834l50J787J52j503o3J350Mj715O14J491r86j167
4508i94Q73J201j320o94J374M84j841N5J456l28j166M1J902p62j388Q26J307j425
$$ y = [-1130, -738, 1018, 63, -1413, 186, 1111, -310, -848, 389, 1096, -892, -838, 683, 586, -814, -541, 902, 549, -1084, -159, 1340, -59, -1030, 357, 914, -561, -1042, 876, 843, -699, -636, 1033, 548, -1005, -218, 842, 423, -861, 229, 1226, -608, -958, 829, 981, -522, -585, 765, 769, -946, -332, 1159, 173, -994, -121, 1080, -240, -934, 440, 924, -917, -862, 594, 266, -900, -859, 1043, 281, -1107, -281, 1026, -399]
$$ [...]
8191i4
##END NTUPLES=NMR FID
##END=
