##TITLE=1H_SAV32-singlet-bat25
 CDCl3, 8 sc, 
 26.11.2020
##JCAMPDX= 6.0         $$ Bruker NMR JCAMP-DX V2.0
##DATA TYPE= NMR FID
##DATA CLASS= NTUPLES
##ORIGIN= UXNMR, Bruker Analytische Messtechnik GmbH
##OWNER= root
$$ XWIN-NMR		Version 3.5
$$ Thu Nov 26 11:35:31 2020 Russian Standard Time (UT+4h)  she@DPX200
##.OBSERVE FREQUENCY= 200.1315066352
##.OBSERVE NUCLEUS= ^1H
##.DELAY= (6, 6)
##.ACQUISITION MODE= SIMULTANEOUS
##.ACQUISITION SCHEME= undefined
##.AVERAGES= 8
##.DIGITISER RES= 18
##SPECTROMETER/DATA SYSTEM= spect
##.PULSE SEQUENCE= zg30
##.SOLVENT NAME= CDCl3
##.SHIFT REFERENCE= (INTERNAL, CDCl3, 0, 15.7039)
##AUDIT TRAIL= $$ (NUMBER, WHEN, WHO, WHERE, WHAT)
$$ ##TITLE= Audit trail, XWIN-NMR		Version 3.5
$$ ##JCAMPDX= 5.01
$$ ##ORIGIN= Bruker BioSpin GmbH
$$ ##OWNER= she
$$ F:/spectra/data/she/nmr/H-F/1/audita.txt
$$ ##AUDIT TRAIL=  $$ (NUMBER, WHEN, WHO, WHERE, WHAT)
(   1,<2020-11-26 11:34:15.62 +0400>,<she>,<DPX200>,
      <created by zg, POWCHK disabled, PULCHK disabled
       configuration hash MD5:
       00 E9 B6 7A A2 85 ED C7 34 08 36 98 17 FE 4E 26
       data hash MD5: 16K
       FA C6 FA A4 0D 9C B8 08 53 42 B3 75 CF 9C BB 94>)
$$ ##END=
$$ 
$$ hash MD5
$$ D8 9F EF F1 B3 60 DE E9 03 8A 1B 5E D0 EB AB 04
##$RELAX= 
##$RELAX= 
##$RELAX= 
##$RELAX= 
##$RELAX= 
##$RELAX= 
$$ Bruker specific parameters
$$ --------------------------
##$DU= <F:/spectra>
##$EXPNO= 1
##$NAME= <H-F>
##$PROCNO= 1
##$TYPE= <nmr>
##$USER= <she>
##$AMP= (0..31)
100 100 100 100 100 100 100 100 100 100 100 100 100 100 100 100 100 100 
100 100 100 100 100 100 100 100 100 100 100 100 100 100 
##$AQSEQ= 0
##$AQ_mod= 1
##$AUNM= <au_zg>
##$AUTOPOS= <>
##$BF1= 200.13
##$BF2= 200.13
##$BF3= 200.13
##$BF4= 200.13
##$BF5= 200.13
##$BF6= 200.13
##$BF7= 200.13
##$BF8= 200.13
##$BYTORDA= 1
##$CFDGTYP= 0
##$CFRGTYP= 5
##$CHEMSTR= <none>
##$CNST= (0..31)
1 1 145 1 1 1 1 1 1 1 1 1 1 1 1 1 1 1 1 1 1 1 1 1 1 1 1 1 1 1 1 1 
##$CPDPRG= <>
##$CPDPRG1= <>
##$CPDPRG2= <>
##$CPDPRG3= <>
##$CPDPRG4= <mlev>
##$CPDPRG5= <mlev>
##$CPDPRG6= <mlev>
##$CPDPRG7= <mlev>
##$CPDPRG8= <mlev>
##$CPDPRGB= <>
##$CPDPRGT= <>
##$D= (0..31)
0 1.2 0 0 0 0 0 0 0 0.06 0 0.03 0 0 0 0 0.0002 0 0 0 0 0 0 0 0 0 0 0 0 
0 0 0 
##$DATE= 1606376055
##$DBL= (0..7)
120 120 120 120 120 120 120 120 
##$DBP= (0..7)
150 150 150 150 150 150 150 150 
##$DBP07= 0
##$DBPNAM0= <>
##$DBPNAM1= <>
##$DBPNAM2= <>
##$DBPNAM3= <>
##$DBPNAM4= <>
##$DBPNAM5= <>
##$DBPNAM6= <>
##$DBPNAM7= <>
##$DBPOAL= (0..7)
0.5 0.5 0.5 0.5 0.5 0.5 0.5 0.5 
##$DBPOFFS= (0..7)
0 0 0 0 0 0 0 0 
##$DE= 6
##$DECBNUC= <off>
##$DECIM= 32
##$DECNUC= <off>
##$DECSTAT= 4
##$DIGMOD= 1
##$DIGTYP= 9
##$DL= (0..7)
0 120 120 120 120 120 120 120 
##$DP= (0..7)
150 150 150 150 150 150 150 150 
##$DP07= 0
##$DPNAME0= <>
##$DPNAME1= <>
##$DPNAME2= <>
##$DPNAME3= <>
##$DPNAME4= <>
##$DPNAME5= <>
##$DPNAME6= <>
##$DPNAME7= <>
##$DPOAL= (0..7)
0.5 0.5 0.5 0.5 0.5 0.5 0.5 0.5 
##$DPOFFS= (0..7)
0 0 0 0 0 0 0 0 
##$DQDMODE= 0
##$DR= 18
##$DS= 0
$$ [...]
##$SUBNAM2= <"">
##$SUBNAM3= <"">
##$SUBNAM4= <"">
##$SUBNAM5= <"">
##$SUBNAM6= <"">
##$SUBNAM7= <"">
##$SUBNAM8= <"">
##$SUBNAM9= <"">
##$SW= 16.9725356469052
##$SWIBOX= (0..15)
0 0 2 0 0 0 0 0 0 0 0 0 0 0 0 0 
##$SW_h= 3396.73913043478
##$TD= 16384
##$TD0= 1
##$TE= 0
##$TE2= 300
##$TE3= 300
##$TEG= 300
##$TL= (0..7)
0 120 120 120 120 120 120 120 
##$TP= (0..7)
150 150 150 150 150 150 150 150 
##$TP07= 0
##$TPNAME0= <>
##$TPNAME1= <>
##$TPNAME2= <>
##$TPNAME3= <>
##$TPNAME4= <>
##$TPNAME5= <>
##$TPNAME6= <>
##$TPNAME7= <>
##$TPOAL= (0..7)
0.5 0.5 0.5 0.5 0.5 0.5 0.5 0.5 
##$TPOFFS= (0..7)
0 0 0 0 0 0 0 0 
##$TUNHIN= 0
##$TUNHOUT= 0
##$TUNXOUT= 0
##$USERA1= <user>
##$USERA2= <user>
##$USERA3= <user>
##$USERA4= <user>
##$USERA5= <user>
##$V9= 5
##$VALIST= <valist>
##$VCLIST= <CCCCCCCCCCCCCCC>
##$VD= 0
##$VDLIST= <DDDDDDDDDDDDDDD>
##$VPLIST= <PPPPPPPPPPPPPPP>
##$VTLIST= <TTTTTTTTTTTTTTT>
##$WBST= 1024
##$WBSW= 4
##$XGAIN= (0..3)
0 0 0 0 
##$XL= 0
##$YL= 0
##$YMAX_a= 507542
##$YMIN_a= -465513
##$ZGOPTNS= <>
##$ZL1= 120
##$ZL2= 120
##$ZL3= 120
##$ZL4= 120
##$ABSF1= 10
##$ABSF2= 0
##$ABSG= 5
##$ABSL= 3
##$ALPHA= 0
##$AQORDER= 0
##$ASSFAC= 0
##$ASSFACI= 0
##$ASSFACX= 0
##$ASSWID= 0
##$AUNMP= <proc_1d>
##$AZFE= 0.1
##$AZFW= 0.1
##$BCFW= 1
##$BC_mod= 2
##$BYTORDP= 1
##$COROFFS= 0
##$CY= 11.3945322036743
##$DATMOD= 1
##$DC= 2
##$DFILT= <>
##$DTYPP= 0
##$F1P= 15.9154993809931
##$F2P= -4.1035820241983
##$FCOR= 0.5
##$FTSIZE= 0
##$FT_mod= 4
##$GAMMA= 1
##$GB= 0.15
##$INTBC= 1
##$INTSCL= 1
##$ISEN= 128
##$LB= 0.24
##$LEV0= 0
##$LPBIN= 0
##$MAXI= 10000
##$MC2= 0
##$MEAN= 0
##$ME_mod= 0
##$MI= 1.114404
##$NCOEF= 0
##$NC_proc= 0
##$NLEV= 6
##$NOISF1= 3.799351
##$NOISF2= 2.8
##$NSP= 1
##$NTH_PI= 0
##$NZP= 0
##$OFFSET= 15.70392
##$PC= 1
##$PHC0= -11054.63
##$PHC1= 18.80088
##$PH_mod= 1
##$PKNL= yes
##$PPARMOD= 0
##$PSCAL= 0
##$PSIGN= 0
##$REVERSE= no
##$SF= 200.130013532006
##$SI= 16384
##$SIGF1= 3
##$SIGF2= 2
##$SINO= 400
##$SIOLD= 16384
##$SREGLST= <1H.CDCl3>
##$SSB= 0
##$STSI= 0
##$STSR= 0
##$SW_p= 3612.71676300578
##$SYMM= 0
##$S_DEV= 0
##$TDeff= 0
##$TDoff= 0
##$TI= <>
##$TILT= no
##$TM1= 0
##$TM2= 0
##$TOPLEV= 0
##$USERP1= <user>
##$USERP2= <user>
##$USERP3= <user>
##$USERP4= <user>
##$USERP5= <user>
##$WDW= 1
##$XDIM= 8192
##$YMAX_p= 0
##$YMIN_p= 0
$$ End of Bruker specific parameters
$$ ---------------------------------
##NTUPLES= NMR FID
##VAR_NAME=  TIME,          FID/REAL,        FID/IMAG
##SYMBOL=    X,             R,               I
##VAR_TYPE=  INDEPENDENT,   DEPENDENT,       DEPENDENT
##VAR_FORM=  AFFN,          ASDF,            ASDF
##VAR_DIM=   8192,          8192,            8192
##UNITS=     SECONDS,       ARBITRARY UNITS, ARBITRARY UNITS
##FACTOR=    0.0002944,     1,               1
##FIRST=     0,             0,               0
##LAST=      2.4114304,     0,               0
##MIN=       0,             -465513,         0
##MAX=       2.4114304,     507542,          0
$$ Real data points
##PAGE= N=1
##DATA TABLE= (X++(R..R)), XYDATA
$$ [...]
$$ plain form
3409 3749 3012 -3680 -1703 3549 348 -3462 728 2796 -2503 -3208 2826 2122 -4445 -2444 4665 1143
3425 1143 -5878 -1963 5256 31 -6368 -593 4747 -1052 -5087 774 3229 -2605 -3222 2428 1360
3440 1360 -3799 -876 3579 -954 -4467 1467 4302 -2687 -4585 3014 4628 -3720 -3960 4123 3756
3455 3756 -4119 -2786 4475 2176 -3704 -520 4228 -208 -2787 2355 3279 -2465 -1391 4341 2158
3470 2158 -4199 -578 5921 649 -5328 709 6099 -24 -5239 1353 5163 -1143 -3914 2349 3567
3485 3567 -2660 -1620 2883 707 -3227 312 3506 -2074 -3961 2826 4050 -3892 -4469 3667 3309
3500 3309 -5155 -3861 4141 1919 -5061 -2157 3796 323 -4375 -234 2544 -2037 -2785 1660 997
3515 997 -3776 -1583 4378 527 -5934 -20 4911 -427 -5684 461 6149 -664 -4331 1808 4538
$$ packed form
3409C749p37o692J977N252l201l810M190K068n299p05O034p04o567K001P109l522
3425A143p021L915P219n225o399N775N340n799m035N861K455n834o17N650j068
3440A360n159K923M455m533l513N934K835o989j898P599J614q348k40Q083l67
3455C756p875J333P261k299n880L184M748m436k579N142R24n744J074N732k183
3470B158o357L621O499n272n977O037N390o123n215O592L810o306k771O263J218
3485C567o227J040M503k176l934L539L194n580j887O787J224p942n77Q136l58
3500C309q464J294Q002k222o980K904N953l473m698M141K778m581p48M445o63
3515I97m773K193N961l851o461N914M931n338n257O145N688o813l667O139K730
$$ plain form
3530 4538 -1918 -2572 2777 2384 -2245 -367 3309 -54 -2930 2268 3843 -2536 -3119 4086 4253 -3566
3546 -3566 -3205 5202 4016 -4571 -1736 4945 2181 -3809 -386 4024 167 -2913 1097 2468 -2807
3561 -2807 -1595 3553 448 -4675 -598 4644 -245 -5521 230 5259 -1189 -6042 789 4385 -2308
3576 -2308 -5070 951 2763 -3129 -2801 2071 -314 -3410 -99 3000 -2388 -3486 2242 2711 -3637
3591 -3637 -3784 3350 2657 -5052 -2895 4606 2351 -4869 -1789 4273 732 -4205 592 3611 -1363
3606 -1363 -2010 2574 2254 -2466 -919 3915 575 -4062 779 5516 -262 -4869 1856 5701 -1322
3621 -1322 -4359 2927 4523 -2290 -2815 3463 2654 -2630 -584 3346 164 -2888 1624 3226 -2224
3636 -2224 -3119 2981 2743 -4246 -2594 4713 1954 -5270 -2161 4519 805 -5100 -870 3658 -909
$$ packed form
3530D538o456o54N349l93m629J878L676l363k876N198J575o379n83P205J67p819
3546c566L61Q407j186q587K835O681k764n990L423M410l857l080M010J371n275
3561b807J212N148l105n123M077N242m889n276N751N029o448m853O831L596o693
3576b308k762O021J812n892L28M872k385l096L311L099n388j098N728M69o348
3591c637j47P134o93p709K157P501k255p220L080O062l541m937M797L019m974
3606a363o47M584l20m720J547M834l340m637M841M737n778m607O725L845p023
3621a322l037P286J596o813n25O278q09n284K046L930l182l052M512J602n450
3636b224q95O100k38o989J652P307k759p224L109O680l714n905M230M528m567
$$ plain form
3651 -909 -4251 628 2461 -2190 -2646 2097 866 -4023 -774 3643 -882 -4961 980 4319 -2183
3666 -2183 -5200 2243 4148 -2984 -4298 2865 3206 -3104 -2346 3354 1683 -3141 -322 3112 -731
3681 -731 -2500 2201 2951 -2917 -2037 4275 2356 -4240 -1277 5426 1648 -4479 -132 5605 870 -4298
3697 -4298 508 4352 -572 -2524 1899 2357 -1723 -1046 3212 486 -3233 1129 4188 -1700 -4551
3712 -4551 2223 4483 -2820 -4841 3221 3922 -3763 -3771 3100 2329 -3710 -1964 2665 105 -3203 85
3728 85 1843 -2295 -2757 2394 1531 -4366 -1771 3989 921 -5253 -1161 4751 622 -4936 -776 4119
3744 4119 -609 -3886 802 2806 -1434 -2244 1800 1068 -2709 -96 3374 -518 -3515 2016 4266
3759 4266 -2333 -3905 3298 4656 -2940 -3528 3843 3740 -2698 -2101 3735 2166 -2497 -240 3260 -56
$$ packed form
3651i09l342M879J833m651m56M743j231m889L249M417m525m079N941L339o502
3666b183l017P443J905p132j314P163L41o310P58N700j671m824K819L434l843
3681g31j769M701P50n868Q80O312j919o596K963O703l778o127M347N737m735n168
3697d298M806L844m924j952M423M58m080O77M258k726l719M362L059n888k851
3712d551O774K260p303k021Q062P01p685qO871p71o039J746M629k560l308L288
3728H5J758m138m62N151q63n897K595N760l068o174M092N912m129n558M160M895
3744D119m728l277M688K004m240q10M044p32l777K613L470l892k997N531K250
3759D266o599j572P203J358p596n88P371j03o438N97N836j569m663K257L500l316
$$ plain form
3775 -56 -2048 2058 2455 -2273 -1227 3688 1659 -4167 -967 4795 570 -4894 -150 4711 -39 -4568
3791 -4568 314 3759 -1221 -3664 1010 1979 -2525 -1623 2314 -137 -3454 287 2880 -1922 -4190
3806 -4190 1828 3259 -3514 -3965 2965 2755 -4014 -3239 3302 2035 -3805 -1911 3272 131 -3281 251
3822 251 2416 -1447 -2019 2234 1816 -3187 -1270 4121 939 -4197 -43 4910 264 -4758 1125 4727
3838 4727 -649 -3823 1843 3791 -1712 -1819 2540 2086 -1758 -493 2602 221 -2701 1908 3707
3853 3707 -1849 -2908 3144 3404 -3042 -2996 3782 2666 -4078 -1935 4138 1381 -3808 -837 3270 -359
3869 -359 -3259 869 1950 -2218 -2166 2452 882 -4208 -914 3490 -689 -4921 -18 4315 -1565 -4842
3885 -4842 997 3922 -2139 -4232 1319 2782 -2417 -2183 2085 1101 -3090 327 2563 -1349 -2510
$$ packed form
3775e6j992M106L97m728J046M915k029n826L200N762m225n464M744M861m750m529
3791d568M882L445m980k443M674R69m504R02L937k451l317L741K593m802k268
3806d190O018J431o773m51O930k10o769P75O541j267n840J894N183l141l412L532
3822B51K165l863n72M253m18n003J917N391l182n136M154M953m646n022N883L602
3838D727n376l174N666J948n503j07M359m54l844J265L095k381k922M609J799
3853C707n556j059O052K60o446M6O778j116o744K143O073k757n189K971M107l629
3869c59k900M128J081m168N2M618j570n090L294M404m179m232M903M333n880l277
3885d842N839K925o061k093N551J463n199K34M268r84m191L417K236l912j161
$$ plain form
3900 -2510 2023 3151 -3077 -2202 4081 2498 -3946 -1859 4770 2585 -4387 -1308 4024 1134 -3359
3915 -3359 240 3283 -41 -2123 1770 1619 -2274 -105 3548 176 -3783 685 4568 -467 -4638
3930 -4638 2046 5363 -1574 -3955 1724 4000 -2189 -2987 1886 1832 -2234 -1376 1899 -194 -2679 739
3946 739 2285 -2743 -2906 2442 1971 -4131 -3197 3815 1726 -4733 -2190 4073 956 -4419 -1163 3061
3962 3061 -514 -2998 410 2266 -1881 -1710 2252 582 -3272 -401 3271 -497 -4314 1023 4221
3977 4221 -1573 -4298 1929 4473 -1901 -3472 2346 3396 -1986 -1842 2589 1379 -2085 265 2916
3992 2916 -752 -2058 2456 2808 -2737 -1953 3974 2240 -3679 -1352 4572 1800 -3852 -575 4134
4007 4134 587 -3516 119 3040 -569 -2589 1533 1549 -2316 -1309 2545 104 -3473 369 3401
$$ packed form
3900b510M533J128o228Q75O283j583o444K087O629k185o972L079N332k890m493
3915c359L599L043l324k082L893j51l893K169L653l372l959M468L883n035m171
3930d638O684L317o937k381N679K276o189p98M873n4m066Q58L275k093k485L418
3946G39J546n028j63N348m71o102R34P012k089o459K543O263l117n375L256M224
3962C061l575k484L408J856m147J71L962j670l854K871L672l768l817N337L198
3977D221n794k725O227K544o374j571N818J050n382J44M431j210l464K350K651
3992B916l668j306M514L52n545P84N927j734n919K327N924k772n652L277M709
4007D134l547m103L635K921l609k020M122J6l865J007L854k441l577L842L032
$$ plain form
4022 3401 -1295 -4212 1336 3828 -2514 -4174 1710 2893 -3109 -3077 2253 1590 -3091 -1496 2107 -91
4038 -91 -2858 283 1907 -1691 -2362 2410 1709 -3176 -1505 3449 1362 -4078 -1228 4174 905 -4585
4054 -4585 58 4062 -215 -3005 1093 3114 -1047 -1970 2151 1536 -2058 224 3176 -196 -2836
4069 -2836 1662 3815 -1129 -3067 2572 3911 -2581 -2986 3252 3287 -2717 -1834 2991 2043 -2597 -687
4085 -687 2637 -28 -2077 1481 1764 -2105 -1792 2788 1108 -3638 -1246 3557 212 -4632 -308 4181
4101 4181 -499 -4545 154 3424 -1602 -3480 617 1961 -2188 -1802 1683 178 -3058 218 2416
4116 2416 -1562 -3496 1515 2989 -2892 -3605 2835 2853 -3166 -2705 3001 2250 -2977 -1490 3172 901
4132 901 -2140 245 2628 -305 -1367 2331 1792 -2512 -604 3899 958 -3491 377 4654 399
$$ packed form
4022C401m696k917N548K492o342j660N884J183o002L2N330o63m681J595L603k198
4038i1k767L141J624l598o71M772p01m885J671M954k087n440K850N402l269n490
4054d585M643M004m277k790M098K021m161r23M121o15l594K282K952l372k640
4069b836M498K153m944j938N639J339o492m05O238L5o004Q83M825r48m640J910
4085f87L324k665k049L558K83l869L13M580j680m746K392M803l345m844M324M489
4101D181m680m046M699L270n026j878M097J344m149L86L485j505l236L276K198
4116B416l978j934N011J474n881p13O440J8o019M61N706p51n227J487M662k271
4132I01l041K385K383k933j062L698n39m304J908M503k941m449L868M277m255
$$ plain form
4147 399 -4083 821 4526 -312 -3259 1325 3188 -1205 -1957 1684 1472 -1906 -297 2410 -465 -2506
4163 -2506 1373 2709 -2190 -3137 2486 2935 -3241 -3316 2888 2542 -3862 -2339 2709 911 -3378 -1053
4179 -1053 1959 521 -2857 799 1779 -2279 -1585 2141 458 -3553 -801 3220 -241 -4383 89
4194 89 4084 -674 -4079 563 3535 -1157 -2900 1336 2320 -1517 -1334 2394 674 -1841 424 2851
4210 2851 -600 -2863 2249 2846 -2029 -2213 3466 2477 -2786 -1925 3786 2716 -2731 -963 3395 356
4226 356 -2552 608 2862 -81 -1912 2024 1289 -2836 -1242 2000 304 -3570 677 3221 -823
4241 -823 -3691 1052 3839 -1808 -3238 570 2745 -2264 -3219 1956 601 -2171 -1060 1786 -174
4256 -174 -2748 535 2100 -2364 -2844 1843 1153 -3307 -2547 2630 1276 -4214 -2366 3575 881 -3675
$$ packed form
4147C99m482M904L705m838k947M584J863m393p52L641k12l378J609K707k875k041
4163b506L879J336m899r47N623M49o176p5O204l46o404J523N048j798m289K325
4179a053L012j438l378L656R80m058O94L726j683m011K752M021l461m142M472
4194H9L995m758l405M642K972m692j743M236R84l837J83L728j720k515K265K427
4210B851l451k263N112N97m875j84N679r89n263Q61N711j070n447J768M358l039
4226C56k908L160K254k943j831L936p35m125J594L242j696l874M247K544m044
4241h23k868M743K787n647j430L808K175n009r55N175j355k772J111K846j960
4256a74k574L283J565m464m80M687o90m460P60N177j354n490J848N941k694m556
$$ plain form
4272 -3675 -786 3181 67 -2538 524 2312 -1014 -1258 1700 670 -1979 38 3291 425 -2955
4287 -2955 1345 2768 -51 -3393 1814 4489 -938 -2444 2876 2223 -1757 -972 1512 1476 -2165 288
4303 288 2505 94 -1740 1495 2291 -2168 -1698 3227 1608 -3194 -1586 3908 952 -3700 -1005 3715
4319 3715 373 -3565 -382 2583 -835 -2516 778 1066 -1802 -1541 1720 -248 -3001 94 2747
4334 2747 -1346 -3590 1093 3061 -2119 -3866 1736 2888 -2383 -2861 2152 1561 -2484 -1665 1790 183
4350 183 -2075 486 2173 -1465 -1786 2173 1538 -2941 -1212 3742 1587 -3468 -776 3988 1146 -3561
4366 -3561 -25 3661 495 -2753 553 2558 -706 -1300 1868 1104 -2033 -43 3043 -337 -2881
4381 -2881 1586 3251 -1192 -3255 1806 3353 -2104 -3039 2118 2394 -2534 -2144 2099 1027 -2262 -511
$$ packed form
4272c675K889L967l114k605L062J788l326k44K958j030k649K017L253k866l380
4287b955M300J423k819l342N207K675n427j506N320o53l980P85K484l6l641K453
4303B88K217k411j834L235P96m459M70M925j619m802J608N494k956m652K695M720
4319C715l342l938L183K965l418j681L294K88k868K61L261j968k753L095K653
4334B747m093k244M683J968n180j747N602J152n271m78N013n91m045Q19L455j607
4350A83k258K561J687l638l21L959o35m479J729M954k155n055K692M764k842m707
4366c561L536L686l166l248L306K005l264n94L168p64l137J990L086l380k544
4381b881M467J665m443k063N061J547n457r35N157K76m928L90M243j072l289J751
$$ plain form
4397 -511 1628 -463 -2140 969 1458 -2665 -1598 2237 1005 -3454 -1442 3185 501 -3921 -806
4412 -806 3377 -237 -3659 115 2723 -722 -2595 980 1361 -1652 -1341 1840 377 -2102 315 2561
4428 2561 -676 -2688 1895 2987 -1993 -2866 2291 2979 -2092 -2012 3054 2343 -2206 -944 2751 877
4444 877 -1899 549 2235 -507 -1444 2055 1806 -2032 -712 3131 1046 -2937 -14 3501 521 -3240
4460 -3240 334 3428 -1447 -3217 793 2531 -1244 -2203 1148 1184 -1759 -1054 1693 -473 -2742 373
4476 373 2055 -1921 -2675 1461 2164 -2549 -2794 2378 2326 -3026 -1946 2550 905 -2958 -761 2090
4492 2090 178 -2136 790 1153 -1423 -1236 1529 1001 -2900 -681 2815 120 -3416 514 4049 -813
4508 -813 -3709 1140 3256 -973 -1819 1120 2914 -641 -650 1251 1140 -1611 -237 1834 -150 -3070
$$ packed form
4397e11K139k091j677L109M89m123J067L835j232m459K012M627k684m422L115
4412h06M183l614l422L774K608l445j873L575L81l013L11L181j463k479K417K246
4428B561l237k012M583J092m980q73N157O88n071Q0N066p11m549J262L695j874
4444H77k776K448J686k742r37L499k49l838J320L843k085l983K923L515k980l761
4460c240L574L094m875j770M010J738l775r59L351L6k943P05K747k166k269L115
4476C73J682l976p54M136P03m713k45N172n2n352J080M496j645l863K197K851
4492B090j912k314K926L63k576J87K765n28l901K219L496k695l536L930L535m862
4508h13k896M849K116m229q46K939J794l555rJ901j11k751J374K071j984k920
$$ plain form
4524 -3070 1073 2224 -2808 -1873 2557 2540 -2529 -1732 3261 2041 -3005 -1470 2890 780 -2362 -172
4540 -172 2210 -612 -1567 797 1002 -2109 -842 2172 -171 -3225 -252 2885 -856 -3747 289 3134
4556 3134 -1311 -3632 535 2517 -1404 -2438 1106 1160 -1748 -936 1475 189 -1842 668 1475 -1599
4572 -1599 -2333 2108 2016 -2823 -2157 3075 1852 -2883 -1844 3089 1445 -2823 -502 2418 574 -2246
4588 -2246 665 1675 -1084 -555 2390 1484 -1831 56 3455 80 -2860 536 3411 -346 -3111
4603 -3111 1392 3517 -1431 -2649 1410 2677 -1391 -1590 1656 892 -1846 -215 1849 -331 -2016
4618 -2016 1174 1798 -2415 -2028 2181 1551 -3074 -2239 2883 1343 -3287 -1253 2585 218 -2656 -399
4634 -399 1986 -853 -2056 449 1117 -1705 -833 1502 102 -2646 -45 2627 -732 -2731 973 2897
$$ packed form
4524c070M143J151n032R35M430j7n069P97M993j220n046J535M360k110l142K190
4540a72K382k822r55K364K05l111J267L014k343l054K973L137l741k891M036K845
4556C134m445k321M167J982l921j034L544N4k908Q12K411j286k031K510Q07l074
4572a599p34M441r2m839O66N232j223m735J039M933j644m268K321K920j844k820
4588b246K911J010k759N29K945r06l315J887L399l375k940L396K875l757k765
4603c111M503K125m948j218M059J267m068j99L246p64k738J631K064k180j685
4618b016L190O24m213L87M209o30m625Q35N122j540m630K034L838k367k874K257
4634c99K385k839j203K505O68k822Q72K335j400k748K601K672l359j999L704J924
$$ plain form
4650 2897 -1284 -2922 1305 2893 -1611 -1940 1812 1661 -1662 -726 2114 895 -1492 535 2142 -679
4666 -679 -1737 1557 1994 -1786 -1012 2929 1512 -2599 -708 3461 842 -2783 -528 2943 -406 -2161
4682 -2161 554 2095 -580 -2006 1378 809 -2176 -584 1875 -345 -2590 636 2670 -1240 -2851
4697 -2851 1307 2590 -2213 -2925 1540 1914 -2677 -2256 1836 813 -2187 -845 1604 -167 -2214 668
4713 668 1063 -1349 -1365 2077 1217 -2641 -1191 2894 921 -3174 -1132 3274 205 -3001 245 3243
4729 3243 -446 -2097 534 2110 -995 -562 2028 683 -1569 -199 2681 -572 -2606 1288 2609
4744 2609 -1313 -2393 2382 3161 -1388 -2263 1784 2207 -1260 -1136 1666 1025 -1635 -18 2199 -687
4760 -687 -953 1279 812 -2176 -856 2733 358 -3324 -784 2370 -74 -3140 -413 2913 -503 -3141
$$ packed form
4650B897m181j638M227J588m504l29L752j51l323R36K840j219k387K027J607k821
4666f79j058L294M37l780P74L941j417m111J891M169k619l625K255L471l349j755
4682b161K715J541k675j426L384n69k985J592K459k220k245L226K034l910j611
4697b851M158J283m803p12M465L74m591M21M092j023l000J342K449j771k047K882
4713F68L95k412j6L442q60l858J450M085j973m095K042M406l069l206L246K998
4729C243l689j651K631J576l105M33K590j345k252J370K880l253k034L894J321
4744B609l922j080M775P79m549q75M047M23l467J24K802o41k660J617K217k886
4760f87k66K232m67k988J320L589k375l682K540L154k444l066K727L326l416k638
$$ plain form
4776 -3141 499 1671 -1132 -1781 792 1020 -2027 -823 1361 -418 -2222 268 2178 -2087 -2663 1435
4792 1435 2408 -2157 -2155 1698 1996 -2368 -1885 1879 1561 -2046 -1069 1750 -65 -1363 585 1608 -1168
4809 -1168 -1027 1983 1322 -2400 -426 3266 651 -2883 153 3596 280 -2722 492 3080 -282
4824 -282 -2196 1125 2079 -867 -1036 1570 818 -1684 301 2360 -531 -1915 1067 2100 -1388 -2331
4840 -2331 1812 2042 -2220 -2191 1859 1390 -2264 -1511 2143 537 -2209 -400 683 -569 -1959 409
4856 409 870 -2055 -1292 2286 62 -2730 -149 2392 -539 -2596 -29 2514 -28 -2437 731 2018
4872 2018 -1162 -1332 319 -798 -1232 -658 2089 44 -2158 1000 2249 -1169 -1859 2060 2231 -1810
4888 -1810 -1504 2494 1824 -2393 -1290 2796 1243 -2187 -544 2726 756 -1697 601 1946 -470
$$ packed form
4776c141L640J172k803o49K573K28l047J204K184j779j804K490J910m265n76M098
4792A435R73m565KL853K98m364M83L764l18l607R77K819j815j298J948J023k776
4809a168J41L010o61l722J974L692k615l534L036L443l316l002L214K588l362
4824b82j914L321R54k946j69K606p52k502J985K059k891j384K982J033l488r43
4840b331M143K30m262K9M050m69l654P53L654j606k746J809J083j252j390K368
4856D09M61k925P63L578k224k792K581K541k931k057K567K543k542k409L168J287
4872B018l180j70J651j117m34N74K747k045k202L158J249l418o90L919J71m041
4888a810L06L998o70m217J103M086j553l430J643L270j970k453K298J345k416
$$ plain form
4903 -470 -1158 1613 1017 -1716 -292 2405 86 -2666 387 2971 -664 -2887 800 2705 -1195 -2616
4919 -2616 1085 1765 -1377 -1840 1489 982 -1410 -510 1358 -705 -1905 686 1354 -1748 -1974 1828
4935 1828 1197 -2718 -1611 2471 1326 -3041 -1382 2349 665 -2767 -332 2015 -146 -1551 432
4950 432 1131 -1278 -976 1811 478 -2024 221 2447 -579 -2547 924 3077 -707 -2750 1421 3016
4966 3016 -1258 -2157 1687 1992 -1043 -910 1745 695 -1111 617 2050 -619 -1307 1615 1483 -1922
4982 -1922 -1457 2502 1383 -2674 -1330 2873 1161 -2863 -475 2676 217 -2098 65 1401 -666
4997 -666 -1217 841 442 -1763 -663 1746 -325 -2588 383 2369 -1082 -3113 442 2278 -1323 -2583
5013 -2583 1391 2039 -1725 -1817 1468 784 -1645 -724 1533 -88 -1561 719 1744 -1054 -1351 1850
$$ packed form
4903d70o88K771n96k733J424K697k319k752L053K584l635k223L687J905l900j421
4919b616L701O80l142m63L329n07k392R00J868k063j200K591O68l102k26L802
4935A828o31l915J107M082j145m367J659L731j684l432K435K347k161j405J983
4950D32O99k409L02K787j333k502K245K226l026j968L471K153l784k043M171J595
4966C016m274q99L844L05l035J33K655j050j806J728J433k669o88K922j32l405
4982a922M65L959j119m057J344M203j712m024K388L151k459k315K163J336k067
4997f66n51K058l99k205J100K409k071k263K971J986l451k031L555J836l601j260
5013b583L974O48l764r2L285o84k429R21K257j621j473K280J025k798k97L201
$$ plain form
5029 1850 1401 -2447 -800 2644 548 -2468 -461 2749 486 -2338 961 2647 515 -885 856
5044 856 2046 -1391 -881 1632 397 -1572 1195 2251 -11 -2140 847 1771 -1244 -1719 1743 2087
5060 2087 -1173 -2150 1815 1690 -1759 -1055 1632 530 -1780 -218 1376 -717 -1604 1079 1094 -1959
5076 -1959 -1318 2045 504 -2878 -966 2574 98 -2934 -503 2258 -132 -2642 373 1728 -989
5091 -989 -1927 785 726 -1493 -618 1351 -57 -2085 586 1994 -973 -2066 1410 2366 -1559 -1964 1876
5108 1876 2063 -1662 -1629 2379 1452 -1689 -246 1768 711 -1369 498 1584 -406 -781 1797 1196
5124 1196 -1879 -217 2605 445 -2582 181 3001 -27 -2585 473 2582 -385 -2133 611 1676
5139 1676 -835 -1206 990 656 -1550 -36 1626 -539 -1799 805 1693 -1657 -2142 1642 1787 -2437
$$ packed form
5029A850m49l848J647L444k096l016K007L210k263k824L299J686k132j400J741
5044H56J190l437N10K513j235j969K767J056k262k129K987R24l015m75L462L44
5060B087l260r77L965j25l449P04K687j102k310J562J594k093q87K683J5l053
5076a959O41L363j541l382J912L540k476l032K431K761k390k510L015J355k717
5091i89r38K712n9k219Q75J969j408k028K671J408k967j093L476R56l925m05L840
5108A876J87l725L3M008r27l141J443K014j057k080J867J086j990l75K578o01
5124A196l075J662K822k160l027K763K820l028k558L058K109k967j748K744J065
5139A676k511l71K196l34k206J514J662k165j260K604Q88l350m85L784J45m224
$$ plain form
5155 -2437 -2267 1724 1370 -2364 -1587 1579 495 -2028 -275 1180 -410 -1335 464 1007 -1558 -690
5171 -690 1864 379 -2653 -113 2628 -76 -2589 132 3035 5 -2425 733 2259 -685 -1676
5186 -1676 1047 1118 -816 -269 1528 339 -1355 672 1861 -879 -1790 1801 2048 -1721 -1674 2080 2070
5203 2070 -1904 -1385 2555 1160 -2255 -386 2522 1001 -1490 -436 1643 234 -1275 1417 767
5218 767 -2291 -7 1442 91 -2764 -17 2148 -95 -3122 155 2374 -1094 -2319 802 1576
5233 1576 -1212 -1426 1049 361 -1661 -569 1142 -406 -1567 671 1663 -1548 -1895 1422 1521 -2162
5249 -2162 -1623 1922 1319 -2237 -882 1970 660 -1589 -127 1605 -64 -1234 781 1290 -836 -536
5265 -536 1840 709 -1626 32 2540 140 -2244 625 2554 -536 -2300 1002 2261 -701 -1541
$$ packed form
5155b437J70L991l54l734P77L166j084k523J753J455j590r25J799N43k565Q68
5171f90K554j485l032K540K741k704k513K721K903l030k430L158J526k944r91
5186a676K723P1j934N47J797j189j694K027J189k740r11L591K47l769M7L754j0
5203B070l974N19L940j395l415J869K908j521k491J054K079j409j509K692o50
5218G67l058K284J449j351k855K747K165k243l027L277K219l468j225L121P74
5233A576k788k14K475o88k022J092J711j548j161K238R92l211l47L317R9l683
5249b162N39L545o03l556J355K852j310k249J462J732j669j170K015N09k126L00
5265e36K376j131k335J658K508k400k384K869J929l090j764L302J259k962q40
$$ plain form
5280 -1541 1448 1693 -1156 -825 1499 498 -1359 144 1399 -721 -1697 1273 1467 -1644 -1368 1697
5296 1697 867 -2191 -1401 2148 479 -2329 -765 2059 106 -2090 -147 1309 -901 -1509 591 445
5312 445 -1585 -681 1814 -108 -2102 140 1997 -851 -2383 752 2389 -911 -2176 1267 2064 -1357
5328 -1357 -1723 1493 1017 -1282 -366 1274 427 -1154 560 1467 -822 -937 1925 1238 -1696 -755 2438
5345 2438 1117 -2062 -586 2949 751 -1815 -325 2031 158 -1330 585 1624 -513 -1087 1421
5360 1421 284 -1227 44 1938 -532 -1957 1020 2064 -991 -2472 1196 1939 -1444 -2188 1000
5375 1000 1331 -1426 -1403 937 591 -1749 -498 669 -582 -1231 1003 824 -1598 -690 1605 346 -1937
5392 -1937 -660 2501 481 -1811 -475 2258 -128 -1810 229 1973 -162 -1268 60 1001 -584
$$ packed form
5280a541K989K45k849L31K324j001j857J503J255k120r76K970J94l111K76L065
5296A697q30l058P90L549j669k808J564K824j953k196J943J456k210o08K100j46
5312D45k030R04K495j922j994K242J857k848j532L135J637l300j265L443P97l421
5328a357l66L216m76k299R16J640q47j581J714R07k289j15K862o87k934R41L193
5345B438j321l179J476L535k198k566J490K356j873j488J915J039k137n74K508
5360A421j137j511J271J894k470j425K977J044l055j481L668P43l383p44L188
5375A000L31k757K3K340l46k340J251J167j251o49K234j79k422R08K295j259k283
5392a937J277L161k020k292J336K733k386j682K039J744k135j106J328R41j585
$$ plain form
5407 -584 -154 1779 -184 -1405 536 2721 -756 -1858 1370 1714 -772 -1110 742 2668 -1638 -1681
5423 -1681 1108 806 -789 -403 1221 1014 -1117 727 1476 43 -1260 1227 631 -1937 -298 2429
5439 2429 428 -2613 -55 2486 199 -2375 -99 1742 -521 -1850 276 1048 -1023 -1133 959
5454 959 174 -1785 -273 1608 -513 -2132 614 1406 -1266 -2099 1240 1685 -1724 -1683 1424 1027 -1593
5471 -1593 -999 1519 874 -1636 -286 1156 -308 -1235 662 1129 -953 -659 1890 536 -1805 -388
5487 -388 2306 508 -2176 153 2646 206 -1779 594 2222 -343 -1341 917 1359 -830 -543 1414
5503 1414 335 -1070 355 1662 -471 -1357 1405 2006 -1440 -1754 1600 1379 -1961 -1515 1680 1179
5519 1179 -1879 -864 1676 499 -1717 174 1237 -641 -1051 872 295 -1650 -561 1377 -13
$$ packed form
5407e84M30J933j963j221J941K185l477j102L228L44k486l38J852J926m306m3
5423a681K789l02j595L86J624k07k131J844P49j433j303K487n96k568J639K727
5439B429k001l041K558K541k287k574K276J841k263j329K126P72k071j10K092
5454I59p85j959J512J881k121j619K746P92k672q33L339M45l409M1L107l97k620
5471a593N94K518o45k510J350J442j464r27J897M67k082K94K549j354k341J417
5487c88K694j798k684K329K493k440j985K373J628k565r98K258M42k189K87J957
5503A414j079j405J425J307k133q86K762O01l446l14L354k21l340M46L195n01
5519A179l058J015K540j177k216J891J063j878m10J923n77j945J089J938j390
$$ plain form
5534 -13 -2117 -157 2051 -245 -2665 80 2090 -612 -2058 511 1413 -723 -1351 953 675 -1106
5550 -1106 -411 1161 -268 -1154 654 1312 -1411 -1462 1437 1472 -1568 -1478 2048 1392 -2033 -880 2102
5567 2102 1138 -1628 -128 1780 293 -847 1001 1133 -550 -674 1460 890 -1342 329 2112 226
5583 226 -2256 346 2375 125 -2295 416 2075 -1160 -1608 684 1358 -965 -650 612 -423 -1052
5599 -1052 393 1100 -812 -1935 331 1308 -1448 -1275 1152 1432 -2118 -1787 1937 897 -2155 -1758
5615 -1758 1465 745 -1679 -395 1638 -703 -1007 540 581 -1301 -506 1486 393 -2041 263 2514
5631 2514 -187 -1756 446 2215 -479 -1711 1098 1698 -626 -1309 1608 1096 -900 -370 1441 184
5647 184 -798 816 1436 -890 -1167 1354 1142 -1329 -1083 2024 1094 -1788 -811 2124 672 -1724 -271
$$ packed form
5534a3k104J960K208k296k420K745K010k702j446K569R02k136o28K304k78j781
5550a106O95J572j429q86J808O58k723n1K899L5l040R0L526o56l425J153K982
5567B102r64k766J500J908j487j140J848J32j683j24K134n70k232J671J783j886
5583B26k482K602K029k250k420K711J659l235m48K292O74k323L15J262j035o29
5599a052J445P07j912j123K266R77k756J73K427K80l550L31L724j040l052L97
5615a758L223p20k424J284K033k341l04J547M1j882P95J992j093k434K304K251
5631B514k701j569K202J769k694j232K809O00k324o83K917n12j996N30J811j257
5647A84r82J614O20k326k77K521k12k471K46L107r30k882R77K935j452k396J453
$$ plain form
5664 -271 1718 -281 -1316 513 795 -559 -608 1059 275 -1651 -283 1601 -451 -2064 303 1760
5680 1760 -933 -2003 691 1729 -1258 -1823 946 1369 -1339 -1146 800 248 -1071 -29 785 -577
5696 -577 -1126 982 692 -1033 -1173 1727 917 -2034 -1221 1906 913 -2255 521 2136 485 -1701 278
5713 278 1622 -523 -698 938 1706 -632 -318 1376 51 -1353 193 1867 -48 -1434 1006 1956
5729 1956 -805 -1854 1412 1885 -1122 -1149 1230 1311 -1306 -439 1142 498 -1164 237 1115 -792 -1057
5746 -1057 895 520 -1599 -950 1490 445 -2081 -690 2015 -79 -2258 -445 1659 67 -1785
5761 -1785 113 1107 -706 -1171 430 303 -1201 -105 926 -432 -1546 514 1783 -777 -1838 1072
5777 1072 1925 -1394 -1839 1255 1459 -1325 -927 1225 828 -1035 -197 1160 -3 -856 938 889 -905
$$ packed form
5664b71J989j999j035J829K82j354m9J667p84j926J368J884k052j613K367J457
5680A760k693j070K694J038k987n65K769M23k708J93J946n52j319J042Q14j362
5696e77n49K108k90j725j40K900q10k951Q13L127r93l168K776J615j651k186J979
5713B78J344k145j75J636P68k338L14J694j325j404J546J674j915j386K440R50
5729A956k761j049L266M73l007k7K379Q1k617Q67J581o44j662J401Q78j907k65
5746a057J952l75k119O49K440j045k526J391K705k094k179J813K104j592j852
5761a785J898R94j813m65J601j27j504J096J031j358j114K060J269k560j061K910
5777A072Q53l319m45L094K04k784L98K152l97j863Q38J357j163q53J794m9j794
$$ plain form
5794 -905 -438 1513 743 -1503 -269 2280 361 -1979 73 2131 272 -1793 229 1851 -258 -1039
5810 -1039 680 943 -521 -477 1125 348 -1244 298 1256 -872 -1612 869 1508 -1293 -1740 1412 1598
5827 1598 -1696 -1492 1225 968 -1722 -1089 932 -128 -1258 -133 775 -664 -1095 775 438 -1489
5843 -1489 -778 1512 257 -1962 -580 1576 276 -1992 33 1897 -7 -1726 345 1365 -507
5858 -507 -1054 821 1077 -860 129 1122 55 -1272 622 1323 -616 -1060 1299 1589 -1166 -1336 1576
5875 1576 1238 -1332 -911 1514 756 -1214 -298 1351 279 -1111 477 1110 -606 -704 1383 531 -1421
5892 -1421 -278 1599 209 -1788 133 1942 -390 -2156 559 1501 -677 -1510 506 1021 -900 -1097
5908 -1097 616 419 -1189 -287 850 -590 -1571 779 805 -1321 -1364 1244 1145 -1674 -1320 1542 997 -1754
$$ packed form
5794i05M67J951p70k246J234K549j919k340K052K058j859k065K022J622k109p81
5810a039J719K63j464M4J602p77j592J542R58k128p40K481O39k801m47L152J86
5827A598l294K04K717k57k690O33K021j060j130J125R08j439m31J870l37j927
5843a489P11K290j255k219J382K156j300k268K025J864j904j719K071J020j872
5858e07n47J875K56j937R89R93j067j327J894P01j939m44K359K90k755j70K912
5875A576l38k570M21K425p58j970R16J649j072j390J588O33j716r8K087q52j952
5892a421J143J877j390j997J921J809k332j766K715R42k178q33K016N15j921j97
5908a097J713j97j608R02J137j440r81K350K6k126m3K608r9k819L54K862n45k751
$$ plain form
5926 -1754 -708 1570 213 -1469 -14 1299 1 -886 646 933 -796 -192 1392 58 -1347 188
5942 188 2238 -228 -1708 703 1979 -390 -1790 824 1877 -589 -1406 803 1218 -911 -470 829
5958 829 196 -1135 524 967 -739 -894 1284 967 -1364 -970 1444 862 -1944 -918 1555 583 -1861
5975 -1861 -583 1215 -7 -1597 -296 841 -731 -683 775 299 -1322 -368 1320 -133 -1774 300
5991 300 1782 -785 -1914 516 1621 -626 -1850 454 1100 -824 -982 1036 723 -1125 -1 1186
6007 1186 -273 -1052 821 945 -1177 -841 1772 1117 -1463 -733 1943 940 -1626 -232 1790 718
6023 718 -1391 220 1304 -68 -869 755 828 -797 -290 1050 165 -1227 216 1629 -11 -1670
6039 -1670 750 1768 -765 -1412 846 1620 -743 -1274 899 640 -1001 -749 694 27 -1138 -54
$$ packed form
5926a754J046K278j357j682J455J313j298q87J532K87j729O04J584j334j405J535
5942A88K050k466j480K411J276k369j400K614J053k466q17K209M15k129M41J299
5958H29o33j331J659M43j706j55K178l17k331L94K414n82k806J026K473r72k444
5975a861J278J798j222j590J301J137j572M8J458m76j621R54J688j453j641K074
5991C00J482k567j129K430J105k247j224K304O46j924j58K018l13j848J124J187
6007A186j459p79J873J24k122L36K613o55k580P30K676j003k566J394K022j072
6023G18k109J611J084j372q01J624P3j625N07J340q85j392J443J413j640j659
6039a670K420J018k533o47K258P74k363n31K173k59j641K52J443o67j165J084
$$ plain form
6055 -54 836 -776 -1030 816 734 -1487 -812 1380 481 -1732 -791 1440 409 -1845 -438 1261 -65
6072 -65 -1604 131 1009 -702 -778 555 438 -1010 -452 1386 -21 -1243 345 2091 -245 -1415 494
6089 494 2143 -770 -1157 1047 1643 -1456 -869 1119 30 -1476 -204 1532 0 -764 785 1108
6105 1108 -870 -625 1395 775 -1495 -103 1757 457 -1959 159 1220 320 -891 -438 1346 -128
6121 -128 -1391 215 609 -596 -904 753 367 -1223 -303 1092 -286 -1513 471 1147 -1130 -1427 901
6138 901 1398 -1353 -1565 702 1151 -1185 -963 1038 -237 46 130 463 -2 -853 577 569 -1027 -621 1405
6157 1405 457 -1554 -359 2003 569 -1696 -9 2088 -125 -1360 394 1599 -279 -918 542
6172 542 769 -388 -99 970 254 -843 663 1437 -639 -1176 863 1411 -955 -1152 1551 1339 -1553
$$ packed form
6055e4Q90j612k54J846q2k221O75K192q99k213R41K231j031k254J407J699j326
6072f5j539J735Q78j711p6J333j17j448N58J838j407j222J588J746k336j170J909
6089D94J649k913l87K204N96l099N87J988j089j506J272J736j532p64J549L23
6105A108j978K45K020o20k270J392J860j300k416K118J061r00j211M53J784j474
6121a28j263J606L94j205l08J657l86j590R20J395j378j227J984O76k277k97K328
6138I01M97k751k12K267M49k336K22K001j275K83Q4L33m65q51J430qj596M06K026
6157A405r48k011J195K362j434k265J687K097k213j235J754J205j878o39J460
6172E42K27j157K89J069p16j097J506P74k076n37K039N48k366j97K703k12k892
$$ plain form
6189 -1553 -937 1009 569 -935 -369 939 69 -859 311 969 -770 -875 997 365 -1579 -648 1397
6206 1397 26 -2028 -230 1434 -265 -1786 13 1397 -473 -1296 419 903 -678 -989 417 92
6222 92 -984 -34 943 -468 -1128 761 1136 -1330 -1247 977 1307 -1119 -1141 1445 1239 -1365 -404 1423
6240 1423 501 -1027 -3 1011 -41 -581 699 844 -839 -238 1437 438 -1166 115 1634 366
6256 366 -1536 213 1857 -69 -1424 264 1367 -227 -1021 714 790 -745 -475 1065 91 -1095
6272 -1095 247 1205 -705 -1107 870 955 -1150 -1385 1072 1175 -1556 -938 1101 405 -1458 -637 963
6289 963 105 -1158 -171 756 -508 -670 828 286 -935 -468 1151 -33 -1467 129 1537 -74 -1540
6306 -1540 603 1608 -540 -1367 597 1461 -416 -750 1028 884 -558 -308 1299 -227 -684 811
$$ packed form
6189a553O16J946m40j504N66J308q70r28J170O58j739j05J872o32j944R31K045
6206A397j371k054J798J664j699j521J799J384j870q23J715M84j581l11J406l25
6222I2j076R50R77j411o60J889L75k466Q3K224L30k426k2K586k06k604R61J827
6240A423r22j528J024J014j052n40J280J45j683O01J675r99j604J281J519j268
6256C66j902J749J644j926j355J688J103j594p94J735P6j535K70J540r74j186
6272a095J342R58j910m02J977Q5k105k35K457J03k731O18K039o96j863Q21J600
6289I63q58j263R87R27j264j62J498n42j221M67J619j184j434J596J408j611j466
6306a540K143J005k148q27J964Q64j877l34J778j44j442K50J607j526m57J495
$$ plain form
6322 811 1247 -719 -814 1270 990 -912 -734 1497 941 -1498 -528 1778 522 -992 18 1443 -83
6339 -83 -993 421 843 -754 -428 990 181 -1232 110 1398 -201 -1759 201 1566 -504 -1880
6355 -1880 488 1408 -1147 -1530 791 554 -959 -677 374 72 -959 -120 833 -516 -998 988 368
6372 368 -1290 -719 1451 756 -1623 -700 1459 379 -1532 -482 1493 15 -1042 89 1134 -298
6388 -298 -954 865 380 -888 44 1281 -214 -1066 395 1775 -166 -1341 688 1576 -607 -1149 883
6405 883 1423 -880 -1217 941 1064 -702 -340 1107 27 -661 541 938 -654 -533 845 814 -1253
6422 -1253 -506 1450 472 -1611 -645 1079 349 -1332 -190 1079 -121 -1325 189 615 -751 -593
6438 -593 589 -86 -1071 -228 1230 -354 -1311 246 1397 -610 -1270 790 1321 -854 -1119 731 793
$$ packed form
6322H11M36j966r5K084k80j902J78K231n56k439R70K306j256j514J010J425j526
6339h3r10J414M22j597L26J418q09j413J342J288j599j558J960J365k070j376
6355a880K368R20k555l83K321k37j513K82J051l02j031Q39R53j349m82J986o20
6372C68j658N71K170o95k379R23K159j080j911J050J975j478j057J131J045j432
6388b98o56J819m85j268R32J237j495q52J461J380j941j175K029Q88k183n42K032
6405H83N40k303l37K158J23j766L62J447j080o88J202L97j592J21J378l1k067
6422a253P47J956r78k083R66J724p30j681J142J269j200j204J514M26j366J58
6438e93J182o75r85Q43J458j584r57J557J151k007o60K060N31k175k65J850O2
$$ plain form
6455 793 -968 -714 1324 396 -606 -83 961 -165 -636 814 959 -1041 -486 1320 606 -1221 -310
6472 -310 1546 418 -1505 -50 1586 103 -1511 380 1121 -2 -632 406 506 -534 -399 1042
6488 1042 261 -865 311 1299 -318 -1236 675 1092 -862 -1376 1021 982 -972 -1060 1000 527 -973
6505 -973 -577 579 -71 -1307 78 528 -468 -740 698 299 -1293 -382 1200 302 -1512 -288 1274
6522 1274 -213 -1395 -168 1332 -401 -1256 403 838 -635 -912 630 466 -780 -68 798 -118 -962
6539 -962 568 888 -506 -856 1030 1171 -827 -979 1321 1151 -994 -575 1019 501 -961 -73 1072
6556 1072 -135 -829 611 587 -741 -197 999 114 -1264 -21 1441 -279 -1443 134 1451 -172
6572 -172 -1423 332 1244 -669 -1046 517 651 -802 -404 711 -347 -963 41 708 -619 -1084 639
$$ packed form
6455G93j761K54K038r28j002N23J044j126m71J450J45k000N55J806p14j827R11
6472c10J856j128j923J455J636j483j614J891P41j123o30J038J00j040J35J441
6488A042p81j126J176R88j617r18J911M17j954n14K397l9j954q8K060m73j500
6505i73L96J156o50j236J385M50r96k72J438l99j592R11J582q98j814J224J562
6522A274j487j182J227J500j733q55J659M35j473k77J542j64j246P12Q66r16q44
6539i62J530L20j394l50J886J41j998j52K300j70k145M19J594n18j462Q88J145
6556A072j207o94J440k4j328N44J196q85j378J243J462j720j164J577J317j623
6572a72j251J755R12j913l77J563J34j453L98J115j058o16J004O67j327m65J723
$$ plain form
6589 639 848 -953 -1086 932 794 -1538 -1079 1290 741 -1244 -489 968 159 -892 150 526 -401
6606 -401 -361 661 405 -791 -34 1307 161 -1147 161 1700 -46 -1144 660 1271 -125 -1155
6622 -1155 654 1339 -366 -750 356 527 -642 -87 1078 -74 -787 720 963 -773 -870 1209 985
6639 985 -1195 -828 1189 834 -1159 -609 1097 236 -1175 -177 1050 -91 -902 107 473 -962 -529
6656 -529 683 -285 -1037 -172 1043 -186 -1620 -64 1409 -531 -1443 304 1187 -713 -877 557 573
6673 573 -619 -506 690 89 -768 128 889 -540 -716 854 1002 -788 -681 1188 762 -1084 -519 1156
6691 1156 723 -986 -261 1131 305 -1065 205 1153 -110 -512 722 420 -247 31 884 -95 -947 374
6709 374 1380 -133 -1372 792 1312 -752 -1390 492 1118 -610 -793 525 430 -833 -371 742 26
$$ packed form
6589F39K09j801j33K018j38k332M59K369n49j985P55J457q09j051J042L76r27
6606d01M0J022k56j196P57J341j146j308J308J539j746j098J804O11j396j030
6622a155J809O85j705l84J106J71j169N55J165j152p13J507K43j736r7K079k24
6639I85k180L67K017l55j993N50J706q61j411R98J227j141q11J009L66j435M33
6656e29J212r68p52Q65J215j229j434J556J473j940r12J747Q83j900j64J434J6
6673E73j192J13J196o01q57Q96P61j429j76J570J48j790J07J869m26j846N65J675
6691A156m33j709P25J392q26j370J270R48j263m02J234l02o67K78Q53r79q52J321
6709C74J006j513j239K164N20k064o38J882O26j728j83J318r5j263M62J113p16
$$ plain form
6726 26 -1030 174 473 -724 -490 700 398 -1274 -574 1300 235 -1649 -607 1095 11 -1562
6742 -1562 -551 981 -280 -1155 161 729 -662 -344 700 194 -790 -43 1100 -137 -1285 431
6758 431 1218 -752 -1071 1088 1199 -632 -911 845 974 -763 -514 826 510 -556 20 663 -203 -465
6776 -465 839 613 -912 -424 1215 577 -1080 -313 1288 526 -1087 -284 1426 -72 -1218 73 1159
6793 1159 -341 -830 486 668 -638 -296 786 -189 -1006 -37 924 -682 -1243 481 965 -851 -971
6810 -971 759 940 -993 -1198 796 606 -818 -444 775 -198 -838 27 550 -772 -531 793 316 -1136
6828 -1136 -585 1191 177 -1580 -397 1653 154 -1334 -39 1477 -165 -724 206 619 -425 -382
6844 -382 538 202 -458 206 1047 -343 -726 518 1068 -737 -898 733 1303 -735 -930 918 891 -855
$$ packed form
6726B6j056J204K99j197K34J190l02j672P00J874j065j884J042J702j084j573
6742a562J011J532j261q75J316N68j391L18J044n06r84P47J143j237j148J716
6758D31P87j970l19K159J11j831k79J756J29j737K49J340l16j066N76O43q66k62
6776d65J304k26j525M88J639o38j657P67J601p62j613Q03J710j498j146J291J086
6793A159j500m89J316J82j306L42J082r75q17R69R61j606n61J724M84j816j20
6810i71J730J81j933k05J994j90j424L74J219r73o40Q65N23j322K41J324m77j452
6828a136N51J776j014j757J183K050j499j488J295J516j642n59R30M13j044M3
6844c82R20l36o60O64Q41j390l83J244N50j805j61J631N70k038j95J848k7j746
$$ plain form
6862 -855 -508 966 283 -588 -257 579 -65 -862 562 298 -788 -337 803 366 -1181 -393 886 42
6880 42 -1412 -342 1091 136 -1210 -159 598 -645 -1119 212 687 -816 -416 521 -134 -974 316
6897 316 657 -571 -978 723 572 -946 -1181 979 779 -886 -671 1252 634 -1149 -12 1194 65
6914 65 -797 235 675 -148 -342 688 704 -601 -167 949 251 -821 217 1382 -170 -1096 256 1334
6932 1334 -328 -1123 493 814 -117 -605 629 420 -625 -186 779 -248 -719 367 831 -752 -789 788
6950 788 856 -956 -1085 847 599 -1304 -610 978 243 -790 -196 860 -20 -743 98 387 -672 -408
6968 -408 912 -25 -883 111 1064 -438 -1539 -7 1411 254 -1226 804 1019 -417 -878 814 1034
6985 1034 -713 -795 383 697 -827 -217 443 -271 -771 736 816 -749 -807 1129 814 -877 -408 1343
$$ packed form
6862h55L47J474o83q71L31Q36o44p97J424k64j086M51J140m37j547P88J279q44
6880D2j454J070J433r55j346J051P57j243m74J331M75j503M00R37o55q40J290
6897C16L41j228m07J701j51j518k35K160k00j665K15J923o18j783J137J206j129
6914F5q62J032M40q23j94J030J6j305M34J116o98j072J038J165j552r26J352J078
6932A334j662p95J616L21r31m88J234k09j045M39R65j027m71J086M64j583l7J577
6950G88O8j812j29J932k48j903O94J588p35j033N94J056q80p23Q41K89j059K64
6968d08J320r37q58R94R53j502j101J532J418j157j480K030K15j436m61J692K20
6985A034j747q2J178L14j524O10O60p14n00J507Q0j565n8J936l15j691M69J751
$$ plain form
7003 1343 542 -1152 -181 1240 250 -919 294 844 -88 -507 360 506 -676 -22 849 -271 -795 247
7021 247 1027 -320 -1176 462 1201 -999 -1476 1183 1057 -782 -685 355 589 -412 290 913 -330 -918
7039 -918 544 732 -797 -1014 611 578 -1074 -901 992 525 -1175 -243 1188 375 -1125 178 915
7056 915 -114 -648 686 645 31 20 -70 807 -62 601 875 424 -1171 352 1281 -40 -787 658 830
7075 830 -214 -706 1332 873 -660 -378 737 321 -974 138 1102 -86 -637 661 627 -678 -831
7092 -831 1031 293 -1299 -472 1012 253 -1347 -374 1026 -42 -959 -424 776 -309 -801 532 293
7109 293 -764 -379 760 -158 -1174 59 456 -161 -909 613 732 -576 -908 604 968 -653 -295
7126 -295 805 459 -788 -374 1061 468 -709 282 833 -101 -469 1212 550 -883 -439 1197 -26
$$ packed form
7003A343q01j694R71J421r90j169J213N50r32m19Q67J46j182O54Q71j120n24J042
7021B47P80j347q56J638P39k200m77K659j26j839R7J040K34j001P02O23j243n88
7039i18J462J88j529k17J625l3j652J73J893m67j700R32J431q13j500J303P37
7056I15j029n34J334m1o14j1r0Q77q69O63K74m51j595J523R29j321p47J445J72
7075H30j044m92K038m59j533K82J115m16j295J112R64j188n51J298l4j305j53
7092h31J862p38j592Q27J484p59j600R73J400j068r17N35J200j085m92J333k39
7109B93j057L85J139r18j016J233L97o17p48J522J19j308l32J512L64j621L58
7126b95J100l46j247M14J435n93j177R91N51r34l68J681o62j433M44J636j223
$$ plain form
7143 -26 -1187 -346 1446 404 -982 160 1648 75 -1131 408 958 -527 -438 805 444 -562 208
7160 208 468 116 -860 513 987 -407 -363 1037 1031 -886 -688 925 379 210 -8 913 398 -1080 -735
7179 -735 355 -34 -678 26 303 -452 -684 788 -3 -1100 -314 1129 -126 -1386 -123 1121 -264
7196 -264 -1078 -170 793 -489 -811 319 466 -385 -178 380 143 -810 117 765 -460 -648 757 963 -729
7215 -729 -561 1018 1115 -599 -720 975 690 -813 -466 873 416 -338 187 436 -324 -366 686 226 -722
7234 -722 -107 1000 -35 -1258 105 1178 191 -1236 12 1021 -260 -940 218 952 -607 -973
7250 -973 271 277 -415 139 435 -299 -903 585 695 -493 -1089 490 666 -874 -1129 526 881 -883
7268 -883 -315 319 399 -1280 -462 961 -255 -772 118 398 -415 -545 840 376 -783 -25 1163 -229
$$ packed form
7143b6j161Q41J792j042j386J142J488j573j206J539N50j485Q9J243l61j006P70
7160B08K60l52r76J373M74j394M4J400oj917J98J613n46j69k18R21n15j478L45
7179g35J090l89o44P04K77p55k32J472p91j097P86J443j255j260J263J244j385
7196b64q14R08R63j282l22J130J47q51K07N58k37r53R27O48j225j88J405K06j692
7215g29J68J579R7j714j21J695k85j503L47J339m57p54N25K49p60m2J052m60r48
7234g22O15J107j035j223J363J073r87j427J248J009j281o80J158P34j559l66
7250i73J244Oo92N54K96p34o04J488J10j188n96J579J76j540k55J655L55j764
7268h83N68O34Q0j679Q18J423j216n17Q90K80q13j30J385m64j159P58J188j392
$$ plain form
7286 -229 -983 78 1278 29 -1144 642 956 -337 -804 704 912 -285 -464 568 229 -510 38
7303 38 725 -108 -620 754 913 -729 -590 996 1028 -1072 -388 1163 657 -993 -368 692 206 -726
7321 -726 -87 900 -306 -538 500 270 -785 -285 809 -216 -1022 -246 1036 -271 -1293 195 1077
7338 1077 -389 -1142 409 645 -744 -706 414 389 -830 -466 993 -123 -612 184 402 -882 -568 461
7356 461 938 -652 -824 1140 615 -851 -367 1011 323 -816 97 937 -108 -455 148 867 -305 -241
7374 -241 590 306 -765 437 940 -57 -950 560 1194 -337 -740 671 1165 -535 -917 483 935 -540
7392 -540 -525 599 152 -487 131 337 -119 -389 577 579 -627 -623 860 583 -1100 -548 958 256 -1428 -251
7412 -251 905 20 -1062 -173 657 -40 -718 149 300 -504 -275 568 48 -842 238 668 -347 -1096 568
$$ packed form
7286b29p54J061J200j249j173J786L14j293m67J508K08j197j79J032l39p39N48
7303C8O87q33n12J374J59j642J39J586L2k100O84J551n06j650O25J060m86r32
7321g26O39R87j206k32J038k30j055N00J094j025q06P76J282j307j022J488Q82
7338A077j466p53J551K36j389L8J120k5j219L64J459j116m89P96K18j284L14J029
7356D61M77j590j72J964n25j466M84J378o88j139R13Q40j045l47O03P19j172O4
7374b41Q31k84j071J202N03r97q93J510O34j531m03J411M94j700l82J400M52j475
7392e40J5J124m47o39O18K06m56k70R66Kj206MJ483k77j683N52J506p02j684J177
7412b51J156q85j082Q89Q30o97o78Q67J51q04K29Q43n20q90J080M30j015p49J664
$$ plain form
7431 568 1579 -366 -802 751 999 -385 -376 223 1424 -504 -448 916 -236 628 418 197 -288 42
7449 42 316 522 -548 -154 1336 1398 -1030 -39 1130 147 -945 293 1031 -305 -781 247 613 -284
7467 -284 -357 333 476 -688 142 975 -176 -778 288 958 -547 -876 487 974 -539 -832 619 572
7485 572 -882 -867 614 81 -628 -120 587 -162 -707 230 276 -780 -565 756 97 -936 -661 776 50
7504 50 -983 35 1090 -49 -803 336 927 -471 -412 653 534 -180 -8 831 -129 -546 465 872
7522 872 -602 -883 68 1563 -339 -681 1071 170 19 241 500 1047 -726 -503 1105 123 -411 941
7540 941 1023 -410 -482 -39 796 -733 -496 700 9 -1286 -34 1147 -109 -1049 -111 907 -381 -1034
7558 -1034 288 480 -179 -692 207 21 -595 -526 500 -342 -673 160 631 -682 -804 808 613 -704
$$ packed form
7431E68J011j945m36J553K48j384RN99J201j928N6J364j152Q64k10k21m85L30
7449D2K74K06j070L94J490O2k428R91J169r83j092J238P38j336m76J028L66q97
7467b84p3O90J43j164Q30Q33j151o02J066O70j505l29J363M87j513k93J451m7
7485E72j454J5J481n33p09N08P07p49n45R37M6j056K15J321o59j033K75J437p26
7504E0j033J018J055j139p54J139N91j398N9J065j19p14J72Q39r60m17J011M07
7522H72j474k81R51J495j902l42J752r01j51K22K59N47j773K23J608r82n34J352
7540I41Q2j433p2M43Q35j529K37J196o91j295J252J181j256r40R38J018j288o53
7558a034J322J92o59n13Q99j86o16O9J026q42l31Q33M71j313j22J612j95j317
$$ plain form
7576 -704 -1011 552 1627 -682 -756 687 671 -656 -397 915 -268 -594 177 552 -357 -504 844 227
7594 227 -737 -20 1049 65 -806 167 1275 -137 -949 794 1296 -109 -835 536 766 -432 -557 411
7612 411 151 -469 534 461 -736 -667 527 491 -934 -859 656 488 -890 -935 724 273 -937 -667 675
7631 675 146 -1187 -171 388 -212 -510 512 221 -987 -144 927 -134 -1347 275 1230 -37 -1414
7648 -1414 -186 1182 45 -798 680 448 -494 -863 353 -59 -803 -621 575 -5 -386 583 1038 -247
7666 -247 -635 595 476 -581 -374 1030 1190 -277 -116 1125 770 -805 256 997 99 -919 328
7683 328 918 -494 -582 702 1123 -1187 194 778 -420 -732 -414 1147 -121 -707 528 688 -1207
7700 -1207 -350 896 1244 -174 -562 773 -303 -669 -235 570 -152 -569 925 598 -1011 -477 707
$$ packed form
7576g04l07J563J075k309p4J443j6j327K59J312j183l26P71L75r09j47J348o17
7594B27r64P17J069r84q71R73J108j412q12J743N02j405p26J371K30j198j25R68
7612D11k60o20J003p3j197O9J194l6j425P5J515j68j378m5J659m51j210K70J342
7631F75n29j333J016N59o00k98J022k91j208Q43J071j061j213J622R55j267j377
7648a414J228J368j137q43J478k32r42l69J216m12p44J82J196n80l81R69M55j285
7666b47l88J230j19j057K07J404J60j467J61J241l55j575J061P41q98j018J247
7683C28N90j412q8J284M21k310J381N84j198l12L18J561j268n86J235J60j895
7700a207Q57J246L48j418l88J335j076l66M34Q05p22m17J494l27j609N34J184
$$ plain form
7717 707 472 -1343 -262 616 561 -940 -348 861 -238 -1045 -32 151 -178 -209 159 550 -306 -74 520
7736 520 304 -443 314 765 -370 -932 648 1061 -434 -817 659 1037 -439 -809 986 601 -494 -45
7754 -45 419 543 -486 200 487 -392 -379 673 377 -858 -75 823 375 -1104 -296 1154 253 -1118 -73
7773 -73 808 57 -753 17 548 -506 -641 432 18 -707 -157 551 -233 -928 155 835 -710 -1045 545
7792 545 598 -785 -796 746 642 -1039 -748 592 144 -532 -313 340 -232 -739 278 543 -459 -178 858
7811 858 163 -934 -111 1375 421 -1060 144 980 79 -1199 149 798 -267 -363 394 559 -600 -100
7829 -100 26 213 -506 -115 852 -585 -653 326 1264 -1018 -822 539 571 -695 -477 642 899 -984 -132
7848 -132 963 313 -488 -107 552 -417 -64 296 516 -939 -751 826 -675 -1086 -553 1070 -53 -1739
$$ packed form
7717G07k35j815J081Q78n5j501N92J209j099q07J013J83l29l1L68L91q56K32N94
7736E20k16p47P57M51j135n62J580M13j495l83J476L78j476l70J795l85j095M49
7754d5M64J24j029O86K87q79J3J052k96j235P83Q98m48j479Q08J450r01j371J045
7773g3Q81p51q10P70N31j054j35J073m14p25N50P08p84o95J083O80j545l35J590
7792E45N3j383j1J542j04j681K91J340m48o76K19O53n72n07J017K65j002K81J036
7811H58o95j097Q23J486r54j481J204Q36r01j278J348O49j065r6P57J65j159N00
7829a00J26J87p19L91R67j437o8R79R38k282J96J361L2j266K18J119K57j883Q52
7848a32J095o50q01L81O59r69L53L60K20j455J88J577j501m11N33J623j123j686
$$ plain form
7866 -1739 536 853 -177 -1097 -431 858 -1012 -1446 846 -316 -761 -119 5 -152 -561 247 584 -590
7884 -590 -686 848 690 -170 -52 969 100 -940 -153 743 603 -392 -345 839 189 -309 439 606 -328
7903 -328 -4 1030 412 -734 38 857 284 -1066 231 1226 -90 -739 292 828 -245 -672 220 482
7921 482 -534 -398 546 -107 -672 -183 489 -398 -725 444 549 -723 -979 465 495 -992 -765 681
7939 681 393 -1039 -355 995 -148 -648 -21 556 -213 -450 311 357 -720 36 523 48 -823 -28 1130
7958 1130 -135 -702 51 1123 -70 -1173 474 781 -301 -763 155 354 -231 -227 770 41 -509 352
7976 352 617 -411 -327 788 719 -804 -466 1183 456 -1029 -582 1062 409 -764 -149 873 106 -456
7994 -456 388 550 -371 -379 595 126 -796 237 822 -292 -1124 214 869 -439 -1049 392 693 -628 -1101
$$ packed form
7866a739K275L17j030r20O66J289j870m34K292j162m45O42J24j57m09Q08L37j174
7884e90r6J534j58q60J18J021q69j040P87Q96j40r95M7J184o50m98P48J67r34
7903c28L24J034o18j146P72Q19n73j350J297R95j316o49J031N36j073m27Q92K62
7921D82j016J36R44o53n65M89O72q87l27J169J05j272k56J444L0j487K27J446
7939F81k88j432O84J350j143n00O27N77p69k37P61M6j077P56M87m75q71P95J158
7958A130j265n67P53J072j193j103J647L07j082m62R18J99n85MR97p29n50Q61
7976C52K65j028Q4J115o9j523L38J649p27j485M47J644o53j173O15J022p67n62
7994d56Q44J62r21qR74m69r22J033N85j114q32J338O55j308o10J441L01j321m73
$$ plain form
8013 -1101 309 733 -747 -489 345 266 -484 74 219 -388 -492 279 489 -987 -552 1138 416 -884
8031 -884 -333 1042 491 -1064 -202 1233 66 -637 71 719 19 -624 366 634 -284 -13 686 -81 -838
8050 -838 213 1098 -305 -675 643 1000 -398 -733 399 1081 -535 -786 643 474 -421 -552 637
8067 637 -12 -264 154 535 -622 -178 680 459 -715 -275 787 240 -435 -689 1360 88 -1148 -269
8085 -269 813 -175 -546 -116 298 -204 -326 375 218 -483 -43 573 -183 -852 165 796 -542 -737 567
8104 567 779 -506 -784 498 788 -672 -457 783 484 -526 -139 552 19 -428 498 625 -243 -368
8122 -368 689 1238 -755 -236 1097 414 -873 -39 1022 201 -960 194 777 65 -692 116 460 -152
8140 -152 -243 559 74 -674 224 704 -461 -1005 536 617 -543 -692 918 498 -1082 -731 894 507 -876
$$ packed form
8013a101J410M24j480K58Q34p9p50N58J45o07j04P71K10j476M35J690p22j300
8031h84N51J375n51j555Q62J435j167p03P08O48p00o43R90K68r18K71O99p67p57
8050h38J051Q85j403l70J318L57j398l35J132O82j616k51J429j69q95j31J189
8067F37o49k52M18L81j157M44Q58k21j174M40J062n47o75k54K049j272j236Q79
8085b69J082r88l71M30M14n02j22P01j57p01M40O16p56o69J017O31j338j95J304
8104E67K12j285k78J282K90j460K15J240k99j010L87O91n33m47R26J27q68j25
8122c68J057N49j993N19J333o83j287Q34J061q21j161J154N83p12p57Q08L44o12
8140a52r1Q02m85p48Q98M80j165n44J541Q1j160j49J610m20j580L51J625l87j383
$$ plain form
8159 -876 -510 827 206 -748 -52 516 -96 -479 -246 529 -594 -401 763 -164 -1028 -228 960 -552
8177 -552 -327 341 752 277 -899 647 1166 -452 -741 657 -220 -871 13 884
$$ packed form
8159h76L66J337o21r54O96N68o12l83K33P75j123J93J164r27q64Q00J188j512
8177e52K25O68M11m75j176J546N19j618k89J398q77o51Q84Q71
8191H84
$$ Imaginary data points
##PAGE= N=2
##DATA TABLE= (X++(I..I)), XYDATA
$$ plain form
0 0 0 0 0 0 0 0 0 8 -8 8 -8 16 -16 24 -24 32 -40 50 -64 75 -90 107 -128 152 -176 205 -239 275 -316 363
30 363 -414 474 -537 607 -685 770 -864 966 -1078 1202 -1338 1484 -1645 1821 -2013 2222
46 2222 -2450 2701 -2978 3278 -3610 3978 -4383 4840 -5349 5923 -6582 7337 -8221 9263
60 9263 -10521 12068 -14029 16598 -20117 25253 -33430 48427 -84577 341516 203699 -465513
72 -465513 318267 -20743 -107999 103079 -163167 119480 129066 -181081 123226 47824 -87812
83 -87812 11965 60028 37777 -81400 -26509 135527 11015 -138345 -2688 196092 -71635
94 -71635 -159858 111310 44284 -17923 -54280 -50144 165014 -95777 -133201 175725 -63205
105 -63205 -81941 81609 -16692 4272 -91525 11825 131903 -143251 -63352 113362 8783
$$ packed form
0@%%%%%%%Qj6J6j6K4l2M0m8N6p2R0j14J39j65J97k35K80l28L81m44N14n91O79
30C63p77Q88j011J144j292J455j634J830k044K280k540K822l129L466l834M235
46B222m672N151n679O256o888P588q361R223j0189J1272j2505J3919j5558J7484
60I263j9784K2589k6097L0627l6715M5370n8683Q1857j33004M26093j37817o69212
72d65513P83780l39010q7256K11078k66246K82647R586l10147L04307p5402j35636
83h7812R9777M8063k2251j19177N4891J62036j24512j49360J35657J98780k67727
94g1635q8223K71168o7026o2207l6357M136K15158k60791l7424L08926k38930
105f3205j8736J63550r8301K0964r5797J03350J20078k75154P9899J76714j04579
$$ plain form
116 8783 -69853 -110612 77606 88317 -147663 -19554 115230 7285 -88514 -21756 87979
127 87979 -59815 -73449 77931 9900 -43350 -29193 69688 45641 -144923 39159 126719
138 126719 -66196 -32932 -6554 84700 37683 -175322 82601 134856 -120819 10813 60116
149 60116 15030 5542 -64036 76519 36608 -106144 60295 77723 -52360 -30049 60285
160 60285 68242 -67784 -59699 92138 59303 -90933 -50283 123421 8621 -123094 38222
171 38222 52175 -9814 -23087 -31366 87758 -31065 -106926 103706 -12948 -97397 45714
182 45714 11696 5751 -53692 -44315 120942 -42591 -129209 75970 55775 -61703 -57316 27990
194 27990 54425 -67129 -61388 57286 34126 -53889 -13779 64914 -30379 -69937 42740 28631
$$ packed form
116H783p8636m0759J88218J0711k35980J28109J34784j07945r5799O6758J09735
127H7979j47794j3634J51380o8031n3250J4157R8881k4047j90564J84082Q7560
138A26719j92915L3264K6378R1254m7017k13005K57923N2255k55675J31632M9303
149F0116m5086r488o9578J40555l9911j42752J66439J7428j30083K2311R0334
160F0285P957j36026Q085J51837l2835j50236M0650J73704j14800j31715J61316
171C8222J3953o1989j3273q279J19124j18823p5861K10632j16654q4449J43111
182D5714l4018n945n9443R377J65257j63533q6618K05179k0195j17478M387Q5306
194B7990K6435j21554N741J18674k3160q8015M0110P8693r5293l9558J12677j4109
$$ plain form
206 28631 -36847 -29231 49964 64906 -94614 -41226 118751 -3213 -71509 7999 60795 33491
218 33491 -87404 -7352 103099 -29889 -45944 46191 33474 -13863 -23215 55488 28318 -74079
230 -74079 16824 72421 -33302 -56690 42838 81838 -33514 -69548 54909 66635 -48848
241 -48848 -57596 58976 51945 -64105 -28179 43703 4930 -33584 -3535 54427 -15493 -65493
253 -65493 57510 20632 -90145 -7540 51745 15922 -58874 -46078 92411 14275 -118930
264 -118930 8831 67230 -27337 -53506 -2635 46874 -17100 -60758 35084 22727 -61413 5928
276 5928 53131 -26341 -46201 20425 44103 -20504 -73612 25734 88533 -55506 -68455 80743
288 80743 45756 -52408 -25313 38563 38200 -39434 -15149 65723 -9580 -40460 41497 23284
$$ packed form
206B8631o5478P616P9195J4942j59520N3388J59977j21964o8296P9508N2796k7304
218C3491j20895Q0052J10451j32988j6055R2135j2717m7337r352P8703k7170j02397
230g4079R0903N5597j05723k3388R9528L9000j15352l6034J24457J1726j15483
241d8848q748J16572p031j16050L5926P1882l8773l8514L0049N7962o9920n0000
253f5493J23003l6878j10777Q2605N9285l5823p4796J2796J38489p8136j33205
264a18930J27761N8399r4567k6169N0871M9509o3974m3658R5842j2357q4140O7341
276E928M7203p9472j9860O6626K3678o4607n3108R9346O2799j44039j2949J49198
288H0743l4987r8164K7095O3876l63p7634K4285Q0872p5303l0880Q1957j8213
$$ plain form
300 23284 -30328 -8855 50735 42807 -54119 -28011 82731 14145 -82218 5521 83034 2594
312 2594 -60998 11066 61494 -12886 -51138 23970 37756 -34470 -21219 36626 4003 -44494
324 -44494 -1464 54144 -13262 -68164 35120 60680 -59253 -56551 40241 33954 -47991 -48434
336 -48434 48700 37916 -57963 -22812 35935 -2490 -38658 -11142 37958 -6910 -55731 32957
348 32957 34405 -69333 -17091 59717 579 -52561 -8407 58403 9988 -73264 3965 69619
360 69619 -23642 -52299 27141 40805 -12794 -31285 25041 37457 -41332 -17565 60531 -5727
372 -5727 -41924 35928 34533 -24191 -29936 25885 61342 -25648 -50603 65681 40358 -66161
384 -66161 -18390 51109 18910 -34657 -9877 54924 7563 -50093 22093 34441 -37640 -14277
$$ packed form
300B3284n3612K1473N9590p928r6926K6108J10742o8586r6363Q7739P7513q0440
312B594o3592P2064N0428p4380l8252P5108J3786p2226J3251N7845l2623m8497
324d4494M3030N5608o7406n4902J03284K5560j19933K702R6792o287q1945m43
336d8434R7134j0784r5879L5151N8747l8425l6168K7516M9100m4868m8821Q8688
348C2957J448j03738N2242P6808n9138n3140M4154O6810m8415q3252P7229O5654
360F9619r3261k8657P9440J3664n3599j8491N6326J2416p8789K3767P8096o6258
372e727l6197P7852j395n8724n745N5821L5457q6990k4955J16284k5323j06519
384f6161M7771O9499l2199n3567K4780O4801m7361n7656P2186J2348p2081K3363
$$ plain form
396 -14277 32875 6946 -31871 -16296 43269 13410 -68704 -3197 68070 -22175 -64818 19757
408 19757 48048 -25708 -56327 19609 36642 -41738 -29949 33464 7177 -34506 -7433 26226
420 26226 -13715 -46136 19516 40146 -40057 -39135 42999 29477 -51490 -32174 55430 30489
432 30489 -54637 -18561 50261 4178 -45504 -665 38055 3569 -24581 18255 35498 -28890
444 -28890 -20234 51207 3680 -49792 16800 53664 -4694 -45970 12932 65276 -15088 -56718
456 -56718 34464 48800 -24853 -26590 24054 31378 -18421 -25837 34415 13814 -41193 17681 42686
469 42686 -35826 -27650 37706 18880 -35762 -32438 41280 37871 -61578 -28487 59640 5284 -46973
482 -46973 -8841 30585 8407 -45510 -7158 34835 -29467 -28078 33406 1675 -36343 946
$$ packed form
396a4277M7152k5929l8817J5575N9565k9859q2114O5507P1267r0245m2643Q4575
408A9757K8291p3756l0619P5936J7033p8380J1789O3413k6287m1683K7073L3659
420B6226l9941l2421O5652K0630q0203R22Q2134j3522q0967J9316Q7604k4941
432C0489q5126L6076O8822m6083m9682M4839L8720l4486k8150M2836J7243o4388
444b8890Q656P1441m7527n3472O6592L6864n8358m1276N8902N2344q0364m1630
456e6718R1182J4336p3653j737N0644P324m9799p416O0252k0601n5007N8874K5005
469D2686p8512Q176O5356j8826n4642L324P3718l409r9449L3091Q8127n4356n2257
482d6973L8132L9426k2178n3917L8352M1993o4302J389O1484l1731l8018L7289
$$ plain form
494 946 31875 -6768 -50364 -2669 49883 -13103 -60654 20415 54233 -30817 -46655 25278
506 25278 32985 -25177 -29179 31995 19150 -37134 4057 31888 -16333 -19102 22329 30341 -19299
519 -19299 -30038 44060 32540 -47323 -17375 50362 24397 -41176 -13078 56548 11181 -42223
531 -42223 8889 37111 -3983 -22292 15902 26913 -22562 -15062 34706 5881 -38046 3462
543 3462 46589 -8047 -46418 17786 42107 -23339 -44948 19555 42042 -31906 -34217 34596
555 34596 10601 -30257 -12878 12861 12890 -32268 -9076 39759 -26269 -39727 32613 14012 -38738
568 -38738 -18583 34088 18960 -48017 -19793 47187 1806 -52116 102 40483 -7605 -32029
580 -32029 8223 26667 -7864 -31036 18548 27490 -37183 -3367 43771 -13689 -26823 13515
$$ packed form
494I46L0929l8643m3596M7695N2552o2986m7551Q1069L3818q5050j5838P1933
506B5278P707n8162m002O1174j2845n6284M1191K7831m8221k769M1431Q012m9640
519a9299j0739P4098j1520p9863K9948O7737k5965o5573K8098O9626m5367n3404
531d2223N1112K8222m1094j8309L8194J1011m9475P500M9768k8825m3927M1508
543C462M3127n4636l8371O4204K4321o5446k1609O4503K2487p3948k311O8813
555C4596k3995m0858J7379K5739K9m5158K3192M8835o6028j3458P2340j8601n2750
568c8738K0155N2671j5128o6977K8224O6980m5381n3922N2218M0381m8088k4424
580c2029M0252J8444l4531k3172M9584Q942o4673L3816M7138n7460j3134M0338
$$ plain form
592 13515 29232 -1952 -41077 24323 54154 -34604 -29391 36855 23070 -22295 -23427 34590
604 34590 29104 -35471 -2055 38455 -7656 -22243 19473 22571 -19351 -12444 28525 13609 -30286
617 -30286 -14456 41175 14665 -48409 -1054 47508 -5319 -42556 -1651 39585 -8826 -43127
629 -43127 20957 23398 -27981 -10228 13057 1128 -24909 -8714 31199 -13236 -40191 20048
641 20048 25774 -29465 -36992 22326 36374 -36432 -33056 37215 17249 -37278 -19752 26119 8650
654 8650 -27466 465 23285 -5566 -21302 13605 23808 -30671 -14392 47124 4271 -37517
666 -37517 2739 38004 9249 -46026 1594 58074 -12155 -31148 20434 21456 -918 -21881
678 -21881 8045 31798 -18381 -8445 37130 -3871 -26283 16832 26974 -18688 -27986 26126
$$ packed form
592A3515J5717l1184l9125O5400K9831q8758N213O6246j3785m5365j132N8017
604C4590n486o4575L3416M0510m6111j4587M1716L098m1922O907M0969j4916m3895
617c0286J5830N5631k6510o3074M7355M8562n2827l7237M0905M1236m8411l4301
629d3127O4084K441n1379J7753K3285j1929k6037J6195L9913m4435k6955O0239
641B0048N726n5239p527N9318J4048p2806L376P0271j9966n4527J7526M5871j7469
654H650l6116K7931K2820k8851j5736L4907J0203n4479J6279O1516m2853m1788
666c7517M0256L5265k8755n5275M7620N6480p0229j8993N1582J022k2374k0963
678b1881K9926K3753n0179R936M5575m1001k2412M3115J0142m5662r298N4112
$$ plain form
690 26126 34584 -27072 -33200 34143 29599 -39793 -18584 35073 11119 -23198 -13443 21812 5765
703 5765 -35428 8180 23837 -30472 -9100 25992 -520 -27865 -13464 30881 4673 -47669
715 -47669 -243 40576 -7368 -40768 -699 34016 -12366 -38685 14333 24961 -19560 -17554
727 -17554 19087 4104 -28388 2828 24347 -11530 -21029 14829 28253 -19274 -32375 30176
739 30176 27745 -30711 -18660 30337 25355 -28855 -17451 40128 8029 -28099 10966 23631
751 23631 -3029 -13729 12313 22426 -21553 -12448 36532 7774 -29426 3334 36879 1210
763 1210 -37756 6538 40291 -9677 -33895 16698 31339 -19836 -22949 19878 11056 -17983 -10155
776 -10155 16303 6708 -29356 524 28933 -22970 -26303 23406 15330 -23843 -24697 23100 20813
$$ packed form
690B6126Q458o1656o128O7343m544o9392K1209N3657k3954l4317R755L5255j6047
703E765m1193M3608J5657n4309K1372L5092k6512k7345J4401M4345k6208n2342
715d7669M7426M0819m7944l3400M0069L4715m6382k6319N3018J0628m4521K006
727a7554L6641j4983l2492L1216K1519l5877r499L5858J3424m7527j3101O2551
739C0176k431n8456J2051M8997m982n4210J1404N7579l2099l6128L9065J2665
751B3631k6660j0700K6042J0113m3979R105M8980k8758l7200L2760L3545l5669
763A210l8966M4294L3753m9968k4218N0593J4641n1175l113M2827q822k9039P828
776a0155K6458r595l6064K9880K8409n1903l333M9709q076l9173q54M7797k287
$$ plain form
789 20813 -41732 -18728 36180 1734 -32418 -3514 21835 -1682 -27351 243 21429 -12275
801 -12275 -19575 20321 11549 -28472 -3340 26590 -6261 -27153 4835 32263 -3305 -35144
813 -35144 14977 35364 -18935 -24818 18502 25874 -11631 -21880 24196 19577 -26099 157 27345
826 27345 -5861 -15362 16505 19843 -16763 -15514 27112 17954 -26099 -11086 35084 15442 -33172
839 -33172 -8398 34218 4882 -30768 -883 30331 -3214 -23765 12999 14304 -19571 -7923
851 -7923 17613 1269 -22768 280 26870 -10893 -35598 10145 28180 -17760 -32771 15967
863 15967 28520 -24729 -28912 19179 13438 -22700 -12480 15411 3989 -19385 -1231 16194
875 16194 -12542 -20946 17704 15051 -26872 -12407 30648 11102 -32350 -11550 34517 8181
$$ packed form
789B0813o2545K3004N4908l4446l4152K8904K5349k3517k5669K7594K1186l3704
801a2275p300L9896q772m0021K5132K9930l2851k0892L1988K7428l5568l1839
813c5144N0121K0387n4299n883M3320P372l7505j0249M6076m619m5676K6256K7188
826B7345l3206r501L1867L338l6606J249M2626r158m4053J5013M6170j9642m8614
839c3172K4774M2616k9336l5650K9885L1214l3545k0551L6764J305l3875J1648
851g923K5536j6344k4037K3048K6590l7763k4705M5743J8035m5940j5011M8738
863A5967J2553n3249m183M8091n741l6138J0220K7891j1422k3374J8154J7425
875A6194k8736q404L8650k653m1923J4465M3055j9546m3452K0800M6067k6336
$$ plain form
887 8181 -35360 2276 33823 -3586 -19515 5322 17111 -1585 -14546 13167 16828 -18345
899 -18345 -910 28503 -3650 -22877 13309 29872 -8929 -27966 17868 32296 -20003 -24759
911 -24759 24168 22451 -17017 -14005 18719 13468 -18860 -7942 20604 -2685 -19488 13473 15231
924 15231 -20609 -12940 21017 8387 -28402 -11693 28459 6261 -33429 -5806 28274 -1353
936 -1353 -31190 -2331 23573 -7586 -24053 9711 13461 -18213 -11142 15000 -396 -22024 1854
949 1854 22566 -8827 -26013 11693 23091 -17680 -24533 17413 23139 -18829 -20901 21900 16837
962 16837 -22961 -8921 23496 4411 -17001 4722 18694 -6349 -13584 16286 16056 -18346 -7552
975 -7552 27311 8385 -23962 -1794 30542 5595 -27349 3834 32948 -5149 -24141 12695
$$ packed form
887H181m3541L7636L1547l7409j5929K4837J1789j8696j2961K7713L661l5173
899a8345J7435K9413l2153j9227L6186J6563l8801j9037M5834J4428n2299m756
911b4759M8927j717l9468L012L2724n251l2328J0918K8546k3289j6803L2961J758
924A5231l5840P669L3957j2630l6789J6709M0152k2198l9690K7623L4080k9627
936a353k9837K8859K5904l1159j6467L3764L750l1674P071K6142j5396k1628K3878
949A854K0712l1393j7186L7706J1398m0771o853M1946N726m1968k072M2801n063
962A6837l9798J4040L2417j9085k1412K1723J3972k5043p235K9870k30l4402J0794
975g552L4863j8926l2347K2168L2336k4947l2944L1183K9114l8097j8992L6836
$$ plain form
987 12695 19360 -9988 -11737 12620 13077 -12914 -7480 18630 -1019 -22395 7464 19975 -11135
1000 -11135 -20607 13158 21810 -21423 -24583 23222 13968 -28294 -12025 20543 5151 -22202 -8424
1013 -8424 16415 -1823 -21385 3298 14096 -13372 -13548 14708 5628 -23435 -6984 23546 786
1026 786 -28727 2211 28025 -7571 -27591 7285 24125 -7425 -21816 11254 20945 -13031
1038 -13031 -12422 17286 6548 -15023 2830 18283 -4831 -15348 15131 19207 -15917 -13730 22427
1051 22427 17732 -19384 -12941 25486 15779 -22584 -9739 25825 8059 -20760 2075 19929
1063 19929 -5201 -12536 10430 9178 -12935 -5194 20705 3327 -23646 1816 23671 -5677
1075 -5677 -26920 2780 27159 -7078 -28978 10088 21541 -15764 -18411 9627 9167 -12925 -8952
$$ packed form
987A2695O665k9348j749K4357M57k5991N434K6110j9649k1376K9859J2511l1110
1000a1135r472L3765Q652m3233l160M7805r254m2262J6269L2568j5392k7353J3778
1013h424K4839j8238j9562K4683J0798k7468j76K8256r080k9063J6451L0530k2760
1026G86k9513L0938K5814l5596k0020L4876J6840l1550j4391L3070R691l3976
1038a3031O09K9708j0738k1571J7853J5453k3114j0517L0479M076l5124K187L6157
1051B2427m695l7116O443L8427r707l8363J2845L5564j7766k8819K2835J7854
1063A9929k5130p335K2966j252k2113P741K5899j7378k6973K5462K1855k9348
1075e677k1243K9700K4379l4237k1900L9066J1453l7305k647K8038m60k2092L973
$$ plain form
1088 -8952 11702 -284 -18607 3558 14081 -15010 -17676 14871 13342 -21143 -17924 20407 15157
1101 15157 -26437 -13830 26676 6120 -24682 -2691 17188 -140 -14629 2512 14754 -6810
1113 -6810 -9566 15895 5664 -17422 493 21397 1691 -20961 5208 29901 -4384 -25536
1125 -25536 11773 25195 -10260 -17218 14368 18076 -9735 -9599 14840 8712 -13286 49 17235
1138 17235 -4679 -13227 11538 13508 -14578 -14201 17882 14391 -22650 -11080 23507 6643 -22354
1151 -22354 -8301 18351 5037 -22301 -2109 19069 -7711 -16769 8192 6259 -15087 -8124
1163 -8124 14549 1530 -21632 -274 20129 -8868 -23881 6779 18358 -10032 -20561 8532
1175 8532 19082 -13420 -19697 14688 11921 -17720 -5295 15105 1068 -12783 1887 14689
$$ packed form
1088h952K0654j1986j8323K2165J0523k9091k666L2547j529l4485L219L8331n250
1101A5157m1594J2607M0506k0556l0802K1991J9879j7328j4489J7141J2242k1564
1113f810k756K5461j0231k3086J7915K0904j9706k2652K6169K4693l4285k1152
1125b5536L7309J3422l5455o958L1586L708k7811J36K4439o128k1998J3335J7186
1138A7235k1914q548K4765J970k8086L77L2083l491l7041J1570L4587j6864k8997
1151b2354J4053K6652j3314k7338K0192K1178k6780r058K4961j933k1346O963
1163h124K2673j3019k3162K1358K0403k8997j5013L0660J1579k8390j0529K9093
1175H532J0550l2502o277L4385k767k9641J2425K0400j4037j3851J4670J2802
$$ plain form
1187 14689 -6834 -14502 16295 13564 -17451 -6394 19891 8318 -18739 -6885 25432 7895
1199 7895 -22491 2820 23652 -2662 -15540 6635 15599 -4700 -9187 12341 9505 -12889 -2418
1212 -2418 16982 -1139 -16134 6825 19596 -5905 -20183 10496 21564 -16454 -18823 18145
1224 18145 12705 -16144 -10497 12273 7658 -16236 -7083 14025 -3817 -14702 5897 7880 -11877
1237 -11877 -11215 11521 7102 -21339 -8773 21444 1685 -25172 -2344 19954 -2052 -21731
1249 -21731 -154 18666 -3710 -18567 6587 12617 -11782 -7596 12105 1718 -12340 1983
1261 1983 16143 -4289 -18612 11834 19293 -14296 -13678 16839 15971 -11577 -14694 16340 16507 -15777
1275 -15777 -7181 18677 4905 -11068 2387 12799 -3007 -8902 11541 10300 -14509 -4312
$$ packed form
1187A4689k1523p668L0797k731l1015J1057K6285j1573k7057J1854L2317j7537
1199G895l0386K5311K0832k6314j2878K2175Q964k0299m487K1528k836k2394J0471
1212b418J9400j8121j4995K2959J2771k5501j4278L0679J1068l8018k369L6968
1224A8145n440k8849N647K2770m615k3894R153K1108j7842j0885K0599J983j9757
1237a1877O62K2736m419k8441J2566L0217j9759k6857K2828K2298k2006j9679
1249b1731K1577J8820k2376j4857K5154O030k4399M186J9701j0387j4058J4323
1261A983J4160k0432j4323L0446P459l3589O18L0517q68k7548l117L1034J67l2284
1275a5777Q596K5858j3772j5973J3455J0412j5806n895K0443j241k4809J0197
$$ plain form
1287 -4312 20635 3367 -20055 -49 21718 1517 -21545 -626 22076 -2930 -21355 5184
1299 5184 14829 -8048 -10749 6919 6398 -10741 -5563 11861 -3788 -17187 6685 13356 -11523
1312 -11523 -15907 9237 14876 -15745 -19763 15529 13526 -19689 -11137 15407 4688 -15419 -5093
1325 -5093 11056 -735 -12032 4765 9592 -10893 -6837 12926 3684 -14768 -3447 18927 4933
1338 4933 -21853 -199 24616 -3363 -19194 7775 18219 -2882 -12928 7344 14890 -8690
1350 -8690 -6569 14383 3297 -10130 4400 14043 -3416 -12868 9648 17196 -11922 -13768 17981
1363 17981 12973 -15864 -8539 15337 8379 -14308 -7409 15699 4544 -16551 720 12650 -7111
1376 -7111 -10325 7348 6524 -11686 -7668 14354 2002 -21313 -554 17670 -6198 -18703 3363
$$ packed form
1287d312K4947j7268k3422K0006K1767k0201k3062K0919K2702k5006j8425K6539
1299E184R645k2877k701J7668n21j7139N178J7424j5649j3399K3872O671k4879
1312a1523m384K5144N639l0621m018L5292k003l3215Q552K6544j0719k0107J0326
1325e093J6149j1791j1297J6797M827k0485M056J9763r242j8452J1321K2374j3994
1338D933k6786K1654K4815k7979j5831K6969J0444k1101j0046K0272P546k3580
1350h690K121K0952j1086j3427J4530R643j7459r452K2516P548k9118j846L1749
1363A7981n008k8837P325K3876o958k2687O899K3108j1155k1095J7271J1930j9761
1376g111l214J7673q24j8210M018K2022j2352k3315K0759J8224k3868j2505K2066
$$ plain form
1389 3363 15215 -5882 -19119 4030 14297 -10812 -14209 10633 7004 -12230 -4418 10117 -823
1402 -823 -13273 2814 13049 -8787 -12396 13399 10152 -13759 -8895 14774 10880 -16192 -7716
1415 -7716 20235 5169 -17227 1017 15427 -48 -10591 4162 12469 -4392 -6912 12409
1427 12409 4651 -10906 1722 14834 1077 -13725 2819 18822 -4866 -18681 10142 17799
1439 17799 -9831 -12602 11120 11579 -9857 -10177 10551 6023 -12153 214 10723 -5184 -9767
1452 -9767 5521 7515 -10882 -11586 12723 9030 -19543 -8535 17580 1339 -20356 -4141 14348
1465 14348 1328 -16870 -2492 13256 -4632 -13277 5909 5941 -9819 -3404 9105 -166 -14141
1478 -14141 507 16519 -5370 -17778 9818 15790 -10006 -13911 8284 15034 -8500 -13250 12504
$$ packed form
1389C363J1852k1097j3237K3149J0267k5109l397K4842l629j9234P812J4535j0940
1402h23j2450J6087J0235k1836l609K5795l247k3911M864K3669l894k7072Q476
1415g716K7951j5066k2396J8244J4410j5475j0543J4753Q307j6861k520J9321
1427A2409p758j5557J2628J3112j3757j4802J6544J6003k3688j3815K8823P657
1439A7799k7630k771K3722M59k1436l20K0728m528j8176J2367J0509j5907m583
1452i767J5288J994j8397p04K4309l693k8573J1008K6115j6241k1695J6215J8489
1465A4348j3020j8198J4378J5748j7888q645J9186L2j5760O415J2509r271j3975
1478a4141J4648J6012k1889j2408K7596N972k5796l905K2195O750k3534m750K5754
$$ plain form
1491 12504 11714 -10493 -3456 11212 1645 -8191 3316 10939 -4462 -7675 13640 9583 -14351
1504 -14351 -4945 17758 5881 -15369 -2860 18843 5387 -17321 -1206 17076 -1313 -12457
1516 -12457 4429 9823 -4705 -7278 7451 4058 -12115 -483 12573 -4349 -13987 4614 13358
1529 13358 -7832 -17883 7364 14962 -12523 -14896 10904 9300 -12769 -10408 8202 3564 -11809
1542 -11809 -2869 9575 -4434 -9823 6239 5689 -11301 -7332 10826 6282 -15104 -6690 17706
1555 17706 2900 -19015 55 16230 -791 -13780 1849 14196 -2832 -10985 8242 8372
1567 8372 -8067 -1799 11078 1684 -9351 2844 13771 -3151 -12752 9262 16125 -8884 -11579
1580 -11579 13213 11559 -10473 -7919 12479 9360 -10440 -4768 13547 1573 -11067 3226 8654
$$ packed form
1491A2504p90k2207P037J4668r567r836J1507P623j5401l213K1315m057k3934
1504a4351R406K2703j1877k1250J2509K1703j3456k2708J6115J8282j8389j1144
1516a2457J6886N394j4528k573J4729l393j6173J1632J3056j6922r638J8601Q744
1529A3358k1190j0051K5247P598k7485k373K5800j604k2069K361J8610m638j5373
1542a1809Q940J2444j4009n389J6062n50j6990L969J8158m544k1386Q414K4396
1555A7706j4806k1915J9070J6175j7021j2989J5629J2347j7028q153J9227J30
1567H372j6439O268J2877r394j1035J2195J0927j6922r601K2014O863k5009k695
1580a1579K4792j654k2032K554K0398l119j9800N672J8315j1974j2640J4293N428
$$ plain form
1593 8654 -5064 -7576 8194 7376 -12477 -5950 14521 875 -17012 -528 14465 -1698 -16395
1606 -16395 669 13644 -5503 -14644 4190 9983 -7873 -10029 6911 3837 -10886 -3467 9179
1619 9179 -2672 -12065 4426 10170 -8913 -11705 8850 9877 -12076 -10933 13732 8631 -14285
1632 -14285 -5571 13015 4333 -11342 -1930 12877 -157 -9609 6254 7450 -7251 -2768 10140
1645 10140 4545 -8878 -604 15465 1374 -14906 3366 18017 -2580 -14309 6895 15254
1657 15254 -5209 -11325 7981 10563 -7741 -5368 10336 1423 -8259 3389 7229 -4802 -8331
1670 -8331 6047 10631 -10310 -11022 13436 7827 -15534 -7871 12857 5675 -14432 -5924 12369
1683 12369 1201 -13511 -588 8164 -5341 -7587 5310 2807 -9515 -3809 9864 -346 -16387
$$ packed form
1593H654j3718k512J5770q18j9853O527K0471j3646j7887J6484J4993j6163j4697
1606a6395J7064J2975j9147r141J8834N793j7856k156J6940l074j4723P419J2646
1619I179j1851r393J6491N744j9083k792K0555J027k1953J143K4665n101k2916
1632a4285Q714J8586q682j5675R412J4807j3034r452J5863J196j4701M483J2908
1645A0140n595j3423Q274J6069j4091j6280J8272J4651k0597j1729K1204Q359
1657A5254k0463o116J9306K582j8304K373J5704q913r682J1648L840j2031l529
1670h331J4378M584k0941p12K4458n609k3361P663K0728p182k0107Q508J8293
1683A2369j1168j4712J2923Q752j3505k246J2897k503j2322N706J3673j0210j6041
$$ plain form
1696 -16387 1071 15620 -5447 -15461 4705 12720 -5347 -14203 5150 12394 -7108 -9132 7648
1709 7648 6099 -7063 -2654 8859 184 -8808 6144 10653 -7841 -8314 12360 9274 -11971 -6072
1723 -6072 15551 8567 -12248 -4681 14750 5078 -12118 -417 12491 607 -7487 3955 8236
1736 8236 -5376 -4795 10180 2340 -10921 1396 12022 -1337 -13144 1829 14920 -5054 -15408
1749 -15408 6529 12521 -7875 -11654 5809 7979 -8801 -7519 7905 1532 -10502 865 7150
1762 7150 -6563 -8475 5767 6337 -9387 -9001 9842 7104 -14995 -7314 13725 2542 -13658
1775 -13658 -2519 11326 1605 -12292 -256 10859 -4846 -8173 7557 4729 -7403 -1577 9432
1788 9432 1670 -10291 1561 14128 -2681 -12806 7512 13291 -6848 -9932 9052 10917 -5975
$$ packed form
1696a6387J7458J4549k1067j0014K0166Q015j8067q856J9353P244j9502k024J6780
1709G648j549j3162M409J1513q675q992J4952M509j8494m73K0674l086k1245N899
1723f072K1623o984k0815P567J9431r672j7196J1701J2908j1884q094J1442M281
1736H236j3612N81J4975p840j3261J2317J0626j3359j1807J4973J3091j9974j0354
1749a5408K1937N992k0396l779J7463K170j6780J282J5424o373j2034J1367O285
1762G150j3713j912J4242N70j5724L86J8843k738k2099P681K1039j1183j6200
1775a3658J1139J3845r721j3897J2036J1115j5705l327J5730k828j2132N826J1009
1788I432p762j1961J1852J2567j6809j0125K0318N779k0139l084J8984J865j6892
$$ plain form
1801 -5975 -7200 10486 7845 -9106 -1893 9903 390 -6436 3544 8735 -3735 -7436 9228 7106
1815 7106 -11759 -4832 13289 3252 -12987 -2044 13552 749 -14428 239 10751 -2971
1827 -2971 -10708 2822 7765 -5987 -7733 5546 2050 -9648 -1495 9037 -3438 -11665 3673
1840 3673 9505 -7737 -12422 6943 10152 -10286 -10996 9314 7271 -10559 -6786 8671 4396 -9037
1854 -9037 -1475 8847 -2666 -7694 5484 4950 -6812 -3150 9857 4992 -10626 -2839 14431
1867 14431 2234 -13826 1056 15164 31 -11321 2371 12495 -1814 -8887 6482 8652
1879 8652 -5788 -1387 8622 -36 -7004 2979 9261 -3026 -9792 7162 12078 -9105 -9995 10449
1893 10449 8550 -9988 -7814 9271 6850 -10080 -5856 8773 1112 -8561 1297 6018 -4956
$$ packed form
1801e975j225J7686k641j6951P213J1796r513o826R980N191j2470l701J6664k122
1815G106j8865O927J8121j0037j6239J0943J5596j2803j5177J4667J0512j3722
1827b971p737J3530M943j3752j746J3279l496j1698Q153J0532j2475q227J5338
1840C673N832j7242m685J9365L209k0438p10K0310k043j7830L773J5457m275j3433
1854i037P562J0322j1513n028J3178n34j1762L662J3007m865j5618P787J7270
1867A4431j2197j6060J4882J4108j5133j1352J3692J0124j4309p073J5369K170
1879H652j4440M401J0009q658o968R983O282j2287o766J6954M916k1183q90K0444
1893A0449j899j8538K174J7085k421j6930M224J4629p661r673R858M721j0974
$$ plain form
1906 -4956 -6112 5631 2818 -10440 -5129 10895 1379 -15218 -1354 13564 -2495 -14256 789
1919 789 10910 -2992 -11588 2306 8373 -4989 -6728 4972 2725 -6637 -923 7728 -1671 -9187
1933 -9187 4471 9848 -7249 -10097 9281 10363 -9228 -8032 11605 8149 -9490 -4660 10683
1946 10683 4616 -7620 -565 9103 -39 -5962 5324 6585 -5758 -2444 10107 3587 -9495
1959 -9495 -1277 12186 1216 -12752 1161 14134 -1684 -11534 3543 10259 -4102 -9073 4475
1972 4475 6839 -7169 -4454 7687 -344 -8914 2176 6730 -4846 -8385 4637 7687 -8641
1985 -8641 -10107 8121 6539 -11540 -7302 9570 3977 -10770 -4267 8497 607 -10387 291
1998 291 7605 -5036 -6103 5933 2720 -7259 -2365 8105 1924 -10651 27 13009 -2261
$$ packed form
1906d956j156J1743k813j3258N311J6024r516j6597J3864J4918j6059j1761J5045
1919G89J0121j3902q596J3894O067j3362j739J1700k247r362N714Q651r399p516
1933i187J3658N377j7097k848J9378J082j9591J196J9637l456j7639M830J5343
1946A0683o067j2236P055R668r142n923J1286J261j2343L314J2551o520j3082
1959i495Q218J3463j0970j3968J3913J2973j5818r850J5077O716j4361m971J3548
1972D475K364j4008K715J2141q031q570J1090M554j1576l539J3022L050j6328
1985h641j466J8228j582j8079M238J6872n593j4747O503J2764p890j0994J0678
1998B91P314j2641j067J2036l213r979M894J0470o181j2575J0678J2982j5270
$$ plain form
2011 -2261 -12066 4153 11073 -3627 -9341 5844 10286 -4773 -6083 7645 5481 -6118 -1271
2024 -1271 8210 662 -6279 4156 8546 -4718 -6868 9115 8629 -8740 -4882 12133 5205 -11001
2038 -11001 -3226 11239 2874 -9879 -467 9465 -602 -7961 1782 6275 -5123 -5388 6300 1672
2052 1672 -9248 -256 8703 -2217 -11465 1704 10832 -5774 -12423 4880 8936 -7296 -10190
2065 -10190 4917 7049 -7065 -6581 6720 2333 -8294 -214 6023 -4147 -6348 5477 4675 -7439
2079 -7439 -5642 8670 5607 -11361 -4213 12608 3110 -10944 -1767 10725 2298 -9804 473
2092 473 10313 -1498 -5454 6385 4583 -5294 -246 7795 318 -7531 2942 11074 -2291 -10418
2106 -10418 6300 12105 -5592 -9112 7329 9535 -5560 -7531 6636 6101 -6941 -2807 7343
$$ packed form
2011b261r805J6219O920j4700n714J5185M442j5059j310J3728k164j1599M847
2024a271R481p548o941J0435M390j3264k150J5983m86j7369L858J7015o928j6206
2038a1001P775J4465q365j2753R412R932j0067p359R743M493j1398k65J1688m628
2052A672j0920Q992Q959j0920r248J3169R128j6606o649J7303M056j6232k894
2065a0190J5107K132j4114M84J3301m387j0627Q080O237j0170k201J1825q02j2114
2079g439J797J4312l063j6968P148J6821r498j4054R177J2492q427j2102J0277
2092D73R840j1811l956J1839j802r877N048Q041p477p849J0473Q132j3365q127
2106a0418J6718N805j7697l520J6441K206j5095j971J4167n35j3042M134J0150
$$ plain form
2119 7343 13 -5555 3063 5208 -5167 -6253 6296 4871 -10309 -5284 10477 2979 -12541 -3595
2133 -3595 10332 862 -11650 -1385 8236 -1702 -9205 814 5162 -4692 -4948 4596 1321 -7409
2147 -7409 -641 7869 -2354 -10620 2657 9743 -5231 -10746 6008 10079 -6932 -8592 7854
2160 7854 6893 -6761 -4446 7211 3860 -6333 -351 7247 -1405 -5182 6433 6403 -6063 -3432
2174 -3432 9194 4732 -9124 -2669 11603 3024 -10280 341 11776 360 -8708 1627 8749
2187 8749 -1765 -6659 4323 5825 -5980 -2340 7526 -447 -7314 2147 7709 -3219 -8748 3943
2201 3943 8569 -7096 -9472 6604 6681 -8123 -6831 6735 4913 -8476 -4679 7167 -91 -8689
2215 -8689 1127 5247 -4978 -5206 4686 3082 -7551 -4002 8581 1706 -11246 -1665 9858 -1026
$$ packed form
2119G343p330n568Q618K145j0375j086J2549j425j5180N025J5761p498j5520Q946
2133c595J3927r470j2512J0265R621r938p503J0019M348r854k56R544l275q730
2147g409O768Q510j0223q266J3277P086j4974n515J6754M071j7011j660J6446
2160G854r61j3654K315J1657l351j0193N982P598q652l777J1615l0j2466K631
2174c432J2626m462j3856O455J4272q579j3304J0621J1435j1416r068J0335P122
2187H749j0514m894J0982J502j1805L640R866p973o867R461N562j0928n529J2691
2201C943M626j5665k376J6076P7j4804J292J3566j822j3389L797J1846p258q598
2215h689R816M120j0225k28R892j604j0633L549J2583o875j2952R581J1523j0884
$$ plain form
2229 -1026 -10793 783 10269 -1337 -8172 3361 8119 -3924 -5517 4613 3900 -5355 18 7414
2243 7414 -571 -6072 3467 8817 -3913 -7212 7804 9144 -6894 -6350 9268 6621 -8229 -3695
2257 -3695 9366 4125 -6578 -869 7467 671 -5663 2913 5403 -4866 -3175 6720 2284 -7931
2271 -7931 -1597 9748 768 -11083 438 10885 -2828 -11210 1896 8127 -3880 -8651 2804
2284 2804 5657 -5029 -5009 4843 237 -7402 557 5409 -4758 -7088 4193 6063 -7346 -7769 7846
2299 7846 6431 -9531 -6015 8521 4152 -8523 -4771 7758 2598 -7568 538 6901 -2444 -4061
2313 -4061 5379 3130 -5944 -1069 8373 1267 -8560 1045 11113 -532 -9807 3157 11216 -1559
2327 -1559 -8105 3538 9130 -2998 -6133 5342 4570 -4230 -552 5754 -92 -5383 3257 6714
$$ packed form
2229a026r767J1576R486j1606o835J1533M758j2043j593J0130p13r255N373P396
2243G414p985n501R539N350j2730l299J5016J340j6038N44J5618k647j4850M534
2257c695J3061n241j0703N709Q336o796o334Q576K490j0269J691R895m436j0215
2271g931O334J1345q980j1851J1521J0447j3713q382J3106O231j2007m771J1455
2284B804K853j0686K0R852m606p639P959M852j0167k330J1281J870j3409m23J5615
2299G846j415j5962L516J4536m369j2675L752J2529n160j0166Q106O363r345j617
2313d061R440k249r074M875R442p106r827R605J0068j1645r275J2964Q059j2775
2327a559o546J1643N592j2128l135J1475p72q800L678O306n846n291Q640L457
$$ plain form
2341 6714 -4879 -6820 6787 6515 -7814 -6164 8646 5789 -9763 -4707 8804 2470 -8489
2354 -8489 -2099 5822 -880 -6762 1048 4136 -4439 -4079 5157 1058 -8218 -1413 7675 -1317 -10391
2369 -10391 175 9586 -2750 -11135 3086 8396 -5045 -7535 4093 5396 -4547 -4986 5276
2382 5276 1632 -6613 578 6605 -2686 -4904 5101 6045 -5072 -5231 7533 6216 -8085 -3644
2396 -3644 9965 4075 -7900 -1226 9045 2156 -6585 579 8326 -1197 -5725 4893 4236 -5426
2410 -5426 -1000 7179 1289 -6681 823 9356 -2009 -9467 3556 8445 -4643 -7792 4382 6817
2424 6817 -5079 -6463 5239 4530 -6309 -2929 5884 -411 -6505 737 4678 -4732 -5747 5300
2438 5300 4114 -8207 -5026 7752 2243 -10125 -3793 8610 1626 -10072 -1333 8256 -1154 -7909
$$ packed form
2341F714j1593j941J3607k72j4329J650J4810k857j5552N056J3511o334j0959
2354h489O390P921o702n882P810L088q575L60R236m099r276O805R088q992r074
2369a0391J0566R411j2336q385J4221N310j3441k490J1628J303r943m39J0262
2382E276l644q245P191O027r291k218J0005R44j1117j59J2764j317j4301M441
2396c644J3609n890j1975O674J0271o889q741P164P747r523m528J0618o57r662
2410e426M426Q179n890p970P504Q533j1365p458J3023M889j3088l149J2174K435
2424F817j1896j384J1702p09j0839L380Q813o295o094P242L941r410j015J1047
2438E300j186j2321L181J2778n509j2368O332J2403o984j1698Q739R589r410o755
$$ plain form
2452 -7909 1530 5055 -2891 -4295 3967 2395 -5793 -857 6878 -873 -6881 2416 8862 -2742 -8050
2467 -8050 4773 9126 -5518 -6804 6579 6882 -5347 -3899 6748 4135 -4329 -458 6110 -44
2481 -44 -4241 3703 5021 -5061 -2606 6897 4221 -7253 -2186 9641 3032 -9487 -685 10141
2495 10141 -36 -8938 -180 6995 -1065 -6648 2131 4501 -4743 -2971 4570 -755 -6678 590
2509 590 5880 -3619 -8704 3437 7443 -6462 -8761 5847 6077 -6818 -6749 4823 4387 -6354 -4565
2524 -4565 5465 1265 -6070 1204 4444 -3768 -3706 4961 3345 -6839 -2838 8713 2010 -9294
2538 -9294 -539 9781 1202 -8169 623 9376 119 -7065 2588 6762 -2411 -3449 4906 3094 -3768
2553 -3768 613 6305 -794 -6140 3601 7518 -3988 -6674 5800 7477 -5631 -6453 7041 6526
$$ packed form
2452g909R439L525p946j404Q262j572q188M936P735p751o008R297O446j1604n308
2467h050J2823M353j4644j286J3383L03j2229J448J0647k613q464L871O568o154
2481d4m197P944J318j0082K455R503k676j1474N067J1827o609j2519Q802J0826
2495A0141j0177q902Q758P175q060n583Q779K370r244J772P541n325n923P268
2509E90N290r499n085J2141M006j3905k299J4608K30j2895O9J1572m36j0741J789
2524d565J0030m200p335P274L240q212O2Q667j616j0184M001J1551o703j1304
2538i294Q755J0320q579r371Q792Q753r257p184R653M174r173j038Q355j812o862
2553c768M381N692p099n346R741L917j1506k686J2474J677j3108q22J3494n15
$$ plain form
2567 6526 -6860 -4095 6710 2209 -6141 -1158 4615 -960 -5316 2045 4027 -5282 -3518 5984
2581 5984 1417 -7878 -2487 7634 336 -9976 -1073 8479 -2095 -9373 1437 6856 -3168 -6575
2595 -6575 2444 3998 -4767 -3962 4813 532 -6115 1164 5699 -2804 -5807 3700 6197 -4958 -6379
2610 -6379 6941 6119 -7614 -4216 7466 3913 -6082 -1954 6903 2152 -5734 1362 6361 -1962
2624 -1962 -3490 4679 3788 -4281 -1154 7159 1861 -6932 894 9102 -908 -8096 2687 8262 -2374
2639 -2374 -7075 3218 6652 -3624 -5158 4751 3426 -4998 -1371 4390 -671 -5410 1505 5094
2653 5094 -4719 -5854 5237 4449 -7326 -5159 6426 3412 -8459 -4307 7267 1328 -8530 -1342
2667 -1342 5571 -892 -5841 1121 3758 -3905 -3269 4179 948 -6385 -523 6758 -1191 -7444 1554
$$ packed form
2567F526j3386K765J0805m501q350M983N773n575m356P361J982r309J764R502
2581E984m567r295N391J0121p298j0312Q903R552j0574p278J0810N419j0024l407
2595f575R019J554q765Q05Q775m281o647P279M535q503l003R507K497j1155j421
2610f379J3320q22j3733L398J1682l553r995M128Q857m751p886P096M999q323
2624a962j528Q169q91q069L127Q313n298q793P826Q208j0010p188J0783N575j0636
2639b374m701J0293L434j0276j534R909j325q424L627N761n061m739O915L589
2653E094r813j135J1091p88j1775K167J1585l014j1871M152J1574n939r858P188
2667a342O913o463m949O962K637p663O36P448l231p333N862P281p949o253Q998
$$ plain form
2682 1554 8324 -2427 -8566 3749 8147 -3966 -6247 4818 5710 -3458 -3473 5094 2750 -4120 809
2697 809 5439 -1811 -3553 4812 4385 -4476 -3557 7321 5238 -7132 -3125 8986 2929 -7070 -1645
2712 -1645 7607 1472 -6106 321 6223 -1180 -4285 3310 3004 -4833 -1455 4873 -463 -6054 663
2727 663 6752 -2270 -9266 3328 7746 -4788 -8522 3047 5148 -5106 -6623 2927 3411 -5489
2741 -5489 -3309 3402 -919 -4211 1893 3751 -3898 -4964 4525 3330 -6787 -3960 7040 2101
2755 2101 -7416 -2459 8024 1503 -7380 -1041 6733 102 -6402 2208 4797 -2073 -2012 4759 2049
2770 2049 -4817 773 7156 -744 -6606 3709 7623 -3148 -6536 4224 8088 -3930 -5416 5780
2784 5780 5645 -4319 -2744 5201 1948 -4695 -254 4918 -1707 -4261 3775 3734 -4897 -3323 6122 2704
$$ packed form
2682A554O770j0751o139J2315M398j2113k281J1065Q92r168j5Q567k344o870M929
2697H09M630p250j742Q365m27q861R19J0878k083j2370M007J2111o057r999N425
2712a645R252o135p578O427N902p403l105P595l06p837L378O328n336n591O717
2727F63O089r022o996J2594M418j2534l734J1569K101j0254j517R550M84q900
2741e489K180O711m321l292O104J858p649j066R489j195j0117K827J1000m939
2755B101r517M957J0483o521q883O339P774o631o504Q610K589o870O1O771k710
2770B049o866N590O383p900n862J0315L914j0771l388J0760L864j2018j486J1196
2784E780j35r964J575P945l253o643M441N172o625k554Q036m1q631J574R445l418
$$ plain form
2800 2704 -7053 -2804 7181 1480 -8671 -1473 7339 -907 -7510 726 5215 -2084 -5338 1573 2854
2815 2854 -5143 -2642 3886 -969 -6339 431 4824 -2695 -6838 2864 6370 -4796 -6642 5074
2829 5074 5378 -5759 -4405 5289 3657 -4905 -1812 5613 1306 -4820 1302 4877 -2587 -3115 5015
2844 5015 3660 -4790 -1887 7430 2501 -6961 666 8430 182 -6752 1613 7762 -903 -5976 2636
2859 2636 6000 -2145 -3314 3817 2743 -3899 -611 5122 -1252 -5333 2894 5553 -4568 -5322 4783
2874 4783 4758 -6237 -4735 5849 3577 -6588 -4083 5412 1222 -6021 -1509 4067 -823 -4636 1541
2889 1541 2246 -4364 -2812 4284 797 -6735 -1025 6701 -397 -8113 444 7913 -1768 -7294 2156
2904 2156 6778 -2676 -5839 2877 4089 -2883 -1125 4440 704 -3833 2443 4800 -2427 -3824 4198
$$ packed form
2800B704r757M249R985n701j0151P198Q812q246o603Q236M489p299l254O911J281
2815B854p997K501O528m855n370O770M393p519m143R702L506j1166j846J1716
2829E074L04j1137J354R694j632q562L093P425m307o126O122L575p464n28Q130
2844E015j355q450K903R317m929r462P627P764q248o934Q365O149q665n073Q612
2859B636L364q145j169P131j074o642L288N733o374m081Q227K659j0121p54J0105
2874D783k5j0995J502J0584k272j0165K505R495m190p243M512N576m890l813O177
2889A541P05o610J552P096l487p532N710P726p098p716Q557P469r681n526R450
2904B156M622r454l163Q716J212o972J758N565l736m537O276K357p227j397Q022
$$ plain form
2919 4198 4594 -4589 -4309 6927 5161 -5771 -3866 6912 3749 -5686 -1536 6287 1710 -4685 773
2934 773 4493 -1759 -2428 4117 2071 -4935 -841 6153 1025 -6395 377 7173 -1463 -8136 1238
2949 1238 6305 -1833 -6357 2036 4991 -2998 -4647 2228 1678 -4292 -1313 3504 -1303 -5224 2055
2964 2055 3287 -4210 -5245 4578 3680 -6570 -4335 5722 2752 -6989 -2942 5912 1679 -5777 -1097
2979 -1097 4782 -471 -4020 1801 3550 -3176 -1601 4969 1604 -5259 262 6912 -201 -6318 1748
2994 1748 7721 -1457 -6477 3512 7039 -2341 -4336 4303 4786 -3041 -1954 4603 1372 -3469 1192
3009 1192 4749 -1926 -3530 3895 3949 -4223 -3674 5692 3576 -6197 -3044 6485 2124 -6670 -1408 5885
3025 5885 325 -5916 282 4564 -2420 -4026 2437 1962 -4745 -1746 4229 -541 -6184 146 5414
$$ packed form
2919D198L96r183K80J1236j766j0932J905J0778l163r435M150P823m577o395N458
2934G73L720o252o69O545k046p006M094O994n128p420O772O796q636o673R374
2949A238N067q138m524Q393K955p989j649O875n50n970K979M817m807l921P279
2964B055J232p497j035R823q98j0250K235J0057k970r741M047Q854m233p456M680
2979a097N879n253l549N821J749o726J575O570l365o863N521O650p113o117Q066
2994A748N973r178n020R989L527r380j995Q639M83p827J087O557l231m841M661
3009A192L557o675j604P425N4q172N49R366k116r773L153R529m361q794N262P293
3025E885n560o241O198M282o984j606O463m75o707K999N975m770n643O330N268
$$ plain form
3040 5414 -2205 -6771 2196 5775 -3973 -6339 3659 4557 -4210 -4646 3823 2817 -4497 -1727 3973
3055 3973 24 -3835 1635 3518 -3058 -3433 4446 3249 -5395 -1918 7033 2154 -6416 -867 7528
3070 7528 1435 -6116 529 6494 85 -4231 2332 4503 -1795 -1966 3821 1674 -3798 412 5590
3085 5590 -952 -5086 3047 6025 -3287 -5706 4268 5994 -4481 -4949 4810 4032 -4865 -3228 4077
3100 4077 1486 -4405 -704 3338 -1897 -3801 2448 1992 -4863 -2885 4769 1049 -6837 -1832 6232
3115 6232 289 -8078 -934 6391 -836 -6994 405 4859 -1892 -4152 1927 2573 -3217 -964 3914
3130 3914 -595 -4490 1820 4916 -2467 -5174 3769 5819 -4035 -5074 5069 5383 -4204 -3430 5051
3145 5051 3524 -4076 -1351 4823 800 -2899 1774 3565 -2278 -2061 4555 2464 -4638 -1158 6545
$$ packed form
3040E414p619m566Q967L579r748k366R998Q98q767m36Q469j006p314K770N700
3055C973l949l859N470J883o576l75P879j197q644L477Q951m879q570N549Q395
3070G528o093p551O645N965o409m316O563K171o298j71N787k147n472M210N178
3085E590o542m134Q133K978r312k419R974J726j0475m68R759p78q897J637P305
3100D077k591n891L701M042n235j904O249m56o855J978P654l720p886N005Q064
3115F232n943q367P144P325p227o158P399M454o751k260O079O46n790K253M878
3130C914m509l895O310L096p383k707Q943K050r854j039J0143L14r587P74Q481
3145E051j527p600K725O174m023l699M673J791n843K17O616k091p102L480P703
$$ plain form
3160 6545 1244 -6122 -262 7128 162 -6271 473 6133 -911 -4859 1531 3946 -2629 -2753 2824
3175 2824 961 -3783 -461 3906 -1613 -5270 1888 4405 -4283 -5652 3876 4334 -5350 -4892 4423
3190 4423 3083 -5607 -3273 4066 1169 -4864 -546 3589 -1360 -3448 1926 2231 -4041 -2383 4838
3205 4838 1463 -5898 -584 6392 271 -6122 608 6852 -749 -5792 2369 5587 -1999 -3446 3138
3220 3138 3885 -2672 -1167 4206 620 -3149 2113 4800 -1983 -3651 3747 4997 -3652 -3563 5194 3971
3236 3971 -4927 -2953 5692 2733 -4831 -1214 4913 361 -4452 619 3649 -2140 -2931 2993 1572
3251 1572 -4308 -1346 4437 -235 -5925 202 5500 -1822 -6642 1145 5074 -2867 -5814 2120 3999
3266 3999 -3729 -4122 2781 1610 -3932 -1325 3215 -950 -3962 1880 3484 -3530 -3786 4234 3494 -5311
$$ packed form
3160F545n301p366N860P390o966o433O744N660p044l948O390K415o575j24N577
3175B824j863m744L322M367n519l657P158K517q688j369R528M58r684M58R315
3190D423j340q690K334P339k897o033M318M135m949k088N374L05o272J658P221
3205D838l375p361N314O976o121o393O730O244p601n043Q161L218p586j447O584
3220C138P47o557J505N373l586l769N262K687o783j668P398J250q649Q9Q757j223
3236C971q898J974Q645k959p564L617O127m552m813N071L030n789p91N924j421
3251A572n880K962N783m672n690O127N298p322m820P787L929p941k947P934J879
3266C999p728l93O903j171n542K607M540m165l012N842J604p014k56Q020p40q805
$$ plain form
3282 -5311 -3064 5787 2418 -5749 -1914 5653 1762 -4992 9 5113 54 -3246 1638 2967 -2351
3297 -2351 -1149 4309 1677 -3808 1327 6137 -463 -4998 1510 6240 -1781 -5411 3581 5995 -2462
3312 -2462 -4011 3732 4312 -3300 -2200 3055 949 -3011 479 3031 -2085 -3738 3373 2624 -4737
3327 -4737 -3293 4897 2352 -6116 -2806 5553 1497 -6367 -1777 5075 213 -5354 -333 2991 -1736
3342 -1736 -3254 1912 1297 -3942 -959 4002 -763 -5301 1304 5191 -1688 -6067 1608 5574 -3085
3357 -3085 -5266 3376 5065 -3170 -3458 3964 2760 -3510 -816 3491 -203 -2840 2579 3177 -2584
3372 -2584 -2350 5169 3586 -4656 -1994 6259 1887 -5289 -809 5960 1311 -4751 639 4725 -480
3387 -480 -3386 1930 2971 -2393 -1438 3105 816 -3902 47 4314 -1393 -5416 1621 5529 -3008
$$ packed form
3282e311K247Q851l369q167L835P567l891o754N001N104n059l300M884J329n318
3297b351J202N458k632n485N135M810o600m535O508M730q021l630Q992K414q457
3312b462j549P743N80p612J100N255k106l960L490K552n116j653P111p49p361
3327d737J444Q190k545q468L310Q359m056p864M590O852m862n567N021L324m727
3342a736j518N166o15n239K983M961m765m538O605L887o879m379P675L966q659
3357c085k181Q642J689q235k88P422j204o270K694M307l694k637N419N98n761
3372b584K34P519j583q242K662Q253m372p176M480O769m649o062N390M086n205
3387d80k906N316J041n364R55M543k289m718L949M267n707m023P037L908q537
$$ plain form
3402 -3008 -5562 2844 4397 -3789 -4879 3412 3039 -4195 -2401 3166 661 -3896 -412 2632 -1891
3417 -1891 -3690 2262 2443 -4497 -2625 4333 1643 -5581 -1629 5430 833 -5704 -518 5479 -316
3432 -316 -5085 827 4362 -1582 -2720 2443 2612 -2831 -821 3907 69 -3828 1945 4513 -1539
3447 -1539 -3669 3180 5049 -2964 -3930 4680 4594 -3639 -2541 4554 2992 -3761 -930 4426 500 -3152
3463 -3152 1414 3384 -2313 -2252 3415 1856 -4365 -1129 4912 561 -5705 -515 5793 -787 -6085
3478 -6085 484 4928 -1579 -5281 1335 3230 -2840 -3278 2449 382 -3984 -513 2562 -1617 -4771
3493 -4771 1808 3718 -3492 -4449 3409 3216 -4395 -3807 4402 2928 -4986 -2450 4523 1183 -3943 -402
3509 -402 3460 -747 -2439 2104 2205 -2397 -1058 4437 1596 -4897 244 6015 704 -5264 1075
$$ packed form
3402c008k554Q406J553q186j090Q291l73p234J794N567k505m557L484L044m523
3417a891j799N952J81o940J872O958k690p224L952P059m597o537N186N997n795
3432c16m769N912L535n944j138N163J69n443K010M728l838l897N773K568o052
3447a539k130O849J869q013r66Q610q6q233J098P095j562o753K831N356l926l652
3463c152M566J970n697O1N667j559o221L236O041m351o266N190O308o580n298
3478f085O569M444o507l702O616J895o070m38N727k067m366L471L075m179l154
3493d771O579J910p210r57P858j93p611N88Q209j474p914K536O973l340n126L541
3509d02L862m207j692M543J01m602J339N495k841o493N141N771n311n968O339
$$ plain form
3524 1075 5903 -895 -5244 1372 5324 -1784 -3470 2536 2982 -2364 -1057 3064 416 -2774 1467
3539 1467 3463 -2165 -3324 3463 3528 -3844 -3984 4339 3117 -4869 -3072 4577 2274 -4763 -1718 3865
3555 3865 261 -3572 150 2392 -2277 -2365 2401 921 -4477 -1045 4145 -494 -6195 -311 5364
3570 5364 -1472 -5660 330 4948 -1679 -4598 1896 3465 -2458 -2841 2433 1594 -2877 82 2845
3585 2845 -773 -3026 2330 3482 -2882 -2972 4428 3772 -4151 -2267 5171 3173 -4600 -1753 4499 1805
3601 1805 -4024 123 4369 -260 -2766 2408 2070 -2314 -855 3395 1044 -4087 116 4634 -418
3616 -418 -4937 1543 5276 -1883 -5124 1885 4210 -2809 -4102 2497 2232 -3275 -1765 2700 -312
3631 -312 -3576 363 2637 -2300 -3332 2394 2489 -3958 -3036 4157 1995 -5181 -2374 4613 1048 -4924
$$ packed form
3524A075M828o798m349O616L952p108j686O006M46n346J307M121k648l190M241
3539A467J996n628j159O787O5p372j40Q323j222p986J797P649k303p037L045N583
3555C865l604l833L722K242m669q8M766j480n398L432N190m639n701N884N675
3570E364o836m188N990M618o627k919O494J569n923l83N274q39m471K959K763
3585B845l618k253N356J152o364r0P400o56p923J884P438j998p773K847O252k694
3601A805n829M147M246m629k506N174l38m384J459M250k351n131M203M518n052
3616d18m519O480L733p159l241P009K325p019j293O599k65n507J510M465l012
3631c12l264L939K274m937j032N726R5o447R22P193k162p176K807O987l565n972
$$ plain form
3647 -4924 -773 4318 -420 -4213 448 3200 -1354 -2416 1998 1768 -2934 -550 3837 -128 -4060
3662 -4060 1101 4917 -1391 -4349 2239 5020 -2177 -3996 3317 4102 -2547 -2573 3594 2538 -2560 -463
3678 -463 3641 30 -2473 1907 2958 -2090 -2002 3696 2228 -3986 -1706 5029 1454 -4993 -819 5319
3694 5319 487 -4976 -11 4105 -826 -3774 1048 2217 -2293 -2100 2227 211 -3424 4 3090
3709 3090 -1643 -4644 1664 4106 -3064 -4858 2547 3780 -3791 -4218 3087 2969 -3690 -2431 2932
3724 2932 1021 -2978 -34 2591 -1249 -2185 2239 2177 -3224 -1841 4259 1256 -4582 -878 5562 1059
3740 1059 -4855 286 5112 -62 -3950 876 3996 -708 -2526 2299 2079 -1989 -328 3408 -63
3755 -63 -3175 1618 4134 -1674 -3928 2851 4626 -2938 -3917 3610 3873 -3479 -2837 3488 2064 -2987
$$ packed form
3647d924M151N091m738l793M661K752m554j062M414k30m702K384M387l965l932
3662d060N161L816o308k958O588K781p197j819P313P85o649k6O167j056n098K097
3678d63M104l611k503M380J051n048Q8N698j468o214K280O735l575o447M174O138
3694E319m832n463M965M116m931k948M822J169m510J93M327k016l635L428L086
3709C090m733l001O308K442p170j794P405J233p571m27P305j18o659J259N363
3724B932j911l999K944K625l840r36M424o2n401J383O100l003n838L704O440m503
3740A059n914N141M826n174l888M826L120m704j818M825k20m068J661L736l471
3755f3l112M793K516n808k254O779J775p564r79P527K63p352O42O325j424n051
$$ plain form
3771 -2987 -1484 2846 -227 -2959 904 2207 -2817 -2196 2850 1265 -4674 -1671 4398 286 -5533
3786 -5533 -852 4652 -552 -5026 -85 3784 -1221 -3973 1111 2573 -2080 -2185 2118 490 -3233
3801 -3233 136 3007 -1128 -3695 1681 3763 -2482 -3822 3326 3702 -3221 -2779 3766 2983 -3181 -1816
3817 -1816 3778 1419 -2937 299 3380 -319 -1837 2518 2758 -2070 -1036 4116 1305 -3881 -309
3832 -309 4988 437 -4429 479 5162 -627 -4210 1535 3723 -1532 -2837 2275 2417 -2146 -1384 2267
3848 2267 43 -3327 887 2885 -2122 -3425 2165 2958 -3161 -3598 3158 2555 -4312 -2939 3414 1586
3864 1586 -4230 -1613 3110 -229 -3447 129 2235 -1783 -2448 2157 1417 -3387 -816 3707 195
3879 195 -4560 151 4649 -728 -4540 1417 4631 -1460 -3879 2086 3583 -1939 -2246 2614 1694 -2201
$$ packed form
3771b987J503M330l073k732L863J303n024O21N046j585n939L003O069m112n819
3786e533M681N504n204m474M941L869n005k752N084J462m653j05M303j628l723
3801c233L369K871m135k567N376K082o245j340P148L76o923M42O545p83o164J365
3817a816N594k359m356L236L081l699j518M355K40m828J034N152k811n186L572
3832c09N297m551m866M908M683n789l583N745K188n255j305N112J42m563P62L651
3848B267k224l370M214J998n007j303N590P93o119m37O756o03o867J373O353j828
3864A586n816K617M723l339l218L576K106m018o65M605p40m804K571M523l512
3879A95m755M711M498n377l812N957L214o091k419N965J497n522l07M860r20l895
$$ plain form
3895 -2201 112 3301 -318 -2444 1771 3045 -2538 -2813 4094 3358 -3686 -2089 4305 2281 -4220
3910 -4220 -1517 4137 1219 -3303 -272 3166 -70 -2769 1132 2351 -2015 -1041 3075 606 -3389
3925 -3389 -241 3990 -1195 -4600 752 4243 -1719 -4566 1355 3624 -2554 -4041 1658 2165 -1975
3940 -1975 -1949 2185 -402 -2767 114 1926 -2192 -2946 2189 2004 -3598 -2324 3552 2054 -4290 -2096
3956 -2096 4248 1771 -3890 -1139 3944 640 -3019 458 2769 -512 -1732 2315 1626 -2380 -270
3971 -270 4012 -125 -3072 1193 4621 -867 -4106 2048 4730 -1591 -3555 2653 3654 -2180 -2417
3986 -2417 2567 2023 -2102 -475 2447 -201 -2430 1553 2482 -2523 -2643 3153 2115 -3769 -2760 4091
4002 4091 1472 -4682 -1544 4011 322 -3968 -524 3041 -1033 -3264 794 1555 -2093 -1709 2025
$$ packed form
3895b201K313L189l619k126M215J274n583k75O907p36p044J597O394k024o501
3910d220K703N654k918m522L031L438l236k699L901J219m366R74M116k469l995
3925c389L148M231n185l405N352L491n962k847N921K269o178j487N699N07m140
3940a975K6M134k587k365K881J812m118p54N135j85n602J274N876j498o344K194
3956b096O344k477n661K751N083l304l659L477K311l281j220M047o89m006K110
3971b70M282m137k947M265L428n488l239O154K682o321j964O208J001n834k37
3986b417M984n44m125J627K922k648k229L983R29n005j20N796j038n884J009O851
4002D091k619o154L138N555l689m290L444L565m074k231M058P61l648L84L734
$$ plain form
4017 2025 255 -3521 -238 3264 -1074 -3997 1002 3904 -1976 -4009 1639 3735 -2593 -3306 2893
4032 2893 2483 -2517 -1635 2914 873 -2240 263 2748 -855 -1832 2523 2434 -2270 -1521 3836 1978
4048 1978 -3273 -931 4557 1328 -3775 43 4289 233 -3434 892 3267 -888 -2696 1800 1692
4063 1692 -2177 -644 2804 111 -2815 728 3395 -1216 -3551 1933 3582 -2692 -3632 2785 2750 -3221
4079 -3221 -2617 2419 1457 -3395 -1406 2341 -103 -2773 44 1836 -2082 -2110 2139 932 -3521 -1296
4095 -1296 3624 493 -4411 -492 3893 -221 -4176 268 3879 -892 -3496 1095 2696 -1255 -1774
4110 -1774 2164 1214 -2264 270 2686 -538 -2868 1876 3688 -1926 -3002 3203 3394 -2686 -2618 3502
4126 3502 2759 -2659 -1426 3183 1393 -2333 163 2571 -61 -1929 1637 1727 -2057 -934 3290 739
$$ packed form
4017B025j770l776L283L502m338k923M999K902n880k033N648K096o328p13O199
4032B893m10n000Q82M549k041l113K503K485l603r77M355q9m704P49N357j858
4048A978n251K342N488l229n103L818M246m056l667M326K375m155j808M496j08
4063A692l869J533L448k693k926L543K667m611k335N484J649o274r40O417l5n971
4079c221O04N036r62m852J989L747k444k670K817J792l918k8M249j207m453K225
4095a296M920l131m904L919M385m114l955M444L611m771k604M591J601l951n19
4110a774L938r50l478K534K416l224k330M744J812n614j076O205J91o080O8O120
4126C502p43n418J233M609j790l726K496K408k632j868L566R0l784J123M224k551
$$ [...]
8191I66
##END NTUPLES=NMR FID
##END=
