##TITLE=1H_SAV29(21.12)
 CDCl3, 8 sc, 
 22.12.2020
##JCAMPDX= 6.0         $$ Bruker NMR JCAMP-DX V2.0
##DATA TYPE= NMR FID
##DATA CLASS= NTUPLES
##ORIGIN= UXNMR, Bruker Analytische Messtechnik GmbH
##OWNER= root
$$ XWIN-NMR		Version 3.5
$$ Tue Dec 22 11:02:03 2020 Russian Standard Time (UT+4h)  she@DPX200
##.OBSERVE FREQUENCY= 200.1315066352
##.OBSERVE NUCLEUS= ^1H
##.DELAY= (6, 6)
##.ACQUISITION MODE= SIMULTANEOUS
##.ACQUISITION SCHEME= undefined
##.AVERAGES= 8
##.DIGITISER RES= 18
##SPECTROMETER/DATA SYSTEM= spect
##.PULSE SEQUENCE= zg30
##.SOLVENT NAME= CDCl3
##.SHIFT REFERENCE= (INTERNAL, CDCl3, 0, 15.7039)
##AUDIT TRAIL= $$ (NUMBER, WHEN, WHO, WHERE, WHAT)
$$ ##TITLE= Audit trail, XWIN-NMR		Version 3.5
$$ ##JCAMPDX= 5.01
$$ ##ORIGIN= Bruker BioSpin GmbH
$$ ##OWNER= she
$$ F:/spectra/data/she/nmr/H-F/1/audita.txt
$$ ##AUDIT TRAIL=  $$ (NUMBER, WHEN, WHO, WHERE, WHAT)
(   1,<2020-12-22 11:00:43.06 +0400>,<she>,<DPX200>,
      <created by zg, POWCHK disabled, PULCHK disabled
       configuration hash MD5:
       00 E9 B6 7A A2 85 ED C7 34 08 36 98 17 FE 4E 26
       data hash MD5: 16K
       45 32 C9 09 EA 55 78 1D 1B C3 24 99 62 A4 B9 15>)
$$ ##END=
$$ 
$$ hash MD5
$$ B6 9A C9 22 43 51 0F 17 D7 BD 3E 87 76 18 09 76
##$RELAX= 
##$RELAX= 
##$RELAX= 
##$RELAX= 
##$RELAX= 
##$RELAX= 
$$ Bruker specific parameters
$$ --------------------------
##$DU= <F:/spectra>
##$EXPNO= 1
##$NAME= <H-F>
##$PROCNO= 1
##$TYPE= <nmr>
##$USER= <she>
##$AMP= (0..31)
100 100 100 100 100 100 100 100 100 100 100 100 100 100 100 100 100 100 
100 100 100 100 100 100 100 100 100 100 100 100 100 100 
##$AQSEQ= 0
##$AQ_mod= 1
##$AUNM= <au_zg>
##$AUTOPOS= <>
##$BF1= 200.13
##$BF2= 200.13
##$BF3= 200.13
##$BF4= 200.13
##$BF5= 200.13
##$BF6= 200.13
##$BF7= 200.13
##$BF8= 200.13
##$BYTORDA= 1
##$CFDGTYP= 0
##$CFRGTYP= 5
##$CHEMSTR= <none>
##$CNST= (0..31)
1 1 145 1 1 1 1 1 1 1 1 1 1 1 1 1 1 1 1 1 1 1 1 1 1 1 1 1 1 1 1 1 
##$CPDPRG= <>
##$CPDPRG1= <>
##$CPDPRG2= <>
##$CPDPRG3= <>
##$CPDPRG4= <mlev>
##$CPDPRG5= <mlev>
##$CPDPRG6= <mlev>
##$CPDPRG7= <mlev>
##$CPDPRG8= <mlev>
##$CPDPRGB= <>
##$CPDPRGT= <>
##$D= (0..31)
0 1.2 0 0 0 0 0 0 0 0.06 0 0.03 0 0 0 0 0.0002 0 0 0 0 0 0 0 0 0 0 0 0 
0 0 0 
##$DATE= 1608620442
##$DBL= (0..7)
120 120 120 120 120 120 120 120 
##$DBP= (0..7)
150 150 150 150 150 150 150 150 
##$DBP07= 0
##$DBPNAM0= <>
##$DBPNAM1= <>
##$DBPNAM2= <>
##$DBPNAM3= <>
##$DBPNAM4= <>
##$DBPNAM5= <>
##$DBPNAM6= <>
##$DBPNAM7= <>
##$DBPOAL= (0..7)
0.5 0.5 0.5 0.5 0.5 0.5 0.5 0.5 
##$DBPOFFS= (0..7)
0 0 0 0 0 0 0 0 
##$DE= 6
##$DECBNUC= <off>
##$DECIM= 32
##$DECNUC= <off>
##$DECSTAT= 4
##$DIGMOD= 1
##$DIGTYP= 9
##$DL= (0..7)
0 120 120 120 120 120 120 120 
##$DP= (0..7)
150 150 150 150 150 150 150 150 
##$DP07= 0
##$DPNAME0= <>
##$DPNAME1= <>
##$DPNAME2= <>
##$DPNAME3= <>
##$DPNAME4= <>
##$DPNAME5= <>
##$DPNAME6= <>
##$DPNAME7= <>
##$DPOAL= (0..7)
0.5 0.5 0.5 0.5 0.5 0.5 0.5 0.5 
##$DPOFFS= (0..7)
0 0 0 0 0 0 0 0 
##$DQDMODE= 0
##$DR= 18
##$DS= 0
$$ [...]
##$SUBNAM2= <"">
##$SUBNAM3= <"">
##$SUBNAM4= <"">
##$SUBNAM5= <"">
##$SUBNAM6= <"">
##$SUBNAM7= <"">
##$SUBNAM8= <"">
##$SUBNAM9= <"">
##$SW= 16.9725356469052
##$SWIBOX= (0..15)
0 0 2 0 0 0 0 0 0 0 0 0 0 0 0 0 
##$SW_h= 3396.73913043478
##$TD= 16384
##$TD0= 1
##$TE= 0
##$TE2= 300
##$TE3= 300
##$TEG= 300
##$TL= (0..7)
0 120 120 120 120 120 120 120 
##$TP= (0..7)
150 150 150 150 150 150 150 150 
##$TP07= 0
##$TPNAME0= <>
##$TPNAME1= <>
##$TPNAME2= <>
##$TPNAME3= <>
##$TPNAME4= <>
##$TPNAME5= <>
##$TPNAME6= <>
##$TPNAME7= <>
##$TPOAL= (0..7)
0.5 0.5 0.5 0.5 0.5 0.5 0.5 0.5 
##$TPOFFS= (0..7)
0 0 0 0 0 0 0 0 
##$TUNHIN= 0
##$TUNHOUT= 0
##$TUNXOUT= 0
##$USERA1= <user>
##$USERA2= <user>
##$USERA3= <user>
##$USERA4= <user>
##$USERA5= <user>
##$V9= 5
##$VALIST= <valist>
##$VCLIST= <CCCCCCCCCCCCCCC>
##$VD= 0
##$VDLIST= <DDDDDDDDDDDDDDD>
##$VPLIST= <PPPPPPPPPPPPPPP>
##$VTLIST= <TTTTTTTTTTTTTTT>
##$WBST= 1024
##$WBSW= 4
##$XGAIN= (0..3)
0 0 0 0 
##$XL= 0
##$YL= 0
##$YMAX_a= 209109
##$YMIN_a= -249152
##$ZGOPTNS= <>
##$ZL1= 120
##$ZL2= 120
##$ZL3= 120
##$ZL4= 120
##$ABSF1= 10
##$ABSF2= 0
##$ABSG= 5
##$ABSL= 3
##$ALPHA= 0
##$AQORDER= 0
##$ASSFAC= 0
##$ASSFACI= 0
##$ASSFACX= 0
##$ASSWID= 0
##$AUNMP= <proc_1d>
##$AZFE= 0.1
##$AZFW= 0.1
##$BCFW= 1
##$BC_mod= 2
##$BYTORDP= 1
##$COROFFS= 0
##$CY= 11.3945322036743
##$DATMOD= 1
##$DC= 2
##$DFILT= <>
##$DTYPP= 0
##$F1P= 15.9154993809931
##$F2P= -4.1035820241983
##$FCOR= 0.5
##$FTSIZE= 0
##$FT_mod= 4
##$GAMMA= 1
##$GB= 0.15
##$INTBC= 1
##$INTSCL= 1
##$ISEN= 128
##$LB= 0.24
##$LEV0= 0
##$LPBIN= 0
##$MAXI= 10000
##$MC2= 0
##$MEAN= 0
##$ME_mod= 0
##$MI= 1.114404
##$NCOEF= 0
##$NC_proc= 0
##$NLEV= 6
##$NOISF1= 3.799351
##$NOISF2= 2.8
##$NSP= 1
##$NTH_PI= 0
##$NZP= 0
##$OFFSET= 15.70392
##$PC= 1
##$PHC0= -10763.23
##$PHC1= 12.20095
##$PH_mod= 1
##$PKNL= yes
##$PPARMOD= 0
##$PSCAL= 0
##$PSIGN= 0
##$REVERSE= no
##$SF= 200.130013532006
##$SI= 16384
##$SIGF1= 3
##$SIGF2= 2
##$SINO= 400
##$SIOLD= 16384
##$SREGLST= <1H.CDCl3>
##$SSB= 0
##$STSI= 0
##$STSR= 0
##$SW_p= 3612.71676300578
##$SYMM= 0
##$S_DEV= 0
##$TDeff= 0
##$TDoff= 0
##$TI= <>
##$TILT= no
##$TM1= 0
##$TM2= 0
##$TOPLEV= 0
##$USERP1= <user>
##$USERP2= <user>
##$USERP3= <user>
##$USERP4= <user>
##$USERP5= <user>
##$WDW= 1
##$XDIM= 8192
##$YMAX_p= 0
##$YMIN_p= 0
$$ End of Bruker specific parameters
$$ ---------------------------------
##NTUPLES= NMR FID
##VAR_NAME=  TIME,          FID/REAL,        FID/IMAG
##SYMBOL=    X,             R,               I
##VAR_TYPE=  INDEPENDENT,   DEPENDENT,       DEPENDENT
##VAR_FORM=  AFFN,          ASDF,            ASDF
##VAR_DIM=   8192,          8192,            8192
##UNITS=     SECONDS,       ARBITRARY UNITS, ARBITRARY UNITS
##FACTOR=    0.0002944,     1,               1
##FIRST=     0,             0,               0
##LAST=      2.4114304,     0,               0
##MIN=       0,             -249152,         0
##MAX=       2.4114304,     209109,          0
$$ Real data points
##PAGE= N=1
##DATA TABLE= (X++(R..R)), XYDATA
0@%%%%%%%%%%%Qj6J6j7K5l2M0m8N6p2Q8j04J20j36J59j84K10k44K82l22L65m15
33b21M69n28N98o72P51q39R35j038J151j276J412j562J725j902K097k308K542
50A334k801L084l399L750m145M589n094N677o356P156q118R299j0786J2721j5348
65h437J9126k5017L5448n8920J94041j6688l54130M23686k42901j20556K97984
76A43636k06541L9447J43221j61957P8359k7340l3972O0435m8155K2712J6738
87B6583l6190Q064L994J8884k1516M2192j8970o1250O6927o0277r725R6122p1652
100a6814N7610Q118r6307P6747o2021k0270R4641o7292N2940J6744p5495N1880
112B0481m1803p210L9822l7231M9816k0355k2843M3132n0913K6221J4475m2085
$$ plain form
0 0 0 0 0 0 0 0 0 0 0 0 0 8 -8 8 -9 16 -16 24 -24 32 -40 48 -56 64 -72 87 -97 113 -131 151 -171 194 -221
33 -221 248 -280 318 -354 397 -442 493 -545 606 -670 742 -820 905 -997 1100 -1208 1334
50 1334 -1467 1617 -1782 1968 -2177 2412 -2682 2995 -3361 3795 -4323 4976 -5810 6911 -8437
65 -8437 10689 -14328 21120 -37800 156241 139553 -214577 209109 -33792 -154348 143636
76 143636 -62905 -23458 119763 -42194 36165 8825 -25147 35288 -12867 9845 26583
87 26583 -9607 -1543 2451 21335 -181 42011 23041 -38209 28718 -31559 -41284 54838 -16814
100 -16814 40796 48914 -47393 29354 -32667 -52937 41704 -25588 27352 44096 -31399 20481
112 20481 -21322 -28532 11290 -25941 23875 3520 -19323 23809 -27104 -883 13592 -28493
124b8493M5124k3594j5626K9522j9218J6813J993m893o88j3130J5985l0154J7470
137h889K9660m4784M3673o055l8943N2650m4281m976M1149m4767L3050K461k0588
150a0640L9247l7011L650J2155l4963L3073q251l546K8771k5126R304q232j1754
163a3323J9318k0035J9142M25j5986K6060l1843J3873K1300l7453L7348j8475
175C51k9905M3451l8405J2983M2697l7626K2408j868m0520J6524n596j965K5315
188G844R209n662m202l135k6740Q774J3742j8958L9721p726k6939M0728m2613
201a5957J655M2886n6146L6356J3251n8615N7283j5193k4299O0950m4304l857
213e990K9351n4766K5678J8896k6168M3761o196k8642K2767k6347j7367L4733
$$ plain form
124 -28493 16631 -6963 -22589 6933 -12285 4528 6521 1628 940 -12190 3795 -26359 -8889
137 -8889 20771 -24013 19660 13605 -25338 27312 -16969 -21945 19204 -25563 7487 9948 -10640
150 -10640 28607 -8404 -4754 7401 -27562 5511 -2740 -6286 22485 -2641 6663 -1569 -13323
163 -13323 5995 -14040 5102 5527 -10459 15601 -16242 -2369 18931 -18522 18826 351
175 351 -29554 13897 -24508 -11525 31172 -6454 15954 14086 -26434 -9910 -15506 -17471 7844
188 7844 17053 11391 7189 4054 -22686 -13912 -170 -19128 20593 12867 -14072 26656 -15957
201 -15957 -14302 28584 -27562 8794 22045 -36570 20713 5520 -18779 42171 -2133 -5990
213 -5990 23361 -31405 -5727 13169 -12999 30762 24566 -4076 18691 -7656 -25023 9710
225I710j0859J39L7153k8490j1310K7258m0470N644L2524l7364K4427J4831l7934
238a4741L1576q033k1139L0749k7342J684J8966l0751K7865N441k6379L2018j8050
251A864k1774K7104k0061p80K5962j4643L882P392j7148K962j329n843J1514m730
265e628R6J1404j2624J461J0112j6443M729O568j4623J0566L911n073J0827p366
279b083p23K207j4957J2440L45r724K3256r662j0664K0660j8700l361K0500j9177
293i643N503J3989j9567J1513O515j6556J5748k736j5356J6050o794q504J9496
306I658p158m636J6084j4221m157J2102j3238K917J0599j1118O328N085j0728
319b483P674j34r183P608m731n398J0602k792M54R829q903k669K836j2904N262
$$ plain form
225 9710 -1149 -1010 36143 7653 -3657 23601 -16869 -11225 21299 -16065 8362 23193 -14741
238 -14741 16835 8802 -12337 18412 -8930 -7246 11720 -19031 8834 14275 -12104 19914 1864
251 1864 -19910 7194 -12867 -13647 12315 -2328 1554 8946 -8202 -5240 -6569 -12412 -898 -5628
265 -5628 -5532 5872 -6752 -5291 4821 -11622 -6893 -325 -14948 -4382 -471 -5544 5283 -2083
279 -2083 -2806 -599 -15556 -3116 -2771 -12495 10761 1099 -9565 11095 -7605 -10966 9534 -9643
293 -9643 -4140 9849 -9718 1795 8310 -8246 7502 4766 -10590 5460 -1334 -9838 9658
306 9658 2500 -2136 13948 -273 -4430 7672 -5566 -2649 7950 -3168 3160 8245 -2483
319 -2483 5191 5057 -4126 3482 -1249 -6647 3955 1163 1617 11446 2543 -126 2710 -10194 -4932
334d932Q902q356J2306M240j7485R708k310j8240K0106K02j3725K2722r348j3758
348i968K2665j5524n013K1677k2064M133J3930k3687J9526P805k2002K4160j0772
361D866k2131K5667j6153m465L2899j8552J485J5860l0242M597R693j8819K1458
374F163O550j4483J6535j1583j3658J5690j2129J379J7815j4915M227Q886j9098
387h621R676M690j5095J5311m605j2022J6709j0244j880J6589j4583L854N132
400D911j8296J0830K40q616J8238q083j516R485j8771N492M272j2746J6442j512
414C70n748J3115j3272k312P322j1194Q627L285n760J0600n395o545P469p190
428f628K23Q751n172K202N436j0294J676O309q463Q003M743j1749J0721n091j1082
$$ plain form
334 -4932 3970 -4386 7920 12160 -5325 4383 2073 -16167 3939 4141 -9584 13138 3790 -9968
348 -9968 12697 -2827 -7840 13837 -8227 -4094 9836 -13851 5675 13480 -8522 15638 4866
361 4866 -17265 8402 -7751 -12216 20683 2131 3616 19476 -10766 -6169 3524 -15295 6163
374 6163 12713 -1770 14765 3182 -10476 5214 -6915 -5536 12279 -2636 1591 10477 -8621
387 -8621 1055 5745 -9350 5961 1356 -10666 6043 -4201 -6081 10508 -4075 -221 4911
400 4911 -13385 -2555 -2315 -10931 7307 -776 -2292 7193 -11578 -6086 -1814 -14560 1882 370
414 370 -5378 7737 -5535 -7847 -525 -11719 -3092 193 -5567 5033 -362 -6907 562 -6628
428 -6628 -6405 2346 -2826 -624 4812 -5482 -3806 2503 -5960 2043 6786 -4963 5758 667 -10415
443a0415J6882p816l32J6397j7848N265N991k0491J5744L071j0607J7694q855
456D680p719J1558j2464J603J1064o547K251L241q919N83N569o984M581J0196
470A2693j3517K600L696j6406J5294J793j3116K1943j0502j2168J6200j8097L840
483e747J6117j6062J0570M516j5538O722k421m942Q998q33l114L427J281q169
497e195L541M172q398R460l460r060J5874j0824j937J6121j7316P806N208j9886
511a3894J7282j104j1324J7546q293l719R827j2533K440P079p319L796L780n234
525a670L590M83q009P272J110j0895J2305k059q317J6306j3451k053J5329k0654
539a0713Q825P645j5512J8804q828q716J8431j8446M347R894j5869J6307m033
$$ plain form
443 -10415 6467 -1349 -1681 14716 -3132 2133 8124 -12367 3377 6448 -4159 13535 4680
456 4680 -3039 8519 -3945 -2342 8722 2175 4426 7667 -1252 -669 4900 -2084 2497 12693
470 12693 -824 1776 5472 -10934 4360 6153 -6963 14980 4478 -7690 8510 -9587 -5747
483 -5747 10370 -5692 4878 9394 -6144 578 -1843 -6785 2213 1380 -1734 1693 2974 -5195
497 -5195 -1654 2518 -5880 3580 120 -8940 6934 -3890 -5827 10294 -7022 784 5992 -13894
511 -13894 3388 2284 -9040 8506 213 -3506 6321 -6212 -3772 3307 -4012 -216 3564 -1670
525 -1670 1920 2403 -5606 1666 2776 -8119 4186 2127 -6190 10116 -3335 -5388 9941 -10713
539 -10713 -1888 5757 -9755 9049 221 -8495 9936 -8510 -4163 5731 -10138 6169 2136
552B136j1683J4837j0152R86O546r205R593l231o103P984n704K064L890o046K986
567a102J270l798q0N016J01k832M148p083P45N975r503J0662K267j0072J3044
582H758j3112m011J8217j8714R719J3979k2052J3608r68j7500J9684n084p181
595d657J6003r357k965O997q583L829P191q659K305N504j1588M665P111j1961
609d165J3411P30j8145J5558o964j0520K1792j1396J124J3699k1319N513L320
622B638j2417J5166k841k735J0681j3125p93M325o908O146J611k164J702j730
636d44j543l006N625O8m202O003o358q21N250p717Q209J813p641P861q318k876
652h097J0616j0301O166Q226j2187N926R92j0185Q024N36m513P322l69o187M266
$$ plain form
552 2136 -9547 5290 -4862 -3876 2670 -6535 3058 -173 -6276 1708 -3996 -1932 1958 -4088 -1102
567 -1102 168 -3630 -3710 1306 1407 -1425 2723 -4360 -3615 2360 -7143 3519 5786 -4286 8758
582 8758 -4354 -8365 9852 -8862 857 14836 -7216 6392 5424 -12076 7608 2524 -4657
595 -4657 11346 1989 -976 6021 -2562 1267 8458 -201 2104 7608 -3980 685 7796 -4165
609 -4165 9246 9976 -8169 7389 425 -10095 11697 301 1425 15124 -6195 -682 2638
622 2638 -9779 5387 2546 -189 10492 -2633 -3426 899 -6009 137 1748 -416 1286 -444
636 -444 -1987 -4993 632 700 -3502 2501 -3857 -4678 572 -7145 1064 2877 -4764 3097 -5221 -8097
652 -8097 2519 -7782 -1616 6610 -5577 349 1341 -8844 -820 -284 -4797 2525 2156 -4031 235
667B35r69m287P032k626k450O980o521L1O866q930O208K269r626R800k976o298
683e262J0451p161o7O704p762M764J343n429N441m899j2M157n574N717J644n490
699a435M930m474l402N756l396J534M668l760M68ll799J879J554j914K948L36
715A890m943M264j581l174R351n495l424Q337j1564K415R990j1262J0962L434
729I200j5910J1501o124j0135J8308p100l92J4297j5346J078N027j3726R989M427
743E094q085J1532m019q584R491o513l186J2103p786j408R411j1433J742J0050
757H409j1293O113M543j4641Q498r18q262J5568n388l139J0903j5497R34O857
771B687j2090J0620M931q761Q179m275p374N066k830L25M332j840J119%k562O51
$$ plain form
667 235 -734 -5021 2011 -615 -3065 3915 -2606 -2575 4291 -4639 1569 3838 -5788 4012 1036 -5262
683 -5262 5189 -1972 -2039 4665 -3097 1667 3010 -2419 3022 -1877 -1889 2268 -3306 2411 4055 -1435
699 -1435 3495 -979 -4381 1375 -2021 -487 4181 421 889 886 -2913 -1034 520 -1394 1554 1890
715 1890 -3053 1211 -370 -3544 5807 312 -3112 5225 -6339 -3924 6066 -5196 5766 9200
729 9200 -6710 4791 -1333 -11468 6840 -260 -652 13645 -1701 -623 4404 -9322 667 5094
743 5094 -2991 8541 4522 -4062 5429 -1084 -4270 7833 47 -1361 8050 -3383 -1641 8409
757 8409 -2884 3229 7772 -6869 1629 711 -7551 8017 2629 -510 10393 -5104 -4170 2687
771 2687 -9403 1217 6148 -2613 5566 1291 -6083 -1017 -3847 -3522 810 -1030 89 89 -2473 -1822
787a822Q80k743J388J907n030L549K571n704O033K63o761M967l202k396N743k369
803b726K399J654l874L289l221j896M456k674M58L241j407j112K246M98l835K500
819dJ609n775M582K412m849N286n47l507K464k074P7L05J100K030l024K216N10
836B811m361M863j473k744M294l909K99K864k336K995K4k310J254l590l2J865
852E14q28K604K169k906r99J043m137J80M692l745K080M194p565M105J066p194
868d727Q049l580m334Q862q377K745Q085j0625P272J560j3004R350k589o150J3767
883F304m057l423Q515r224k588O069p043M370O232o447M304R96q305N482r31n470
899e216R865m750l780R666p778O26Q177j0296L325L617j0797O715K695n283Q796
$$ plain form
787 -1822 -942 -3685 -2297 -390 -5420 -1871 700 -5004 1029 1292 -5469 -502 -3704 -6100 -357 -2726
803 -2726 -327 1327 -2547 742 -2479 -4375 81 -2593 -2135 1106 -301 -1413 833 1331 -2504 -4
819 -4 1605 -4170 412 2824 -2025 3261 2714 -793 1671 -403 -326 -21 1079 3109 85 2301 2811
836 2811 -1550 3313 1840 -904 3390 -519 -220 2644 308 3303 3327 1017 2271 -1319 -1351 514
852 514 -314 2290 4459 1553 554 1597 -2540 -2360 2332 -1413 667 4861 -2704 1401 2467 -4727
868 -4727 3322 -258 -4592 4270 -4107 -1362 6723 -3902 3370 4930 -8074 1276 -1313 -7463 6304
883 6304 2247 -1176 7339 -1885 -4473 1596 -5447 -1077 5155 -1292 3012 4008 -4297 1185 254 -5216
899 -5216 4649 -101 -3881 5785 -1993 -1367 6810 -3486 -161 3456 -7341 -626 2069 -3214 5582
914E582k719m327M194o972p77M964k504M246K746m958J430j189n659L536J449
929i58k290M600j29l663L518k272k839M337k961l30K554l067K924J698l671L732
945A183j475k985K112k153O21L505j465J184L25r12l28k346J812M86j504L225
961A285o0j227L141l347r75K699k759O46J713r66L124n91k101J881j784p42J586
978A523j181J634J629k748M53J875k544R30J377k551J036Q04l735K969K450k931
994I90K049J39l729P13q21j467M459O37j705J715j900k674J361k029R01M617l687
1011d31N68K921n505K081J259n214O061j281n403O887l172j083O786p221J833
1026i14L435r457M855K259m518Q235k226l932N647o724k444N730l427K759M593
$$ plain form
914 5582 2863 -1464 2730 -4242 -5019 -55 -2559 1687 4433 -525 905 -284 -5943 -2407 -958
929 -958 -3248 1352 1223 -2440 1078 -1194 -4033 304 -2657 -2987 -433 -3500 -576 1122 -2549 1183
945 1183 -292 -3277 -1165 -3318 -2697 808 -657 527 852 -60 -388 -2734 -922 -436 -1940 1285
961 1285 1225 -2 3139 -208 -1183 1516 -1243 -597 1116 150 3274 2683 582 2463 679 -63 1523
978 1523 342 1976 3605 857 1310 3185 641 1571 2948 397 1433 2237 -1498 1471 3921 990
994 990 3039 3178 -551 162 -659 -2126 2333 2970 1265 2980 1080 -1594 -233 -2262 -1361 3256 -431
1011 -431 137 3058 -2447 -366 893 -4321 1740 459 -4944 1943 -1229 -2312 4474 -2747 -914
1026 -914 2521 -6936 -2081 178 -4340 3895 1669 -2263 3384 -3340 -5784 -54 -3481 -722 3871
1041C871m954J801J883p064K301K766m158M334R21m645N987j522n108N901l194
1056h80k177M612n030K770M687n531M020N45o270L890k511k590O794j875j150
1071f96M382l607r61R75l781K725J568k544L376o3k317K391k383j942L954k978
1087a901p44M331j725j1J601k303K21j3j042M86K49K289j317r33L276l005o29
1104a170K673l449K123J765l916L537K91j868K376k142o01J928k940J041K922
1119B570j926J758j7k568J505k99k072K738O70j513J294k52k062K045j004j091
1135b24K578r56j806K372k051O20K541k824Q48O99m546K961L45l391N825j534
1151A457k909M050l756k421M178k678P31M067m479P61K711n049K191J846m666
$$ plain form
1041 3871 -1083 718 2601 -4463 -2162 604 -3554 780 1701 -2944 3043 1521 -3587 2314 -880
1056 -880 -3057 1555 -3475 -705 3982 -1549 2471 3016 -3254 636 -1875 -4465 2329 454 -696
1071 -696 3686 79 -882 93 -3688 -963 605 -1939 1437 1374 -943 1448 -935 -2877 1077 -1901
1087 -1901 -2645 1686 -39 -50 1551 -752 -531 -544 -1586 -1100 -851 1438 121 -812 2464 -541 -1170
1104 -1170 1503 -1946 177 1942 -1974 1563 1854 -14 2362 220 -381 1547 -1393 -352 2570
1119 2570 644 2402 2385 -183 1322 1023 -1049 1689 2359 846 2140 1888 -174 1871 867 -224
1135 -224 2354 1398 -408 1964 -87 533 3074 250 1098 1797 -2749 212 557 -2834 2991 1457
1151 1457 -1452 2598 -1158 -3579 599 -2079 -1348 2719 -1760 -999 1712 -3337 -1146 700 -3966
1166c966L562L00m351N248j170k833N539m249j743M320n626K281M347m842M170
1181I87J144n687L082j111l231M897j48j492L804k100k273K884k869k73M141l584
1197a829J062L508m712K837J756n613M701o09m611N907k539q44N290m677J169
1212G96J397m587L107o51j255M147k023k73J814k918L28M62j257J181J083m04
1228I47qO62j087m14L90j519R16N31n98J866j342J8J193k991J834k07j776L708
1246B123k449L7K565l763K147N6k335L237k030p96K754k852K214Q98k636K482
1262A652j576j588K291r94Q7K268o16j436R48p16k163L353q16j458M107l387p76
1279h20L247m406K904J106m065M943k626k849N156m133J377L610n522L126o5m243
$$ plain form
1166 -3966 -404 -104 -4455 793 -377 -3210 2329 -1920 -3663 657 -4969 -2688 1659 -3183 987
1181 987 2131 -3556 -474 -1585 -4816 81 -67 -1559 2245 145 -2128 756 -2113 -2386 1755 -1829
1197 -1829 -767 2741 -1971 866 2622 -2991 1710 1101 -3510 2397 -142 -986 4304 -373 796
1212 796 2193 -2394 713 62 -1193 2954 931 658 2472 -446 -118 344 -913 268 1351 947
1228 947 939 1601 514 100 490 -1029 -113 418 -180 1686 344 362 1555 -1436 398 191 -1585 2123
1246 2123 -326 -289 2276 -1487 660 716 -1619 1618 -412 -1208 1546 -1306 908 1806 -830 1652
1262 1652 76 -1512 779 -215 -128 2140 1524 88 1036 320 -1843 1510 694 -764 3343 -44 -820
1279 -820 2427 -1979 925 2031 -2034 2909 283 -2566 2590 -1543 -166 3444 -2078 1048 983 -3260
1295c260L395n35n10K411q79j317M11r83j146K260l51j444L689k763j635M447
1311A790n233J584L774o037L798J374n663N612j247k707M532l535n37K609k625
1326b511J370J376j186J221K53k158L29Q18j583K137J632l045L098n87l912M286
1342A538j655k326N269l809J029L224m675K919K93l266L428j789n00K985k526
1357A39J541Q56k434J099k95p28P28M5M63j59M51o21l34O89j147o4R50m76M11
1376A114n18M71l62p78J131j483m75K305j978J164Q93k040J526j330q80K257k294
1393a277J018J525k771K137n29k268K719n07j039J428q61o72J376o69j159K151
1409F02l15k006K109j271p89K707k290J196J480l254K409o13k156L888k422o48
$$ plain form
1295 -3260 135 -400 -910 1501 622 -695 -284 -1267 -2413 -153 -504 -1948 1741 -1022 -2657 1790
1311 1790 -3443 -1859 1915 -4122 -324 1050 -4613 999 -248 -2955 1577 -1958 -2495 114 -2511
1326 -2511 -1141 235 -951 270 523 -1635 -1306 -488 -2071 66 1698 -1347 1751 1164 -2748 1538
1342 1538 -117 -2443 2826 -983 46 3270 -1405 1514 1807 -1459 1969 180 -320 2665 139
1357 139 1680 2536 102 1201 906 178 906 951 1414 1255 1706 1085 751 1440 293 229 1179 703 1114
1376 1114 596 1067 705 -73 1058 -425 -900 1405 -573 591 1484 -556 970 -360 -1240 1017 -1277
1393 -1277 -259 1266 -1505 632 103 -2165 554 47 -992 436 -425 -1097 279 -390 -1549 602
1409 602 287 -1719 390 -881 -1670 1037 -1253 -57 1423 -1831 578 -35 -2191 1697 -725 -1373
1425a373M148m638Q74K937m057L019P79l822L126n66k695L159r61o98K857k662
1441e73n55K384l069O38K697k685J703J159m045K423N35l365L399p48j580L494
1457A812k602r07L153k797J28K002k499R69J207k655J973J640k937J590K74k686
1473b335K431m77j699M164j641j889L256l235L49K511l600K713J148k853K677
1488A520q21j666K673j998J54K121k316J273O43j300J227p99n00J037n63K18J1
1505I14l9Q98p83k85M10o42M08K71r10J102J35j181Q66p2n10K16r21N17N46j008
1525f8L39O21m45k0o53n93J257k55j086J148J10r86O54r31l68J746j014r83K168
1544F41j538o28J458j459J065R61k358J209M19k278K414r23p97L098k374q65L021
$$ plain form
1425 -1373 2775 -1863 -989 1948 -2109 910 1689 -2133 993 427 -2268 891 -70 -768 2089 -573
1441 -573 -1128 1256 -1813 -1175 1522 -1163 540 1699 -2346 77 612 -2753 646 -102 -1682 1812
1457 1812 -790 -1697 1456 -1341 -1213 789 -1710 -741 466 -2189 -216 1424 -1513 77 351 -2335
1473 -2335 96 -381 -2080 2084 443 -1446 1810 -1425 -1076 1435 -2165 548 1696 -1157 1520
1488 1520 699 -967 1706 -292 -138 1983 -333 940 1583 283 1510 711 211 1248 685 903 914
1505 914 875 1773 990 705 1115 473 881 1152 242 1344 1479 298 1164 1092 582 798 -123 394 940 -68
1525 -68 271 892 447 427 -226 -819 438 183 -903 245 355 -631 23 -908 -1276 470 -544 -1527 641
1544 641 -897 -1525 -67 -1526 -461 500 -1858 -649 -230 -2508 -94 -1017 -1814 1284 -1090 -1955 1066
1561A066l234P45K476l137K535L90l219K419K32k391K999q05j412L001k728j76
1577a239L387k941O25J842l152J781Q23l478L406L41k167K263j077j353J868j615
1593f86m49K498p81n76J239j202m44J688k028K57J923k128J000P62k214J827J9
1610G05k127K537r40j632K504j484K56J922k625J105K47j731J544m85l83J631
1626A044j317K35O74j405O47N19q09Q48L52p00N72P7n52J61J06j12K93j88K95
1645G40L01p65O74m46o28J178r87L79Q78j003M63n0q97J272r87K8Q21j627J209
1664E53M98j695J790n27j357J464o65p12J074n85j64J101p92m88O91q97j32J383
1682E40j621K20J577k660J455P14k302K456o72j949K758k320K0K267k520J600
$$ plain form
1561 1066 -2168 -1423 1053 -2084 451 841 -2378 41 273 -2118 881 76 -1336 1665 -1063 -1239
1577 -1239 2148 -793 -168 1674 -1478 303 1126 -2352 1054 1395 -772 1491 414 -939 929 -686
1593 -686 -1135 1363 582 6 1245 43 -401 1287 -741 -484 1439 -689 311 1073 -1141 686 705
1610 705 -1422 1115 175 -1457 1047 -437 -181 1741 -884 221 468 -1263 281 -204 -587 1044
1626 1044 -273 -38 636 -769 -122 397 -412 436 788 88 660 737 185 346 452 340 633 445 740
1645 740 1041 276 950 504 -124 1054 67 446 1324 321 784 734 -163 1109 122 150 971 -656 553
1664 553 1051 -644 1146 619 -738 726 61 -651 423 -162 -326 775 -17 -505 186 -711 -843 540
1682 540 -1081 -861 716 -1944 -489 225 -2077 379 -293 -2242 516 -1804 -1784 483 -2037 -437
1698d37P39k680K225n16j735K348q14o14J866j036o14J200n84o88J720q63o99
1715a182K203j856L3J826k457J512Q60k724K979o83j553L185k053n30J948j874
1731c66K60J114j230J063M62q66L59K17r85J87M99p95Q77Q62j750J594l41k015
1749h54K493j243j238K914k398M19J688k507J617K55k123K001j134j64J119p74
1765G1M54L73j251O81l97l14L36P1J87l98P05q25n2P58j218P59L69o38J110r14
1785a33j56J047j615J238l35r23J500q82K12N11r11R48n56m16J054j390R51O52
1803G96j301J274k54j485J619q22j86J228j542K53O98l05M35m5j153K39R23j436
1821a064J093Lp23J094k39k227L285k290n70K665l043J570J347k628K084q5k591
$$ plain form
1698 -437 302 -2378 -153 -669 -2404 -56 -870 -1484 382 -654 -1268 -68 -652 -1340 380 -483 -1182
1715 -1182 1021 -835 -802 1024 -1433 79 939 -1785 1194 511 -1042 2143 90 -440 1508 -366
1731 -366 -106 1008 -222 841 1303 437 796 1013 28 215 714 -81 796 1658 -92 1502 1161 -854
1749 -854 1639 396 -842 2072 -326 93 1781 -726 891 1146 -977 1024 -110 -274 845 71
1765 71 525 898 -353 328 -69 -383 -47 24 211 -187 518 -307 -359 399 -819 -60 309 -329 781 -133
1785 -133 -289 758 -857 381 46 -877 623 -259 -47 464 -447 501 -55 -471 583 -807 144 796
1803 796 -505 769 515 -970 649 -173 -359 869 -673 -420 278 -27 408 363 -790 -551 372 -1064
1821 -1064 29 32 -691 403 164 -2063 1222 -1068 -1638 1027 -2016 -446 901 -1727 357 272 -2319
1838b319K711m27j795K385j700k08J649j029J75P36j233n01J540j249L36J305
1854C76j642R87R74j852R07m23k20J488q87l65J316j671J505J425k266J299K94
1871A245j614M52L35Q4L30P3j71j93M11q40N93N54j206J346m8j434J278r88L1
1890B38J440j648R65P98j659J088m17o45R72j024K39O51r42O01J13o05L05k31
1908B39n35L47L02k80J19M63o03r9m5o17N17N8n53P24l48j3K98j057L89P68j119
1929a045O20K80p18J076l42p32Q45n43k09J62L4k33k0N43M5k12k41M89n96M30
1949c67L41q98Q84J57p79J109j039L03J054j870J333N29j790K044r55j129K539
1966A466j774q58K371k251P27J551k471J944J64k587K571p57j369K571k365L59
$$ plain form
1838 -2319 392 -35 -1830 555 -1145 -1353 296 -733 -558 178 -1055 -1556 -16 -1265 -929 376
1854 376 -1266 -279 695 -1157 -250 -673 -893 595 -292 -657 659 -1012 493 1918 -348 951 1245
1871 1245 -369 83 418 502 832 905 734 541 952 112 705 1259 53 1399 1351 -83 1195 207 238
1890 238 1678 30 995 1793 134 1222 805 160 1132 108 347 998 56 657 770 165 470 239
1908 239 -296 51 353 73 192 655 52 -47 -92 -709 -192 -134 -687 37 -311 -324 -26 -1083 -694 74 -1045
1929 -1045 -425 -145 -863 213 -129 -861 -16 -559 -768 -606 -572 -805 -825 -282 -237 -449 -690 -201 -797 -367
1949 -367 -26 -924 -40 117 -662 447 -592 -289 765 -1105 228 757 -1033 1011 56 -1073 1466
1966 1466 -308 -1166 1205 -1046 -319 1232 -1239 705 869 -1718 853 96 -1273 1298 -1067 -708
1982g08K378k524K62J722k166J201K86j998K156p3j938K330q05r29J523j252k47
1999g82J927k018L66J448r75j07N54j433J315K00j409J333L19r29R42n19n11J409
2017A130r07p70J597n66k10P97j129J080N0j286R56p1n75O22m24M24N04r28R8
2036C92M76n66J66K07l87P30l10j36k63J70J10p62J38L47m56M63m08q8Q16o69
2056c0m57O61m83Q8Nl81J148o02o35M22k54l01O65q04M78O12r41J34m6k91L47
2077f65j03n9L13m01L37k35R7M33o08K95K59o51R44p16j85J235j108M75P55j244
2097h32J099n02p62J849p20p90J658j595N17Q89j758J378K68j379J392j77j281
2114g46J830j010o27J877j171m48J875k101N11J421j998R08R31k172J945j44j790
$$ plain form
1982 -708 1670 -854 -592 1130 -1036 165 451 -1547 609 536 -1402 928 123 -806 717 -535 -782
1999 -782 1145 -873 -507 941 -34 -141 413 -1020 295 495 -914 419 738 -191 751 232 -279 1130
2017 1130 223 -547 1050 484 274 1071 -58 1022 1072 -214 742 671 96 718 294 718 1222 294 392
2036 392 868 302 468 675 288 1018 708 572 309 479 589 -173 -35 312 -144 319 -89 -177 639 -30
2056 -30 -487 174 -309 -221 -216 -597 551 -51 -686 -264 -518 -819 -154 -958 -480 132 -809 -675 -721 -1012 -665
2077 -665 -768 -827 -514 -915 -578 -813 -716 -283 -891 -596 -337 -988 -44 -760 -945 290 -818 -343 412 -832
2097 -832 267 -235 -997 852 132 -658 1000 -595 -78 811 -947 431 699 -680 712 535 -746
2114 -746 1084 74 -553 1324 153 -295 1580 -521 -10 1411 -587 321 1252 -920 1025 881 -909
2131i09K210q90j222K142j592j82J700j748O78P24j610J134J97j492J403k71r36
2148f64J166m51n26J291q37o38J041p82J74O22r29P90K97r15O80j53o44J091j111
2167d98N32P61j069R46l1j098J088m66k64P76r60O71j35j35N40m09l12L81k56
2186F2N7K84l22J21k6j26J29n26L02K04l36K19k25o5k41O78j020L98K68n33L68
2207c30J54o40J214q43n31J717j823P86J44p86N01J03j63N17j122N64L93p61J16
2226g90P0m1J11R37p00m11P07l60n87J515p88m10J104j171O01N73r29R36k52p95
2246f80R42j74m56J126k34m67O10m13k98O28k13j46J068r74j65R79j277N54J116
2265A526j979J344L83j588J426l78p37J726j443l25J294j766J100K65j048J363
$$ plain form
2131 -909 1301 411 -811 1331 -261 -443 1257 -491 187 911 -699 435 632 -860 543 272 -664
2148 -664 502 51 -475 816 -21 -659 382 -400 -226 396 -533 257 554 -361 319 166 -478 613 -498
2167 -498 34 795 -274 672 641 -457 631 165 -99 677 -283 388 253 118 658 249 -63 318 62
2186 62 119 403 81 202 176 50 179 -347 -45 159 -177 42 -183 -248 -489 189 -831 -433 -165 -698 -330
2207 -330 -176 -816 398 -445 -976 741 -1082 -296 -152 -938 -437 -334 -497 20 -1102 -538 -145 -906 -790
2226 -790 -720 -761 -650 287 -413 -824 -117 -477 -1064 451 -337 -747 357 -814 -213 360 -569 367 115 -680
2246 -680 262 88 -368 758 524 57 667 254 -44 584 371 225 1293 319 154 1133 -144 410 1526
2265 1526 -453 891 1274 -314 1112 734 -3 1723 280 -45 1249 -517 583 848 -200 1163
2281A163m15j185J183q07k68J011o95k65J232j048k24R37j171K47P74j140P80
2298A09O5j061J735j256l29J353j526N94P94j556Q75P69j494J248n63p35J282
2315C04r33K98M87p11M75J00o97O24J61p25O43p3k79J50P1J5J75L6j87j33J29
2336g0j93k80M60M32o40L44o9m72Q48m38l99J285j012m28R37j120O58N88j169
2355g38O48J71o69N25k19j05N95p18l14J43l46m16J742m94M9N08j055J72O75j009
2375h55M76M56o28O81q3q42J055m04k90J016j094N24K14n31M48J84k50L76n71
2394a18J27K53R3l7J51J91l44J3P6k74P1O70o98R11l40p65Q40m53k96R21p00L83
2416F75L48j124N96L77p61J145r56p54J620r36o04J353j065N8J056j759R45L20
$$ plain form
2281 1163 748 -437 746 -61 -329 682 -13 -278 954 -94 -318 619 -552 -305 469 -671 109
2298 109 174 -887 848 -408 -737 616 -910 -316 478 -1078 -203 566 -928 320 -243 -978 304
2315 304 -629 -331 156 -555 -80 20 -677 -53 108 -617 26 -47 -326 -176 -105 -90 85 121 -66 -199 -70
2336 -70 -263 -543 -83 349 -291 53 -16 -488 360 -78 -477 808 -204 -632 305 -815 -157 431 -738
2355 -738 -90 81 -588 -63 -282 -387 208 -510 -824 -681 -1027 -1443 299 -195 -146 362 -693 -521 154 -855
2375 -855 -379 77 -551 130 47 -795 260 -144 -434 582 -512 12 226 -305 143 327 77 453 -118
2394 -118 9 262 355 318 469 660 316 329 405 131 202 872 174 1085 745 -20 820 367 71 992 292 675
2416 675 1023 -101 495 872 111 1256 300 -454 1166 230 -374 979 -86 -28 1028 -731 214 534
2434E34j454R50J56o97J168j171P3R91j141J12O53r39L68K84r51J282m01p43R17
2453iq29J31K53l72K98L40l10k57L16k60L30l22L02L79o54L06R2M0j99K2NM86
2475H8k49J59j00l33O06r6m52L89J88n37L66L7j54N70m52l93R10l16l88N54o27
2496b30L77M52j219J151j31p55P50m37p9J487r39j029J438j617J078J39p73J008
2514F71k85j188J451p10j02Q10q87L60J88r43N98O99j037Q87m13n02Q34n97j09
2533b75P77o34J11L22l97L14L5n40N97Ok84J29k53N10l00Q3O3l60N05k29k58O28
2555E50l50J94N4m96N23P0o61M51m2l16O21l53P7M23j114N10M26q90Q41q32k66
2576e80J472q68k49R23j009L72n4q30M35N94p53N40l39l98O00j83j35M01l40j64
$$ plain form
2434 534 -920 30 186 -511 657 -514 -441 550 -591 -479 174 -765 -397 -113 -1064 218 -183 -926 -9
2453 -9 -838 -707 -454 -826 -528 -188 -498 -755 -439 -699 -369 -691 -389 -10 -664 -358 -266 -226 -425 -403 -398 88
2475 88 -161 -2 -102 -435 171 75 -377 12 200 -337 29 66 -88 482 30 -363 547 231 -157 397 -230
2496 -230 147 599 -620 531 400 -355 395 -42 -121 1366 427 -602 836 -781 297 436 -337 671
2514 671 386 -802 649 -61 -163 647 -240 120 308 -635 -37 662 -375 512 99 -403 431 -166 -275
2533 -275 502 -132 -21 301 -96 218 253 -287 310 316 32 161 -92 418 118 201 264 -96 409 180 -78 550
2555 550 200 394 448 -48 475 545 -116 335 293 -23 598 245 322 745 -369 141 567 -323 518 -314 -580
2576 -580 892 24 -225 698 -311 61 7 -823 -388 206 -547 -7 -346 -744 -144 -327 -462 -61 -401 -565
2596e65O43m87j43L23j160R96P44q16N00k78n84M93Q8j38M91o31k53J310j042
2615e09l4J47k40O28k03P16p38r0r4J135r41K68L90j160J346J6l40O42r70Q5M43
2636D97m26M80o55K08R02q07m00J050j076M44R58j320P54L44j236J009k20p43
2654b37J171p93j30Q09q56L50K56q72M00O17j273R26Mn48P46l10n14Q73r01J28
2674a54N30p54L88K95n05J09j14p4N62l80L1M08m30k39M50l66L11j15j93K81J00
2695A41n03N12k7J28j64j12j67J43Q0j11j9J48j00PP6M0N6j00j36J06K38o26N68
2718A78n75K54K62l54J96K0l91J27N13o05M38O1l53jQ1l19M76k18n2L31o77J18
2740d90M20j255Q00l40L6Q43l51l18M71k83O55m88J32J79m83p3M53q4j09M88l29
$$ plain form
2596 -565 78 -409 -552 -229 -1389 -393 351 -465 35 -243 -827 -334 -246 -384 107 -524 -777 533 -509
2615 -509 -543 -396 -636 -8 -211 505 -233 -323 -417 718 -223 45 435 -725 621 637 297 939 -31 54 497
2636 497 71 551 -104 104 1006 199 -201 849 -227 217 1175 -145 609 953 -283 726 506 -237
2654 -237 934 141 11 820 -36 314 570 -302 98 715 -558 368 372 -176 570 260 -254 619 -282 -154
2674 -154 376 -378 10 305 -200 -91 -205 -279 283 -97 -66 342 -88 -327 123 -243 68 -47 -240 41 141
2695 141 -362 150 123 251 87 -25 -192 -49 31 -80 -99 49 -51 -44 32 72 128 28 -108 -2 236 -390 178
2718 178 -397 -143 119 -235 -39 -19 -410 -283 230 -375 63 124 -229 -230 -149 -468 8 -210 -262 69 -608 -490
2740 -490 -70 -1325 -525 -865 -829 14 -337 -655 -184 -467 188 -300 -168 11 -472 -545 -92 -176 -285 203 -126
2761a26r4j54P1K8L59n0k12J82j9M67m15j44P11r05O85l83M19K1k95J32M45n75
2783A48o3M73p22N35M66r05P79n67j24R18q69j81J097j700Q33J172j389O93k89
2802C05o78O67o5k73N56m99n39J152p76M71j45k28M7k9O0J4om85P75r43j03O88
2824c4o38j04O04l68J77Q86j288J228q50k32N28j054j78R97j38k05O06j25l09
2843d97K17j45J0m5l0L80k02k17K86j90J39K38j40J26k5j65K55k00P3L42k32r4
2865a16N6lk1q2J22K8j15J47R3m86M20J01k82L12l76M4J72m52N95l9l65N07k35
2888B5n00N83l80J81K87l34J51J40l96M98m55m3N18n50N1K60k12M56l55j06N01
2909C20m95L09k3j80K96k28n6L10j15q3J5m13N31K63m13K66l0o1J13l09o6O36
$$ plain form
2761 -126 -220 -374 -303 -275 84 34 -178 4 -15 452 37 -107 604 -301 384 1 420 441 146 278 723 148
2783 148 85 558 -164 371 837 -68 711 144 20 938 69 -112 985 -715 118 1290 -99 594 305
2802 305 -373 294 229 -44 512 13 -526 626 -150 321 176 -52 -5 -34 26 40 34 -451 324 -619 -722 -34
2824 -34 -672 -776 -172 -540 -363 523 -765 463 -387 -619 -91 -1145 -1323 -326 -464 -669 -63 -188 -497
2843 -497 -280 -425 -415 -460 -490 -110 -312 -529 -243 -433 -294 -56 -196 -70 -95 -260 -5 -205 -132 210 -22 -116
2865 -116 -60 -63 -84 -166 -44 -16 -131 16 109 -377 43 144 -138 174 -202 -158 14 -438 157 118 -247 260 25
2888 25 -475 108 -272 -91 196 -138 13 153 -243 255 -200 -243 275 -275 -224 36 -176 280 -75 -181 320
2909 320 -175 134 111 -69 227 -1 -57 253 138 55 70 -343 188 451 38 304 274 213 326 17 -49 587
2931E87n32J54M94m90J17j66k1O44k81p16M32J6J82O2m08J43K68m75K87K9k34
2952I2MK24k88Q5l4o66O64P5k75K79l24k01O45o95j43Q33q52P90k75p76Q88l98
2974c48n10J192p74m6L53o00O35L4n80O07l26p1L41m37J26M57p04K28K89n55Q04
2995A15k64l44O44l65l21M48k13K61J93k29R7L68n64L36l39O3N15o84O61j50l50
3016a22K01M2P8L77l84m3K34k80L12k7n00M56j6k14K51o06M89J7k42Q0K31k77
3038E7m3J62l8M7mq2J74j72p7J74q9l99J53L02l85L36k37QM25n08J82P8k49M37
3062B52k15k25M47k01q3K84j53J24j57M1j75K42j79M1p1K17j01j42J34j21K97
3083B56j9r2k15k08J57J11NJ93L1o22M82K74p05O46l50k43M40k88r4Q52r53N1
$$ plain form
2931 587 55 209 703 213 330 164 143 787 506 -210 222 238 420 482 74 217 485 10 297 326 92
2952 92 96 320 32 117 83 -583 81 156 -119 160 -164 -365 280 -415 -558 275 -577 213 -62 -838 50 -348
2974 -348 -858 334 -440 -486 -133 -733 -98 -64 -644 -37 -363 -434 -93 -530 -404 53 -651 -423 -134 -689 115
2995 115 -149 -493 151 -214 -535 -87 -300 -39 154 -75 22 390 -174 162 -177 -114 401 -283 378 228 -122
3016 -122 79 121 199 576 192 149 383 103 415 388 -112 344 328 114 365 -241 248 265 23 103 334 57
3038 57 14 176 138 185 181 99 273 101 24 198 109 -290 -137 165 -220 116 -121 -113 312 -196 -14 64 -185 252
3062 252 37 -188 259 58 -25 259 106 230 73 114 -61 181 2 43 -28 189 88 -54 80 -41 256
3083 256 237 145 -70 -278 -121 -10 -5 188 219 -403 79 353 -352 294 -56 -299 141 -147 -241 611 -342 -291
3105b91L82m63K70J87p88R74q0p08P07o85J45N30o06Q5L67o26N65k26m04N40j56
3126b81k5L49l02k2K32j75j29K72j88N1L00m46J98N8k80N38m43K25J22j97K11
3147F8J3m13M28q1j60N91n04K28Ok46J91J72l63L15j78j63M11J27n24L43j04O9
3169B26J52r1J87j37k74K07K66k62j34K31k13K60o67K85L30J16j18Nl42K74k83
3190A8K96j33k6n0J15k45o9N3N9J41j82k89N07J20m02Lj8q7n2k2J56j09JK7J02
3215h6J81j0m36J3K45j18J11J76l7k43L0J24PN0j30jJ30k02J25J0J7o5l6Q0k74
3240c39M15o2j25M50o06K95R6l96K16k8P8L16l39j35R8N0j36M4j18q0L72l14L15
3263F7j81k01O00l77o5K53k04n0J29l03K11K25l01L8J74k47M24l08r1M57n23K2
$$ plain form
3105 -291 91 -372 -102 85 -703 271 191 -517 190 -495 -350 180 -426 -341 26 -600 -35 -261 -665 -125 -281
3126 -281 -306 43 -259 -281 -49 -224 -353 -81 -269 -218 82 -364 -166 -108 -388 150 -293 -68 54 -143 68
3147 68 81 -332 96 15 -145 446 -58 170 176 -70 121 293 -70 245 67 -96 315 442 -82 261 157 226
3169 226 378 287 474 337 63 270 536 274 140 371 158 418 -249 36 366 482 364 369 27 301 18
3190 18 314 181 155 105 220 -25 -94 -41 18 159 -23 -312 195 315 -87 -84 -102 -189 -241 -263 -107 -216 -215 -188 -86
3215 -86 95 85 -351 -338 -93 -211 -100 76 39 -204 -174 -50 -43 7 -123 -124 6 -196 -71 -61 -44 -109 -145 -65 -339
3240 -339 76 14 -111 339 -267 28 124 -272 -56 -84 -6 310 -29 -164 -66 -16 -152 -108 -226 -306 66 -248 67
3263 67 -114 -315 285 -92 -157 96 -108 -158 -29 -332 -121 104 -197 -159 15 -232 192 -116 -207 250 -273 -251
3285b51L63n23M41Q1j05J23k34j5J95J3R7rp6J5K77j97j5j05J72J38k5j52Qp3
3309A43Q9K32m68K81K81l48K72k62J63J13o51J86L13k43J28K83l21J65m97K31
3329I0Q4j32L0J34l46L37J98n97J57j08n5M01k10j24J21p4j41J97l82K44J10l26
3351c92J77n1O3J52j83j4K23k10K21l89j3M00l59L04j94k8K80m56P7L26k27K35
3373e8J34m06M72j31r5J98l30J02J50m46N94j19j77P27m99l2l45o5K01l17N77
3394A35L95k9l35P88j052J28J99R5K7j55N3l25M45n09R0L13J7l92K75j07N0J43
3416B49k00J3Q2l29L86k16j24M6K24l61K88J04j17kJ69k46K79l07K82l73N7J08
3438A2j42j0M15n47L84k5m2N5j20J23J35k18l9L08j48K32k81k14L01k20J26L2
$$ plain form
3285 -251 112 -411 30 111 6 129 -105 -120 75 88 185 176 100 115 392 195 180 75 247 385 360 208 216 143
3309 143 232 464 -4 277 558 210 482 220 383 496 -155 31 344 101 229 512 191 356 -141 90
3329 90 174 42 72 206 -140 197 395 -202 -45 -153 -208 193 -17 -141 -20 -94 -235 -38 -420 -176 -66 -392
3351 -392 -215 -266 -203 -51 -234 -248 -25 -235 -14 -403 -416 -16 -375 -71 -265 -293 -13 -469 -392 -66 -293 -58
3373 -58 76 -330 142 11 -84 114 -216 -114 36 -410 184 65 -112 615 116 84 -261 -326 -125 -442 135
3394 135 530 501 166 954 -98 30 229 324 351 196 249 -76 369 -140 -50 263 280 -112 163 56 106 249
3416 249 49 62 144 -185 201 -15 -139 -93 131 -230 58 162 45 43 212 -34 245 -62 220 -153 -96 12
3438 12 -130 -140 275 -272 112 87 45 100 -20 103 238 20 -19 289 141 373 92 -122 179 -41 85 117
3460A17K1J45j39k57M05k34r3L59j81j3L23n00Q9J89k05J9J81k02L34m50j04L27
3482A31m78K00K93l49O0R7l37M08p0j48o6R0j17J98m51M59j87k63J95j53J67K13
3504a08M4M2q7o0j66O6K50l45J47j03j60K81K39m56K84O2P9P9k56J69J77k35J51
3527I4k17K5L65m74j00M55j85J7%J27J69m21L05pq9L49k87M8J83l62N5O7K07j12
3551B12j34n4K37J0n13N96k50J54m4j27nK35k37P2n3K17o1P4m3l56M0L10j95j66
3575h1L92k26P9j12q3K14o7r5J12j97O2M0rj88L48l07r6K15L1K04j13m06K86k17
3599b14M63j58l02k3K69m12J43K56k12K58l84Q6L00j35J2n6J16j97K32l33L56
3620F5j82q6L80l02J30k7m8j05O4o0M09m77K27j57N1k8J85j94K61J51l67k55M57
$$ plain form
3460 117 138 283 144 -113 292 58 -35 324 143 130 453 -47 42 231 26 45 226 24 358 -92 -196 131
3482 131 -347 -147 146 -203 -143 -46 -383 25 -45 -193 -259 -169 -286 -88 -539 -80 -267 -530 -335 -488 -321 -108
3504 -108 -64 -22 -109 -169 -335 -269 -19 -364 -217 -320 -480 -199 40 -416 -132 -70 9 88 -168 1 178 -57 94
3527 94 -123 -98 267 -207 -307 148 -37 -20 -20 107 276 -145 160 153 64 413 126 174 357 -5 50 117 324 212
3551 212 78 24 261 271 -242 354 104 258 214 87 82 317 80 152 99 316 255 329 286 -70 -30 280 85 -81
3575 -81 311 85 164 52 -31 183 116 21 133 -64 -2 38 29 -159 189 -118 -214 1 32 236 123 -283 3 -214
3599 -214 249 91 -211 -234 35 -377 -234 22 -190 68 -316 -230 70 -65 -53 -109 7 -190 42 -291 65
3620 65 -117 -203 177 -125 5 -22 -70 -175 -111 -171 238 -239 -12 -169 -118 -146 39 -155 106 257 -110 -365 92
3643I2j02%l91P4K77m42N9M64j97k04Q05q05J62l59N63l97K55j5l55R14p17P19
3665D00K59o14J6o90P63n41J44P98o78K07l5o4N2J04J31j86K7M3K46k97p5J56
3687A66q7K4M42j56j84k3LM3M0K8l28K88K1M5k63M99n61N6O8Q5j60M4M8m0k36
3712a38J19J92J3k29J53K08k23j40kR4j32J33L8k76J70p2K56k72M2o9L8M4j42
3735a95J18j25j43j4J59K56q4o7j56k6L44j92P3O0k30j06K53k30J52L10m96K00
3757a39J32j29J08l9J3K23k84Q6n4J74j42l4L2k0P1M3j68K58j97j06O24k67j24
3780F1L6o8P4k03K08M8j13j10J84j70j45J97K14l37J23K1r3K25j01M4k87J69m4
3803f7j31K12n3K2J8J02j91J6Q2K40k81R4p2R8kK41l29n9N5l1O1n4J20j13j54
$$ plain form
3643 92 -10 -10 -401 -327 -50 -492 -433 31 -166 -370 435 -370 -208 -567 -4 -401 -146 -161 -516 398 -319 400
3665 400 659 45 61 -629 134 -407 -263 535 -143 64 29 -35 17 121 252 66 93 136 382 85 10 166
3687 166 79 103 545 389 205 182 185 228 268 296 -32 256 277 322 59 558 -3 53 121 206 46 90 138 98 -138
3712 -138 -19 173 186 -43 110 318 95 -45 -47 47 -85 48 86 -190 -20 -92 164 -108 -66 -135 -97 -53 -195
3735 -195 -77 -202 -345 -359 -200 56 -28 -95 -251 -277 67 -125 -52 8 -222 -328 -75 -305 -153 157 -339 -139
3757 -139 -7 -136 -28 -67 -54 169 -115 -29 -83 91 -51 -85 -53 -73 -2 41 -127 131 -66 -172 452 185 61
3780 61 97 29 103 -100 108 156 43 -67 117 -53 -198 -1 213 -124 -1 20 -73 152 51 95 -192 -23 -67
3803 -67 -198 14 -39 -17 1 103 -88 -72 10 250 -31 63 -9 89 87 328 -1 -60 -5 -36 25 -29 91 -22 -176
3828a76K93Qj46K97k08p0O5K38q8j29n9J31o6m4j4k1J46J02l68J38J84l43l7K63
3852I6K6k9j90M3R7o1L08k02j89Qj60N3J36N8j07j65K70n9o4J8k7Q1j6k44J36
3877a83Q0j7k77M6L69j36J90j99Lj10K7j68J94j11J63K2p6k28K00L91n91J69J65
3900g7J13j43lj72L42k64K59j16p1K18j15N3j22J13l77O22l97K86l4j0K62k65
3922A02J95o7k8j13p4l2J18J51k16J1K61k86L78l69j65P8kL3j5l9K65l89L50M2
3946A89j2k54K54o7K89l16J84Q8m36n4M8p4K38ll8J05q8J37k22O1J2o3j5m7O6
3971a8L6L5j2J4J51r1k7J76l37K21j63n4K25j38J04k93j8K64j51L6J52J0q6K24
3995B60j66j33Q9O0K02m49J66j58J06K29j27k41L13l77Q5j8R0RJ99m03k0J85o8
$$ plain form
3828 -176 117 125 -21 276 68 -2 63 301 213 84 25 156 90 46 32 11 157 259 -109 29 213 -130 -167 96
3852 96 122 93 -97 -54 43 -18 290 88 -101 -93 -253 -200 -64 -6 -113 -278 -8 -67 -131 -113 -140 -59 -75 -319 -183
3877 -183 -103 -120 -397 -351 18 -118 72 -127 -124 -234 -207 -375 -181 -292 -129 -107 -183 -411 -211 180 -411 -242 -77
3900 -77 36 -107 -110 -282 60 -204 55 -61 -132 86 -29 24 -98 15 -362 260 -137 149 115 105 367 102
3922 102 297 230 202 89 15 -17 101 252 36 47 308 22 400 31 -134 -56 -58 -25 -40 -79 186 -203 147 189
3946 189 177 -77 177 110 399 83 267 355 -81 -135 -87 -161 77 74 36 141 53 190 -32 29 41 -22 -37 -84 -18
3971 -18 18 53 41 55 206 115 88 264 -73 148 -15 -69 156 18 122 -171 -189 75 -76 -40 112 122 36 260
3995 260 94 -39 50 110 312 -137 29 -129 -23 206 79 -162 151 -226 -141 -159 -69 -60 139 -264 -284 -99 -167
4018a67J21q6N2J37k16m5K43m42K91J42J0l4l08J32n0J10o8O0J0J52l31j9Q3j25
4042c48K59j80K06J01q5j3j92K77j47O3J98J11j82k13J00L4L51k35L0l8O5J6q
4065A70k87L04j31LO1r5J4L17j09k66K14nK49l29J28Q0m4j94n5K72j00o6J0j45
4089dK80k75K78N9l89J90n5J29n7k72lK26m0R8Mj39j72K04L8n9r2j01K2j61J20
4114a71RJ45O1n5l73N6k3K95j86J72K9k38Q1j23N53j91L1k8r6j34Q8M7j85L42
4138A06j25K49j41j68Ok02L06J29k78J68l2j49O9O2J3PJ02l1j95l5o1rK90J52
4162B33j98k14J95j83J57j10K03j37K57o3l25mM40l31p3J10J11j70j86J64p9K91
4184H8j67Oj20K94o6j20P7J87j51q9R1p9k57L44j2m2K42k52L00m70J63lK98Q5
$$ plain form
4018 -167 -46 -132 -80 57 -159 -204 39 -403 -112 30 40 6 -302 -170 -220 -110 -178 -118 -108 44 -287 -306 -223 -348
4042 -348 -89 -269 -63 38 -47 -60 -252 25 -122 -59 139 250 68 -145 -45 -11 340 105 135 97 162 178 170
4065 170 -117 187 56 59 120 25 39 356 247 -19 195 190 439 110 238 318 274 80 25 297 197 131 141 -4
4089 -4 276 1 279 338 -51 139 84 213 156 -116 -119 107 67 165 169 30 -142 62 100 41 -51 -152 -130 -291 -171
4114 -171 -162 -17 44 -11 -384 -328 -351 -56 -242 -70 -41 -279 -198 -321 232 41 72 44 -52 -186 -98 -51 -236 106
4138 106 -19 230 89 -79 -73 -275 31 160 -118 50 18 -131 -62 0 13 20 122 91 -104 -139 -200 -209 81 233
4162 233 35 -179 16 -167 -10 -120 83 -54 203 140 -185 -189 251 -80 -153 -43 68 -102 -288 -124 -203 88
4184 88 -79 -73 -193 101 35 -85 -8 179 28 -61 30 -49 -306 38 26 -16 226 -26 274 -196 -33 -36 262 347
4208C47k86K19j5j38k0N6n7%J34j40m2m7R9j18K15o4J64r7k10K65k94O6R0p9Q9
4233A37j18m2l3r2L0K46j81p2L21jk79J11J67l40J87M8l44Q8L3j14q0L17Nj03
4257a09j25J39j05J2R6k42K52k34M34k40J8j60O6QK17L4k57J62j00j17L9M0J40
4280c2O0l47N6J57R5j24K62l80J94L24l03j05k3K31j11J61k26R0r7K74l28L11
4302A39O1k80K89j94m5L03m07K14k8j77L45j73m0J8J69k00J10l06M13j98O9pj26
4325e1K23p2r4o1J10j4Rj1l1j34L63k09M0m5J6o6j7K36j66J2J48p3k27K12r9J2
4351A1J93m31M12Jl9Pp6j01K17q7l4Q3K8j91J15LM0k27j96K76j09L45j7j75r2
4376d4P8r0O1J64m00K71r6J15l51L65Pl6p0o9j16j14K04Q1Q9l68N30k11j05r9
$$ plain form
4208 347 61 280 265 127 107 163 106 106 240 100 58 11 110 -8 207 143 307 210 0 265 -29 37 127 48 137
4233 137 19 -23 -56 -148 -118 128 -53 -125 196 195 -84 27 194 -146 41 89 -255 -167 -134 -248 -328 -11 -6 -109
4257 -109 -234 -95 -200 -188 -92 -334 -82 -316 118 -122 -104 -264 -198 -190 27 61 -196 -34 -134 -251 -212 -172 -32
4280 -32 28 -319 -263 -106 -11 -135 127 -253 -59 265 -38 -143 -166 65 -46 115 -111 -21 -118 156 -172 139
4302 139 200 -80 209 15 -30 273 -134 80 52 -125 220 47 7 25 194 -6 104 -202 211 13 82 75 -51
4325 -51 172 100 6 -55 55 41 50 39 8 -126 237 28 68 23 39 -27 -44 192 26 38 186 113 -114 98 -1 11
4351 11 204 -227 185 186 147 154 78 -23 194 107 73 156 184 -7 108 111 151 -76 -272 4 -105 240 223 48 -44
4376 -44 34 -56 5 169 -231 40 -56 59 -292 73 80 44 -26 -95 -211 -325 -121 -40 49 -319 211 0 -105 -204
4400b04K27k4j4k79L24l68L70m29P6L63l69M8J93l33J9L45oo4j15OJ10J45j89
4423a68J28L7k29K69j54K28k80K22j15K09O7o2j00o5K3j23J29j3j50M04p7J42
4445C22k40J00p3Q2r7M5R5k08K59l14K26p7j18J0K6N1J01j36M0J10q3k30J70j45
4469h4K24Q8k78J34j91KO8J91j77K11l82J45P5j6J45o0j0j32K25l19J1J76L83
4492D29j89J34J29m17k38J5M07l00m85L04k98M64N9j82j10J67J14o6r4q5J02K5
4514a15K53k78K22m01J87J34j81r2L16k1j69J84m3jn9Lk7K02m00L13J08o2j14
4537d1k91J98Q1J23o0j7j8j70Kj8Q7o4J01M5jo1rL24l49J01l8q5J95k30J82j09
4563a22O5q4J08n4Q0M1N0K79l17j3O2l08P7J37J82j43j02r4J77J37L7K2k07K61
$$ plain form
4400 -204 23 -1 -15 -294 30 -338 32 -397 -321 42 -327 -279 -86 -419 -400 -55 -61 -125 -240 -234 -124 21 -168
4423 -168 -40 -3 -232 37 -117 111 -169 53 -62 147 214 152 52 -13 10 -113 16 3 -147 257 180 322
4445 322 82 182 109 191 94 139 234 26 285 -29 197 120 2 12 38 89 190 54 94 204 121 -109 61 -84
4469 -84 140 228 -50 84 -107 -105 -37 154 -23 188 -194 -49 26 10 155 95 85 -47 178 -141 -130 46 429
4492 429 240 374 503 86 -152 -137 270 -30 -515 -211 -509 -45 14 -168 -278 -111 3 -63 -157 -242 -140 -115
4514 -115 138 -140 82 -319 -132 2 -179 -271 45 24 -145 39 -4 -5 -64 -61 -88 114 -286 27 135 73 -41
4537 -41 -332 -134 -53 70 10 -7 -25 -195 -193 -211 -124 -188 -87 -42 -43 -104 -113 211 -138 -37 -75 -160 35 -195 -13 -122
4563 -122 -57 -141 -33 -87 -7 34 84 363 46 33 95 -213 -136 1 183 40 -62 -156 21 158 195 217 10 271
4587B71j03l6k37K82j30K51k02k89K69k80N47R7l75M3J6j70R2j54K97J7l8ONl8
4611A41pn6Qj96N0J96k55J01K22j68J54j50j07K01J48k95J18j27j62J57k5p3N4
4634g1k61J50l25M85j0J09j26n0J39r5o2J65k51P8m8j7M1P5j83R5j41K67p9L4
4658h1p4j30J30K49k0j43N2k57J44M0o5K55j30M9J73k34J84l55K44O5J5k50L33
4681A94o9l50K12r4K77m37OR1J38O5j45m4K14J69l68j21K52j10K70j39j91J61
4703a9j10j03J45K0k4J49k50K40k97P2j18M20k50Q3j60J10L5J85O3m25K34j24
4725a24K27k37K44R8k9k87M34k11O3k79L1R9r4K46p8J41j98j47J40K14j94P3L3
4748A65j75J22M0nj10j44K18r9J14J6J38l79L26k42J38j24j09J4L24p1m30L12
$$ plain form
4587 271 168 132 -105 177 47 298 96 -193 76 -204 343 440 65 108 124 -46 46 -108 189 206 168 174 179 141
4611 141 134 78 86 -110 -60 136 -119 -18 204 36 190 40 -67 134 282 -13 105 -22 -184 -27 -52 -125 -71
4634 -71 -332 -182 -507 -22 -32 77 -49 -99 40 -55 -117 48 -203 -125 -173 -190 -149 -74 -257 -162 -303 -36 -115 -81
4658 -81 -155 -285 -155 94 74 -69 -17 -274 -130 -90 -155 100 -30 19 192 -42 142 -213 31 96 111 -139 194
4681 194 125 -225 -13 -107 170 -267 -261 -170 -32 33 -112 -156 58 227 -141 -262 -10 -120 150 11 -180 -19
4703 -19 -129 -232 -87 -67 -91 58 -192 48 -249 -177 -295 125 -125 -42 -202 -92 -57 128 191 -234 0 -124
4725 -124 103 -134 110 208 179 -108 326 115 178 -101 -70 29 -65 181 103 244 46 -101 39 253 59 132 165
4748 165 -10 112 152 147 37 -107 111 12 126 142 280 -99 227 -15 123 -1 -110 -96 228 157 -273 39
4770C9j9J53K0l13K2qp9K59l61J57r2K33l0q2k74L20k16J32K35k99N2L6J63k63
4794b15nK91j22k16K24m6J06j68j44K51Q0j50J74j96k52O58j81j34K45k31L6J34
4816A39R3q4J98l70L41l73J79L3j10J25j75j44K22O8J34l80N7J47M3M4l91L25
4838A21n9K07k04j28P7kno1L28k71J02j31O2j83K07k55L29j26j05L41k58m5KJ29
4862G2j13Q3j54q9J38Q0L0J51l52L51k57n8O0J06r6k33J25M07l75k2R8Q2Q0k33
4886a19j4L85k17M5k56K20j20QJ30k13K48k9%l8j08K98j80k7K00n3l4p5o9k3J85
4911A44m26J08L18k33J72j37j78J89K4L3m4J60k03l1K26j07K2j21Qp0J68o3M5
4934Dj72j66J27K35J8q5p9LJ01j85j1J94k51K51J49j89r7O6Q7Oj42R9L6mj19K43
$$ plain form
4770 39 20 173 193 -120 -98 -106 -185 74 -287 -130 -222 11 -19 -101 -375 -55 -271 -139 96 -203 -151 -115 48 -215
4794 -215 -220 71 -51 -267 -43 -89 17 -151 -295 -44 36 -114 60 -136 -388 270 89 -45 200 -31 5 139
4816 139 232 148 346 -24 317 -56 123 156 46 171 -4 -148 74 142 276 -104 -47 100 143 187 -204 121
4838 121 62 269 65 -63 14 12 7 -54 274 3 105 -26 36 -147 60 -195 134 8 -97 244 -14 -59 -57 72
4862 72 -41 42 -112 -201 -63 17 47 198 -154 197 -60 -118 -58 48 -48 -281 -156 251 -124 -146 -48 34 114 -119
4886 -119 -133 252 35 80 -176 44 -76 -68 62 -151 97 68 68 30 -78 220 40 13 213 160 126 51 -18 -41 144
4911 144 -282 -174 144 -89 83 -54 -232 -43 -19 14 -30 130 -73 -104 122 15 37 -84 -76 -146 22 -41 4
4934 4 -168 -334 -207 28 46 -39 -118 -115 -14 -199 -210 -16 -267 -16 133 -56 -153 -87 0 6 -136 -37 -1 -5 -124 119
4960A19J16j61jj37k0P3R2J96P2j17o5k32J59m9%M0M2l0p0o4K17o0K20p3l75K06
4986I8K0q9p8j45L94k17P7m5L44l03O8L1o6Lp4J08J21j86n5J4k68K91j84J69m7
5011a9K51j90J2J45l75J03J77j24J56l05K30j3j26J78m2j76J40q7J03o7j79J74
5033c4N6k66M4J01L27m30L19j54k07J73m2j97O8K12j38L97r0k9K6J53l67N2j25
5056a51J18Q1N6rm9k93K22j3M9p6P6L3M9k34K2K24k15N3l7J68k36J03N1J39J06
5081B37m62J74o1J4K52l05J88m2j19m2N2J61M7k10P3L38l15N3n2J11j53J4K7m5
5105f5J23K14j01p9J9j56J40J06r4r3q1P1O2J30j59N5o2m0ko3M30l27J0o0j16
5130a38K94o3j23K48k14R1l9R7K64j12j31p9j35J24j26O9k22L88k55K26m81N51
$$ plain form
4960 119 235 74 73 -64 -84 -11 81 277 349 232 167 -65 94 45 45 85 127 97 27 -37 180 120 340 267 -108 98
4986 98 118 29 -49 -194 200 -17 60 15 359 56 124 155 89 92 18 126 247 61 6 20 -248 43 -141 28 -19
5011 -19 232 42 54 199 -176 -73 104 -20 136 -169 61 48 -78 100 58 -118 22 -65 38 -29 -208 -34
5033 -34 22 -244 -200 -99 228 -202 117 -37 -244 -71 -113 -310 -242 -30 -168 229 139 110 136 289 -78 -26 -151
5056 -151 -33 48 104 95 46 -247 -25 -38 11 -65 11 44 93 -141 -119 105 -110 -57 -94 74 -162 -59 -8 131 237
5081 237 -225 -51 -112 -98 154 -151 37 -5 -124 -166 -114 47 94 -116 -43 295 -20 33 -19 92 -61 -47 -20 -65
5105 -65 58 272 171 92 111 -45 95 201 107 14 -67 4 66 196 37 92 30 -10 -12 -75 355 28 38 -22 -138
5130 -138 156 93 -30 218 4 95 56 153 417 305 174 95 -40 84 -42 27 -195 193 -62 164 -317 234
5152B34l95k5K28k59K20j37j55K36k17K3L45l92K70j90K87l40L85j05j17J45J4
5173E5M9p3k02J17L9J24k73j9J74R3l11K08L9l39N23l15K83m8p3k96J32J55o8
5196b6j7k56k3L38j73J69Pk47J36J18p0J21k75L66j3k12K66q0l16K46M5n4J09
5219A59k64K05P3l99O84l27K24k67J98l41K49j53j84p3J25J81r0n9j57K59Q8j39
5241hLM3j06Q6k82N02l4j25K1p7M4K9k61K77j16n2k62L03l80O07l4J12k84N1j39
5266h2K54nr3Q02p05q27R05l57l83N27j25J66j11k6k0K25j63J63l4j70L9M7j19
5289i2K66j95K26l10K57k46J33J30m10K52j61J76Jj5j01J48j05l15K57k0j22p6
5311c22L21j51q3J51q4J0J31N1j87K53j28R8m7j18j24J34q7j38L20j78K82j85
$$ plain form
5152 234 -161 -186 42 -217 3 -134 -289 -53 -270 -247 98 -294 -24 -214 73 -267 118 13 -104 41 55
5173 55 104 31 -171 -54 -15 109 -164 -183 -9 84 -227 -19 20 -319 204 -111 172 124 51 -245 -113 42 -26
5196 -26 -43 -299 -322 16 -157 12 19 -228 -92 26 -44 77 -198 168 155 -57 209 129 -187 59 104 50 159
5219 159 -105 100 173 -226 458 131 355 88 286 -55 194 41 -143 -216 -91 90 0 -59 -216 43 131 -8
5241 -8 -5 38 -68 18 -264 238 204 79 100 23 67 96 -165 112 -4 -56 -318 -15 -395 212 178 290 6 57 -82
5266 -82 172 167 74 876 171 -656 249 -108 -491 36 -89 77 -34 -60 -80 145 -18 145 111 -59 -20 27 -92
5289 -92 174 -21 205 -105 152 -94 39 169 -241 11 -150 26 27 12 -89 59 -46 -361 -104 -124 -246 -322
5311 -322 -1 -152 -235 -84 -168 -158 -27 24 -163 90 -38 60 13 -105 -229 -95 -182 -320 0 -178 104 -81
5333h1p2N14k78m9j17J89j77k7J21J20O4n2Qk29K62k27J76q4k57K22j15K77Jj75
5357A4K90l62J49PK19k12J43k03J27k25K21om0j36N7PMo0R7K04j15N2j54j33j12
5382a67K32j53J56p8K5J30l05J42K18k93O5M5K5j22J9j69L02L8j39J43j37j46
5404a69N8J28J69j07k07J34j55L50l34K45j69J55j69j05N1K96l01K07P5J39k82
5425Ik20J96K6J54m9Q0k70J70j82R9K3R3m7j15k11K31l5O7j76R2j40M59l59O1
5449d4L20k85J6n3K43l23r1J40L6j97n7L9L44k19K5Q1J81l12K6L89n94K11J43
5472A9l6N2k4J22L4j44r1k0J20k93N01l44J11r9J28K80n18L16m7j28J09k5j4l
5496FJ24j16J00j36J76j8l1K18k32k03K47M17l66k53j9q4J9J31l1O5R4j2n0Kk2
$$ plain form
5333 -81 -153 361 83 34 -83 106 -71 -98 23 143 207 155 163 -66 196 -31 145 61 -196 26 -89 188 189 14
5357 14 304 -58 91 98 317 105 248 45 172 -53 168 162 122 -14 43 50 54 -6 91 295 180 232 78 -55 -167
5382 -167 65 -88 68 -10 15 145 -160 -18 200 -93 -28 17 42 -80 -61 -230 72 110 -29 114 -23 -169
5404 -169 -111 17 186 79 -128 6 -149 201 -133 112 -57 98 -71 -176 -125 171 -130 77 152 291 9
5425 9 -211 -15 11 165 116 196 -74 96 -86 13 36 129 82 -33 -244 -13 -48 19 -157 -65 -205 254 -105 -44
5449 -44 276 -9 7 -46 197 -126 -217 -77 -41 -238 -295 -256 88 -131 -106 -25 156 -156 -130 259 -335 -124 19
5472 19 -17 35 11 133 167 23 -68 -88 32 -261 240 -104 7 -92 36 316 -202 114 67 -61 48 23 9 6
5496 6 130 14 114 -22 154 136 105 323 91 -112 135 552 186 -67 -86 -170 -151 -20 -51 14 108 96 46 48 26
5521B6Q6k30O9J92K5k51J62k71J76J85l7nj49j25O9K91K4k66m5J11j24j76L18
5544E5j12j16J40q9%K33j30n04M57j7J89j6k29J78K72n22k5K66J15k30p3M3L27
5567B12k53m1j34M90q2m39K57K08m44K62O3k26K91r1k58L10o7j56K42k47R9N3
5589D9j25n6K84J10m40O9J76r0J18J30o5j91M02n01J51l9K88l23K48k69j1J12
5611B7J18m2j57J81j06R6k23Q3J09J9l0O2r8l4J79m2k53J3J95r3k48K14j04l1
5635a65K19J5k21J56L37k80J06Rp3j4k54J07k2L47j69J78k52j33L62p2p4Ol4M0
5659A19m2j24R2J12k12J71j8k34J15o8o8J73j52J72J71k10n6L67l95J16k5L8r6
5682e4p6j6J35r5P0j29O9K37j48j91K55O5j80J35m17J95L5P4P2q4k45K80k23N79
$$ plain form
5521 26 112 -118 -49 143 168 -83 79 -192 -16 169 132 127 -22 -147 -78 213 237 -29 -74 37 -87 -263 55
5544 55 -57 -173 -33 -122 -122 111 -19 -523 -66 -83 106 90 -139 39 311 -211 -236 30 145 -85 -158 -115 212
5567 212 -41 -82 -216 274 192 -247 10 218 -226 36 99 -127 164 73 -185 125 58 -98 144 -103 -4 49
5589 49 -76 -132 152 262 -178 -109 67 -23 95 225 160 -31 371 -130 21 -18 270 -53 195 -74 -85 27
5611 27 145 103 -54 127 21 117 -106 -23 86 105 75 137 39 5 184 142 -111 -98 97 4 -244 -30 -134 -165
5635 -165 54 69 -152 4 341 61 167 176 103 89 -165 -58 -80 267 98 276 24 -109 253 181 107 113 79 119
5659 119 77 -47 45 157 -55 116 98 -136 -21 -89 -157 16 -136 36 207 -3 -59 308 -87 29 4 42 -54
5682 -54 -130 -146 -11 -106 -36 -165 -96 141 -7 -198 57 122 -58 77 -340 -145 -110 -36 36 -48 -293 -13 -236 343
5706C43l42r8l07K73j05K26m6J44k60J64q3M8Q5k5j65K61j25j7n0L04j46k89K29
5729A9n0j6K2j03J0J53j30J79K4o2j55L29l36K61R6l82J64K62Nj5k71K31l42Q6
5753b1L6j99L44o0O8M5k08K02l33L46K6j58j55M1R0J67k95l4P0J26M7j74K37l8
5777A70k28j45J25k1pR2K9l1PK37l28n6K86j15j36O4J2J30k55Q9K19k08K61k30
5801c9j00K91j72L3J56j64j16k42N34nj41J10j37L07n55J06J50k41J43L5n6J43
5823D0k78j13M93L7q5j75L48k14L3j10j88k8J64K12L3j72l9m2M8j08J04p7J17
5846@J98m67K99nl04%K21J08Jj66P9J68j88Q0p4J48j43j60J34R7j16K89k70j41
5870b12J01K41j40m3J29J71j81k76J35K02n6l7R6j63M63l98K41k96J14J16R3k99
$$ plain form
5706 343 1 -97 -404 -131 -236 -10 -56 88 -172 -8 -91 -43 42 17 -148 113 -12 -29 -79 225 79 -210 19
5729 19 -31 -47 -25 -128 -118 35 -95 84 108 46 -109 220 -116 145 241 -141 23 285 290 275 4 235 -107 -21
5753 -21 15 -184 160 100 168 213 5 207 -126 220 246 88 -67 -26 64 231 -64 -98 -28 98 145 -29 208 170
5777 170 -58 -203 -78 -99 -106 -14 15 -16 -9 228 -100 -156 130 15 -121 -57 -45 85 -170 -81 138 -70 191 -39
5801 -39 -139 152 -20 13 169 5 -111 -353 181 176 35 145 8 315 -240 -134 16 -225 -82 -47 -103 40
5823 40 -238 -351 142 179 94 -81 267 53 86 -24 -212 -240 -76 136 169 -3 -42 -84 -36 -144 -40 -117 0
5846 0 198 -269 30 25 -279 -279 -58 50 51 -115 -36 132 -56 24 -50 98 -45 -205 -71 26 -90 199 -71 -212
5870 -212 -111 130 -10 -53 76 247 66 -210 -75 127 71 34 130 -33 430 32 273 -23 91 207 300 1
5892Ap0M61j88J5k32K17L1k00N7o6J74L8j72K05l30M7K57m47M0K48r2J01p9j06
5916i0j01J65l07M01k43J87k3j0r8j0n9M2L14j38k47J72n4P2L0l0Q3j60J8J7J56
5941H7q2oj94L06q0k36L40j44Q3M9j79k70L57J25m41L92N0k55L05n99j76P66j75
5964B3M69j055J55M15O77p02o4J78j60J50j81n4J00K47l61K77J6j73K2O9R8j82
5986c6o3k0N1J21r2p1J55Q4k93J4J49l3P2j61R1l9K42j12O8M1l08J24K06j3j84
6011gq9K54l39L38j35N3k05O9K68l09K95k86j17L11N2m59M48j50n4K02k8j07k9
6034b4J41n1J13j15J32r7j38K07k95L13k78j5K60L6l89J49j55J07J11k1j53J32
6056c0J1l88L82P0r8P8n0j82J17J88j51O2j46O7J48j09Q1o1k95L41p8j46J38K7
$$ plain form
5892 1 -69 392 204 219 -13 204 235 35 92 26 200 238 66 271 -59 -12 245 -202 -162 86 -6 95 16 -90
5916 -90 -191 -26 -333 68 -175 12 -11 -21 -119 -129 -188 -146 168 30 -217 -45 -99 -27 3 -27 56 -104 -86 -69 87
5941 87 5 -1 -195 111 31 -205 135 -9 74 123 -56 -326 31 156 -285 107 157 -98 207 -392 -568 198 23
5964 23 492 -563 -408 7 684 -18 -82 96 -64 86 -95 -149 -49 198 -163 114 130 -43 -21 48 146 -36
5986 -36 -99 -119 -68 53 -39 -110 45 129 -164 -150 -1 -34 38 -123 -32 -71 171 59 127 168 -140 -16 190 177 -7
6011 -7 -96 158 -181 157 22 75 -130 -61 207 -102 193 -93 -210 101 153 -306 142 -8 -62 140 112 5 -24
6034 -24 117 66 179 64 196 99 -39 168 -127 186 -92 -107 153 189 -200 -51 -206 -99 12 -9 -162 -30
6056 -30 -19 -407 -25 45 -53 25 -25 -207 -90 98 -53 9 -137 -70 78 -31 50 -11 -306 35 -43 -189 -51 -24
6080b4M1Kj83K8J46J9r9j69M1qK02j88Q2o5K27k43J35j2O2N5j00M3K5j04L2q6
6106a41L69k93J30j50P9l7N2nj26L60k49m6j0J50j10J44J00k54J62r6P3o0j32
6129i0J97L1p2J12j29K8l9J54n2LR7l10K43j19N6j90L37j52l28L19P9k72n3K02
6153E2K8p9m7j40K64rn4K5k20L3J98m7J63m06K56j8J3O3N1qk72L88j45j68j13
6178a92J90j92J98J06jJ42j33j24j6k1j49J64K0J12j08q9O2O1l9J51Q6j68o0o0
6202f0m7L8K46k37J37j96P5J48j61j38P6J79o7R6J9j72j1r1l6J67J22k32R7j60
6226b08J47o9J09M7j04j22r0J79J06J1l0J89j42J14j52k85M05K1q6O5j73r4J39
6249b3l7K0K76q8J50k53o5J7J76j66K52K14p60L93k01M56p4k19j37P4r7Q3k73
$$ plain form
6080 -24 17 19 -164 -136 10 29 -70 -239 -198 -206 -4 -192 -110 -175 52 -191 -56 -68 -6 49 -51 -8 17 -87 -55 -141
6106 -141 228 -65 65 -85 -6 -43 9 4 -122 238 -11 -57 -67 83 -27 117 217 -37 125 29 102 42 -90
6129 -90 107 138 66 178 49 77 38 192 140 143 240 -70 173 54 110 -80 257 105 -223 96 175 -97 -150 52
6153 52 80 1 -46 -186 78 69 15 40 -180 -147 51 4 167 -239 17 -1 12 75 126 118 -154 234 89 -79 -192
6178 -192 -2 -194 4 110 109 251 118 -6 -22 -43 -192 -28 -8 104 -4 -93 -31 30 -9 142 228 60 0 -60
6202 -60 -107 -69 177 -60 77 -119 -44 104 -57 -195 -119 60 -7 89 108 -64 -75 -166 -202 -35 87 -145 -48 -208
6226 -208 -61 -130 -21 26 -78 -200 -290 -111 -5 6 -24 165 23 137 -15 -300 105 126 40 105 -68 -162 -23
6249 -23 -60 -40 236 148 298 45 -20 -3 173 7 259 473 -287 106 -95 361 287 68 -69 5 -92 -9 -282
6272b82N01r2l7N7n4K3j01J71l95l25M31n83P58j55L24K6k8l31o7O58o90k2N85
6295C72r32J025m22K48j88q4l0k45J75j68n2n0Q05p74N4M98k20Oj76K18k12J6
6317a36l5N73n11J54k73J69Q0N26r04k68J46M76L70m61j3k00J72nR65j062N77
6338C40p9J88r05N70p31J629q72l36M90k15o84M84J96O18j42p49n07K90N31m77
6358c61M74o70N72l71L24K68n11m0N9J35N2O91j162J147l23n25N96L62r25o8K14
6379f2j90O59l45J46o61K28q0L44k6PM1l38M02m30J43L74m3l02K57K50m49M14
6401C39o0l95j6k0L1L13K76m97ON80n74k41K83j08L1kM74l6K44l96p48J420r92
6424h8Q4o4k22O63q19P93k90M25j40m44N85L79n59o62N95M19p33m4j00K63K26
$$ plain form
6272 -282 219 127 90 147 93 116 15 186 -209 -534 -103 -686 72 -83 241 267 239 -92 -159 499 -191 -213 372
6295 372 -560 465 43 291 103 19 -11 -256 -81 -249 -301 -351 454 -320 -266 232 12 18 -158 60 -152 -136
6317 -136 -171 402 -109 45 -228 -59 21 547 -357 -625 -479 -3 367 -94 -107 -307 -135 -140 825 -237 340
6338 340 261 449 -456 114 -617 1012 140 -196 294 79 -605 -121 75 693 551 -198 -705 -415 116 -361
6358 -361 113 -557 15 -356 -32 236 -275 -315 -256 -121 -69 622 -540 607 284 -241 355 717 -208 -276 -62
6379 -62 -252 407 62 208 -453 -225 -305 39 13 20 61 -277 125 -305 -162 212 169 -133 124 374 -75 339
6401 339 279 -116 -132 -152 -121 192 468 -29 -23 557 -17 -258 25 -83 -52 -54 420 384 628 232 -516 904 -88
6424 -88 -4 -68 -290 373 -446 347 57 482 342 -102 483 862 303 -359 236 655 -78 -122 -222 41 267
6445B67j96R5r00k3Q65p60J108m93M83j87L91o91J94M4L77K0p17L20o38J067m28
6466A98l05K93o34M55K54k20L39n1p50K85j31k33J89N4J70J87K64n46j79K2N95
6487B56j11k32K38r9j58J24j43K8r7J54k1R6k6j85K84l23J6K13q5k89L09R9r7
6510d9P3J93n7m58L34j23m6J43J42k35J91l39N64o60M81M5p82J15L80K24k64j58
6532b86M80k0j77M7n3J56k49K05L1J5o5k20J41j6J46N7k28j08J37j36Q2J24J38
6555B01N5l53J64J62n1l95L9J45j59K39j98J37J12l2k1L9O2j50J38jr7j09J40
6578F7r2L4J52o8l4j75J9K1j81J71M1j91j1K03n5qQ3o7o3J00n8R6j62PK93k69
6604a47J68K71k93l46L73k35J25K9L3k02L04L3j10j13L19j96K15k21J72m5m6Q7
$$ plain form
6445 267 71 166 -734 -757 108 -652 456 -37 446 259 650 -41 153 197 574 594 -123 197 -441 626 198
6466 198 -107 186 -448 7 261 41 380 329 -421 -136 -267 -500 -311 -257 -87 100 364 -182 -361 -339 256
6487 256 145 -87 151 52 -106 18 -125 -97 -194 -40 -61 35 9 -176 108 -215 -199 14 -71 -360 -51 48 -49
6510 -49 24 217 160 -298 36 -87 -133 10 152 -83 108 -231 333 -327 154 199 -583 -468 -88 136 -128 -286
6532 -286 194 174 -3 44 -9 147 -102 103 134 149 84 -136 5 -11 135 192 -36 -144 -7 -143 -61 63 201
6555 201 256 -97 67 229 178 -217 -178 -33 -192 47 -151 -14 98 66 45 84 146 -4 134 133 36 -73 67
6578 67 -25 9 161 93 59 -116 -97 -76 -257 -86 -45 -236 -247 -44 -99 -107 -24 -91 -154 -54 -112 -16 -178 -171 122 -147
6604 -147 21 292 -1 -347 26 -209 -84 -55 -22 -224 80 113 3 -110 209 13 228 7 179 134 88 175
6626A75j64p1j10M4K82j64j48j2L43k30o7J76RK59k89j32L5J68n0R0k54L73j38
6649A25J03m3k53RJ72n7j57R2J3L25l86Q7q1R8J53p9j47L6mN5j89P3M0k5K32k25
6675c3r8L12k99j5J72K7J46k57R7l3j87J37J04j86K70p4j55P4N3n9O4j31J87k4
6699I2J11l49K71j56J17m8o9P9M7j20RJ17j17o5K79l23R6Q8n3p4k81K68K02j82
6723f1mQ6K0k86K97j79m6J1J53k43K96k79J46Q5j21j46L97l00J29n0o3J13J80
6746A35j25k92J41J65J43l21K21j96K15k21K03J20j93k0l7O7rn0o0O4k92K19L35
6769B12l18J21j8K6J36k69R9J59j15j93K57k0p3L0N7o8K1M2K6n6J82j21n5K18
6793B80j56j15K30m53J89J00l44L73j54J46j26K54j60J8N6Q6l50L94l99P5K91
$$ plain form
6626 175 11 -60 -170 -126 156 -8 -156 -168 175 -55 -122 54 63 322 33 -99 -64 104 54 144 -110 263 125
6649 125 228 185 -68 -59 113 56 -101 -9 4 329 -57 30 -51 47 200 121 -26 10 6 61 -128 -55 -15 -40 192 -33
6675 -33 -131 181 -118 -133 39 66 212 -45 52 19 -168 -31 73 -113 157 83 -72 2 55 -4 60 -71 116 92
6699 92 203 -146 125 -31 86 38 -31 48 95 -25 -16 101 -16 -81 198 -125 -29 59 6 -68 -349 -81 121 -61
6723 -61 -65 21 41 -245 52 -127 -173 -162 -9 -252 44 -235 -89 -4 -125 -271 126 -174 -45 -95 -158 -45 135
6746 135 10 -282 -141 24 167 -154 67 -129 86 -135 68 188 -5 -25 -62 5 -4 -54 -114 -50 -342 -123 212
6769 212 -106 15 -3 23 159 -110 -11 148 33 -160 97 77 4 34 91 23 44 86 112 56 238 117 62 280
6793 280 124 9 239 -214 -25 75 -269 104 -50 96 -30 224 64 82 138 224 -126 268 -131 -56 235
6814B35j05j28rj7j1J66j90k0j15R7J55q8k21M22n7p8k35L50o0j15R6K06m8k06
6838B4O3k20J75p8LO1j80L9q3Oj1M39k95LK47j69J57k42k8K29j33K10l77O5Q5
6863a0K87j72j86q0M5L1L45l97J51L08l98J45k8M0k1k99L34j56P0K2l02J22L45
6886A96j89pkJ07j01J41m0l61J99j09K08K7K06k44q1j30J9K86M8m1j71r6J91j40
6910h4j13J06K37k86J17J69j63K05k78J61j98M5J56oK5o4L7M6j02j02J10j28K13
6933A03j45J72p4J65k52K5j03K00j87L9L86k48P0N4l58p9N07k45J59k58R3r2J37
6956F9N1j98K64m99J73K47K3j40O8O7N9k30r8Q1j8j60J9L40n32N07N55j079L97
6979c4l05j95L04j25L93L5J95m68K07J59m08M36j46k45M8N28k2l76j77J78n67
$$ plain form
6814 235 130 2 -7 -24 -35 131 -59 -79 -194 -97 58 -30 -251 171 114 36 -199 151 91 -24 72 278 230 24
6838 24 87 -133 42 -36 -33 28 -152 -113 -196 -190 -201 238 -57 -54 193 24 181 -61 -89 140 7 217 -160 -95 -10
6863 -10 277 105 -81 -161 -116 -85 260 -137 14 322 -76 69 41 81 60 -239 95 -61 9 31 -271 -149 196
6886 196 7 0 -2 105 4 145 105 -256 -57 -166 42 69 275 31 -50 -180 -161 125 173 132 -39 -135 56 -84
6910 -84 -197 -91 146 -140 -23 146 -17 188 -90 71 -127 -82 74 68 93 29 66 112 10 -92 18 -110 103
6933 103 -42 130 56 221 -31 -6 -109 91 -96 -57 329 81 151 205 -153 -232 275 30 189 -69 24 -68 69
6956 69 120 -78 186 -313 -140 107 130 -10 58 125 184 -46 -144 -63 -81 -241 -222 118 -414 93 648 -431 -34
6979 -34 -339 -534 -230 -355 38 73 268 -200 7 166 -242 194 48 -197 -149 379 357 -19 -196 -18 -585
7000e85L88k1P5O2j03M50k32J30k97N9m8K05J8j44k61K11J92j1o7K15n00L29l0
7023C5j31q3J98L7J43J50m89M94j91j96q1J44m10P21m94L08n51L92L86k13O8k59
7045b2J54j33j42j73Q5o0l41M03O65k60q7j29K07k3j30J8K0J80q5k06L80k33k11
7068a23K20ll6J62m9j72j49K39K5k57J95J04o6p4J5NJ45k06%l6J20k00J92k03
7092a52l9K97j25K04j62r1j2N7K66j85N8j06J56q9j62o7J87n0Q0n5j20M6k12L89
7116A13l31R0J94k65N8J25j66J31k2L1l6J19J48k09Nl0j28J7j34L70j0k32P3L7
7140e2M2L3k7j67m1L45j59L02k67N5k30k0J65j22J23O4o7n3J3O9N7n8J86o6n7
7165F8J19m16K56K11J1q7J69q3m49J88O9J92k8q9Q9k13K57m8m43J50J33j19J76
$$ plain form
7000 -585 -197 -218 -143 -81 -184 266 34 164 -133 -74 -122 83 101 -43 -304 -93 99 88 21 236 -264 65 35
7023 35 -96 -179 19 56 199 349 -140 354 163 -33 -114 30 -380 341 -153 155 -396 -4 382 169 237 -22
7045 -22 132 -1 -143 -316 -231 -291 -632 -229 436 176 89 -40 167 144 14 32 52 232 147 -59 321 88 -123
7068 -123 97 94 58 220 171 -1 -150 89 114 -143 52 156 90 16 31 36 181 -25 -25 -61 59 -141 51 -152
7092 -152 -191 106 -19 185 23 -68 -80 -23 243 58 116 10 166 77 -85 -152 35 -15 65 10 -110 -64 -276 113
7116 113 -218 -128 66 -199 -141 -16 -182 -51 -73 -42 -78 41 189 -20 -15 -45 -173 -156 -290 80 70 -162 -89 -52
7140 -52 -10 23 -4 -171 -212 133 -26 276 9 64 -166 -186 -21 -143 -20 44 -23 -76 -63 6 63 5 191 125 68
7165 68 187 -229 27 238 249 162 331 248 -201 -13 56 248 220 131 220 7 264 216 -227 -77 56 -63 113
7188A13j39n5L28j89k12K08L1L5P2j52J34k33m7J3n8K54k30K64l33J61O3j20J40
7211D8j39j22K27%o4K33j26J2m9J34k72N9j22m3K06j4j78N1P1K12k17J20k9Om4
7236d0J2j01J21M7o6J3j13l45N24M5j96J97Jk36L24j81j85L26k07R7K30k27o3
7259b3o7o7L44J57l08j48J46j42J36j50mk4J2J70j76P9j70L10o0o2r8K81k67K00
7283F9m0p6jK8m2j80K46J59k9K23o46L35J15j68k86K35J39q3j17L8J79n7k47J03
7307a03R1L16j14l40L61l53K48j64j81M4L84n83k98O70L1k05K87q5k36L45j72
7328e7n1J6J19N4k36J80L96o15mj26P8J98J47O7j32J33m01L96Q0m44J63J32k66
7351a73L23m68K61j1j75p4J02J12j25J92M7o6L5p2K4P3m9pj4M8j93J19J99J36
$$ plain form
7188 113 -26 -81 247 58 -154 54 85 120 192 40 174 -59 -106 -93 -151 103 -127 137 -196 -35 28 -92 48
7211 48 -91 -213 14 14 -50 183 57 69 20 154 -118 -59 -181 -224 -18 -32 -210 -159 -88 124 -93 27 -2 4 -40
7236 -40 -28 -129 -8 39 -27 -14 -127 -472 52 97 -99 98 99 -137 187 6 -179 147 -60 37 267 40 -23
7259 -23 -90 -157 187 344 36 -112 34 -108 28 -122 -126 -150 -138 32 -144 -65 -235 75 15 -47 -145 136 -131 69
7283 69 29 -47 -48 -20 -62 -242 4 163 134 357 -289 46 161 -7 -293 -58 81 -2 -119 -81 98 41 -206 -103
7307 -103 -12 304 190 -150 211 -142 106 -58 -239 -195 189 -394 -692 -22 9 -196 91 6 -230 115 -57
7328 -57 -108 -92 27 81 -155 25 421 -194 -198 -324 -246 -48 99 166 34 167 -234 162 242 -202 -39 93 -173
7351 -173 150 -318 -57 -68 -243 -317 -215 -103 -228 -36 11 -55 -20 -92 -68 5 -44 -51 -65 -17 -210 -91 108 244
7375B44m48K23k16M2J11Oj3r9K35M9k29j77L74j76N6R0R9k05J04j83K24j27j75
7398a91N2L58j58rk34J58J34r8L4l01L12rk58O2K14j82L92m5m41K17L1R4M6k58
7422h0L21m22k0L94m07J23k7K9K44K2j78l1l7J14J09j16N9k8l54L38J40k22L67
7445C38l56K3n5k9K6l7K51j22K0j53q1L17j9J1n1m4L7J3m1J58m56M52j16L20p90
7470c84N75j79J49J25j049R11k15K58k67J59j22J33q2J06k2m37J81K77j42r0p3
7491a88J69J53k33j3R2o0J1k13J70M4K8J72p2l14N3N10n92K97J46l58K27j60J95
7514F4n0k96J40J4J25J85j94K7k90L00j42K17P5r5k12K34J26k75J82j22M0j58
7536a05J06P6Q9j49q6L7P8n4N4N7k91K92l12M19j46P2m19K70J55P4j00j99J77
$$ plain form
7375 244 -204 19 -197 -155 -44 -38 -51 -150 85 134 -95 -272 102 -74 -18 72 171 -34 70 -113 111 -16 -191
7398 -191 -139 219 61 52 -182 -24 110 12 46 -255 57 48 -210 -148 66 -116 276 231 -210 7 38 132 178 -80
7422 -80 241 -181 -201 193 -214 -91 -118 -89 155 177 -1 -32 -69 45 154 38 97 69 -285 53 193 -29 338
7445 338 -18 5 -50 -79 -53 -90 161 39 59 -94 -175 142 123 134 83 39 76 89 48 206 -250 202 86 406 -384
7470 -384 191 12 161 286 -763 148 -67 191 -76 83 -39 94 12 118 96 -341 -160 117 -25 -115 -188
7491 -188 -19 134 -99 -112 -20 -80 -69 -282 -112 -68 -40 132 60 -254 -201 309 -283 14 160 -198 29 -131 64
7514 64 14 -282 -142 -128 -3 182 -12 15 -275 25 -117 100 175 80 -132 102 228 -47 135 13 53 -105
7536 -105 1 77 166 17 -69 -32 46 -8 46 103 -188 104 -208 211 65 137 -282 -12 143 217 117 -82 95
7559I5J21k91K9J19j51J14k6M1K5r9J13M3l90J63J92q4n6L43l55Q6p2O3j34pn6
7584a74M8K04m07N04j64N8j37J42j05O4j1J75j19oj24j06K60k34L12k15J15n6
7606B4l00K41K97j71j67J2J7K9J14nM3k06k5K2O6j8O4l77K29J04J02n4j06J77
7630A12l16R5Q2OQ6k21J95j36J73l02J9K69k20P0J06j40J15k5k1L7J08j36P3j75
7654a46p3Q2n5L1j64K58q2J81j89J42l9K14k9k15J12j11M4K90j14q7n2K31m02
7677a73R2K35j20R5M0j79j02l1r1J82L54k85J22j66%J91r7J12l98O7L74q5k12
7700g5K58k01R4j71L99l25j3L3n7j38L39j36J4N4N6q8j32P2Q0k97K11RP7L4j64
7725f7j34M46k08J05k19K4L63l16j3n9J29j87K77o3k24M52l99J47l31N03j42k17
$$ plain form
7559 95 216 -75 -46 73 -78 36 10 51 76 -23 90 133 -257 -94 98 14 -42 301 -54 32 -40 23 -111 -118 -174
7584 -174 -126 78 -329 175 11 69 -68 74 -31 33 22 197 78 72 -52 -158 102 -132 180 -35 80 24
7606 24 -276 -35 262 91 -76 -64 -47 -18 96 91 134 -72 -97 -75 -9 -27 37 -340 -111 -7 95 41 -65 112
7630 112 -204 -109 -27 -21 65 -156 39 -97 76 -226 -207 62 -158 -88 18 -122 -7 -32 -53 -16 92 -44 29 -146
7654 -146 -219 -137 -192 -161 -325 -67 -149 32 -157 -15 -54 160 131 -84 28 -83 -39 251 137 50 -2 229 -173
7677 -173 -81 154 34 129 169 -10 -112 -143 -234 -52 302 17 139 -27 -27 164 67 179 -219 -152 222 137 -75
7700 -75 183 -18 76 -95 304 -21 -34 -1 -58 -196 143 7 21 75 131 43 -89 -17 63 -234 -23 -14 63 97 -67
7725 -67 -201 245 37 142 -77 -53 310 -6 -19 -78 51 -136 141 78 -146 306 -93 54 -277 226 84 -133
7747a33J33J3j14Q3K1k5P9p4j77J86J02k8Pk30Q9L62j44l7p5K1J9k31J96L6K13
7772B92l10J95j68P4N1l28J60l7MK8m7M4K25l5j92K8K33j75rj8o7M19k32j26K8
7797C7o4j27J45J99o1p9l8N9j21j1p8k0K38N7n0K32l02j94J16J46k68J92M1Jj64
7822a14M83k04j44k41K32K12j98Nq3K2l8l5K21j90k02L42m6q3J59j40O6p5J33
7845H2j13J3K07j21o3M3P9l58J88K08K32p17J011p01r6j0J6J69r4O5R8k13k8K72
7869A69k22J20j41k3J60j34j1P6K55j32m12K18L8J0O2j18k5J65J74j8k24k07K46
7892B6m09L63K06j90j98J20K55j34l0p8M4j28n2K53O3l1J3N2j03k21K03q0K5o6
7916i7R9Q1k70J25J53p8o4L43j64L7j97J32K91k90k57L43J94l27j16K43J9r4m8
$$ plain form
7747 -133 0 13 -101 -18 3 -22 57 -17 -194 -8 94 66 73 -157 -68 294 150 113 38 59 78 -153 43 79 292
7772 292 -18 177 9 83 134 -194 -34 -71 -67 -39 -86 -42 183 148 -44 -16 217 42 33 15 -52 367 135 9 37
7797 37 -27 -154 -9 190 129 50 12 71 -50 -61 -139 -159 79 136 86 318 16 -178 -62 84 -184 8 49 50 -114
7822 -114 369 165 21 -220 12 224 26 31 -52 -30 -68 -103 118 -72 -274 68 22 -61 98 -42 24 -51 82
7845 82 -31 -18 189 68 5 48 127 -231 -43 165 397 -320 691 -10 -106 -116 -100 69 -25 40 138 -75 -103 169
7869 169 -53 67 -74 -97 63 -71 -82 -6 249 117 -295 -77 -39 -29 33 -85 -110 55 229 211 -13 -220 26
7892 26 -383 -20 186 -4 -202 -82 173 39 9 -69 -25 -153 -205 48 111 80 93 145 42 -179 24 -56 -31 -97
7916 -97 2 83 -187 -62 91 13 -51 292 128 165 -32 100 391 101 -156 187 381 54 -62 181 200 106 58
7939E8k21J51j2p7o4L6K60p7k40K91l66K46N7lJ20k96K40mJ59q4k72j8O4N2j65
7964a65L53k03qJ0j23J65j70K71kj02J01pk13L6J25j40Q8J0J55j44k97J28J85
7987E3k10J3m3n5J94p8K21j32K3J57k26j2J43J02k00j0J08Ln1K7j10j21J12O5
8011b7J62j54K78l36M44p79O58m19L12N38o48J3Q6k53m67P27m82M40l23L08N48
8032F26j090R29L98p67J38m84J40L9o1j14M51l00K94k19j18K23o5l9K5m3nJ25
8054H3m3q0P0J52l74P8J30kl2J49k9j76J19j88L50k24M0j8L12k98M8Nk20P9L2
8079c7K55l65o8K73k73L35J17j78j6K02l27K47OK8k84L45o46J39J92k13R1K27
8101E0J96j87l76K42M49l04Q0n86L53k89J23k4K13N2P3r4j3r2N1J82j77J74j75
$$ plain form
7939 58 -163 -12 -24 -101 -165 -129 131 54 -186 105 -261 -15 42 39 159 -137 103 99 258 174 -98 -116 -52 0 -165
7964 -165 188 -15 -23 -13 -136 29 -141 130 128 26 127 120 -93 -57 68 -72 16 26 181 37 -260 -132 53
7987 53 -157 -144 -187 -242 -48 -126 95 -37 -14 143 -83 -95 48 150 -50 -60 48 51 0 27 -83 -204 -92 -27
8011 -27 135 -19 259 -77 367 -412 246 -173 139 677 29 42 128 -125 -592 135 -347 93 -230 78 626
8032 626 -464 465 863 96 234 -250 -110 -71 -132 -246 205 -95 199 -20 -138 85 20 -19 6 -37 -42 83
8054 83 40 -40 30 182 -192 -114 16 14 -18 131 102 -74 45 -143 207 -17 23 5 317 19 67 72 -148 -69 -37
8079 -37 218 -147 -215 58 -215 120 237 59 43 245 -82 165 171 199 -85 260 -386 -247 -55 -268 -177 50
8101 50 246 59 -317 -75 374 70 150 -436 -83 -372 -249 -273 -60 -8 65 -29 -42 -134 -83 99 -78 96 -79
8124g9n4K66j62j98R6j44K89J12k74J78oJ47l84K77l7q3J47k24N1J31j20K21k19
8147f9J87j8j22no9Q4J03n1J39j01j37J56r9J22m13L38j93P3j0K0J01m2NJk19
8172b19L49ro9Rj56L49j96N2ol30j3L62O2j94k2J57n7rq2
$$ plain form
8124 -79 -133 133 -29 -227 -131 -275 14 126 -148 30 24 171 -213 64 27 -56 91 -133 -82 49 -71 150 -69
8147 -69 118 100 -22 -27 -96 -12 91 40 179 78 -59 97 -2 120 -293 45 -148 -75 -85 -65 36 -6 -1 0 -219
8172 -219 130 121 52 61 -95 254 58 110 104 -226 -239 123 185 -9 -31 126 69 60 -22
8191b2
$$ Imaginary data points
##PAGE= N=2
##DATA TABLE= (X++(I..I)), XYDATA
0@%%%%%%%%%%%Qj6J6j6K4l2L4m2N6o6P4q8J08j32J54j78K08k42K81l23L68m20
33b24M77n41O12o91P78q71R74j086J208j343J493j655J831k023K233k463K713
50A422k988L290l624L993m403M863n378N961o629P402q310R389j0697J2327j4418
65g800J7216k1175K7282l8420R6528k68552K41883P1256l67370L75237r5522j16003
77h5440K21820j43099k6371P3009j00743P6368k3670n962M6091l6369k45J0876
89F265p35j3343J586J9540o5693N6890N455n8362R8241m5122k8046O4194j03196
102f2326N0763K2471p1737J03734l8780k4710O4461q6652L3473J6003m7155N6448
114A5993l0169J0970K1649m7350N0599k2848j8098L9991n2915K4839J6657l2651
$$ plain form
0 0 0 0 0 0 0 0 0 0 0 0 0 8 -8 8 -8 16 -16 18 -24 32 -34 40 -48 60 -72 82 -96 112 -130 151 -172 196 -224
33 -224 253 -288 324 -367 411 -460 514 -572 636 -707 786 -869 962 -1061 1172 -1291 1422
50 1422 -1566 1724 -1900 2093 -2310 2553 -2825 3136 -3493 3909 -4401 4988 -5709 6618 -7800
65 -7800 9416 -11759 15523 -22897 73631 -194921 46962 118218 -249152 126085 30563 -85440
77 -85440 136380 -6719 -33090 39919 -60824 15544 -8126 -14088 32003 -4366 -4611 6265
89 6265 5530 -7813 -6227 13313 -52380 4510 9965 -48397 49844 4722 -23324 40870 -62326
102 -62326 -11563 10908 -60829 42905 4125 -20585 43876 -42776 -9303 6700 -40455 15993
114 15993 -14176 -3206 18443 -28907 21692 -1156 -19254 20737 -32178 -7339 9318 -23333
126b3333M3337r608r199Q046k3144N511o175J7633p96n859L8318m4666K582K8339
140B0986n3769M4886K94l9252N5292l4974n031L3295l7186L3350r614k5964L2338
153A4651l4365J3732J8305k2308L3528j5132j1560R082k4687J8631p029K129K3266
166A8243k3339J9807j2584j7637L4066l6594J2946K0714m2724M3558p715k5284
178a6543M9919l5822q403K5663l8764J6261J6917j2990J9455K620j3855p316K503
191c55j0585J422K4856j9201J4190J3972m1301L3499p965l1635N2633l9850o269
204a6589M9885n7965L2990K8632n6788M6388j8740m3131N0443l0802M368M8678
216C7369l5914J3747O343m8415J9536K850j9808L9889L604k3734K4503j8739l0505
$$ plain form
126 -23333 20004 10396 1197 9243 -13901 -8390 -14565 3068 2272 -3587 34731 -9935 -7353 20986
140 20986 -32783 12103 12397 -26855 28437 -6537 -11568 21727 -15459 17891 8277 -17687 14651
153 14651 -19714 -5982 12323 -9985 23543 8411 -3149 5933 -18754 -123 -7152 -5023 18243
166 18243 -5096 14711 2127 -15510 18556 -18038 -5092 15622 -27102 16456 8741 -16543
178 -16543 33376 -2446 -10849 14814 -23950 -7689 9228 -3762 15693 18313 4458 -2858 -355
191 -355 -10940 -9518 15338 -3863 10327 24299 -17002 16497 8532 -23103 29530 -10320 -16589
204 -16589 33296 -24669 8321 36953 -19835 26553 7813 -35318 15125 -15677 -11309 37369
216 37369 1455 15202 21545 -26870 -7334 -4484 -24292 15597 19201 -4533 19970 1231 -29274
229b9274L5324j4009j2911M5060k9536p775L2070l9400J4551K1016l5140K5352
241E328q745k2002L1414k0480R010K7287l4822J5267R09l7554K8502J934j2460
254a6412L2496q649j3217R899j8471k693J0921l083J2708L618q050P141j0151
267c943q651J4574q356j96J6707j2112Q18R044j2160O060P76n837R237r505K911
282f33R186j5906J4694M097j8919K0044n654j7855K1723j1286q391K3581j2860
295A821L75J5825k0847K430O677j8844J3204R253j3092J5828j220j7199J1680
308E891p180j0170J8276m727m255J3469j1629l724R417r586M140P614j0807L217
322e4P14r629J0012L865m539R356o413j0266M541p441J470J6105n148L548P379
$$ plain form
229 -29274 6050 -7959 -20870 24190 -5346 -13121 18949 -20451 -5900 15116 -20024 5328
241 5328 -3417 -25419 5995 -14485 -5475 21812 -13010 2257 3166 -34388 -5886 -3952 -16412
254 -16412 16084 7435 -5782 4117 -14354 -17047 -6126 -9209 3499 7117 -933 6208 -3943
267 -3943 -12594 1980 -6376 -6572 10135 -1977 -1159 7885 -4275 1785 2561 -3276 5961 -3544 -633
282 -633 8553 -7353 7341 11438 -7481 12563 6909 -10946 10777 -509 -8900 14681 1821
295 1821 2196 18021 -2826 -396 6281 -12563 641 9894 -3198 12630 11410 -5789 5891
308 5891 -1289 -11459 6817 2090 -2165 11304 -325 -4049 5368 -4218 -78 7536 -3271 -54
322 -54 660 -8969 1043 4908 369 9725 3312 -6954 -2413 -9854 -8384 7721 2573 6121 13500
337A3500j9788r16P355j6299J4945J5175j8298J3812J383k5696J7773j366j6248
350a4668K6199r491j0661K2354j9377J714J9582k5614J1729Q994k9709K1916K817
363E785j9861L0649q297j7959K1914k0741p619K3452j6227Q775J6504k1133P644
376B886O90k0261J5364n75r591K0564q003o913J5124j6246j649J2878j6643Q018
390d357Q557j5073J4204L81j3865J5530r608p581J5324j3042N089J1473j4507
403g475J0927l99j2885J3676j0031k226J5146j2953P369O718j4040J1261l815
416A273r316J2950p376L94R849r471O592J419j0194P805k084n150R255l041k284
431F21Q211o561k787Q769p394j91Q719j0949M696N562j4172J2365J092j2449J6175
$$ plain form
337 13500 -6288 -7204 151 -16148 -1203 13972 -4326 9486 10869 -14827 2946 1580 -14668
350 -14668 11531 2040 -8621 13733 -5644 -3930 15652 -9962 1767 10761 -18948 2968 5785
363 5785 -14076 16573 8276 -9683 12231 -8510 -16129 7323 -8904 -129 16375 -4758 2886
376 2886 3576 -16685 -1321 -1896 -11487 9077 1074 -5839 9285 -6961 -8610 4268 -12375 -4357
390 -4357 4200 -10873 3331 3712 -10153 5377 -4231 -11812 3512 -9530 -4441 7032 -7475
403 -7475 3452 3053 -9832 3844 -6187 -8413 6733 -6220 1149 7867 -6173 5088 1273
416 1273 -8043 4907 -2469 -2075 7774 -1697 4895 6314 -3880 3925 1841 -3309 5946 2905 621
431 621 8832 2271 -516 8253 859 668 9387 -1562 3134 8696 -5476 6889 7981 -4468 11707
446A1707j0207o487J6383j7043N394J3322j8166J0594J642j5114J3907m735o602
459e405J2981o429m157O189n870n51P754m503k723Q943j0449m694J2695j0858
473g077O076J1890j9595J1001J847k1194J8280l209p462K1364j4188l385J2295
486F643j6937M459P571p212P637L09o922K363K350m263J202P799q180J801L408
501B028j2079J2583J509j1087J7342j0792o882J3924j7872Q688J3059j6913J3083
514F591j15j5019J1149o734l182J3825n592r12N659p070j314L183n791L780P730
529F188j0537N323N181j4423J1276k233j1462J9791j1417n087J7872j7924P634
542A82N633j7995J9367o688r495J8506j5670M504Q756j7765J4390n8r376J1273
$$ plain form
446 11707 1500 -4987 11396 -5647 -253 13069 -5097 5497 7139 -7975 5932 1197 -5405
459 -5405 7576 1147 -3010 3179 -2691 -3242 4512 9 -2714 6229 -4220 -8914 3781 -7077
473 -7077 -1001 10889 -8706 2295 4142 -17052 1228 -1981 -9443 11921 -2267 -5652 6643
486 6643 -10294 -5835 1736 -5476 2161 2470 -4452 -2089 261 -4002 -2800 4999 -3181 -1380 2028
501 2028 -10051 2532 4041 -7046 10296 -496 -7378 6546 -11326 -2638 10421 -6492 6591
514 6591 6476 -8543 2606 -4128 -7310 6515 923 11 5670 -1400 -2714 469 -5322 -1542 6188
529 6188 -4349 974 6155 -8268 3008 775 -10687 9104 -2313 -7400 10472 -7452 182
542 182 5815 -12180 7187 499 -8996 9510 -6160 -1656 7100 -10665 3725 3667 -5709 5564
556E564q891K459M470r252R420r02m022N957o975J01M822l071R90M713R1n872
572c98J525k171k865J0360m829J958Q277j4933N544j136j1857K1532p744n523
586b260K0292k1118o67J2705k0324J4669Q030j6038J3767l909j2059R758m018
599a172p88J0102o823l734P233q788j424J2175r613L443Q886k0450P713O933j7517
614a3824J9224J96j2865J6324j5283n808J4881j2957R475O945j1522R883p908
627c239p683J0201n127K857N513m631J424j093j846j141K711L026n426M186m30
642f98m964P985n010R24O935j0268M028R95p275J2228m718l142J1452j1533J10
657b951P628r952N264N475p921M410L013p762M415K031n328L944R25o199O230
$$ plain form
556 5564 -3327 -868 3602 -5650 3770 2868 -1154 4803 -2172 -2071 2751 -320 670 5383 5474 -398
572 -398 1127 -1044 -3909 6451 1622 3580 11857 -3076 2468 1332 -10525 11007 3263 -2260
586 -2260 18032 -3086 -3753 8952 -11372 3297 11327 -4711 9056 5147 -6912 2846 -1172
599 -1172 -1960 8142 1319 -2415 4818 -3970 -5394 6781 -2832 611 9497 -10953 -3240 3693 -13824
614 -13824 5400 5596 -7269 9055 -6228 -12036 2845 -10112 -637 6308 -5214 4669 -3239
627 -3239 -10922 -721 -5848 -2991 2522 -2109 -685 -1778 -3624 -4765 -2054 972 -4454 -268 -698
642 -698 -5662 2323 -2687 -1763 5172 -5096 -1068 -73 -7348 4880 162 -2980 8472 -3061 -2951
657 -2951 4677 -5275 -11 5464 -2457 1953 4966 -2796 1619 3650 -1678 2266 3191 -3008 3222
672C222j121m325Q514n962j555P014j0107M560N262r941Q729j045p203Q643n628
687i43n05O608p143L204K5m595O160m049J220N427p158K602m3n947O239m15j847
704a160N896l140k563J833l631J175L260k137J480K242m674J813K157n652N973
719B872k65p773Q952m257m101J3452r056j30R886j6833M992O466j3425J5220J281
734G281j1410J3417r622q230J3305j0169L275J1355j1642M996K312j2338Q300
747H30R72q225J1019l009q113J1015n513m973J3047q989l434R973j3047L028R598
762D179j0752J0799J265j3020R738p766o045J5109q014K791J0264j3222J970K438
776b66r138O829K062k198M789k313j923J164j976O63K418j725l80K649l599J094
$$ plain form
672 3222 2101 -2224 6290 328 -1227 5787 -4320 240 5502 -4439 4290 3245 -3958 4685 -943
687 -943 -1448 5160 -1983 1221 1246 -3349 2811 -1238 -18 5409 -1749 853 810 -5137 1102 687 -1160
704 -1160 4736 1596 -967 866 -2765 -1590 1670 -467 1013 3255 -1419 394 2551 -3101 2872
719 2872 2607 -5166 3786 -471 -4572 8880 -176 -306 9580 -7253 -2261 4205 -9220 6000 7281
734 7281 -4129 9288 -334 -8564 4741 -5428 -2153 9202 -2440 2556 4868 -7470 830
747 830 1802 -6423 4596 1587 -6526 4489 -1024 -5997 7050 -1939 -5373 4600 -8447 -5419 4179
762 4179 -6573 4226 5491 -7529 2209 -5557 -11602 3507 -4507 -1716 8548 -4674 -2704 -266
776 -266 -9404 -2575 -513 -2711 2078 -235 -2158 -994 -2970 -2307 111 -1614 -1994 655 -2944 -1850
792a850N697m971J628L720q568K899K192m341O637J79j638L138m999O20K74l257
808b640N325K50k117L843j569k588J199Q95k902R57L555m240J498M300n903K027
824A890K486n544K782Nj508J598n78J558j900l29L046n186K483J444n397M322
840A172q28k347M985k124j81J069l891P03o95n35M040n25K09J406l543j839J301
857a623q15m43N439k025k000M696o140l03N880o865M194K732q654Q257k328m428
873d426J1291q255j076P665j3142M828O688r445J1035J146j0248P284n021o933
887h609R742k189m77Q796o247k130M083q509K782M865o901P068J005q353Q576
902C502k728o274J0164o764l331R349r302K198Q517q280M618J523q517M349k149
$$ plain form
792 -1850 3847 -1124 504 4224 -4344 -1445 747 -3594 3043 3222 1584 4722 -277 343 617 -2640
808 -2640 2685 2935 818 4661 3092 504 1703 2598 -304 653 4208 -32 1466 5766 -137 1890
824 1890 4376 -1168 1614 1619 111 1709 1131 2689 789 460 3506 -1680 803 2247 -3150 1172
840 1172 344 -2003 2982 858 677 1746 -2145 -1442 -2137 -2672 1368 843 1052 2458 -1085 -2924 -1623
857 -1623 -2438 -2881 2558 533 -1467 3229 -2911 -3214 2666 -4199 -5 2727 -5927 2330 2 -4426
873 -4426 6865 -1390 -2466 5199 -7943 -3115 3573 -5872 5163 6309 -3939 3345 -1676 -8609
887 -8609 1133 -1056 -1533 7263 1016 -1114 2969 -5540 -2758 2107 -4794 2274 3279 -5074 3502
902 3502 774 -5500 4664 -2100 -5431 3918 -5384 -3186 5331 -2949 1669 3192 -5325 -976 -3125
917c125k697P658j170k47L979o136r76K024m563K718M449l148K539J770n144K106
933C7L26m126M014l72k143M323j628J23L008m525J193J218m221K903J047j254
949g7L809j181j301Q26j660qo09O55K692k174J283J257k558K075j572k346L183
966B294j223j305L098j031J203P4l315J055l97j671K370n9n3K101k813j184K557
983A701k253r83K442j861j84K067k556Q81L015l636J84J608l804O56J667j535
999b591L082J539l463L91n84k476J759J91k1L932j974k218L463l836p43M119m535
1016c965K677L186p019N935J215n583O555m130l432O843o937J359P874o109M089
1031B558J184q287M980j689m384P794n51j391M863n138j733L942n391L31O276
$$ plain form
917 -3125 -5822 1836 666 419 4398 -1738 -2714 -690 -5253 -2535 1914 -1234 1305 3075 -2069 37
933 37 363 -3763 251 -121 -2264 2059 431 554 3562 -963 230 1448 -2773 130 1177 -77
949 -77 3732 2551 1250 2076 416 408 -201 454 3146 972 2255 3512 954 3029 1457 -889 2294
966 2294 1071 -234 2864 1833 3036 3110 -205 850 453 -1218 1152 1093 1040 3141 328 -856 1701
983 1701 -552 -1535 907 -954 -1138 929 -1627 -746 2269 -1367 -1183 425 -3379 -2723 -1056 -2591
999 -2591 491 2030 -1433 -1042 -1626 -4102 -2343 -2152 -2173 1759 -215 -2433 1030 -2806 -3549 570 -3965
1016 -3965 -1288 1898 -5121 814 2029 -3554 3001 -1129 -4561 2282 -4655 -3296 4578 -1531 2558
1031 2558 3742 -4545 435 -1254 -5638 2156 1605 214 5077 -61 -1794 2148 -3243 -2912 3364
1046C364l771N17L748n363K431K371o988M332R01n524N868j669j087O511n495
1061A46p48L637o939K148K630m083O448M70m726L558k671l227L152j479J327L296
1077B939k766R47J147l737J427m9k448L826l02k346M061j058k132K134j947k93
1093e97R19o00P47L48J308l80k010K656j349k545L437k045n16L845l459J242K908
1110C909m265J134j62k388L073r39m34L641k244r78P60l096J383J079j608J971
1126H36J224k420j88N92j494J074Q12k050J547M33l155K046K21n49K376k188j371
1143b254K330l828J184L424k813L305m59m450K583p82l836N368j42j767M167k749
1159g19k508L780l571j25M689l565O99L279m926L138J782m996M707j042m767N592
$$ plain form
1046 3364 -407 110 3858 -1505 926 3297 -3691 641 1542 -3982 1886 217 -870 5641 146
1061 146 -602 3035 -3904 -1756 874 -3209 3239 3709 -1017 2541 -130 -3357 -205 -1684 -357 2939
1077 2939 173 1120 2267 -1470 -43 -92 -2540 1286 984 -1362 2699 1641 -491 1643 -304 -597
1093 -597 322 -278 469 817 2125 1745 -265 2391 1042 -1503 1934 -111 -627 3218 -241 1001 3909
1110 3909 -356 778 616 -1772 1301 362 -72 3569 1325 347 1107 -1989 -606 473 -1135 836
1126 836 2060 -360 -548 44 -1450 -376 436 -1614 -67 366 -2789 -743 -522 -1071 1305 -883 -2254
1143 -2254 76 -3752 -2568 856 -1957 1348 889 -3561 -978 -1760 -5596 -228 -370 -2137 2030 -719
1159 -719 -3227 553 -3018 -3143 1546 -2019 -1320 1959 -2967 171 1953 -3043 1664 622 -4145 1447
1175A447k727q38O700m260k55L529o086J048K961l763M285J821l805K648p55l762
1191a812K736l13k128M705j245k152M192l599o82L847n258J710L285n767M724
1206B243O81m238N169l169k384L898l930J208K669k955K937m38k638K371k344
1221i20n62J647p51O39J358q17p86N88m56j089J161j027L35J066m86J016l99j557
1239a040J750k267L00K364k548K446J59k618L098k503n26L113l647K284Q39k867
1255a663L029j473m61K424l068J208N12k493K738P3j115J587l80j976N29M71j681
1272a739J811J341l006K934r56l167M008k584l47L747m590K306J359n046N260
1287A331j572k489N515m541p59L246m164K493J765k172K010p74k022R97j44p55
$$ plain form
1175 1447 -1280 -2118 4582 322 67 3596 -2490 -1442 1519 -2244 2041 3862 57 2705 1950 -1812
1191 -1812 924 611 -1517 3188 1943 -209 3983 384 -298 3549 -1709 1 3286 -2481 2243
1206 2243 2924 -1314 3855 686 -1698 2200 -1730 -522 2147 -808 2129 1691 -947 1424 -920
1221 -920 -1482 165 -586 53 1411 594 -192 396 -60 -1149 12 -1015 -680 386 -100 916 517 -1040
1239 -1040 710 -1557 -1257 1107 -1441 1005 1164 -1454 1644 -859 -1385 1728 -1919 365 1204 -1663
1255 -1663 1366 -107 -568 1856 -1212 -4 508 -1985 753 826 -289 1298 918 -1058 -529 -58 -1739
1272 -1739 72 1413 -1593 1341 385 -2782 1226 -1358 -1705 2042 -2548 -242 1117 -3929 1331
1287 1331 -241 -2730 2785 -1756 -2515 731 -3433 -940 825 -1347 663 -111 -2133 -1136 -1280 -2035
1303b035J855R71k506K694p51l535M513k012k016N819m606p8N148o013K845K827
1319C120n755M090p62l153M190j291l00K845k046j24N18j711j3J908p46L44K441
1336C555k900J57J988m505K673J645m093M804j026l423N032l660m91L251m337
1351a330K471P65k912L288j318r51K138l051P93N49j127R13L59l50J36k89K17
1368C01j354O07l5n66J059k13J34j26o08M02r49M98k2q52J920q18p80J952k254
1387a704N85O26j911K571n74q28K265k486M67J486k869K358O94k215J366L44j833
1404a658J832M41j738J042J123k604J400P05k042K773p15j113K335k919L95J824
1420A081l027L268k00l406M481k512k160M819l319M94L163m536J352J965l526
$$ plain form
1303 -2035 -180 791 -1715 979 228 -3307 1206 -806 -2822 2997 -1609 -1687 3461 -2552 293 3120
1319 3120 -2635 1455 693 -2460 1730 439 139 2984 938 814 1332 -379 -392 1516 770 1114 3555
1336 3555 655 812 2800 -1705 968 2613 -1480 3324 2298 -1125 3907 247 -244 3007 -1330
1351 -1330 1141 1906 -1006 2282 964 13 2151 -900 -107 442 -685 228 587 237 373 84 301
1368 301 -1053 -446 -481 -1047 12 -201 -67 -193 -801 -399 -1348 -850 -872 -1724 196 -622 -1402 550 -1704
1387 -1704 -1119 -493 -2404 167 -407 -1235 1030 -1456 -989 497 -2372 -14 680 -1535 -169 175 -1658
1404 -1658 174 615 -1123 -81 1042 -1562 -162 543 -1499 1274 559 -554 1781 -1138 -743 1081
1420 1081 -1946 1322 1122 -2284 2197 -315 -2475 2344 -975 -481 2682 -1854 -502 1463 -2063
1435b063K352R18k102K052j150k239K961j097j337L551j625j014K523l393M37
1450a226K779l728K313J727l384K608n42k707L659j275j502K929j772p16K429
1465A592j945M16K325k930k4K028k551J303J766k685K368M52l382L046j160j750
1481a131L570k442K30L131l771P66J607k849K327o34j401K812j697m26J686j906
1497a28P84J80j330J118J50p70L67k42M08n91q64J054l72j10K85r61R15lj255
1516a365Q15L78p34J05k62k39Q39m08m27R08m25m59J89o00Q64L11j080J037R1
1535d62j066O09L6p85J406k30j229J768m67j411J978p40l48J996k089k0K032k485
1553a507J218J292k109K456q78k300L402j492j243L264k404J35K563l565J368
$$ plain form
1435 -2063 289 1207 -895 1157 7 -2232 729 -368 -1705 1846 221 -793 1730 -1663 -1226
1450 -1226 1553 -2175 138 1865 -1519 1089 547 -2160 1499 224 -1278 1651 -121 -837 1592
1465 1592 -353 63 2388 -542 -566 1462 -1089 214 1980 -705 1663 2115 -1267 1779 619 -1131
1481 -1131 2439 -3 227 3358 -413 353 1960 -889 1438 804 -597 2215 518 92 1778 -128
1497 -128 656 836 -494 624 774 4 371 129 537 -54 -918 136 -236 -346 -61 -1022 -107 -110 -1365
1516 -1365 -550 -172 -906 -801 -1063 -1302 -463 -871 -1298 -390 -815 -1274 -1085 -1685 -821 -510 -1590 -553 -462
1535 -462 -1528 -919 -883 -1668 -262 -492 -1721 47 -420 -1831 147 -593 -941 1055 -1034 -1054 978 -1507
1553 -1507 -289 1003 -1106 1350 472 -1828 1574 82 -1161 2103 -301 -166 2397 -1168 200
1568B00J906l149J946R16l202L001q49j792L506j599j612K835k641J49K444l020
1584i61J564K029l413J515J37k341J956K84j887K542k31j919J633n58j361J766
1600G55p48r30K389j553p31K066j729L13J288k710J821N92k537K743l47j361K121
1617A442j974k33K051k115Q12J015j004J098q84r45J689j280j29J235p91L38Q67
1634A192j104p2P17j024Q6L06l36N49R0j25J66p79K34K64q20Q66O6j140J218m93
1654a39m46P02j212J031K07j682J711j063J40J135j679Q62P66k135J113K75j125
1671a539J063k37m17R39n74p84J086m46m72J358n80q83J824j564Q5J936k517J238
1689d84J451k862K333l23j831L342j865l56K520l238J027J471k431K130N67j792
$$ plain form
1568 200 2106 -1043 903 1819 -1383 1618 769 -1023 2483 884 -728 2107 -534 -385 2059 -961
1584 -961 603 2632 -781 734 871 -1470 486 770 -1117 1425 1194 -725 908 350 -1011 755
1600 755 7 -923 1466 -87 -818 1248 -481 -168 1120 -1590 231 823 -1714 1029 682 -679 1442
1617 1442 -532 -765 1286 -829 -17 998 -6 1092 208 -737 952 -328 -457 778 -13 325 1192
1634 1192 88 16 733 -291 -205 101 -235 314 404 279 445 -334 -100 164 -656 210 276 -864 354 -139
1654 -139 -585 117 -1095 -64 143 -1539 172 -891 -751 384 -1295 -433 333 -1802 -689 -414 -1539
1671 -1539 -476 -713 -1130 -191 -765 -1549 -463 -909 -1381 -23 -603 -1486 338 -1226 -1141 795 -1722 -484
1689 -484 967 -1895 438 115 -1716 1626 -239 -595 1925 -1313 -286 1185 -1246 884 1451 -341
1705c41J555m94j211J139J66q82J166R5j264J546q25r07K339j622l87K047k559
1722d39R61J867l156K242J5k140K525j372j036K018j108P3Q56j087P1m6m61J9
1740a98R42m98l26J187j353O6J076k279J509M60k148K370n80j406K555k457P5
1757a005J544k155J418L43j374J646q38k82Q80j250P03O9m61N58o6j2j15L97n74
1776e74j07P39q77K35J142j174R11M0j179J255r61q7Q46r25J356k57n36P74j719
1795a098Q31N65j426J532l81r11J788j862Q48P54j595Q90K82p70P27j73j096J378
1813B83m59n13M23P9j76K99n33J82R68j604O25Q95k463K015M08k514K483o93j576
1832a871L559k604L53K043l477J784J430l015K882o41j422K072p38j257J385o78
$$ plain form
1705 -341 1214 720 -491 648 814 -68 1098 1193 -71 1475 650 -257 2082 460 73 2120 -439
1722 -439 522 2389 -767 1475 1490 -650 1875 503 -533 1485 377 450 1306 219 290 244 -217 -198
1740 -198 744 246 -80 1107 -246 -180 896 -1383 126 586 -1562 808 228 -1178 1377 -1080 -1005
1757 -1005 539 -1616 -198 145 -1229 417 -421 -703 177 -1073 -370 -301 -762 -204 -270 -282 -397 0 -574
1776 -574 -681 58 -819 -584 558 -616 295 335 -844 411 -550 -637 209 -716 640 383 -153 621 -1098
1795 -1098 -267 298 -1128 404 23 -888 900 -962 -114 640 -955 -65 217 -553 174 1 -1095 283
1813 283 -176 -689 -266 -187 -363 -64 -597 -415 553 -1051 -426 469 -1994 21 429 -2085 398 -295 -1871
1832 -1871 1688 -916 -563 1480 -1997 -213 1217 -1798 1084 443 -979 1093 355 -902 483 -195
1848a95o51J737n91l3J098q07m36J357j838P09J094j372Q12J062k118J730j167
1865C91j88J527j880R37L56q53j8N21j374J101N11q92k84P48l92j2J129j300L86
1884D14J19j248Q47J74r35J533q71n62J513j593K8O68j144R10k18o14J218r06
1902f67J03N40r70M61j5n24N48K43l73J86J99n18l43M92n74K92P06o55O51O8n22
1923f72M81m23k73R62q83L20N92o45N31K37o76L7K46l10L75J0M17N0n21K26L4
1944A15n90P29l88K81O94q56K96K88q26N50k13k14J538j788K9J711j944Q01J118
1963A331k465K205l30k367K591r39q14K365k230L73J747k966J413R98k300K431
1979A043n10j475K489j613j090K529j702Q5J343j967P12J371k255J390R01j968
$$ plain form
1848 -195 -846 891 300 267 1365 558 122 1479 -359 350 1444 72 884 1946 -172 1558 391
1865 391 203 1730 -150 787 1143 290 272 793 -581 520 1031 139 -145 603 211 199 1328 28 414
1884 414 533 -715 132 306 -629 904 33 -529 984 -609 -581 87 -1057 -147 -365 -979 239 -667
1902 -667 -564 -24 -994 -533 -548 -1072 -524 -281 -654 -468 -269 -787 -1130 -638 -1212 -920 -214 -869 -218 -150 -672
1923 -672 -191 -614 -887 75 -808 -488 104 -541 -10 227 -449 -412 -166 -476 -101 -91 326 376 -145 81 115
1944 115 -475 254 -134 147 841 -15 281 569 -257 293 80 -134 1404 -384 -355 1356 -588 213 1331
1963 1331 -1134 1071 741 -1626 965 26 -788 1577 -653 -280 1467 -1499 -86 912 -1388 1043
1979 1043 533 -942 1547 -66 -1156 1373 -329 -244 1099 -868 -156 1215 -1040 350 1251 -717
1995g17J178k03j200K155r38p75J569o81o02J174j175O03Q73j481Q18O06j390
2012a86O30K37p98O52K9j230J411p1j101J124n92l72J059j160K61O73q64M01K35
2031C38p63J065r69n22P97l13J34K13m02J02K26o13l00K26K77j84N7K86l04p2
2051g21O29r81O36j89p22P59K27o42R49p40L53K35r57O70K66n59O58n3k02M61
2071G7o00O5L68j83j47L02r7O42l87k8J08nL67l44j77P90q04N16J13m05P86o16
2093C41o07J464j071K98Q10j416J174p8j348J661o31q09J937j736Q9J600k119
2110d41P78Q50j631J140J86j483J378p9j437J660q76q22K027j793k97K079k168
2127i29O87J298k161J431P23k433J749j09j354K012j032q08J594j294L34J032
$$ plain form
1995 -717 461 258 -942 1213 275 -500 1069 388 -214 960 -215 388 1261 -220 598 1204 -186
2012 -186 444 681 -117 535 564 -666 745 674 -427 697 105 -267 792 -368 -107 566 -298 103 338
2031 338 -425 640 -329 -851 -54 -367 -233 -20 -422 -320 -94 -707 -1007 -781 -504 -688 -631 -345 -649 -721
2051 -721 -92 -1073 -437 -626 -1348 -589 -362 -1004 -55 -795 -442 -207 -1164 -494 -228 -787 -129 -182 -384 77
2071 77 -523 -458 -90 -273 -420 -118 -215 427 40 12 120 115 482 138 -39 751 -53 463 576 171 957 341
2093 341 -266 1198 127 425 1235 -181 993 915 -433 1228 597 -212 1725 -11 78 1678 -441
2110 -441 337 1187 -444 696 882 -601 777 698 -739 921 45 -777 1250 -543 -840 1239 -929
2127 -929 -242 1056 -1105 326 1049 -1384 365 256 -1098 914 -118 -926 668 -626 -292 740
2143G40j630R06O06j616J211J73j246J317j39j316J624p56o73J445p93J07P50
2160G10j209O44K09j001Q40k14j81R02p88l05R39r58N49P5r90R93l58o2J33l28
2180d00L27J87o58J39P3m7M54m77K73P7m12J30k03l5K79J73l86M97o22N05m05
2201e31l14J87K59l69L42K08n78L95j90r7Q06r9m69O14r16L34J049o55O0J51p40
2222e53O92k23L94L93m30j36L57l0m71N01L3l81N02L96j277Q11m9k3R37r73j9
2243D51Q96j124K96L73m45K26L72p54O90m19o39J038m63l33O45j79r50J251q12
2262A20o61J496j253k6J338j972J215N61j859J614n50j306J706q65k64J372j368
2279g02O76M14j537P37M99j371J267p1r75J261o60p62J445j083J9R51j112M33
$$ plain form
2143 740 -890 16 622 -994 217 390 -856 461 322 -994 630 -126 -799 646 -147 -40 710
2160 710 -499 145 354 -647 193 -21 -202 700 -88 -393 546 -412 137 212 -778 215 -143 -205 -72 -400
2180 -400 -73 114 -544 -405 -332 -379 75 -402 -129 -52 -464 -334 -537 -572 -293 -120 -506 -9 -631 -126 -531
2201 -531 -845 -658 -399 -768 -426 -218 -796 -401 -591 -688 118 19 -450 164 -752 -418 631 -24 36 187 -553
2222 -553 139 -84 310 703 273 137 494 464 -7 494 527 146 648 1044 -233 578 529 506 1443 470 451
2243 451 1347 223 519 892 447 673 1045 291 981 562 -77 961 498 165 810 631 -319 932 120
2262 120 -541 955 -298 -324 1014 -958 257 818 -1041 573 23 -1283 423 -442 -706 666 -702
2279 -702 -26 388 -1149 -412 87 -1284 -17 -88 -1063 198 -462 -1224 221 -862 -843 108 -1004 -571
2297e71P78j369J014J96j008J291o27p30J505j176L21J175j624P85J18j160J462
2314C80l90m11R03n06q9M49q61O24J19m78O52l36k49J11n3J51m3K42l33K61l25
2335a82k2J70M06N8m12j56L91p59Q17J97j107J031m49o98J064n77j60J012o43
2354a9l3L00p97O02O6n95M46O40j326P77k87O74J023j756k63J164o32k13R04o47
2374B8J45O87j138Q67J31j066Q36J11p60Q80l55m58Q39m27P2L04k02oJ5k41K25
2395D87j34J1J63O5j68n49L44Ro9M07p11M37K42j013L75L11m35N98o23j82R24
2416D89j018j95J226j093L40L90j233J107J13j391J293k33q70J357j383J56J330
2433C85j190MQ95j198P79l5j000J485q55l11J422j113K68N39j143Q59N24j367
$$ plain form
2297 -571 207 -1162 -148 48 -960 331 -296 -1026 479 -697 -376 799 -825 -40 78 -1082 380
2314 380 -10 -421 482 -24 -113 336 -525 99 218 -260 392 56 -193 -82 -135 16 -27 215 -118 143 -182
2335 -182 -204 -34 372 430 18 -138 253 -506 311 508 -599 432 -17 -715 349 -228 -388 624 -19
2354 -19 -52 248 -549 53 119 -476 -30 610 -716 61 -226 448 1471 -285 -548 616 -16 -229 675 28
2374 28 173 860 -278 589 720 -346 490 601 -159 721 366 -92 747 320 392 696 494 488 503 262 487
2395 487 353 364 527 592 424 -125 219 228 159 566 -145 292 534 -479 -104 207 -228 370 -253 -435 489
2416 489 -529 -724 502 -591 -251 139 -1094 13 126 -1265 28 -205 -1075 282 -1101 -945 385
2433 385 -805 -801 94 -1104 -325 -360 -1360 125 -730 -1041 381 -732 -464 75 -1068 -209 315 -1052
2451a052J039n3n19N40k62l1J124r16J03L36n23N40m69p0P86l78j03P5k0M14k79
2472B82k33N84k68l72M17l2N0j92l15L03L17l39k5M13n84O10r3q27R07k48o93
2493c38P40r8l12R36j226K57R09j346O21M53j065J540o08o93Q71o86m8N41r03
2512d55N52M93j254J155K73j121O56m14k10R75r46P4J012j367M59M10o79Q35m49
2531am24O83p9n06O50l91J22K86m87M81q2j12O8l31N7N03l73K22k23P0j92k60
2553c19N41m33o0M54m95K28J35j054J104n0p31N53p62Q9J053r59N30J77q19L90
2573d28J84o66Q97k64n61P90o38j82L69j47k22J120j041M10P09j365O07M92n51
2592d87N58J87j104J113o09J38J84l02O42R08j669N73L21j145R85j41l29J416
$$ plain form
2451 -1052 -13 -66 -585 -45 -307 -338 786 -130 -27 309 -214 326 -143 -213 573 195 92 167 147 561 282
2472 282 49 633 365 -7 410 378 428 236 -79 224 541 202 177 590 6 616 523 -304 603 355 -338
2493 -338 402 304 -8 928 -298 -41 868 -478 143 596 -469 1071 463 -230 641 -45 -93 448 -455
2512 -455 97 590 -664 491 764 -357 299 -115 -325 650 -296 -222 790 -577 -118 292 -387 448 -1
2531 -1 -425 258 179 -327 323 -68 54 340 -147 334 252 140 208 -123 -66 437 64 286 63 133 -59 -319
2553 -319 222 -211 -271 183 -312 -84 51 -1003 101 51 -680 -127 -889 -800 253 -706 -176 1 -818 -428
2573 -428 -244 -910 -13 -277 -838 -48 -686 -868 -499 -646 -868 252 -789 -379 330 -1035 -428 64 -487
2592 -487 71 258 -846 267 -342 -204 -20 -322 320 1228 -441 132 453 -692 293 152 -177 1239
2610A239j315K20Q82p15J98r9k73N35j71k45Ml55K77J68q7Q20k37q79M67M28p22
2631A40P97q20M66O26o63o3J21n59M93k61o68R84n98Q4O73j129L15P08j176M70
2651f0N18o45K64K94p32L74n9n89J191r90n3M61o84O32K49p52O33L7p72P39m7
2672Io42Q37l56k97N74p08K8P03o57M28M51p02J98J43l00K85k56J38K64k97l6
2693a93J16k74L62J95l74m2J36j31K69l2l87L64K36q6l95L09k18lK78j18Q3rl71
2716b85m4J35L7L2K37k55J47l32O4L24m72K69K17m94M33Kl46L45K09m62N32j15
2738A78jK22j424R94J85l86M01k84j28K65M66m61O62r83p5N03j96M68Qk36L10
2759D88m9j33K65l68N24j52q6J69j01k92N13l97J34Jj66N6K9m48Q32n57n94P69
$$ plain form
2610 1239 -76 144 1026 311 509 410 137 672 501 256 260 -95 182 350 263 1083 846 -33 434 862 140
2631 140 937 117 583 1209 546 483 604 45 538 277 -391 593 -5 79 752 -377 -62 646 -530 -60
2651 -60 458 -187 77 371 -361 13 -46 -635 556 -434 -487 -26 -710 -78 171 -581 52 89 -683 56 9
2672 9 -633 204 -152 -449 125 -583 -555 148 -509 -81 370 -332 -134 9 -291 -6 -262 -124 140 -157 -193
2693 -193 -77 -351 11 206 -168 -210 -74 -205 64 32 -355 9 245 159 -236 73 -145 -148 130 12 95 86 -285
2716 -285 -329 -194 -157 -125 112 -143 4 -328 -264 60 -412 -143 74 -420 13 15 -331 14 223 -239 293 178
2738 178 177 399 -1025 -31 154 -232 169 -115 -243 22 488 27 689 -294 -369 134 -62 406 414 178 488
2759 488 439 306 571 203 727 575 489 658 557 265 778 381 515 516 350 406 435 -13 819 262 -332 437
2781D37m5p14P56p44N01M31j401L77Q92p54M29k95J03J4m31l01J216j132K00L88
2801g3o66Q43p6j151J140p33k89R75r3n17K74k10n36J019K00j049J418j306M06
2820d24L07j518J248J63j25J73L0n16N43l77l42J436o80k59O92K56q23L88l06
2839a34N03J9l17m18K50MO53q60M78L60m77Q0QK03o1j28Q9po6O8j02o8K68k41
$$ plain form
2781 437 392 -322 434 -310 191 622 -779 -402 490 -264 165 -130 -27 -13 -444 -745 471 -661 -461 -73
2801 -73 -739 104 28 -1123 17 -716 -1005 -30 -123 -640 -366 -576 -1112 -93 107 -942 476 -830 -424
2820 -424 -117 -1635 -387 -224 -349 -176 -146 -662 -119 -496 -838 598 -82 -341 351 607 -216 172 -134
2839 -134 369 388 71 -347 -97 -93 560 -300 178 538 61 141 149 352 291 163 252 245 179 247 145 77 345 104
$$ [...]
8191A48
##END NTUPLES=NMR FID
##END=
