##TITLE=1H_SAV-83(cadinan-epi)
 200.13MHz, CDCl3,
 8 sc
 
 17.1.2025
##JCAMPDX= 6.0         $$ Bruker NMR JCAMP-DX V2.0
##DATA TYPE= NMR FID
##DATA CLASS= NTUPLES
##ORIGIN= UXNMR, Bruker Analytische Messtechnik GmbH
##OWNER= pz
$$ XWIN-NMR		Version 3.5
$$ Fri Jan 17 14:17:03 2025 Russian Standard Time (UT+4h)  she@DPX200
##.OBSERVE FREQUENCY= 200.1313
##.OBSERVE NUCLEUS= ^1H
##.DELAY= (6, 6)
##.ACQUISITION MODE= SIMULTANEOUS
##.ACQUISITION SCHEME= undefined
##.AVERAGES= 8
##.DIGITISER RES= 18
##SPECTROMETER/DATA SYSTEM= spect
##.PULSE SEQUENCE= zg30
##.SOLVENT NAME= DMSO
##.SHIFT REFERENCE= (INTERNAL, DMSO, 0, 14.3821)
##AUDIT TRAIL= $$ (NUMBER, WHEN, WHO, WHERE, WHAT)
$$ ##TITLE= Audit trail, XWIN-NMR		Version 3.5
$$ ##JCAMPDX= 5.01
$$ ##ORIGIN= Bruker BioSpin GmbH
$$ ##OWNER= she
$$ F:/spectra/data/she/nmr/H-C/1/audita.txt
$$ ##AUDIT TRAIL=  $$ (NUMBER, WHEN, WHO, WHERE, WHAT)
(   1,<2025-01-17 14:16:02.85 +0400>,<she>,<DPX200>,
      <created by zg, POWCHK disabled, PULCHK disabled
       configuration hash MD5:
       00 E9 B6 7A A2 85 ED C7 34 08 36 98 17 FE 4E 26
       data hash MD5: 16K
       80 77 D5 2A 1A 8B 2F 8A 55 A2 55 D8 37 6B 71 AF>)
$$ ##END=
$$ 
$$ hash MD5
$$ BD DC 54 B6 6C B3 E2 79 81 99 30 C2 FE C3 F8 0C
##$RELAX= 
##$RELAX= 
##$RELAX= 
##$RELAX= 
##$RELAX= 
##$RELAX= 
$$ Bruker specific parameters
$$ --------------------------
##$DU= <F:/spectra>
##$EXPNO= 1
##$NAME= <H-C>
##$PROCNO= 1
##$TYPE= <nmr>
##$USER= <she>
##$AMP= (0..31)
100 100 100 100 100 100 100 100 100 100 100 100 100 100 100 100 100 100 
100 100 100 100 100 100 100 100 100 100 100 100 100 100 
##$AQSEQ= 0
##$AQ_mod= 1
##$AUNM= <au_zg>
##$AUTOPOS= <>
##$BF1= 200.13
##$BF2= 200.13
##$BF3= 200.13
##$BF4= 200.13
##$BF5= 200.13
##$BF6= 200.13
##$BF7= 200.13
##$BF8= 200.13
##$BYTORDA= 1
##$CFDGTYP= 0
##$CFRGTYP= 5
##$CHEMSTR= <none>
##$CNST= (0..31)
1 1 145 1 1 1 1 1 1 1 1 1 1 1 1 1 1 1 1 1 1 1 1 1 1 1 1 1 1 1 1 1 
##$CPDPRG= <>
##$CPDPRG1= <>
##$CPDPRG2= <>
##$CPDPRG3= <>
##$CPDPRG4= <mlev>
##$CPDPRG5= <mlev>
##$CPDPRG6= <mlev>
##$CPDPRG7= <mlev>
##$CPDPRG8= <mlev>
##$CPDPRGB= <>
##$CPDPRGT= <>
##$D= (0..31)
0 0.7 0 0 0 0 0 0 0 0 0 0.03 0 0 0 0 0 0 0 0 0 0 0 0 0 0 0 0 0 0 0 0 
##$DATE= 1737108962
##$DBL= (0..7)
120 120 120 120 120 120 120 120 
##$DBP= (0..7)
150 150 150 150 150 150 150 150 
##$DBP07= 0
##$DBPNAM0= <>
##$DBPNAM1= <>
##$DBPNAM2= <>
##$DBPNAM3= <>
##$DBPNAM4= <>
##$DBPNAM5= <>
##$DBPNAM6= <>
##$DBPNAM7= <>
##$DBPOAL= (0..7)
0.5 0.5 0.5 0.5 0.5 0.5 0.5 0.5 
##$DBPOFFS= (0..7)
0 0 0 0 0 0 0 0 
##$DE= 6
##$DECBNUC= <off>
##$DECIM= 32
##$DECNUC= <off>
##$DECSTAT= 4
##$DIGMOD= 1
##$DIGTYP= 9
##$DL= (0..7)
0 120 120 120 120 120 120 120 
##$DP= (0..7)
150 150 150 150 150 150 150 150 
##$DP07= 0
##$DPNAME0= <>
##$DPNAME1= <>
##$DPNAME2= <>
##$DPNAME3= <>
##$DPNAME4= <>
##$DPNAME5= <>
##$DPNAME6= <>
##$DPNAME7= <>
##$DPOAL= (0..7)
0.5 0.5 0.5 0.5 0.5 0.5 0.5 0.5 
##$DPOFFS= (0..7)
0 0 0 0 0 0 0 0 
##$DQDMODE= 0
##$DR= 18
##$DS= 0
##$DSLIST= <SSSSSSSSSSSSSSS>
$$ [...]
##$SUBNAM0= <"">
##$SUBNAM1= <"">
##$SUBNAM2= <"">
##$SUBNAM3= <"">
##$SUBNAM4= <"">
##$SUBNAM5= <"">
##$SUBNAM6= <"">
##$SUBNAM7= <"">
##$SUBNAM8= <"">
##$SUBNAM9= <"">
##$SW= 18.0517328524113
##$SWIBOX= (0..15)
0 0 2 0 0 0 0 0 0 0 0 0 0 0 0 0 
##$SW_h= 3612.71676300578
##$TD= 16384
##$TD0= 1
##$TE= 0
##$TE2= 300
##$TE3= 300
##$TEG= 300
##$TL= (0..7)
0 120 120 120 120 120 120 120 
##$TP= (0..7)
150 150 150 150 150 150 150 150 
##$TP07= 0
##$TPNAME0= <>
##$TPNAME1= <>
##$TPNAME2= <>
##$TPNAME3= <>
##$TPNAME4= <>
##$TPNAME5= <>
##$TPNAME6= <>
##$TPNAME7= <>
##$TPOAL= (0..7)
0.5 0.5 0.5 0.5 0.5 0.5 0.5 0.5 
##$TPOFFS= (0..7)
0 0 0 0 0 0 0 0 
##$TUNHIN= 0
##$TUNHOUT= 0
##$TUNXOUT= 0
##$USERA1= <user>
##$USERA2= <user>
##$USERA3= <user>
##$USERA4= <user>
##$USERA5= <user>
##$V9= 5
##$VALIST= <valist>
##$VCLIST= <CCCCCCCCCCCCCCC>
##$VD= 0
##$VDLIST= <DDDDDDDDDDDDDDD>
##$VPLIST= <PPPPPPPPPPPPPPP>
##$VTLIST= <TTTTTTTTTTTTTTT>
##$WBST= 1024
##$WBSW= 4
##$XGAIN= (0..3)
0 0 0 0 
##$XL= 0
##$YL= 0
##$YMAX_a= 67478
##$YMIN_a= -70867
##$ZGOPTNS= <>
##$ZL1= 120
##$ZL2= 120
##$ZL3= 120
##$ZL4= 120
##$ABSF1= 10
##$ABSF2= 0
##$ABSG= 5
##$ABSL= 3
##$ALPHA= 0
##$AQORDER= 0
##$ASSFAC= 0
##$ASSFACI= 0
##$ASSFACX= 0
##$ASSWID= 0
##$AUNMP= <proc_1d>
##$AZFE= 0.1
##$AZFW= 0.1
##$BCFW= 1
##$BC_mod= 2
##$BYTORDP= 1
##$COROFFS= 0
##$CY= -3
##$DATMOD= 1
##$DC= 2
##$DFILT= <>
##$DTYPP= 0
##$F1P= 0
##$F2P= 0
##$FCOR= 0.5
##$FTSIZE= 0
##$FT_mod= 4
##$GAMMA= 1
##$GB= 0.15
##$INTBC= 1
##$INTSCL= 1
##$ISEN= 128
##$LB= 0.25
##$LEV0= 0
##$LPBIN= 0
##$MAXI= 10000
##$MC2= 0
##$MEAN= 0
##$ME_mod= 0
##$MI= 1.114404
##$NCOEF= 0
##$NC_proc= 0
##$NLEV= 6
##$NOISF1= 3.799351
##$NOISF2= 2.8
##$NSP= 1
##$NTH_PI= 0
##$NZP= 0
##$OFFSET= 14.38212
##$PC= 1
##$PHC0= 248.9336
##$PHC1= 14.5922
##$PH_mod= 1
##$PKNL= yes
##$PPARMOD= 0
##$PSCAL= 0
##$PSIGN= 0
##$REVERSE= no
##$SF= 200.129724274929
##$SI= 16384
##$SIGF1= 3
##$SIGF2= 2
##$SINO= 400
##$SIOLD= 16384
##$SREGLST= <1H.CDCl3>
##$SSB= 0
##$STSI= 0
##$STSR= 0
##$SW_p= 3205.1282051282
##$SYMM= 0
##$S_DEV= 0
##$TDeff= 0
##$TDoff= 0
##$TI= <>
##$TILT= no
##$TM1= 0
##$TM2= 0
##$TOPLEV= 0
##$USERP1= <user>
##$USERP2= <user>
##$USERP3= <user>
##$USERP4= <user>
##$USERP5= <user>
##$WDW= 1
##$XDIM= 8192
##$YMAX_p= 0
##$YMIN_p= 0
$$ End of Bruker specific parameters
$$ ---------------------------------
##NTUPLES= NMR FID
##VAR_NAME=  TIME,          FID/REAL,        FID/IMAG
##SYMBOL=    X,             R,               I
##VAR_TYPE=  INDEPENDENT,   DEPENDENT,       DEPENDENT
##VAR_FORM=  AFFN,          ASDF,            ASDF
##VAR_DIM=   8192,          8192,            8192
##UNITS=     SECONDS,       ARBITRARY UNITS, ARBITRARY UNITS
##FACTOR=    0.0002768,     1,               1
##FIRST=     0,             0,               0
##LAST=      2.2672688,     0,               0
##MIN=       0,             -70867,          0
##MAX=       2.2672688,     67478,           0
$$ Real data points
##PAGE= N=1
##DATA TABLE= (X++(R..R)), XYDATA
$$ plain form
0 0 0 0 0 0 0 0 0 0 0 0 0 0 0 0 0 0 0 0 0 0 0 0 0 0 1 -6 8 -8 8 -8 8 -8 9 -11 14 -16 16 -17 21 -23 25 -29 30 -35 37
45 37 -41 46 -51 55 -61 69 -75 82 -91 100 -112 124 -139 160 -183 211 -246 297 -361 460 -618 892
67 892 -1486 3236 -18975 -70867 16479 61627 -16097 -34539 26373 22990 -12421 2127 10996
80 10996 -8004 -484 10149 -9129 -12135 3795 -3600 -10340 1900 -3127 -12568 4252 9233 -8549
94 -8549 -895 16262 -13 -8128 16008 15056 -11796 -4475 17041 3930 -13780 -4055 4129 -3234
108 -3234 -6366 -5451 -6433 -2399 1541 -1944 -4762 17 5321 5827 1922 -67 5163 8253 2595 66
124 66 1858 -347 -29 2949 -6238 -10670 3625 4386 -16126 -10536 13439 1739 -18245 1615 17172
139 17172 -2792 -7654 10702 8601 -1640 4842 4003 -3679 5197 5802 -10893 -5177 9136 -6154
$$ packed form
0@%%%%%%%%%%%%%%%%%%%%%%%%JpJ4j6J6j6J6j6J7k0K5l0L2l3L8m4M8n4N9o5P2
45C7p8Q7r7J06j16J30j44J57j73J91k12K36k63K99l43L94m57N43o58Q21j078J510
67H92k378M722k2211n1892Q7346M5148p7724j8442O0912l383l5411J4548Q869
80A0996j9000P520J0633j9278l006J5930p395o740J2240n027r441J6820M981j7782
94h549P654J7157j6275q115K4136r52k6852P321K1516j3111j7710R725Q184p363
108c234l132R15r82M034L940l485k818M779N304N06l905j989N230L090n658k529
124F6J792k205L18K978r187m432J4295P61k0512N590K3975j1700j9984J9860J5557
139A7172j9964m862J8356k101j0241O482q39p682Q876O05j6695N716J4313j5290
$$ plain form
153 -6154 -15287 5022 4109 -15983 -2887 13847 -5496 -11017 12951 9099 -9600 4194 14768
166 14768 -3492 -3379 12122 629 -9820 4682 4640 -11197 -4152 5194 -8110 -8845 5505 -1365
180 -1365 -10308 3654 7258 -5645 -1089 10669 2500 -2522 6410 4662 -2058 3677 3943 -5717 -2373
195 -2373 4395 -4247 -8857 338 348 -6277 -2993 919 -2352 -233 4628 132 -1948 5592 7378 -246
211 -246 -974 5443 4769 -1575 -3171 1148 1694 -4969 -6346 394 57 -7546 -4412 3949 -388 -5458
227 -5458 1892 4743 -906 1987 6967 -10 -1234 7541 5212 -5150 -1940 4868 -814 -4610 -2501
242 -2501 -3369 -2728 1370 -3221 -7424 724 4292 -1829 -1320 4094 1433 1469 6945 1608 -3952 5540
258 5540 7723 -5369 -4846 6542 -111 -9634 -261 3587 -7352 -6706 3931 315 -6015 872 3855
$$ packed form
153f154r133K0309r13k0092J3096J6734j9343n521K3968l852j8699J3794J0574
166A4768j8260J13J5501j1493j0449J4502m2j5837P045R346j3304p35J4350o870
180a365q943J3962L604j2903M556J1758q169n022Q932j748o720N735K66r660L344
195b373O768q642m610R195J0o625L284L912l271K119M861m496k080P540J786p624
211b46p28O417o74o344j596M319N46o663j377O740l37p603L134Q361m337n070
227e458P350K851n649K893M980o977j224Q775k329j0362L210O808n682l796K109
242b501q68O41M098m591m203Q148L568o121N09N414k661L6N476n337n560R492
258E540K183j3092N23J1388o653r523R373L848j0939O46J0637l616o330O887K983
$$ plain form
273 3855 -819 1658 5800 1053 -1284 4926 5886 -706 -2870 391 2466 199 -4894 -5839 239 1791
289 1791 -4842 -5934 352 797 -1219 995 1226 -1244 2799 7322 720 -3249 3981 6802 -662 -3449
305 -3449 1087 2102 -2749 -3766 -1048 -1061 -4001 -4210 -240 1010 -1915 -2312 2482 3945 1012 1096 2735
322 2735 2150 3393 3664 -763 -2686 2831 3398 -4491 -6011 727 1225 -4270 -4303 -864 -277 -910 719
339 719 375 -132 2315 3744 1731 1017 2851 2662 1105 1273 1099 -1764 -2159 -146 -748 -4086 -3944 -587
357 -587 -224 -3008 -2376 762 1328 238 790 1841 2550 2264 2043 2125 2298 626 -309 929 462 -2626
375 -2626 -3197 -675 -1280 -3823 -2570 -553 -1628 -1407 1545 1198 -1127 2164 4877 1035 -814 3381
391 3381 4450 -372 -1301 1881 587 -2934 -1738 -324 -2347 -3406 -961 -269 -2425 -1674 1142 1367
$$ packed form
273C855m674K477M142m747k337O210R60o592k164L261K075k267n093r45O078J552
289A791o633j092O286M45k016K214K31k470M043M523o602l969P230K821p464k787
305c449M536J015m851j017K718j3k940k09L970J250k925l97M794J463k933Q4J639
322B735n85J243K71m427j923N517N67p889j520O738M98n495l3L439N87o33J629
339G19l44n07K447J429k013p14J834j89j557J68j74k863l95K013o02l338J42L357
357e87L63k784O32L138N66j090N52J051P09k86k21Q2J73j672r35J238m67l088
375b626n71K522o05k543J253K017j075K21K952l47k325L291K713l842j849M195
391C381J069m822r29L182j294l521J196J414k023j059K445O92k156P51K816K25
$$ plain form
407 1367 -348 686 2429 2737 1835 1277 1820 2539 1061 -801 -553 29 -1241 -2410 -1138 -1990 -3802
424 -3802 -1276 1069 -2352 -3338 2569 3140 -2013 170 5648 1697 -980 4021 3479 -2569 68 4398
440 4398 -1625 -5048 1206 698 -5719 -2536 2009 -3313 -4031 2346 1860 -2887 149 4090 1107 1299
456 1299 3099 484 201 4510 1491 -4050 -70 2762 -2104 -3609 -773 -2357 -2924 1430 -870 -5485
472 -5485 912 5277 -1536 -3145 4767 4578 -1814 1688 5452 -372 -2047 3563 1472 -3732 -2041
487 -2041 858 -1948 -3355 -811 -1361 -3367 -723 1606 -155 -2025 937 3777 2080 96 1232
502 1232 2697 2040 1113 104 -1394 -578 845 -719 -3935 -2920 -111 -1037 -2189 -1457 -1277 -102 2680
519 2680 667 -1905 2317 5573 48 -762 4143 1503 -2504 2293 2925 -4724 -2848 3578 -2363 -6932
$$ packed form
407A367j715J034J743L08r02n58N43P19j478j862K48N82j270j169J272q52j812
424c802K526K345l421r86N907N71n153K183N478l951k677N001n42o048K637M330
440D398o023l423O254n08o417L183M545n322p18O377m86m747L036L941k983J92
456A299J800k615k83M309l019n541L980K832m866j505K836j584n67M354k300m615
472e485O397M365o813j609P912j89o392L502L764n824j675N610k091n204J691
487b041K899k806j407K544n50k006K644K329j761j870K962K840j697j984J136
502A232J465o57r27j009j498Q16J423j564l216J015K809r26j152P32J80J175K782
519B680k013k572M222L256n525q10M905k640m007M797O32p649J876O426n941m569
$$ plain form
535 -6932 878 2166 -5738 -1812 5108 -1528 -4760 5104 5167 -3338 773 5838 251 -1348 4299 863
551 863 -4090 1545 2258 -4425 -3254 1687 -2576 -3959 1659 -708 -4348 1974 4110 -2713 -791 5422
567 5422 1787 -1891 3761 3143 -2586 984 4301 -2586 -4326 2238 200 -5177 -1748 1687 -2981
582 -2981 -3143 1860 727 -2620 335 3171 1523 530 1831 2145 1085 1426 1200 -41 -1239 -159
598 -159 901 -1821 -3746 -927 1039 -1932 -3326 -478 853 -201 73 480 310 2650 3302 -84
614 -84 350 3388 1477 -1700 784 764 -2852 -518 602 -3694 -3434 2473 -763 -5220 1106 3523 -3262
631 -3262 -910 5909 592 -3464 4589 5131 -3479 -672 5594 -542 -4041 2405 453 -5399 -393
646 -393 2533 -4579 -3847 3326 396 -4323 740 3126 -615 1037 2984 -620 1119 4607 534 -2557
$$ packed form
535f932P810J288p904L926O920o636l232R864O3q505M111N065n587j599N647l436
551H63m953N635P13o683J171M941m263j383N618k367l640O322K136o823J922O213
567E422l635l678N652o18n729L570L317o887j740O564k038n377L429L435m668
582b981j62N003j133l347K955K836j648r93J301L14j060L41k26j241j198J080
598a59J060k722j925K819J966k971j394K848J331j054K74M07j70K340O52l386
614h4M34L038j911l177K484k0l616K334J120m296K60N907l236m457O326K417o785
631c262K352O819n317m056Q053N42q610K807O266o136l499O446j952n852N006
646c93K926p112P32P173k930m719N063K386l741J652J947l604J739L488m073l091
$$ plain form
662 -2557 2634 2312 -4014 -1005 2545 -3288 -4540 2018 676 -5661 -1254 3603 -911 -2284 2578
677 2578 1904 -645 2282 3760 -310 -880 3071 2075 -1332 -1735 -14 303 -1298 -2508 -1841 -841 -1095
694 -1095 -1138 -467 -575 -52 2154 1685 -353 1150 2930 973 461 1590 447 -727 675 359 -2462
711 -2462 -1212 -13 -2087 -1600 349 -1754 -2622 1192 1937 -1790 -69 3481 483 410 3509 817
727 817 -1729 3369 3086 -4057 -2209 3817 -513 -5470 -156 1056 -4057 -1926 2375 -1404 -2734 2242
743 2242 2334 -1465 727 2866 89 991 3054 -189 -1683 2181 801 -2729 -678 276 -2584 -1464
759 -1464 698 -2599 -3070 1694 1242 -2529 107 3110 458 -261 3186 1425 -1248 1388 2953 -675
775 -675 -1536 338 -25 -1008 -1717 -1875 -1359 -300 -882 -1370 -451 14 555 1041 1074 355 1376 2765 715
$$ packed form
662b557N191l22o326L009L550n833j252O558j342o337M407M857m514j373M862
677B578o74k549K927J478m070n70L951r96l407m03J721L17j601j210O67J000k54
694a095m3O71j08N23K206m69k038J503J780j957n12J129j143j174J402l16k821
711b462J250J199k074M87J949k103q68L814P45l727J721L550k998p3L099k692
727H17k546N098k83p143J848O026m330m957N314J212n113K131M301l779j330M976
743B242R2l799K192K139k777R02K063l243j494L864j380l530K051R54k860J120
759a464K162l297m71M764m52l771K636L003k652p19L447j761k673K636J565l628
775f75q61J874l63r83p09j58N16J059n82m88R19M65N41M86L3p19J021J389k050
$$ plain form
794 715 80 1617 695 -778 86 176 -2181 -1837 0 -1148 -2238 -940 -315 -1060 -201 578 -48 950
812 950 1795 464 895 1939 994 141 1199 747 -1595 -214 626 -1581 -2199 -218 -807 -2435 -293
829 -293 184 -1747 -363 2309 342 -905 2331 2679 60 322 2181 1208 -871 231 1 -768 -980
846 -980 -1091 -1325 -1023 -1004 -1781 -599 -277 -479 -166 1329 507 115 1725 2089 120 603 2230 38 -752
865 -752 765 146 -2188 -1215 331 -1129 -2047 -836 -434 -577 -214 -253 6 1199 1093 697 1030 1491 647
884 647 854 1203 -147 -960 660 76 -2096 -1487 81 -1520 -2076 414 37 -1937 -210 1963 64
901 64 -808 1469 2400 374 609 1660 648 228 669 166 -1731 -1000 -178 -713 -1736 -1348 -883 -643 -304
920 -304 -431 -169 723 1094 988 921 1020 1015 1053 1563 536 -834 -226 946 -365 -2007 -1247 -559 -1165 -1423
$$ packed form
794G15o35J537r22j473Q64R0k357L44J837j148j090J298O25p45Q59P79o26R98
812I50Q45j331M31J044r45q53J058m52k342J381Q40k207o18J981n89j628K142
829b93M77j931J384K672j967j247L236L48k619K62J859r73k079J102k30p69k12
846i80j11k34L02J9p77J182L22k02L13J495q22l92J610L64j969M83J627k192p90
865g52J517o19k334R73J546j460r18J211M02j43L63l9K59J193j06l96L33M61q44
884F47K07L49j350q13J620n84k172O09J568j601n56K490l77j974J727K173j899
901F4q72K277R31k026K35J051j012m20M41n03j897P31Q22n35j023L88M65K40L39
920c04j27K62Q92L71j06o7R9nL8N10j027j370O08J172j311j642P60O88o06k58
$$ plain form
940 -1423 -401 -987 -1308 587 1450 -156 -414 2057 2041 71 573 1684 265 -489 1142 -66 -1948
957 -1948 -834 705 -1466 -2701 -569 163 -1005 -608 530 -191 102 1503 1017 -243 857 1883
973 1883 1052 421 259 -134 35 475 -954 -1625 -763 -104 -1663 -1674 64 -613 -1188 905 1153 -927 57
992 57 2741 1571 -735 702 2320 101 -554 1040 76 -1784 -92 295 -2167 -2203 522 -65 -1777
1009 -1777 -260 800 -511 175 1590 650 -63 1731 1704 -485 246 1798 -431 -1028 682 -539 -1875
1026 -1875 -381 288 -2047 -1390 446 -753 -1316 1250 1028 -1417 905 2709 -145 -679 2366 1415
1042 1415 -1498 471 1760 -1429 -2068 908 -311 -2701 -461 976 -1622 -1368 1101 386 -1034 820
1058 820 2222 147 361 1619 1143 358 845 607 -516 -199 272 -984 -1196 -405 -985 -1424 -690 -31
$$ packed form
940a423J022n86l21J895Q63j606k58K471j6j970N02J111j419p54J631j208j882
957a948J114J539k171j235K132P32j168L97J138p21K93J401m86j260J100J026
973A883q31o31j62l93J69M40j429o71Q62O59j559j1J738o77n75K093K48k080R84
992E7K684j170k306J437J618k219o55J594r64j860J692L87k462l6K725n87j712
1009a777J517J060j311O86J415r40p13J794k7k189P31J552k229n97J710j221j336
1026a875J494O69k335O57J836j199n63K566k22k445K322J804k854n34L045r51
1042A415k913J969J289l189o39K976j219k390K240J437k598K54K469p15j420J854
1058H20J402k075K14J258m76p85M87k38j123L17M71j256k12P91n80m39P34O59
$$ plain form
1076 -31 -806 -307 579 517 -46 821 1394 233 428 1707 956 -672 267 1221 -917 -1593 1 -153 -2408
1095 -2408 -907 689 -1553 -1400 1294 958 -1595 511 2634 -23 -399 2173 1302 -981 1325 1893
1111 1893 -1251 -1344 859 -154 -2093 -311 -9 -2097 -122 1235 -1462 -1209 1970 965 -1225 1116
1127 1116 1877 -182 534 2484 -230 -1266 1678 616 -2609 -533 1268 -1789 -2065 740 -365 -2854
1143 -2854 -79 2021 -998 -976 1749 1450 -330 990 1587 -192 775 1455 -49 -956 216 184 -1203
1160 -1203 -1149 -383 -936 -950 -182 -789 -713 74 884 372 474 232 657 728 1121 700 -211 19 517 68 -1074
1181 -1074 -768 -106 -694 -1240 -496 -54 -1009 -232 641 -509 -959 1200 1910 -570 337 2184 226 -533
1199 -533 1606 783 -1621 58 1454 -1394 -2269 683 17 -2445 -426 889 -1152 -460 1896 418
$$ packed form
1076c1p75M99Q86o2n63Q67N73j161J95J279p51j628R39R54k138o76J594j54k255
1095b408J501J596k242J53K694l36k553K106K123k657l76K572q71k283K306N68
1111A893l144r3K203j013j939J782L02k088J975J357k697K53L179j005k190K341
1127A116P61k059P16J950k714j036K944j062l225K076J801l057k76K805j105k489
1143b854K775K100l019K2K725k99j780J320N97j779R67O80j504r07J172l2j387
1160a203N4P66n53j4P68o07P6P87Q10n12J02k42M25P1L93m21r11K30M98m49j142
1181a074L06O62n88n46P44M42r55P77Q73j150m50K159P10k480R07J847j958p59
1199e33K139q23k404J679J396k848q75K952o66k462K019J315k041O92K356j478
$$ plain form
1215 418 -878 1529 1824 -82 665 1287 -527 196 1585 -712 -2389 871 753 -2427 -1462 996 -875
1232 -875 -1928 737 577 -1593 578 1937 -315 -201 2408 863 -775 889 1543 -1218 -659 893
1248 893 -404 -1313 -493 -1 -1033 -1008 -318 -690 121 369 -345 357 991 740 676 1123 1024 293 416 332 -404
1269 -404 -369 -176 -635 -754 -571 -743 -919 -678 -272 -512 437 127 197 1068 932 231 772 1110 377 -152 850
1290 850 267 -1077 84 454 -1652 -1386 654 -825 -1692 -141 524 -1148 -143 1138 528 -63 1200
1307 1200 1063 -268 1093 1482 -574 -381 973 83 -1566 48 -453 -1461 -601 -445 -1216 -590 630
1324 630 -396 -482 1300 614 -328 836 1695 -177 -130 1115 353 -989 224 142 -1108 -716 46 -955
1342 -955 -1436 -56 102 -825 -420 257 255 619 890 186 749 1075 130 27 675 -142 -698 100 -139 -1413
$$ packed form
1215D18j296K407K95j906P47O22j814P23J389k297j677L260j18l180R65K458j871
1232h75j053K665j60k170K171J359k252J14K609j545j638J664O54k761N59J552
1248H93j297r09Q20M92j032K5O90l72Q11K48p14P02O34k51o4M47r9p31J23q4p36
1269d04L5J93m59j19J83j72j76K41M06k40R49l10P0Q71j36p01N41L38p33n29J002
1290H50n83j344J161L70k106K66K040j479q67J551O65j672J005J281o10n91J263
1307A200j37j331J361L89k056J93J354q90j649J614n01j008Q60J56p71O26J220
1324F30j026q6J782o86r42J164Q59j872M7J245p62j342J213q2j250L92P62j001
1342i55m81J380J58r27M05O77kL64K71p04N63L26r45j03O48q17n56P98k39j274
$$ plain form
1362 -1413 -803 197 -573 -1105 69 136 -1024 112 796 89 197 1215 1130 99 502 758 738 336 -75
1381 -75 -918 -179 -335 -859 -1353 -573 -468 -782 -220 -56 -567 133 710 163 380 1006 1031 220 835 643 -138
1402 -138 66 557 -61 -1002 -365 -261 -575 -926 -685 -353 -510 35 -318 299 805 126 735 693 264 371
1422 371 799 636 -9 -59 82 -766 -695 -490 -746 -1432 -227 -79 -604 -401 128 305 335 636 541 223 954
1443 954 812 3 273 666 -61 -402 451 -848 -1302 -85 -337 -1262 -850 296 -436 -701 772 578 -293
1462 -293 403 1625 401 -176 1087 685 -517 -88 476 -677 -906 -85 -667 -1333 -380 -96 -824 -689
1480 -689 30 145 47 341 684 144 596 918 404 106 864 -88 -491 211 -91 -718 -741 38 -850 -963 -297
1501 -297 -100 -723 -496 689 257 187 898 1177 148 273 1137 277 -305 195 394 -849 -639 -42 -391
$$ packed form
1362a413O10J000p70n32J174O7j160J136O84p07J08J018q5j031M03K56k0m02m11
1381g5q43P39j56n24m94P80J05l14N62J64n11P00N77n47K17O26K5q11O15j92p81
1402a38K04M91o18r41O37J04l14l51K41L32j57N45l53O17N06o79O09m2m29J07
1422C71M28j63o45n0J41q48P1K05k56o86J205J48n25K03N29J77L0L01r5l18P31
1443I54j42q09K70L93p27l41Q53j299m54J217k52r25M12J146p32k65J473j94q71
1462b93O96J222j224n77J263m02j202M29N64j153k29Q21n82o66R53K84p28J35
1480f89P19J15r8K94L43n40M52L22n14k98P58r52m03P02l02o27k3P79q88j13O66
1501b97J97o23K27J185m32p0P11K79j029J25Q64q60n82N00J99j243K10N97l49
$$ plain form
1520 -391 -946 -641 -12 -748 -489 391 374 -383 522 795 64 296 1015 336 -96 682 406 -627 -271 100
1540 100 -840 -896 -404 -322 -917 40 -144 -1009 -253 1121 82 -408 693 1035 -61 751 898 -25 -385
1559 -385 747 167 -1313 -700 432 -599 -1271 -236 209 -690 -315 539 -132 -5 1027 725 55 585
1577 585 1089 420 223 570 87 -507 10 252 -1007 -657 179 -547 -860 -97 -56 -403 72 911 -332 -257
1597 -257 1324 937 -271 247 1109 -174 -276 922 -239 -1470 -105 138 -1123 -1115 457 -491 -1051 427
1615 427 462 -783 -61 1140 467 -456 899 1156 35 358 493 -234 -562 220 -279 -973 -437 173 -1040
1634 -1040 -417 99 -490 -448 746 590 -319 29 1044 546 154 713 447 -68 183 526 -524 -1031 -40
1653 -40 -27 -1394 -702 159 -488 -546 142 367 -309 -204 1324 442 -102 637 1133 -2 -64 922 -145 -518
$$ packed form
1520c91n55L05O29p36K59Q80j7p57R05K73p31K32P19o79m32P78k76j033L56L71
1540A00r40n6M92Q2n95R57j84q65P56J374j039m90J101L42j096Q12J47r23l60
1559c85J132n80j480O13J132j031o72J035M45q99L75Q54o71J27J032l02o70N30
1577E85N04o69j97L47m83n94N17K42j259L50Q36p26l13P63M1l47M75Q39j243P5
1597b57J581l87j208N18Q62j283j02J198j161j231J365K43j261QJ572r48n60J478
1615D27L5j245P22J201o73r23J355K57j121L23J35p27l28P82m99o94N36O10j213
1634a040O23N16n89M2J194j56r09L48J015m98l92N59k66n15K51L43j050n07R91
1653d0J3j367O92Q61o47n8O88K25o76J05J528q82n44P39M96j135o2R86j067l73
$$ plain form
1673 -518 181 205 -1254 -676 315 -331 -939 284 -148 -439 -48 868 -191 80 1031 599 -219 913 736
1692 736 -439 109 650 -801 -871 369 -39 -1306 -528 427 -1028 -909 618 -200 -739 690 1201 -26
1710 -26 50 1403 297 -370 658 650 -654 -97 152 -531 -1105 25 -51 -1147 -269 39 -670 -458 484 53
1730 53 -53 813 705 146 470 770 -196 139 187 30 -582 -103 10 -574 -618 -240 -555 -497 295 -115 51
1751 51 -189 609 896 181 382 835 606 -33 254 448 59 -452 97 -94 -811 -466 -332 -637 -981 17
1771 17 115 -863 132 605 276 -25 580 550 440 487 296 -106 -11 338 -799 -631 228 -376 -807 176 105 -1023
1793 -1023 -149 665 -265 -443 805 745 31 636 946 96 44 734 -206 -681 0 279 -702 -433 -81 -450
1813 -450 -866 -247 -54 -537 -151 539 195 242 514 399 385 768 162 -225 -4 324 -25 -273 5 -301 -332
$$ packed form
1673e18O99K4j459N78R91o46o08J223m32k91L91R16j059K71R51m32q18J132j77
1692G36j175N48N41j451p0J240m08j267P78R55j455J19J527q18n39J429N11j227
1710b6P6J353j106o67J028qj304N57K49o83n74J130p6j096Q78L08p09K12R42m31
1730E3j06Q66j08n59L24L00r66L35M8j57o12M79J13n84m4L78l15N8P92m10J66
1751E1k40P98K87p15K01M53k29o39K87J94l89n11N49j91p17L45J34l05l44R98
1771A7R8r78R95M73l29l01O05l0j10M7j91m02R5L49j137J68Q59o04m31R83p1j128
1793a023Q74Q14r30j78J248o0p14O05L10q50n2O90r40m75O81K79r81K69L52l69
1813d50m16O19J93m83L86O90l44M7K72j15j4L83o06l87K21L28l49k48K78l06l1
$$ plain form
1834 -332 -43 -261 -779 -95 61 -315 -238 489 133 216 626 533 311 757 267 45 86 -460 -60 -47 -146 -542
1856 -542 -483 -415 -497 -678 -61 14 -813 247 504 -76 222 944 585 215 298 288 43 29 257 -551 -728 2
1878 2 -495 -718 -335 -223 -81 -32 241 -155 294 398 51 276 636 767 48 562 236 -2 -462 123 -245
1899 -245 -562 -374 92 -693 -510 45 -60 -242 275 411 -150 185 551 483 128 721 170 -73 -141 -89 -63
1920 -63 55 -280 -878 -159 -184 -859 -361 139 -59 -128 526 444 -267 87 887 229 59 725 413 -546 -81
1941 -81 386 -510 -431 -94 -543 -254 -183 -224 -322 -160 152 -459 370 530 81 331 691 277 -333 624 402 -206
1963 -206 -166 535 -236 -386 -22 -340 -435 -677 -42 -237 -311 96 298 11 162 572 356 25 558 384 -32
1984 -32 10 -19 -264 -579 -386 -387 -459 -126 -508 -252 -197 7 15 97 67 467 252 196 337 314 318 335 -49 -267 -285 -77
$$ packed form
1834c32K89k18n18O84J56l76P7P27l56Q3M10r3k22M46m90k22M1n46M00J3r9l96
1856e42N9O8q2j81O17P5q27J060K57n80K98P22l59l70Q3j0k45j4K28q08j77P30
1878Bm97k23L83J12J42M9K73l96M49J04l47K25L60J31p19N14l26k38m60N85l68
1899b45l17J88M66p85J83N55j05j82N17J36n61L35L66o8l55N93n51k43o8N2K6
1920f3J18l35n98P19k5o75M98N00j98o9O54q2p11L54Q00o58j70O66l12r59M65
1941h1M67q96P9L37m49K89P1m1r8J62L12o11Q29J60m49K50L60m14o10R57k22o08
1963b06M0P01p71j50L64l18r5k42O35j95p4M07K02k87J51M10k16l31N33j74m16
1984c2M2k9k45l15J93jp2L33l82K56N5K04QQ2l0M00k15n6J41k3MJ7l84k18j8K08
$$ plain form
2010 -77 -137 -426 -126 18 -347 -409 -19 -281 -449 51 491 -173 35 786 504 -243 583 337 -64 -106 545
2031 545 -297 -796 119 19 -639 -370 316 -710 -685 -14 134 -308 339 760 -13 240 627 463 -191 263
2051 263 -175 -356 -148 327 -322 -661 3 -72 -890 -355 -251 8 -274 318 331 -346 445 576 168 -106 605
2072 605 410 170 -71 267 -426 -378 -91 -35 -832 -469 243 -573 -437 69 132 -158 480 510 307 -51 550
2093 550 417 135 398 135 -65 -263 -88 -431 -551 128 -232 -657 -160 318 49 -179 174 371 -2 380
2113 380 762 11 20 681 -15 -186 82 121 -391 -200 106 -265 -453 -257 -192 -630 -285 280 155 -107 380
2134 380 573 8 140 364 275 -156 386 152 -334 36 -10 -496 -475 -162 -249 -225 -270 -58 -293 -125 192 71
2156 71 -299 423 404 -8 359 566 70 -90 158 484 -558 -72 259 -244 -429 10 -57 -472 -90 524 -172
$$ packed form
2010g7o0k89L00J44l65o2L90k62j68N00M40o64K08P51k82p47Q26k46m01m2O51
2031E45q42m99R15j00o58K69O86j026K5O71J48m42O47M21p73K53L87j64o54M54
2051B63m38j81K08M75o49l39O64p5q18N35J04K59k82N92J3o77P91J31m08k74P11
2072F05j95k40k41L38o93M8K87N6p97L63P12q16J36N06O3k90O38L0k03l58O01
2093E50j33k82K63k63k00j98J75l43j20O79l60m25M97M78k69k28L53J97l73L82
2113C80L82p51RO61o96j71K68L9n12J91L06l71j88J96O5m38L45N65j25k62M87
2134C80J93n65J32K24q9m31N42k34m86L70m6m86K1L13q7K4m5K12k35J68L17j21
2156G1l70P22j9m12L67K07m96j60K48L26j042M86L31n03j85M39o7m15L82O14o96
$$ plain form
2177 -172 -244 380 295 -303 140 596 184 -47 428 103 -25 306 6 -263 -399 240 -154 -329 39 -20 -97
2198 -97 -152 316 215 -35 435 125 44 370 371 -125 -32 246 -86 -453 -213 28 -429 -414 127 -302 -423 -73
2220 -73 361 -97 -216 532 295 83 147 595 35 -45 357 -184 -431 -86 -64 -452 -494 25 -190 -297 -85 -3
2242 -3 -128 -38 250 202 48 193 127 312 123 152 -314 -86 17 26 -105 -272 -260 -614 -247 -157 61 -64 -67 304
2266 304 -259 45 806 332 -261 364 648 -156 -22 246 103 -273 17 84 -690 -279 53 -670 -550 -89
2286 -89 30 29 109 178 192 406 558 153 84 381 288 -101 96 169 -320 -180 74 -98 -607 -59 -355 -260 -21
2309 -21 -56 -158 -216 376 230 -172 358 488 80 172 474 144 -66 -1 -254 -72 -477 -215 -248 -176 -244 -145 203
2332 203 -239 -59 -43 347 -28 459 211 400 153 256 318 71 -96 -31 -509 -255 -185 -279 -401 -437 -2 -385
$$ packed form
2177a72p2O24q5n98M43M56m12k31M75l25j28L31l00k69j36O39l94j75L68n9p7
2198i7n5M68j01k50M70l10q1L26Jm96R3K78l32l67K40K41m57J5N41m29j21L50
2220g3M34m58j19P48k37k12O4M48n60q0M02n41k47L45K2l88m2N19k15j07K12Q2
2242cj25R0K88m8j54J45o6J85j89K9m66K28J03Rj31j67J2l54L67R0K18j25lL71
2266C04n63L04P61m74n93O25K84q04J34K68j43l76K90O7p74M11L32p23J20M61
2286h9J19jQ0O9J4K14J52m05o9K97r3l89J97P3m89J40K54j72n09N48k96R5K39
2309b1l5j02n8N92j46m02N30J30m08R2L02l30k10O5k53J82m05K62l3P2o8R9L48
2332B03m42J80J6L90l75M87k48J89k47J03O2k47j67O5m78K54P0r4j22l6M35l83
$$ plain form
2354 -385 99 0 -173 -50 414 409 56 546 241 31 199 151 -250 -242 565 -63 -274 -116 -160 -238 -152 111 -80
2377 -80 -95 419 -19 -383 434 334 35 -258 336 91 313 75 12 -123 -39 -351 -499 -164 -173 -246 -75 198
2399 198 -153 -106 179 767 56 7 490 188 166 59 54 22 -337 180 -64 -429 -162 -425 -384 37 -611 -268
2421 -268 33 227 -54 118 176 136 162 425 89 44 342 -241 80 184 334 -336 -136 -337 -142 -362 -132
2442 -132 -114 -131 -41 145 115 -139 161 94 242 58 260 -106 -106 194 6 -47 -135 -365 -260 -85 -277 -260 -134
2465 -134 -196 -56 -197 37 146 103 33 442 216 240 388 -9 136 105 -182 -105 -439 -375 -53 -100 -293 -327 75
2488 75 -43 -158 3 231 57 156 452 166 8 210 114 -110 -226 354 -150 -465 -277 99 -404 -11 -179
2509 -179 -61 -169 283 269 -39 286 315 225 145 415 46 -88 184 109 -270 34 -187 -412 -279 -150 -182 -430
$$ packed form
2354c85M84r9j73J23M64nl53M90l05k10J68m8m01QQ07o28k11J58m4p8Q6K63j91
2377h0j5N14m38l64Q17j00k99k93N94k45K22k38o3j35Q4l12j48L35rp3J71K73
2399A98l51M7K85N88p11m9M83l02k2j07nl2l59N17k44l65K67k63M1M21o48L43
2421b68L01J94k81J72N8m0K6K63l36m5K98n83L21J04J50o70K00k01J95k20K30
2442a32J8j7R0J86l0k54L00o7J48j84K02l66%L00j88n3q8k30J05J75j92J7J26
2465a34o2J40j41K34J09m3p0M09k26K4J48l97J45l1k87P7l34O4L22m7j93l4M02
2488G5j18j15J61K28j74R9K96k86j58K02r6k24j16N80n04l15J88L76n03L93j68
2509a79J18j08M52j4l08L25K9r0q0K70l69j34K72p5l79L04k21k25J33J29l2k48
$$ plain form
2531 -430 99 -24 -370 -207 352 183 123 291 107 160 259 305 28 -214 272 -88 -238 -186 76 11 -509 -100
2553 -100 -212 265 -40 136 -8 -193 366 150 3 290 124 245 85 396 -22 30 -165 242 -160 -363
2573 -363 362 -228 -210 96 2 150 111 184 102 -54 163 409 -1 329 341 109 -184 71 -22 -104 64 44 -36
2596 -36 -81 31 237 -378 -57 171 -64 86 244 188 -8 236 353 55 -323 251 -49 -493 -15 109 -258
2617 -258 -327 7 -265 -7 -58 59 -198 -69 423 77 235 550 126 46 162 197 -173 -79 232 2 -106 1
2639 1 17 -302 -5 31 -12 -335 218 271 -133 338 337 210 465 318 330 82 260 85 -124 55 -36 -280 -350 -270
2663 -270 -14 -229 -252 -252 -80 -115 2 342 99 170 324 204 28 1 237 176 -10 319 -112 -524 -106 -18 -294
2686 -294 -189 2 -247 -134 192 93 0 -133 286 214 8 150 475 -294 247 100 -153 93 -15 -241 -25
$$ packed form
2531d30N29j23l46J63N59j69o0J68j84N3R9M6k77k42M86l60j50N2K62o5n20M09
2553a00j12M77l05J76j44j85N59k16j47K87j66J21j60L11m18N2j95M07m02k03
2573c63P25n90J8L06r4J48l9P3q2j56K17K46m10L30J2k32k93K55r3q2J68k0q0
2596c6m5J12K06o15L21K28k35J50J58n6j96K44J17k98l78N74l00m44M78J24l67
2617b58o9L34k72K58n1J17k57J29M92l46J58L15m24q0J16L5l70R4L11k30j08J07
2639AJ6l19K97L6m3l23N53N3m04M71jj27K55j47J2k48J78j75k09J79r1k44p0Q0
2663b70K56k15k3%J72l5J17L40k43P1J54j20j76k7K36o1j86L29m31m12M18Q8k76
2686b94J05J91k49J13L26r9r3j33M19p2k06J42L25p69N41j47k53K46j08k26K16
$$ plain form
2707 -25 -53 -245 -294 -210 255 -22 123 41 74 50 -42 530 393 -239 228 259 -91 27 175 95 -241 55 -328
2730 -328 -157 -415 -31 -105 -262 -127 141 -203 141 519 222 68 408 312 267 56 106 174 -55 -48 -159 -165 -142
2753 -142 -57 -304 -167 149 80 -137 -75 31 -110 630 620 114 181 279 237 -83 -169 211 18 -305 161 -192 -532
2776 -532 93 -28 -354 137 -115 77 -95 213 313 24 233 502 60 4 140 46 -77 217 89 -228 -103
2797 -103 -145 110 -94 11 11 -196 -193 252 103 268 211 104 81 141 307 189 14 235 -140 -72 -120 -51 38 123
2821 123 -136 -11 -85 40 200 19 98 365 312 -107 158 280 220 98 -120 184 -116 74 -84 -245 -419
2842 -419 11 -87 -435 -70 -167 -117 -93 262 -69 104 132 216 119 130 -123 -109 62 151 -174 -616 56 201 -46
2865 -46 -215 -140 -329 -348 330 107 2 30 5 118 65 343 277 99 -39 -34 -116 -111 150 -354 -139 45 48 -194 -99
$$ packed form
2707b5k8j92m9Q4M65k77J45q2L3k4r2N72j37o32M67L1l50J18J48q0l36K96l83
2730c28J71k58L84p4j57J35K68l44L44L78k97j54L40r6m5k11N0O8k29Pj11oK3
2753a42Q5k47J37L16o9k17O2J06j41P40j0n06O7R8m2l20q6L80j93l23M66l53l40
2776e32O25j21l26M91k52J92j72L08J00k89K09K69m42n6J36r4j23K94j28l17J25
2797a03m2K55k04J05%k07LM45j49J65n7j07k3O0J66j18j75K21l75O8m8O9Q9Q5
2821A23k59J25p4J25J60j81P9K67n3m19K65J22o0j22k18L04l00J90j58j61j74
2842d19M30r8l48L65r7N0K4L55l31J73K8Q4r7J1k53J4J71Q9l25m42O72J45k47
2865d6j69P5j89j9O78k23j05K8k5J13n3K78o6j78j38Nq2NK61n04K15J84Lk42R5
$$ plain form
2890 -99 -129 -45 150 288 -19 47 135 -144 198 216 -40 263 -13 174 113 -46 -34 -208 48 -177 29 -275 -24
2913 -24 -74 -332 31 233 2 56 166 -87 -127 454 21 -101 73 -18 79 -101 -34 -118 -52 -255 -183 -131 -102 43
2937 43 -131 -55 98 318 123 159 127 93 160 120 163 -167 -71 -43 -163 -370 -106 -146 -137 -192 -67 143 169 100 -66
2962 -66 152 25 -65 218 130 245 164 163 -6 177 -92 -251 -233 -215 -29 -22 -27 -147 -31 120 18 48 -231 -2
2986 -2 205 -89 472 275 53 -100 249 213 -305 60 -193 -43 41 83 -53 -523 -33 43 -13 293 113 -11
3008 -11 -132 -10 97 18 -4 165 160 -34 -9 143 -2 56 -35 -77 113 -139 -104 -96 -42 45 -41 -54 29 -62 29 127 -16
3035 -16 220 85 26 -51 -209 139 -204 -214 173 4 -270 -228 -64 86 26 216 146 -73 348 -4 262 98
3057 98 -109 291 -92 312 -20 86 -140 -27 -40 -103 -177 -107 50 118 69 166 -20 124 72 -40 224 124 33
$$ packed form
2890i9l0Q4J95J38l07O6Q8k79L42J8k56L03k76J87o1j59J2j74K56k25K06l04K51
2913b4n0k58L63K02k31N4J10k53m0N81m33j22J74r1R7j80O7q4O6k03P2N2K9J45
2937D3j74P6J53K20j95L6l2l4O7m0M3l30R6K8j20k07K64m0Rn5J25K10K6o9j66
2962f6K18j27r0K83q8J15q1jj69J83k69j59J8J8J86Pnj20J16J51j02L0k79K29
2986bK07k94N61j97k22j53L49l6n18L65k53J50Q4M2j36m70M90P6n6L06j80j24
3008a1j21J22J07p9k2J69nj94K5J52j45N8r1m2J90k52L5QN4Q7q6j3Q3r1R1R8j43
3035a6K36j35n9p7j58L48l43j0L87j69k74M2J64J50o0J90p0k19M21l52K66j64
3057I8k07M00l83M04l32J06k26J13j3o3p4P0J57O8m9R7j86J44n2j12K64j00r1
$$ plain form
3080 33 116 109 -59 -262 -338 141 -206 -445 -84 -191 -389 61 139 -4 -177 135 -82 10 157 167 -248 -69 228
3103 228 4 -196 -49 267 -340 21 -65 -325 -325 3 -204 37 -257 485 198 -225 83 -224 194 9 158
3124 158 34 3 146 35 -134 -26 -19 -118 -325 -129 179 -130 -26 -97 -175 305 81 180 269 176 306 305 25 136
3148 136 -12 241 255 65 35 6 74 85 46 -49 69 -150 -127 -215 162 -79 251 274 269 89 17 -130 -42 252 -39
3173 -39 20 185 54 -83 -189 -59 -23 -83 -92 -223 -297 54 110 37 51 378 234 190 175 79 107 -217 35 -136 -161
3198 -161 -293 -66 -506 -230 -166 -86 -282 -476 321 -134 -96 363 363 -39 179 -105 -298 199 99 -74 95 -28
3220 -28 324 -157 -205 -100 1 104 -108 -195 -159 -21 91 -148 -69 84 260 346 49 257 27 97 -141 186
3242 186 -124 -141 -270 25 -430 -65 -316 -193 -73 -113 171 17 100 280 360 190 324 151 124 14 -78 -35
$$ packed form
3080C3Q3pj68k03p6M79l47k39L61j07j98M50P8j43j73L12k17R2J47J0m15J79K97
3103B28k24k00J47L16o07L61q6k60%L28k07K41k94P42k87m23L08l07M18j85J49
3124A58j24l1J43j11j69J08Pr9k07J96L08l09J04p1p8M80k24R9Q9r3J30jk80J11
3148A36j48K53J4j90l0k9O8J1l9r5J18k19K3q8L77k41L30K3nj80p2j47Q8K94k91
3173c9N9J65j31j37j06J30L6o0rj31p4L51N6p3J4L27j44m4j5r6K8l24K52j71k5
3198a61j32K27m40K76O4Q0j96j94P97m55L8M59%m02K18k84j93M97j00j73J69j23
3220b8L52m81m8J05J01J03k12q7L6J38J12k39P9J53J76Q6k97K08k30P0k38L27
3242A86l10j7j29K95m55L65k51J23J20m0K84j54Q3J80Q0j70J34j73k7j10r2M3
$$ plain form
3264 -35 -146 13 -29 -227 94 62 164 88 145 -19 -16 67 323 179 -45 239 -148 160 108 -5 -185 -269 -32
3287 -32 -15 80 -143 -76 17 -10 -100 -186 209 75 -74 180 321 111 186 206 404 -381 6 146 263 74 130 -61
3311 -61 -34 10 -295 -167 -268 46 -167 -74 203 21 -231 73 21 60 165 138 -217 -86 52 47 90 -329 -202
3334 -202 17 -9 28 -179 7 151 -46 -139 7 -179 30 274 23 309 218 -56 -126 -181 -57 72 -168 -66
3356 -66 -137 -323 -219 -143 -188 -50 -136 14 -111 89 178 -40 -27 103 58 268 92 -147 -300 144 -105 -258 -148
3379 -148 46 -220 -69 -170 -211 27 27 -48 22 126 182 65 106 -33 95 -139 6 -80 -354 -311 46 79 68 122
3403 122 -304 -111 -138 55 -174 8 -105 -15 66 166 -149 154 95 -22 270 -29 64 -164 18 116 -56 29
3425 29 -256 71 -30 -17 -48 132 248 123 16 93 263 39 59 -94 -26 164 -24 -47 0 -306 56 -215 -288
$$ packed form
3264c5j11J59m2j98L21l2J02p6N7j64LQ3K56j44k24K84l87L08n2j13j80q4K37
3287c2J7R5k23O7R3k7r0q6L95j34j49K54J41k10P5K0J98p85L87J40J17j89N6j91
3311f1K7M4l05J28j01L14k13R3K77j82k52L04n2L9J05k7l55J31J38nM3m19J27
3334b02K19k6L7k07J86J44j97r3J46j86K09K44k51K86r1k74p0n5J24J29k40J02
3356f6p1j86J04P6m5J38q6J50j25K00Q9k18J3J30m5K10j76k39j53M44k49j53J10
3379a48J94k66J51j01m1K38%p5P0J04N6j17M1j39J28k34J45q6k74M3L57L3j1N4
3403A22m26J93k7J93k29J82j13R0Q1J00l15L03n9j17K92k99R3k28J82R8j72Q5
3425B9k85L27j01J3l1J80J16j25j07P7J70k24K0j53O8J90j88k3M7l06L62k71p3
$$ plain form
3448 -288 -294 -187 -84 -77 -120 -127 -197 111 100 -204 284 126 101 168 10 -48 36 64 126 268 -61 -227 -177 -18 269
3473 269 249 -178 187 192 26 147 111 80 86 -45 68 169 -129 22 -24 182 -346 3 206 6 -119 46 -95
3496 -95 172 79 54 83 2 131 -53 98 -35 134 3 -69 -13 -231 85 -230 -207 -57 68 -301 -195 -110 -137
3519 -137 291 -218 37 42 -36 206 -71 18 322 337 11 9 36 -226 -98 -169 289 -46 -58 -233 -10 -169 -74 95
3543 95 158 37 28 126 148 -40 282 -51 -196 -74 263 26 -315 255 -9 -92 -10 -56 111 -298 151 -93 -18
3566 -18 59 144 -205 211 80 -318 -32 -79 289 64 87 164 -174 -203 159 74 -217 119 208 -170 -14 -330 -8
3589 -8 -82 554 274 71 66 87 -45 -95 38 339 -138 71 -159 -121 252 35 -1 -183 413 96 38 391 55
3612 55 -186 305 23 404 6 319 237 -15 -85 -167 -110 161 -138 18 151 115 41 53 -87 -117 276 -16 235
$$ packed form
3448b88oJ07J03Pm3pp0L08j1l04M88j58k5O7j58n8Q4K8O2J42l29j66N0J59K87
3473B69k0m27L65Nj66J21l6l1Oj31J13J01k98J51m6K06n28L49K03k00j25J65j41
3496i5K67r3k5K9q1J29j84J51j33J69j31p2N6k18L16l15K3J50J25l69J06Q5k7
3519a37M28n09K55Np8K42k77Q9L04J5l26kK7k62J28p1M58l35j2j75K23j59R5J69
3543I5O3j21rR8K2j88L22l33j45J22L37k37l41N70k64q3Q2m6J67m09M49k44P5
3566a8P7Q5l49M16j31l98K86m7L68k25K3P7l38k9L62q5k91L36Q9l78J56l16L22
3589hp4O36k80k03nK1j32n0J33L01m77K09k30L8L73k17l6j82N96l17n8L53l36
3612E5k41M91k82L81l98L13q2k52p0q2N7K71k99J56J33l6p4J2j40l0L93k92K51
$$ plain form
3635 235 49 166 131 50 220 220 189 -77 202 -94 -104 61 -83 98 -121 119 -104 150 184 145 -116 258 95
3658 95 140 168 244 85 190 19 10 -74 255 -157 121 -215 -3 39 -185 128 -7 65 -213 -49 116 -39 -93
3681 -93 56 -6 99 69 84 305 41 -253 -4 78 -189 -76 99 48 28 -28 119 7 -135 145 256 -145 135
3704 135 15 82 -57 240 253 -7 -53 -48 -214 -182 39 197 -17 -213 82 378 -5 64 -99 -81 120 40 249
3727 249 -124 -109 224 132 16 195 -242 -99 27 279 -159 75 -266 77 223 -156 65 -72 19 -230 -70
3748 -70 111 -143 20 -69 199 -237 -55 30 -30 -136 56 -69 241 32 -225 -95 -5 -108 -49 63 -80 36
3770 36 173 131 11 179 -47 41 59 127 -165 -325 22 -108 -11 -180 -13 -183 -60 76 174 75 134 268 -125
3793 -125 42 -151 236 -77 58 209 -40 46 28 -78 -291 -133 166 -49 14 382 125 -11 -126 55 145
$$ packed form
3635B35j86J17l5q1J70%l1k66K79k96j0J65j44J81k19K40k23K54L4l9k61L74j63
3658I5M5K8P6j59J05j71rq4L29m12K78l36K12M2k24L13j35P2k78J64J65j55n4
3681i3J49o2J05l0J5K21k64k94K49Q2k67J13J75n1k0n6J47j12j42K80J11m01K80
3704A35j20O7j39K97J3k60m6Nj66L2K21J58k14j96K95K96l83O9j63J8K01q0K09
3727B49l73J5L33r2j16J79m37J43J26K52m38K34l41L43J46l79K21j37R1k49J60
3748g0J81k54J63q9K68m36J82Q5o0j06J92j25L10k09k57J30R0j03N9J12j43J16
3770C6J37m2j20J68k26Q8J8O8k92j60L47j30R7j69J67j70J23J36R8r9N9J34l93
3793a25J67j93L87l13J35J51k49Q6j8j06k13J58K99k15O3L68k57j36j15J81R0
$$ plain form
3814 145 23 61 140 -183 53 -35 -23 -114 116 -60 116 -122 183 -140 -14 290 22 -219 -14 -63 -135 -147 3
3837 3 58 76 1 37 -184 61 -96 -202 35 -78 -180 -291 73 -220 77 32 18 426 162 133 68 -151 -117 -55
3861 -55 84 -35 -84 -49 110 -147 -49 -116 171 52 148 -103 6 -73 -165 -99 289 230 -509 12 154 -124 161
3884 161 -21 -123 -362 110 -76 -18 -28 22 -49 -201 271 -170 -58 -145 -19 -326 11 -90 219 -27 104 -26
3906 -26 123 -141 -54 54 27 -178 -269 -29 -307 152 -46 92 219 -146 182 -45 -9 -17 -38 -107 -205 199 150 210
3930 210 -65 107 -277 49 -269 -206 312 -96 -297 -221 101 -129 54 -255 172 186 -9 81 36 131 134 200 28
3953 28 -196 -78 137 -62 -87 -112 -70 88 -69 79 77 -125 187 -149 307 60 -151 -6 127 -56 117 7
3975 7 191 108 -311 4 -116 136 13 -114 166 -45 -57 30 193 48 21 19 -76 85 -19 188 24 -84 221
$$ packed form
3814A45j22L8P9l23K36q8J2r1K30j76J76k38L05l23J26L04k68k41K05m9p2j2J50
3837CN5J8p5L6k21K45j57j06K37j13j02j11L64k93K97m5j4M08k64k9o5k19L4O2
3861e5J39j19m9L5J59k57R8o7K87j19R6k51J09p9r2O6L88n9p39N21J42k78K85
3884A61j82j02k39M72j86N8j0N0p1j52M72m41J12q7J26l07L37j01L09k46J31j30
3906b6J49k64Q7J08k7k05r1K40k78M59j98J38J27l65L28k27L6qk1o9r8M04m9O0
3930B10k75J72l84L26l18O3N18m08k01P6L22k30J83l09M27J4j95R0m5R5LO6j72
3953B8k24J18K15j99k5k5M2J58j57J48kk02L12l36M56k47k11J45J33j83J73j10
3975GJ84q3m19L15j20K52j23j27K80k11j2Q7J63j45k7kr5J61j04K07j64j08L05
$$ plain form
3998 221 94 -119 -50 19 -44 98 -277 -39 -158 -130 -51 -232 173 -177 -118 -64 154 11 -3 -185 -60 157 4
4021 4 124 -71 -26 -279 4 -38 87 62 -119 -88 178 55 51 -55 -98 -62 100 -235 -182 86 11 -87 -213 -291 -188
4046 -188 -22 -98 92 -275 -5 257 73 410 -115 33 -206 26 193 -123 -188 164 40 130 324 -112 -111 -19
4068 -19 16 -119 163 106 53 38 -228 98 -250 -76 -26 211 -72 23 68 -87 85 243 -180 10 210 180 -137
4091 -137 233 108 -22 -82 -22 -208 177 -129 -94 10 -135 215 186 -122 -140 -56 -176 79 215 -309 41 51
4113 51 0 138 153 308 22 -87 -37 -82 185 -97 57 -184 74 5 -128 144 -197 193 213 0 -230 -296 -157
4136 -157 -127 -197 -339 -273 -58 -113 -134 4 -190 206 305 -5 224 184 57 -78 263 -57 61 168 -40 -153
4158 -153 -221 24 -98 47 -157 -86 -165 -252 7 -79 89 147 -88 223 274 -107 214 103 -58 -46 -12 52 -112
$$ packed form
3998B21j27k13O9O9o3J42l75K38j19K8P9j81M05l50N9N4K18j43j4j82J25K17j53
4021DJ20j95M5k53K83m2J25k5j81L1K66j23mj06m3L6J62l35N3K68p5r8j26p8J03
4046a88J66p6J90l67K70K62j84L37n25J48k39K32J67l16o5L52j24R0J94m36JR2
4068a9L5j35K82n7n3j5k66L26l48J74N0K37k83R5M5j55J72J58m23J90K00l0l17
4091a37L70j25j30o0O0j86L85l06L5J04j45L50k9l08j8Q4j20K55J36n24L50J0
4113E1n1J38J5J55k86j09N0m5K67k82J54k41K58o9j33K72l41L90K0k13k30o6J39
4136a57L0p0j42O6K15n5k1J38j94L96R9l10K29m0j27j35L41l20J18J07k08j13
4158a53o8K45j22J45k04P1p9q7K59q6J68N8k35L11N1l81L21j11j61J2L4O4j64
$$ plain form
4181 -112 -21 60 -6 -207 106 188 -50 86 115 102 6 36 8 -47 142 424 -60 161 305 -193 37 -39 -52 -21
4205 -21 64 71 -2 65 -42 26 114 -44 294 57 90 203 -110 -321 10 -93 105 280 -26 187 -10 -140 -164
4228 -164 98 165 140 1 -152 22 -111 -38 -291 -69 -110 -12 77 138 -110 141 -71 184 115 -122 -177 13 -238
4251 -238 151 150 -98 2 -108 110 -16 -65 70 183 112 -72 155 247 369 222 12 -96 -23 -68 -98 -75 -60
4274 -60 -69 7 90 13 -159 9 233 209 216 -170 21 128 -21 -291 39 93 25 -19 108 -70 -268 38 122 -169
4298 -169 -76 52 2 42 156 19 111 -39 17 -131 -31 -14 71 61 -260 -263 -23 -40 60 94 -56 136 229 203 -202
4323 -202 -146 -76 -46 190 131 -157 -37 99 236 74 -69 358 205 213 -124 -144 39 -8 121 189 -31 -55 -88 11
4347 11 136 -277 119 -163 -46 315 -219 57 -74 124 -50 -24 99 51 -51 -18 -131 153 151 5 -84 91
$$ packed form
4181a12R1Q1o6k01L13Q2k38J36K9j3r6L0k8n5J89K82m84K21J44m98K30p6j3L1
4205b1Q5Pp3O7j07O8Q8j58L38k37L3J13l13k11L31j03J98J75l06K13j97j30k4
4228a64K62O7k5j39j53J74j33P3k53K22m1R8Q9O1k48K51k12K55o9k37n5J90k51
4251b38L89jk48J00j10K18j26m9J35J13p1j84K27R2J22j47k10j08P3m5l0K3J5
4274f0rP6Q3p7j72J68K24k4Pl86J91J07j49k70L30N4o8m4J27j78j98L06Q4k91
4298a69R3J28n0M0J14j37R2j50N6j48J00J7Q5j0l21lK40j7J00L4j50J92R3k6m05
4323b02N6P0L0K36n9k88J20J36J37j62j43M27j53Ql37k0J83m7J29O8k20k4l3R9
4347A1J25m13L96k82J17L61n34K76j31J98j74K6J23m8j02L3j13K84kj46q9J75
$$ plain form
4369 91 -94 -296 -173 88 -74 143 405 -102 139 35 94 -25 96 -56 -233 112 16 -49 -125 -170 180 16
4391 16 -69 188 306 53 64 16 229 98 -2 127 255 272 -28 82 111 -18 -54 -91 174 -102 205 -94 44
4414 44 -135 -180 -76 -25 20 187 -101 142 236 -113 16 38 172 -36 -200 81 -129 158 -107 230 205 132 219
4437 219 -279 -175 -256 59 141 122 -19 8 -74 313 9 -52 124 234 -152 236 128 3 34 -187 -3 -11 296
4460 296 173 1 12 17 151 -139 -168 -85 70 -203 97 70 225 -103 69 -160 144 -5 -126 167 300 99
4482 99 -9 -3 62 162 94 121 253 136 -135 -134 -340 160 67 117 -62 21 -114 -79 -284 -280 -46 -267 62 -11 28
4507 28 -463 -239 61 129 70 -24 -155 12 -31 -128 11 -82 -91 304 -39 -40 -174 -10 93 -136 203 -7 77 -5
4531 -5 149 13 -134 85 261 -55 218 -260 94 -235 -2 35 -15 -209 -23 1 85 2 19 -26 -40 238 -62
$$ packed form
4369I1j85k02J23K61j62K17K62n07K41j04N9j19J21j52j77L45r6o5p6m5L50j64
4391A6q5K57J18k53J1m8K13j31j00J29J28J7l00J10K9j29l6l7K65k76L07k99J38
4414D4j79m5J04N1M5J67k88K43R4l49J29K2J34k08j64K81k10K87k65L37k5p3Q7
4437B19m98J04q1L15Q2j9j41K7q2L87l04o1J76J10l86L88j08j25L1k21J84qL07
4460B96j23j72J1NJ34k90k9Q3J55k73L00k7J55l28J72k29L04j49j21K93J33k01
4482I9j08OO5J00o8K7J32j17k71Jk06N00r3N0j79Q3j35L5k05MK34k21L29p3L9
4507B8m91K24L00O8n9r4j31J67m3r7J39r3rL95l43jj34J64J03k29L39k10Q4q2
4531eJ54j36j47K19J76l16K73m78L54l29K33L7n0j94J86K4Q4q3J7m5j4K78l00
$$ plain form
4554 -62 -12 -11 -10 -112 -246 65 166 24 -2 -186 -70 134 -269 -137 -208 -207 23 66 230 -122 -15 -190 -106 -44
4578 -44 -305 13 -207 18 -13 -150 38 29 52 38 -86 -65 -5 49 -23 -116 -39 121 145 -23 -20 28 188 118 21 303
4604 303 -42 -272 -111 140 110 -16 -142 -91 -88 148 -48 73 11 184 -65 -8 27 -57 102 -4 6 -51 -203
4627 -203 -105 39 -144 175 -210 -50 33 -378 0 -179 -115 50 95 -205 72 49 -38 66 -72 -140 -141 -238 384
4650 384 4 101 -29 24 -28 -226 -119 -196 293 -14 -42 120 163 -77 36 -47 126 111 284 89 -113 51 42
4673 42 19 85 -101 -51 211 -80 170 -144 98 -110 -38 64 -92 -96 161 119 188 51 113 12 18 172 133 -38
4697 -38 -75 110 -198 -22 -159 192 -135 95 158 -59 82 -96 -89 60 -18 -28 21 -35 -2 128 -57 -31 12 8 -117
4722 -117 89 -131 19 49 58 98 231 227 255 183 4 -35 267 109 141 -14 171 67 76 329 66 -134 -200 -159 7
$$ packed form
4554f2N0JJj02j34L11J01j42k6j84J16K04m03J32p1JK30M3J64l52J07j75Q4O2
4578d4k61L18k20K25l1j37J88rK3j4j24K1O0N4p2r3P7J60K4j68LM8J60p0r7K82
4604C03l45k30J61K51l0j26j26N1LK36j96J21o2J73k49N7L5q4J59j06J0n7j52
4627b03R8J44j83L19l85J60Q3m11L78j79O4J65M5l00K77k3q7J04j38o8jr7O22
4650C84l80R7j30N3n2j98J07p7M89l07k8J62M3k40J13q3J73j5J73j95k02J64r
4673D2k3O6j86N0K62k91K50l14K42k08P2J02j56mK57m2O9j37O2j01OJ54l9j71
4697c8l7J85l08J76j37L51l27K30O3k17J41j78PJ49p8j0M9n6L3J30j85K6M3mj25
4722a17K06k20J50L0RM0J33mK8p2j79l9L02j58L2j55J85j04RK53k63k00o6M1J66
$$ plain form
4747 7 -199 143 -66 -47 56 -19 -111 323 -312 -147 -101 52 -24 13 -129 -178 55 -72 55 236 -136 -336 107
4770 107 -82 -9 157 129 132 423 -73 -135 204 175 -141 -62 232 -240 -306 -145 26 -27 41 47 193 -125 222 270
4794 270 16 192 -165 -91 48 -33 116 -152 -42 -96 -180 111 166 -2 72 -4 72 78 19 -294 -94 -296 -169 37
4818 37 170 -46 121 -145 30 17 -18 -42 -26 -44 -93 14 -36 -15 -2 -184 30 -196 132 84 268 5 117 -90
4842 -90 -33 -100 -264 183 -116 44 109 252 75 -102 -120 -24 -201 78 -187 -165 20 66 -62 105 -6 184 -230
4865 -230 0 35 206 -67 192 -199 64 -112 -17 98 -50 79 -406 -123 -19 -139 81 -34 -115 48 110
4886 110 -343 -184 -27 48 96 286 83 9 -18 164 -166 91 276 99 34 168 -9 -248 173 111 343 -52
4908 -52 38 77 -235 -42 174 309 149 -97 42 -125 6 115 -63 -135 211 -62 171 65 -43 -188 -4
$$ packed form
4747Gk06L42k09J9J03p5r2M34o35J65M6J53p6L7j42m9K33j27J27J81l72k00M43
4770A07j89P3J66k8LK91m96o2L39k9l16P9K94m72o6J61J71n3O8OJ46l18L47M8
4794B70k54J76l57P4J39q1J49k68J10n4q4K91N5j68P4p6P6On9l13K00k02J27K06
4818C7J33k16J67k66J75j3l5k4J6j8m9J07n0K1J3j82K14k26L28m8J84k63J12k07
4842i0N7o7j64M47k99J60O5J43j77j77j8R6j77K79k65K2J85M6j28J67j11J90m14
4865b30K30L5J71k73K59l91K63j76R5J15j48J29m85K83J04j20K20j15q1J63O2
4886A10m53J59J57P5M8J90k03p4k7J82l30K57J85j77o5J34j77k39M21o2K32l95
4908e2R0L9l12J93K16J35j60k46J39j67J31J09j78p2L46k73K33j06j08j45J84
$$ plain form
4929 -4 156 -2 117 67 169 -178 -12 78 -63 231 103 -100 -9 20 -98 217 112 -200 -86 -3 -13 -57 177
4952 177 -3 189 -68 243 122 9 -2 30 360 164 88 109 108 84 -204 -22 245 -152 10 -130 -1 -37 -59
4975 -59 -30 -63 -234 229 205 259 314 235 -41 192 55 21 -127 -57 279 -161 93 -197 88 57 24 110 85 -32
4999 -32 23 -84 -101 -27 153 -148 19 29 259 -53 -184 -14 -234 -57 -133 86 -42 -402 59 -61 394 -8
5021 -8 31 -50 -42 -108 74 -26 -20 -143 -75 83 -368 32 -37 -54 -56 291 -117 -160 -65 271 -188 255 -113 -134 163 307
5047 307 -63 73 109 -104 122 255 -261 120 -190 -24 90 -174 -54 -190 -72 176 -66 4 226 -141 193
5068 193 20 295 -258 -107 -229 93 153 380 -104 -181 -69 -100 164 58 219 135 -71 -10 310 356 -128 -106
5090 -106 361 -268 73 114 -278 -201 -15 -102 85 -96 18 138 15 -162 2 -385 44 -73 7 16 -141 160
$$ packed form
4929dJ60j58J19n0J02l47J66R0j41K94j28k03R1K9j18L15j05l12J14Q3j0m4K34
4952A77j80J92k57L11j21j13j1L2L30j96p6K1jk4k88J82K67l97J62j40J29l6k2
4975e9K9l3j71M63k4N4N5p9k76K33j37l4j48P0L36m40K54k90K85l1l3Q6k5j17
4999c2N5j07j7P4J80l01J67J0K30l12j31J70k20J77p6K19j28l60M61j20M55m02
5021hL9q1Qo6J82j00Oj23O8J58m51M00o9j7kL47m08m3R5L36m59M43l68k1K97J44
5047C07l70J36L6k13K26J33n16L81l10J66J14k64J20j36J18K48k42P0K22l67L34
5068A93j73K75n53J51j22L22O0K27m84p7J12l1K64j06J61q4k06O1L20M6m84K2
5090a06M67o29L41M1l92P7J86q7J87j81J14J20j23j77J64l87M29j17Q0Rj57L01
$$ plain form
5112 160 -3 -216 47 287 -129 -6 -129 -45 138 -240 10 277 -27 -62 36 172 95 84 123 -135 48 60
5134 60 -198 0 -86 138 -287 122 -243 -119 83 -126 -123 -156 -3 65 174 -145 97 171 86 -5 254 -55 62
5157 62 260 -56 19 69 -88 181 -53 -35 -92 97 -35 310 15 -25 27 174 286 -206 -49 -102 -161 -202 -64
5180 -64 210 -10 69 46 -122 50 -23 -168 -128 14 -138 98 -9 -55 -64 138 -48 7 38 -17 85 173 -7 -21
5204 -21 -64 -3 111 92 -40 24 78 179 -158 118 -4 -35 144 20 -182 -79 -275 -100 -178 -177 49 -133 -44 -118
5228 -118 -224 45 -106 -221 81 53 154 -321 129 199 -190 12 -134 318 156 259 102 -130 -68 38 281
5249 281 -177 -120 205 41 -232 -26 48 -103 8 -12 231 103 75 -60 216 -14 -180 -168 45 -39 180 -223
5271 -223 21 110 -106 17 228 -14 -54 -25 -94 -41 29 -101 174 -158 61 -138 -205 12 -12 153 268 20 220
$$ packed form
5112A60j63k13K63K40m16J23j23Q4J83l78K50K67l04l5R8J36p7j1L9k58J83J2
5134F0k58J98q6K24m25M09l65J24K02k09Ll3J53O8J09l19K42P4q5r1K59l09J17
5157F2J98l16P5N0j57K69k34J8n7J89j32L45k95m0N2J47J12m92J57n3n9m1J38
5180f4K74k20P9k3j68J72p3j45M0J42j52K36j07m6rK02j86N5L1n5J02Q8j80j4
5204b1m3O1J14j9j32O4N4J01l37K76j22l1J79j24k02J03j96J75p8JK26j82Q9p4
5228a18j06K69j51j15L02k8J01m75M50P0l89K02j46M52j62J03j57k32O2J06K43
5249B81m58N7L25j64k73K06P4j51J11k0K43j28k8j35K76k30j66J2K13q4K19m03
5271b23K44Q9k16J23K11k42m0K9o9N3P0j30K75l32K19j99o7K17k4J65J15k48K00
$$ plain form
5294 220 -100 -248 -166 90 127 10 270 -203 37 -210 -229 -104 -29 25 -41 8 -189 -267 -79 34 71 -136 -69
5317 -69 135 -187 -157 200 -272 14 10 -146 47 -56 60 97 -14 138 -132 -160 26 -63 57 -49 230 104
5339 104 58 135 -133 -74 -193 -71 -6 -312 94 79 49 -49 108 -246 -44 96 -143 -199 -41 -15 113 368 -32
5362 -32 -85 -50 404 180 0 294 -130 116 -166 -147 81 -77 281 -44 -149 62 18 -119 111 127 40 -98
5384 -98 134 96 -63 -220 -155 -131 -161 64 54 -144 -167 -149 121 -171 351 59 -32 -106 -108 54 -76 -220 94 -149
5408 -149 -272 -3 228 5 -286 -189 -82 58 -110 -178 -360 129 -2 -111 135 -201 206 12 -87 -36 164
5429 164 71 -75 -12 30 57 -55 110 -201 -98 -521 142 -12 -216 -27 -23 5 52 -22 167 -60 -64 20 -71 -191
5453 -191 -109 -33 -185 -130 -40 70 -83 33 102 155 -21 68 76 292 409 119 127 64 -17 87 89 -177 108 149 -82
$$ packed form
5294B20l20j48Q2K56L7j17K60m73K40k47j9J25P5N4o6M9j97p8J88J13L7k07O7
5317f9K04l22L0L57m72K86mj56J93j03J16L7j11J52k70k8J86q9J20j06K79j26
5339A04m6P7k68N9j19J22O5l06M06j5l0r8J57l54K02J40k39n6J58K6J28K55m00
5362c2n3L5M54k24j80K94m24K46k82J9K28j58L58l25j05K11m4j37K30J6q7j38
5384i8K32l8j59j57O5K4l0K25j0j98k3J8K70k92N22k92r1p4kJ62j30j44L14k43
5408a49j23K69K31k23k91R7J07J40j68o8j82M89j31j09K46l36M07j94r9N1K00
5429A64r3j46O3M2K7j12J65l11J03m23O63j54k04J89MK8M7p4J89k27mQ4r1j20
5453a91Q2P6j52N5R0J10j53J16O9N3j76Q9QK16J17k90Qo3q1J04Kk66K85M1k31
$$ plain form
5478 -82 25 71 -55 80 179 -37 -32 100 -91 -205 -78 -52 223 237 56 -141 -270 133 141 -30 -150 -117 -128 -123
5502 -123 -85 72 269 -204 128 58 137 -415 -10 106 -58 0 7 76 7 -220 -33 -146 -15 -244 128 50 -2
5525 -2 79 -26 -171 33 63 -93 50 94 165 236 88 -23 -199 37 -236 -139 -128 -136 -96 -162 182 -104 162 28
5549 28 -107 -38 154 -123 153 -168 178 188 -71 -65 -162 -36 -144 -13 -8 58 180 3 100 -190 -55 48 -299
5572 -299 -131 54 120 -268 -88 -70 -60 171 70 -79 9 -122 -77 -139 -90 -8 29 -114 -105 35 16 55 -188 -22
5596 -22 73 -62 189 -122 51 58 21 33 116 69 -24 -157 -106 -356 126 -147 -191 220 -280 111 105 10 -1 -39 -100 47
5622 47 188 50 30 -25 77 -267 -84 -159 81 15 -275 -46 41 17 241 191 166 -78 68 -100 38 39 -170 69
5646 69 -127 206 -143 182 9 -261 9 70 -84 211 32 115 -172 28 -124 -353 -20 208 -213 -230 -147 34
$$ packed form
5478h2J07M6j26J35R9k16NJ32j91j14J27K6K75J4j81j97j29M03Qj71j20L3j1N
5502a23L8J57J97m73L32p0P9n52M05J16j64N8PO9o9k27J87j13J31k29L72p8n2
5525bQ1j05j45K04L0j56J43M4P1P1j48j11j76K36k73R7J1qM0o6L44k86K66j34
5549B8j35O9J92k77K76l21L46J0k59Or7J26j08J31NO6J22j77R7k90J35J03l47
5572b99J68J85O6l88J80J8J0K31j01j49Q8j31M5o2M9Q2L7j43RJ40j9L9k43J66
5596b2R5j35K51l11J73Pl7J2Q3m7r3j33N1k50M82k73m4M11n00L91or5j1l8o1J47
5622D7J41j38k0n5J02l44J83p5K40o6k90K29Q7k4K24n0k5k44J46j68J38Jk09K39
5646F9j96L33l49L25j73k70K70O1j54K95j79Q3k87K00j52k29L33K28m21j7Q3J81
$$ plain form
5668 34 313 -59 113 -35 183 204 -11 -70 93 317 -5 -151 49 -190 22 -36 45 -45 -322 102 16 -219
5690 -219 -173 166 302 -142 8 5 -10 148 77 -85 -106 -109 80 82 160 16 100 67 -181 -117 141 -281 -124 12 66
5715 66 127 66 24 55 40 14 247 176 204 -59 -97 -50 -318 95 -249 -249 118 -18 -193 5 1 -14 -147 -72 147 -156
5741 -156 -25 -71 171 167 88 209 311 -20 33 -132 -22 -9 -149 -100 -28 -153 17 161 -159 -102 -83 38 12 -57
5765 -57 -154 39 6 -304 -171 -127 -112 137 -235 -39 -37 -44 -70 234 91 12 76 45 50 164 268 -19 340 -66 40
5790 40 -184 147 99 30 -186 119 195 70 -97 160 -219 139 83 132 284 47 151 -51 5 -14 21 161 107
5813 107 64 -102 -60 67 -187 -15 -54 -158 26 -43 14 -223 -44 85 154 -55 61 51 108 282 -149 77 67
5836 67 -133 -16 255 129 102 22 -154 -342 157 -203 81 83 -8 297 455 34 228 -230 223 -76 -174 35
$$ packed form
5668C4K79l72J72j48K18K1k15n9J63K24l22j46K00k39K12n8Q1r0k77M24q6k35
5690b19M6L39J36m44J50lj5J58p1j62k1lJ89KP8j44Q4l3k48O4K58m22J57J36N4
5715F6O1o1m2L1j5k6K33p1K8k63l8M7k68M13l44%L67j36j75J98mj5j33P5K19l03
5741a56J31m6K42mp9J21J02l31N3j65J10J3j40M9P2j25J70J44l20N7J9J21k6o9
5765e7r7J93l3l10J33M4J5K49l72J96Kpk6L04j43p9O4l1NJ14J04k87L59m06J06
5790D0k24L31m8o9k16L05P6j25j67K57l79L58n6M9J52k37J04k02N6j9L5J40n4
5813A07m3j66M2J27k54J72l9j04J84o9N7k37J79J29O9k09J16j0N7J74m31K26j0
5836F7k00J17K71j26k7q0j76j88M99l60K84Kr1L05J58m21J94m58M53k99r8K09
$$ plain form
5858 35 12 37 -68 152 -103 -314 127 -25 -164 -172 -145 55 208 -48 -10 139 27 -268 -115 8 117 -244
5880 -244 32 285 252 79 -647 236 124 -54 -160 11 265 -239 134 151 -33 154 170 -98 90 -273 43
5901 43 258 -152 -47 -48 323 -68 -377 -156 -454 117 -221 -223 -18 45 168 -89 131 6 152 257 83 43
5923 43 -130 67 2 -231 -140 -52 -151 173 -77 -98 -250 13 -227 -108 -88 30 202 101 7 -249 -163 52 103
5946 103 35 -241 222 -125 58 -3 -131 -19 -111 288 29 164 -32 87 -131 90 -214 -162 190 188 226 295 -75
5969 -75 -146 -239 139 -195 -24 -35 -88 -116 82 46 168 -173 19 141 -80 224 -152 -76 2 -61 -1 -147 84 124
5993 124 223 0 100 -191 47 168 -68 123 45 108 -117 209 -264 100 210 8 70 -37 -130 23 5 -73
6015 -73 -119 189 -120 -60 103 -73 186 -92 -178 -373 -246 -41 -179 103 -20 -24 12 213 -28 -102 43 -24 -6
$$ packed form
5858C5k3K5j05K20k55k11M41j52j39qK7K00J53k56L8J49j12k95J53J23J09l61
5880b44K76K53l3j73p26Q83j12j78j06J71K54n04L73J7j84J87J6k68J88l63L16
5901D3K15m10J05jL71l91l09K21k98N71l38kK05O3J23k57K20j25J46J05j74m0
5923D3j73J97o5k33R1Q8r9L24k50k1j52K63k40J19K0J18J72j01r4k56Q6K15N1
5946A03o8k76M63l47J83o1j28J12r2L99k59J35j96J19k18K21l04N2L52kL8O9l70
5969g5p1r3L78l34J71j1n3k8J98l6J22l41J92J22k21L04l76P6P8o3O0j46K31M0
5993A24R9k23J00k91K38J21k36J91p8O3k25L26m73L64J10k02O2j07r3J53j8p8
6015g3m6L08l09O0J63j76K59k78q6j95J27K05j38K82j23mL6K01k41p4J45o7J8
$$ plain form
6038 -6 -220 -399 -18 -158 -44 166 12 -37 1 -19 171 84 -145 -18 -157 -16 124 -190 144 -152 189 51
6060 51 -73 372 -114 -164 80 23 -42 -141 -46 -77 -273 -200 -215 -164 -78 109 17 -230 167 -71 304 -114 -185 -20
6084 -20 61 221 96 -1 132 99 107 -33 242 177 38 241 -188 232 73 -63 -167 137 52 -83 -20 -109 -257
6107 -257 59 -76 -165 19 -65 50 -81 -34 -122 249 176 254 268 178 12 -102 9 56 -140 -133 60 56 -171 -260 -93
6132 -93 -159 -198 178 -104 -61 5 -43 -39 103 144 -14 54 122 259 -261 15 -20 -88 151 288 -104 -3 -273 25
6156 25 -224 93 256 -227 -14 -70 -110 105 -14 68 -41 -8 -124 178 153 143 123 -126 -135 -40 -9 28 -172 6
6180 6 59 290 25 -153 50 52 -143 148 -217 172 300 -111 -73 121 -332 71 134 -181 24 -77 -7 -349 40
6203 40 319 -312 -135 -46 -125 -53 -18 -42 -29 86 37 54 -56 44 117 -111 -114 101 -133 187 1 91 182 128 28
$$ packed form
6038fk14j79L81j40J14K10j54m9L8k0J90q7k29J27j39J41J40l14L34k96L41j38
6060E1j24M45m86n0K44n7o5r9R5l1j96P3j5N1Q6J87r2k47L97k38L75m18p1J65
6084b0Q1J60j25r7J33l3Qj40K75o5j39K03m29M20j59j36j04L04q5j35O3q9j48
6107b57L16j35q9J84q4J15j31M7q8L71p3P8J4r0j66j14J11M7j96PJ93mk27q9J67
6132i3o6l9L76k82M3O6m8MJ42M1j58O8O8J37n20K76l5o8K39J37l92J01k70K98
6156B5k49L17J63m83K13n6m0K15j19Q2j09L3j16L02k5j0k0k49rR5L1L7k00J78
6180FN3K31k65j78K03Kj95K91l65L89J28m11L8J94m53M03O3l15K05j01P0l42L89
6203D0K79o31J77Q9p9P2L5k4J3J15m9J7j10J00P3k28lK15k34L20j86R0R1n4j00
$$ plain form
6228 28 111 67 -95 -118 40 175 364 131 -113 177 -110 -182 -249 173 6 180 -361 44 47 32 173 18 70
6251 70 -132 -133 95 -147 10 -20 63 291 -143 336 -275 -138 160 58 -143 -45 -106 -64 -16 -76 -78 -37 -144 320
6275 320 -69 22 -52 -119 -16 81 1 -269 256 -24 -158 -160 -12 -33 62 102 -21 38 269 12 -23 48 58 16 -73
6300 -73 25 17 27 154 -7 36 136 -27 -197 -169 -64 1 -133 -50 173 -10 -136 15 267 35 116 -3 78 110
6324 110 -119 109 26 36 -152 -168 -11 -364 -108 -156 -305 -189 18 -273 35 251 -179 37 100 141 168 33
6346 33 52 183 -97 4 337 -64 256 11 90 -85 -123 325 -181 109 -74 -147 -315 -281 36 255 -280 -40
6368 -40 55 -82 -112 13 153 70 -57 -51 -3 -168 135 -38 152 -123 179 1 82 295 -265 226 121 37 -58
6391 -58 -38 55 72 73 -45 -118 118 177 -72 130 -154 -81 111 89 -293 -239 148 153 -96 46 -47 -82 197 123 27 108
$$ packed form
6228B8Q3m4j62k3J58J35J89k33k44K90k87p2o7M22j67J74n41M05Lj5J41j55N2
6251G0k02jK28k42J57l0Q3K28m34M79o11J37K98j02k01R8o1M2M8o0kM1j07M64
6275C20l89R1p4o7J03R7q0k70N25k80j34kJ48k1R5M0j23N9K31k57l5P1J0m2q9
6300g3R8qJ0J27j61M3J00j63j70K8J05O5j34Q3K23j83j26J51K52k32Q1j19Q1L2
6324A10k29K28q3J0j88j6J57l53K56m8j49J16K07k91L08K16m30K16O3M1K7j35
6346C3J9J31k80J01L33m01L20k45P9j75l8M48n06K90j83p3j68L4L17K19n35K40
6368d0R5j37l0J25J40q3j27OM8j65L03j73J90k75L02j78Q1K13n60M91j05q4r5
6391e8K0R3J7Jj18p3K36N9k49K02k84P3J92k2l82N4L87Nk49J42r3l5K79p4r6Q1
$$ plain form
6417 108 -249 -76 -131 42 -111 -125 93 13 51 111 204 109 -202 290 -77 -88 -318 55 87 -11 70 170 -49 -97
6441 -97 93 85 -170 -271 427 -103 -81 -86 -332 -529 253 -75 134 69 -98 20 63 241 -43 -27 81 -135 42
6464 42 173 102 -123 -67 -43 315 40 41 -11 112 4 259 60 -50 170 -136 107 129 54 30 -70 -6 60 95
6488 95 100 -129 14 36 -79 77 -17 -125 -103 47 -257 -104 -139 -145 -16 155 -49 142 130 183 -46 48 -36 -75 -6
6513 -6 -203 77 -254 100 -145 -269 347 -131 -64 51 51 -214 22 184 -110 95 -201 39 -240 -296 312 227
6535 227 -34 -111 -101 22 -72 -138 195 15 -15 167 -44 -4 -252 -44 164 -66 190 124 39 -27 -161 1 -75
6558 -75 -125 8 -114 5 -96 -156 195 183 160 22 132 -42 -14 -72 -85 -222 -242 28 -43 -89 205 -124 -244 -257
6582 -257 139 34 -169 -102 30 -97 19 76 19 -188 176 -120 104 89 -133 -99 -109 296 203 224 81 121 95
$$ packed form
6417A08l57J73n5J73j53j4K18q0L8O0R3r5l11M92l67j1k30L73L2r8Q1J00k19m8
6441i7J90qk55j01O98n30K2nk46j97P82l28K09o5j67J18M3J78k84J6J08k16J77
6464D2J31p1k25N6K4L58k75Jn2J23j08K55j99j10K20l06K43K2p5k4j00O4O6L5
6488I5Nk29J43K2j15J56r4j08K2J50l04J53l5oJ29J71k04J91j2N3k29R4q4l9O9
6513fj97K80l31L54k45j24O16m78O7J15%k65K36J62k94K05k96K40k79n6O08q5
6535B27k61p7J0J23r4o6L33j80l0J82k11M0k48K08K08k30K56o6q5o6j34J62p6
6558g5n0J33j22J19j01o0L51j2k3j38J10j74K8n8j3j37k0K70p1m6K94l29j20j3
6582b57L96j05k03O7J32j27J16N7n7k07L64k96K24j5k22L4j0M05r3K1j43M0k6
$$ plain form
6605 95 101 3 214 65 82 -112 68 -95 19 -126 95 -126 168 -104 -69 -93 51 42 -55 158 -67 -148 105 119
6629 119 251 154 -41 122 -127 283 -45 136 260 132 -75 -116 -87 83 -102 164 237 56 138 -30 26 -73
6651 -73 -47 -110 265 11 -91 -92 81 147 -135 -80 179 -49 128 -68 -331 -459 -291 -126 -41 73 -136 67 -136
6674 -136 3 -69 -114 -105 -14 138 -55 6 -113 -125 167 -12 -118 -32 292 5 -37 41 41 -14 -290 2 -56 28 251
6699 251 10 -14 -225 90 54 62 -3 20 101 250 317 305 73 -252 -156 -87 -361 285 -209 3 -77 47 -65 528
6723 528 69 23 -77 -212 15 37 185 51 -99 10 144 24 -97 -168 -98 -50 142 254 133 97 5 31 -159
6746 -159 22 26 97 40 -323 15 174 -185 -98 43 -180 153 221 81 -84 155 121 180 170 -71 -306 -95 -54
6769 -54 -48 200 -283 -14 314 -102 -116 228 210 -58 -219 -49 16 -14 114 189 103 352 27 -10 39 -230 -31 -134
$$ packed form
6605I5Or8K11j49J7j94J80j63J14j45K21k21K94k72L5k4J44rr7K13k25q1K53J4
6629A19J32r7j95J63k49M10l28J81J24j28k07m1K9J70j85K66P3j81Q2j68N6r9
6651g3K6o3L75k54j02jJ73O6k82N5K59k28J77j96k63j28J68J65Q5J14k09K03k03
6674a36J39p2m5RR1J52j93O1j19j2K92j79j06Q6L24k87m2P8%n5k76K92n8Q4K23
6699B51k41k4k11L15l6Qo5K3Q1J49O7j2k32l25R6O9k74O46m94K12q0J24j12N93
6723E28m59m6j00j35K27K2J48j34j50J09J34j20j21p1P0M8J92J12j21l6r2K6j90
6746a59J81MP1n7l63L38J59l59Q7J41k23L33O8j40j65K39l4N9j0k41k35K11M1
6769e4OK48m83K69L28m16j4L44j8k68j61J70O5l0J28P5q6K49l25l7M9k69J99j03
$$ plain form
6793 -134 126 -81 243 92 -108 -159 116 241 17 -224 -33 313 -54 -165 287 42 -107 -243 13 -38 -132
6814 -132 -185 88 -19 -42 -109 -44 -330 104 -44 -112 -279 22 -310 -104 144 -36 -204 -150 -238 131 81 -209 26
6837 26 -157 -84 43 -108 -155 -308 34 -80 -153 76 106 -241 220 41 112 69 -103 120 82 -90 214 -60 -98
6860 -98 -22 -65 -106 -77 -1 56 76 -191 172 -90 -211 7 -183 98 190 -250 72 -93 141 51 37 -82 179 62
6884 62 -142 51 139 113 94 -121 -66 -61 -177 58 189 81 130 -216 -334 -197 -225 -181 0 28 -225 -52 23 -258
6908 -258 5 15 50 -377 242 70 184 -102 7 13 192 10 -123 30 175 247 218 -216 -172 76 6 -92 -72
6931 -72 -221 45 314 -23 25 -185 -39 -125 161 155 224 -31 -88 -38 -48 -367 -115 88 0 -61 13 -74 34 -146
6955 -146 20 63 143 349 -15 99 124 1 -118 140 -24 27 117 -26 147 88 -161 71 72 -54 -90 146 31
$$ packed form
6793a34K60k07L24j51k00n1K75J25k24k41J91L46l67j11M52k45j49j36K56n1r4
6814a32n3K73j07k3o7O5k86M34j48o8j67L01l32K06K48j80j68N4q8L69n0k90K35
6837B6j83P3J27j51m7j53L42j14p3K29L0l47M61j79P1m3j72K23l8j72L04k74l8
6860i8P6m3m1K9P6N7K0k67L63k62j21K18j90K81R2m40L22j65K34r0j4j19K61j17
6884F2k04J93Q8k6j9k15N5Nj16K35J31j08M9l46j18J37k8M4J81K8k53J73P5k81
6908b58K63J0L5m27O19j72J14k86J09OJ79j82j33J53J45P2k9m34M4K48p0r8K0
6931g2j49K66K69l37M8k10J46q6K86oO9k55n7N0j0l19K52K03q8o1P4q7J08j80
6955a46J66M3Q0K06l64J14K5j23j19K58j64N1R0j43J73n9k49K32Jj26l6K36j15
$$ plain form
6978 31 203 76 -93 -69 -70 37 104 -5 254 165 83 -24 -230 -22 81 23 -80 42 -45 105 -188 -25 287
7001 287 290 18 -350 200 239 -114 148 -85 -66 133 -55 244 7 -21 -71 43 71 114 66 55 -21 -11 277 -74
7025 -74 -108 198 59 10 -72 -268 -18 -81 88 -138 22 37 -101 11 90 86 326 142 -156 -207 21 -195 50
7048 50 -257 39 130 -339 81 81 167 75 83 -19 165 238 -5 203 -110 115 148 154 -103 10 66 -75 183 171 165
7073 165 77 -178 45 -81 250 -199 -36 -214 -363 -77 48 -134 73 111 -82 58 135 -86 123 49 124 76
7095 76 -13 108 -117 19 -163 92 -148 16 26 94 -14 148 262 93 57 147 15 250 123 125 229 -5 87
7118 87 -76 -114 154 2 -80 -43 -152 14 -56 -44 121 -234 -230 -129 55 204 -116 -65 98 22 113 -120 -100 111
7142 111 79 -64 -86 -97 -34 -69 -175 170 51 48 -27 -134 171 125 -67 18 -294 172 153 30 -15 108 202 -29
$$ packed form
6978C1J72j27j69K4jJ07O7j09K59q9q2j07k06K08J03n8j03J22q7J50k93J63L12
7001B87Lk72l68N50L9l53K62k33J9J99j88K99k37k8n0J14K8M3m8j1p6J0K88l51
7025g4l4L06j39m9q2j96K50o3J69k26J60J5j38J12P9mK40j84k98n1K28k16K45
7048E0l07K96R1m69M20%Q6r2Qj02J84P3k43K08l13K25L3Ok57J13N6j41K58j2o
7073A65q8k55K23j26L31m49J63j78j49K86J25j82K07L8j93J40P7k21K09p4P5m8
7095G6q9J21k25J36j82K55k40J64J0O8j08J62J14j69l6R0j32K35j27KJ04k34R2
7118H7j63l8K68j52q2L7j09J66p0J2J65l55MJ01J84J49l20N1J63p6R1k33K0K11
7142A11l2j43k2j1O3l5j06L45j19lp5j07L05m6j92Q5l12M66j9j23m5J23R4k31
$$ plain form
7166 -29 -192 -79 215 5 -146 -107 116 -104 267 -127 -95 -150 -54 72 -90 -176 -157 232 60 34 309 -31 184
7189 184 -78 229 58 -139 -38 82 -87 -46 138 213 -75 -188 -191 161 -2 79 52 -31 -89 -125 -186 -114 -127 -80
7213 -80 -140 157 22 -107 -306 16 -144 -14 -129 117 49 32 -22 -159 -122 -65 -90 170 4 255 138 -58 -101
7236 -101 -197 -184 51 170 -33 -36 -60 2 166 128 14 105 4 -138 -154 32 144 65 -80 -69 -256 -164 63 126
7260 126 112 72 165 92 312 200 168 -104 -230 -119 22 115 -18 -214 -6 123 166 261 7 35 -395 -212 -376
7283 -376 181 60 -180 146 194 61 9 -23 89 100 -90 -81 -60 115 -232 412 30 -9 8 -97 258 -96 44
7306 44 -153 94 -101 -107 -140 -94 95 132 -222 15 45 171 -56 -249 10 -90 105 -1 58 -174 102 -22 235
7329 235 75 170 12 20 30 -14 10 -199 -142 -21 48 398 205 59 -88 -86 -122 -206 151 252 88 171 -64 -182
$$ packed form
7166b9j63J13K94k10j51L9K23k20L71l94L2n5R6J26j62q6J9L89j72k6K75l40K15
7189A84k62L07j71j97J01J20j69M1J84P5k88j13lL52j63Q1k7q3n8l6o1P2j3M7
7213h0o0K97j35j29j99L22j60J30j15K46o8j7n4j37L7N7k5K60j66K51j17j96m3
7236a01r6J3K35J19k03lk4O2J64l8j14R1j01j42j6J86J12p9j45J1j87R2K27O3
7260A26j4m0R3p3K20j12l2k72j26J11J41R3j33j96K08J29M3R5k54K8m30J83j64
7283c76N57j21k40L26M8j33n2l2J12J1j90RK1J75l47O44l82l9J7j05L55l54J40
7306D4j97K47j95ol3M6J89L7l54K37L0J26k27j93K59j00J95j06N9k32K76j24K57
7329B35j60R5j58QJ0m4K4k09N7J21O9L50j93j46j47Kl6q4L57J01j64Q3k35j18
$$ plain form
7353 -182 -17 186 33 -128 -296 93 82 57 209 -81 92 136 -246 23 164 136 58 70 65 -20 19 -94 -31 -174
7377 -174 -61 -105 79 113 45 -80 -61 79 181 -43 -225 374 305 95 80 -91 166 93 -127 111 -187 -354
7399 -354 -49 -214 -119 -113 99 139 182 -38 76 -174 -11 199 158 168 -268 -137 -177 -54 -26 268 -25 33 155
7422 155 -160 166 -236 -27 11 198 47 -202 143 -53 -192 -62 305 -45 59 -58 120 132 95 -48 171
7443 171 32 181 98 -125 73 156 -78 -226 39 43 -10 -31 143 215 236 -227 212 -111 67 -42 15 -140 190
7466 190 181 -61 119 -225 26 -42 -254 -9 -142 137 161 -269 21 -91 -96 -3 37 -35 -38 92 215 -170 -78 82
7490 82 92 61 112 -66 -194 -18 128 50 -51 312 -43 -235 -166 76 14 103 -236 278 112 -49 166 -256 179
7513 179 -12 -12 246 44 -133 -125 -31 -194 115 40 72 24 54 162 80 150 -4 -220 -341 10 182 -41 106 307
$$ packed form
7353a82J65K03j53j61j68L89j1k5J52k90J73M4l82K69J41k8p8J2nq5L9j13O3j43
7377a74J13m4J84L4o8j25J9J40J02k24j82N99o9k10j5j71K57p3k20K38k98j67
7399c54L05j65R5OK12M0M3k20J14k50J63K10m1J0m36J31m0J23K8K94k93N8J22
7422A55l15L26m02K09L8J87j51k49L45j96j39J30L67l50J04j17J78J2l7j43K19
7443A71j39J49q3k23J98Q3k34j48K65Mn3k1J74P2K1m63M39l23J78j09N7j55L30
7466A90rk42J80l44K51o8k12K45j33K79K4m30K90j12nR3M0p2lJ30J23l85R2J60
7490H2J0l1N1j78j28J76J46p8j01L63l55j92O9K42o2Q9l39N14j66j61K15m22M35
7513A79j91%K58k02j77QR4j63L09p5L2m8L0J08q2P0j54k16j21L51J72k23J47K01
$$ plain form
7537 307 76 -91 40 140 128 -210 88 38 -56 176 -92 -53 12 40 -42 97 184 122 265 21 53 -109 83
7560 83 7 -171 -115 39 220 -271 235 355 158 183 -72 17 124 63 190 27 149 -185 169 -144 -199 -420
7582 -420 159 176 153 4 403 359 -116 173 -232 133 9 -87 -221 177 -106 113 -48 385 -27 -148 151
7603 151 -15 -15 137 -90 71 221 110 -72 -121 23 -39 -241 -54 118 -94 168 -221 -34 -162 10 80 50
7625 50 -128 -132 67 81 20 80 22 30 107 -141 28 -11 -94 -36 -4 -140 145 23 9 -306 227 370 -163 -65 -134 -171
7651 -171 41 221 69 152 -133 269 -193 94 255 205 44 95 -83 148 -59 -156 -93 -175 -73 -122 -84 60 224
7674 224 -143 -11 -16 94 117 -3 -100 -123 -46 -221 -309 -187 33 -100 -333 101 -87 -13 -91 20 23 -19 332 122
7698 122 97 -149 144 254 -25 -30 61 -31 79 -82 151 65 253 14 -147 100 99 251 -51 -182 81 -43 66
$$ packed form
7537C07k31j67J31J00j2l38K98n0r4K32k68L9O5K8q2J39Q7o2J43k44L2j62J92
7560H3p6j78N6J54J81m91N06J20j97K5k55Q9J07o1J27j63J22l34L54l13n5k21
7582d20N79J7k3j49L99m4m75K89m05L65j24r6j34L98k83K19j61M33m12j21K99
7603A51j66%J52k27J61J50j11j82m9J44o2k02J87J72k12K62l89J87j28J72P0l0
7625E0j78mJ99J4o1O0n8QP7k48J69l9q3N8L2j36K85j22j4l15N33J43n33R8o9l7
7651a71K12J80j52Q3k85M02m62K87J61n0j61N1j78K31k07r7O3q2J02m9L8J44J64
7674B24l67J32nJ10K3j20r7k3P7j75q8J22K20j33k33M34j88P4p8J11Lm2L51k10
7698A22k5k46K93J10k79nR1r2J10j61K33q6J88k39j61K47jJ52l02j31K63j24J09
$$ plain form
7721 66 300 -109 46 106 15 -89 -32 -298 -36 -173 200 99 193 -142 57 -90 -126 43 -111 -182 46 121 85
7744 85 67 -21 135 72 183 14 136 31 -83 -110 188 -90 358 -263 43 124 -194 90 47 -243 63 9 -81
7767 -81 13 -12 -62 306 -10 70 49 155 203 -39 -230 -154 113 -37 126 51 68 135 -51 360 257 69 95 156
7791 156 96 18 57 -120 -61 72 136 -157 68 -8 127 35 -31 -186 -45 -192 -133 253 125 92 -33 -25 -48 37 -82
7816 -82 -137 -30 49 62 -219 -107 216 147 -102 -58 138 -196 -90 -12 -43 -53 50 136 19 83 41 -105 79 2
7840 2 -23 -102 -157 88 170 -189 94 -350 -355 38 -113 -125 -22 60 66 29 186 -196 -72 -158 126 -104 -17 79 190
7865 190 -67 121 -116 -82 214 -103 -145 32 279 36 60 -105 -85 80 84 152 180 76 51 287 -176 -60 211
7888 211 62 -92 -25 -61 -107 -125 -305 114 -137 -42 -52 64 -91 69 -170 -15 255 161 127 158 275 130 47
$$ packed form
7721F6K34m09J55O0r1j04N7k66K62j37L73j01R4l35J99j47l6J69j54p1K28P5l6
7744H5j8q8J56o3J11j69J22j05j14k7K98k78M48o21L06Q1l18K84m3k90L06n4r0
7767h1R4k5n0L68l16Q0k1J06M8k42j91P6K67j50J63p5J7O7j86M11j03j88K6O1
7791A56o0p8L9j77N9J33O4k93K25p6J35r2o6j55J41j47N9L86j28l3j25Qk3Q5j19
7816h2n5J07P9J3k81J12L23o9k49M4J96l34J06P8l1j0J03Q6j17O4m2j46J84p7
7840Bk5p9n5K45Q2l59K83m44nL93j51j2J03Q2Ol7J57l82J24q6K84k30Q7R6J11
7865A90k57J88k37L4K96l17m2J77K47k43K4j65K0J65MO8K8j04k5K36m63J16K71
7888B11j49j54O7l6m6j8j80M19k51R5j0J16j55J60k39J55K70r4l4L1J17j45q3
$$ plain form
7911 47 146 -23 -91 186 -507 -37 -206 43 -115 -62 -67 79 -133 42 -43 16 71 -73 -14 -71 -121 218 13 64
7935 64 -265 -97 -245 51 -244 -252 -22 143 -179 112 149 202 -19 -339 -33 104 296 125 212 -143 -140 -58 -30
7958 -30 -1 237 -212 -26 -115 27 -170 -107 -154 238 77 -175 -93 -20 78 -22 -31 24 -23 32 -90 44 -325 -13
7982 -13 -240 47 100 -194 22 45 137 -84 14 409 -102 131 194 -20 -9 106 -55 39 232 1 -32 221 -367
8005 -367 230 -38 -223 33 95 87 205 88 161 -22 -36 225 -32 249 130 117 144 -95 -23 128 45 -84 -43
8028 -43 178 173 70 136 -37 67 128 -64 114 -70 -77 -137 290 -28 166 -111 -93 -216 -33 47 -43 -207 -187 -99
8052 -99 145 61 9 17 60 26 -136 73 110 175 3 22 -277 25 103 -132 254 155 38 -179 -2 -22 67 52 88
8077 88 -299 193 -78 -117 -94 95 12 -111 -24 3 -83 -15 118 190 115 -110 47 26 32 139 -281 46 56 -198 -96
$$ packed form
7911D7R9j69o8K77o93M70j69K49j58N3nJ46k12J75q5N9N5j44N9n7n0L39k05N1
7935F4l29J68j48K96k95qK30J65l22K91L7N3k21l20L06J37J92j71Q7l55LQ2K8
7958c0K9K38m49J86q9J42j97O3m7L92j61k52Q2P3R8j00rN5m7N5j22J34l69L12
7982a3k27K87N3k94K16K3R2k21R8L95n11K33O3k14J1J15j61R4J93k31l3K53n88
8005c67N97k68j85K56O2qJ18j17P3j83j4K61k57K81j19j3K7k39P2J51q3j29M1
8028d3K21nj03O6j73J04O1j92J78j84po0M27l18J94k77J8j23J83Q0r0j64K0Q8
8052i9K44q4n2QM3l4j62K09L7O5j72J9k99L02P8k35L86r9j17k17J77k0Q9j5L6
8077H8l87M92k71l9K3J89q3j23Q7K7q6O8J33P2p5k25J57k1OJ07m20L27J0k54J02
$$ plain form
8102 -96 -62 -64 -91 366 112 299 -68 79 -147 -129 -81 38 -209 -63 -3 201 96 -144 79 -70 218 -171 241
8125 241 -81 -100 61 102 91 -43 93 -90 8 76 109 -42 -96 -59 153 -47 -58 -146 -11 -178 26 -130 33
8148 33 242 -136 164 -65 -229 -196 -143 -87 174 -82 -25 163 -28 -191 171 179 -140 -231 2 197 -125 4 -181
8171 -181 -115 -128 95 91 -140 -107 -30 87 -99 39 -45 -86 -88 -140 -132 -58 6 -41 -36 24
$$ packed form
8102i6L4kk7M57k54J87l67J47k26J8M8J19k47J46O0K04j05k40K23j49K88l89M12
8125B41l22j9J61M1j1j34J36j83R8O8L3j51n4L7K12k00j1q8J35j67K04j56J63
8148C3K09l78L00k29j64L3N3N6K61k56N7J88j91j63L62Ql19r1K33J95l22J29j85
8171a81O6j3K23mk31L3P7J17j86J38q4m1kn2QP4O4m7NO0
8191B4
$$ Imaginary data points
##PAGE= N=2
##DATA TABLE= (X++(I..I)), XYDATA
$$ plain form
0 0 0 0 0 0 0 0 0 0 0 0 0 0 0 0 0 -2 8 -8 8 -8 8 -16 16 -16 24 -24 32 -32 40 -44 48 -56 64 -72 82 -95 104
37 104 -119 132 -147 165 -183 202 -223 247 -273 302 -333 368 -404 446 -492 542 -598 661 -731
56 -731 812 -903 1011 -1136 1288 -1472 1705 -2009 2421 -3017 3966 -5693 9904 -47514 -6709
71 -6709 67478 -26090 -48844 17239 30132 -20271 -5246 15464 724 -353 17477 666 -6238
84 -6238 10137 7323 -7221 2316 517 -11708 -2069 6000 -13067 -11041 7387 -3220 -15194 7467
98 7467 12322 -11701 -6444 20194 9671 -9795 1528 14125 4144 -2353 -46 -695 -651 611 -4258
113 -4258 -8501 -4518 -312 -1674 -5797 -5830 211 4592 580 -1145 3839 4786 4177 6597 1627 -3103
129 -3103 7804 9430 -10224 -9059 12332 2546 -20724 -5126 12814 -7023 -16565 3925 6471
$$ packed form
0@%%%%%%%%%%%%%%%kJ0j6J6j6J6k4L2l2M0m8N6o4P2q4R2j04J20j36J54j77J99
37A04k23K51k79L12l48L85m25M70n20N75o35P01p72Q50r38J034j140J259j392
56g31J543j715J914k147K424k760L177l714M430n438O983r659J5597n7418M0805
71f709P4187r3568k2754O6083J2893n0403J5025K0710j4740j077J7830j6811o904
84f238J6375k814j4544R537j799j2225R639Q069j9067K026J8428j0607j1974K2661
98G467M855k4023N257K6638j0523j9466J1323J2597r981o497K307o49M4J262m869
113d258m243L983M206j362m123l3O041M381m012j725M984R47o09K420m970m730
129c103J0907J626j9654J165K1391r786k3270J5598J7940j9837r542K0490K546
$$ plain form
142 6471 -6695 -504 5382 -1082 4918 9823 -3642 -1315 14431 2991 -11100 6181 9226 -12979
156 -12979 -6861 11289 -5953 -17531 5120 6234 -14664 -4110 11553 -3725 -7480 10904 5673
169 5673 -6897 6673 11931 -4532 -1709 10678 -945 -7231 5432 995 -11567 -1413 5096
182 5096 -9447 -8427 5418 -478 -7900 1979 5189 -1983 2701 6742 -780 912 9203 2401 -4815
197 -4815 3459 4875 -4447 -3963 801 -3453 -4706 -286 -3622 -6674 577 3509 -3238 -3789 4526 5704
213 5704 84 -458 5055 6316 222 -1886 4354 3927 -4893 -4201 3456 -931 -8514 -2615 1755 -4906
229 -4906 -4107 2417 -2010 -3908 5482 5570 -3666 246 8825 4231 -1501 2105 2099 769 2321 -1203 -6488
246 -6488 -744 3089 -5217 -6983 37 -1050 -3398 1892 -159 -5125 3918 8815 -2369 -2952 9496
$$ packed form
142F471j3166O191N886o464O000M905j3465K327J5746j1440j4091J7281L045k2205
156a2979O118J8150j7242j1578K2651J114k0898J0554J5663j5278l755J8384n231
169E673j2570J3570N258j6463K823J2387j1623o286J2663m437j2562J0154O509
182E096j4543J020J3845n896p422R879L210p172M684M041p522J692Q291o802p216
197d815Q274J416r322M84M764m254j253M420l336l052P251K932o747n51Q315J178
213E704n620n42N513J261o094k108O240m27q820O92P657m387p583N899M370o661
229d906P99O524m427j898R390Q8r236L912Q579m594n732L606oj330J552l524n285
246f488N744L833q306j766P020j087k348N290k051m966R043M897j1184n83J2448
$$ plain form
261 9496 5690 -5633 1813 8080 -3326 -5867 4364 1372 -7911 -3072 1662 -4633 -4180 1271 -1614
276 -1614 -4347 2538 5029 -596 -1538 3962 6068 3246 -970 -876 4336 4722 -2794 -5168 706 820
292 820 -3751 -3168 -1764 -4285 -1500 2812 -1811 -5413 2646 6817 312 -2428 4243 6132 1016 -186
308 -186 2457 2426 -1082 -2293 301 487 -3876 -5238 -638 313 -3079 -3226 -252 432 703 1869 479
325 479 -459 4825 6124 -718 -2431 4321 5015 -1894 -3230 445 -158 -2575 -2050 -2382 -3494 -1535 -223
342 -223 -1805 -2188 726 1810 820 1738 2746 1701 1268 3656 3095 -566 -1142 1682 1204 -2735 -3333
359 -3333 -881 -1349 -2904 -2669 -1327 -785 -1074 -335 734 1536 1153 1499 2980 2975 977 309 2790 2150
377 2150 -1112 -1202 548 -1642 -3053 -1219 -1438 -4127 -1818 1415 -1188 -3010 1405 3601 -363 -751
$$ packed form
261I496l806j1323P446O267j1406k541J0231k992r283M839M734o295M53N451k885
276a614k733O885K491n625r42N500K106k822m216R4N212L86p516k374N874J14
292H20m571N83J404k521K785M312m623l602Q059M171o505k740O671J889n116j202
308a86K643l1l508j211K594J86m363j362M600R51l392j47K974O84K71J166j390
325D79r38N284J299o842j713O752O94o909j336L675o03k417N25l32j112J959J312
342b23j582l83K914J084r90R18J008j045m33K388n61l661n76K824m78l939n98
359c333K452m68j555K35J342N42k89P39J069Q02l83L46J481nj998o68K481o40
377B150l262r0J750k190j411J834k19k689K309L233k603j822M415K196l964l88
$$ plain form
393 -751 3917 4012 373 906 3214 987 -852 588 653 -2420 -2968 -538 -1378 -3269 -2647 -868 -423 -1298
411 -1298 -606 745 1996 1953 1028 1684 3146 2318 398 1507 1160 -1013 -718 1090 -2637 -4611 -166
428 -166 645 -4906 -3465 2571 -62 -3613 1532 3905 -1710 474 6071 1658 -2424 3837 4597 -2480
444 -2480 -1361 3703 -1458 -4881 788 718 -5401 -3385 1365 -1559 -2796 348 -252 -770 3621 2787
460 2787 -1817 1659 5781 1265 -1636 2237 1097 -1299 1260 -344 -5445 -1211 3263 -3485 -6912
475 -6912 1564 2489 -4461 -1481 4526 464 -1620 4022 4346 -1201 162 4364 1565 -1354 909 311
491 311 -2523 -1115 403 -2159 -4348 -1642 861 -759 -2923 -966 1836 1040 770 1040 1229 1610 3472
508 3472 2119 -1033 -183 2617 796 -2040 -1368 -1357 -1658 -198 -1897 -4620 -1132 2415 -1791 -3027
$$ packed form
393g51M668R5l639N33K308k227j839J440O5l073n48K430q40j891O22J779M45q75
411a298O92J351J251m3r25O56J462q28j920J109l47k173K95J808l727j974M445
428a66Q11n551J441O036k633l551N145K373n615K184N597m413m082O261P60p077
444b480J119N064n161l423N669p0o119K016M750k924j237L144o00n18M391q34
460B787m604L476M122m516k901L873j140k396K559j604n101M234M474o748l427
475f912Q476R25o950K980O007m062k084N642L24n547J363M202k799k919K263n98
491C11k834J408J518k562k189K706K503j620k164J957K802p96k70K70J89L81J862
508C472j353l152Q50K800j821k836O72J1l01J460j699k723L488L547m206j236
$$ plain form
524 -3027 2844 2620 -1781 2295 5161 -1404 -679 6480 2045 -4788 1386 4245 -4476 -3449 3522 -2210
540 -2210 -7577 1232 3207 -5915 -3183 4517 -218 -2761 3910 2948 -2273 2603 5379 -1515 -1097 3913
556 3913 450 -3237 1081 20 -5162 -744 1925 -4587 -4821 2955 471 -4169 1450 3414 -2343
571 -2343 738 5461 555 -2247 4234 3775 -2346 -352 3385 -1493 -3596 819 -87 -4326 -2406 1067
587 1067 -1121 -2756 -420 659 589 405 1390 1041 1137 2127 2816 638 -1008 1035 2509 -1188 -3271
604 -3271 -407 391 -2075 -2182 -1447 -1455 -145 471 -1749 -992 2930 1815 -798 1769 3193 291 1141
621 1141 3278 -262 -1626 2902 488 -4933 -830 2811 -4180 -4108 2676 -549 -5407 1662 4590 -3557
637 -3557 -2028 6273 2000 -2737 3455 4210 -2492 743 4629 -2347 -3779 3388 710 -5439 -1605
$$ packed form
524c027N871k24m401M076K866o565P25P159m435o833O174K859q721J027O971n732
540b210n367Q809J975r122K732P700m735k543O671r62n221M876K776o894M18N010
556C913l463l687M318j061n182M418K669o512k34P776k484m640N619J964n757
571b343L081M723m906k802O481m59o121J994L737m878k103M415r06m239J920L473
587A067k188j635K336J079p0j84R85l49R6R90O89k178j646K043J474l697k083
604c271K864P98k466j07P35qJ310O16k220P57L922j115k613K567J424k902Q50
621A141K137l540j364M528k414n421M103L641o991P2O784l225m858P069K928q147
637c557J529Q301m273m737O192P55o702L235L886o976j432P167k678o149L834
$$ plain form
652 -1605 1890 -2709 -2543 957 -1544 -1176 3024 1029 -2571 2696 4651 -1386 33 5011 -31 -2829
668 -2829 3144 2165 -4901 -2132 2948 -1794 -4799 -241 295 -3169 -566 1856 -1386 -1342 2947 2847
684 2847 -136 -82 2641 2373 825 -247 78 388 -334 -1166 -1360 -1499 -1566 -194 -755 -2256 -1261 1264
702 1264 133 -757 1439 1429 492 1848 2213 163 651 2196 -44 -1006 1025 -748 -3077 152 427
719 427 -3928 -2759 1332 -737 -2564 1482 696 -1576 2628 3854 -1877 -1171 5789 2532 -3378 1140
735 1140 3884 -2079 -2297 2209 -1325 -4432 175 1011 -3877 -1803 1261 -733 -1152 2236 463 -931
751 -931 2770 3140 -690 610 2789 -17 -394 1468 -1133 -2681 769 600 -3938 -2152 1205 -1129
767 -1129 -2581 581 864 -1582 850 3234 278 -668 1960 2426 851 136 329 90 97 -375 -1457 -1022
$$ packed form
652a605L495m599J66L500k501L68M200j995l600N267J955o037J419M978n042k798
668b829N973r79p066K769N080m742l005M558N36l464K603K422l242M4M289j00
684B847k983N4K723k68j548j072L25L10p22q32j94j39o7J372n61j501R95K525
702A264j131q90K196j0r37J356L65k050M88J545k240r62K031j773k329L229K75
719D27m355J169M091k069j827M046p86k272M204J226n731P06O960l257n910M518
735A140K744n963k18M506l534l107M607Q36m888K074L064j994m19L388j773j394
751i31L701L70l830J300K179k806l77J862k601j548L450j69m538J786L357k334
767a129j452L162K83k446K432K384k956r46K628M66j575p15J93k39Pm72j082M35
$$ plain form
785 -1022 -566 -1210 -1355 -1179 -1556 -513 862 -131 -677 1287 1638 400 1445 2246 36 39 2079 447
803 447 -1309 -436 139 -1445 -1594 -707 -1611 -1327 -336 -809 -1136 757 406 -179 1456 1928 156 1114 2841
822 2841 507 -368 1544 841 -1473 -651 497 -2168 -1883 396 -1147 -3045 -366 1465 -1148 -1056 1898
839 1898 1430 -398 880 2044 1273 889 918 285 205 33 -882 -742 -281 -1390 -1590 -567 -874 -2085 22
858 22 519 -1219 -203 1855 785 -277 1572 2126 -106 447 2222 492 -1241 -126 296 -904 -1280
875 -1280 -1271 -1414 -1053 -629 -1007 -578 327 29 213 1696 751 94 1986 1954 -28 166 1485 275 -1019
894 -1019 -24 28 -2245 -1615 614 -1159 -2810 -286 1063 -1050 -797 1009 1082 301 1558 1442 279
911 279 786 1954 905 -311 -266 -60 -329 -858 -1133 -1539 -883 -731 -873 -950 -645 -284 400 819 609 143
$$ packed form
785a022M56o44j45J76l77J043J375r93n46J964L51j238J045Q01k210LK040j632
803D47j756Q73N75j584j49Q87r04K84R91m73l27J893l51n85J635M72j772R58J727
822B841k334q75J912p03k314Q22J148k665K85K279j543j898K679J831k613R2K954
839A898m68j828J278J164p71l84K9o33q0j72r15J40M61j109k00J023l07j211K107
858B2M97j738J016K058j070j062J849N54k232N53J775j730j733J115M22j200l76
875a280Rj43L61M24l78M29R05k98J84J483r45o57J892l2j982J94J319j210j294
894a019R95N2k273O30K229j773j651K524J349k113K53J806P3p81J257j16j163
911B79N07J168j049j216M5K06k69n29k75m06O56J52j42p7L05L61O84M19k10m66
$$ plain form
931 143 1096 2118 1400 -255 647 1216 284 -709 -211 -653 -1576 -489 -234 -1623 -1869 402 728 -1176
949 -1176 -230 1346 730 39 1632 1501 -123 946 2688 416 -1352 240 847 -1129 -1464 -692 -1416
966 -1416 -1526 -407 -565 -1894 -432 1117 293 96 881 953 1377 1746 783 -440 842 1388 -271 -884
984 -884 217 -474 -1432 -424 -144 -2189 -1779 1074 335 -1916 29 2204 671 -167 1943 1517 -72
1001 -72 1225 2106 -323 -1164 994 479 -2092 -1277 157 -1315 -1791 12 -899 -1561 369 956 -562
1018 -562 68 1965 980 -130 1682 1424 -275 826 1453 -825 -900 759 -826 -2288 -95 -58 -2348
1035 -2348 -1321 1464 -782 -1769 1607 1554 -1083 691 2581 191 -551 2347 1715 -1414 47 1803
1051 1803 -1035 -2449 398 -189 -2582 -972 514 -1058 -1277 461 662 -220 824 1095 593 835 1471
$$ packed form
931A43R53J022p18j655R02N69r32r93M98m42r23J087K55j389k46K271L26j904
949a176R46J576o16o91J593j31j624J069J742k272j768J592O07j976l35P72p24
966a416j10J119j58j329J462J549q24j97P85P2M24L69r63j223J282N46j659o13
984h84J101o91r58J008K80k045M10K853p39k251J945K175j533q38K110m26j589
1001g2J297Q81k429q41K158n15k571Q15J434j472m76J803r11o62J930N87j518
1018e62O30J897r85j110J812k58j699J101O27k278p5J659j585j462K193L7k290
1035b348J027K785k246r87L376n3k637J774J890k390p42K898o32l129J461J756
1051A803k838j414K847n87k393J610J486j572k19J738K01q82J044K71n02K42O36
$$ plain form
1068 1471 467 362 820 452 -583 -118 150 -1102 -1535 -559 -615 -1422 -601 130 -652 -708 1029 1027 -456
1087 -456 751 2341 397 -124 1520 1636 -593 -218 1286 -588 -2136 228 38 -2695 -1239 1283
1103 1283 -793 -1939 1133 1103 -1346 279 2550 22 -503 2447 1426 -1098 536 1202 -944 -720
1119 -720 828 -1451 -2325 552 41 -2404 -362 1536 -771 -1012 1713 567 -958 2020 2282 -1269
1135 -1269 40 2951 -97 -1632 1308 963 -2601 -700 1380 -1724 -2541 461 378 -2057 -489 933
1151 933 -701 292 1720 553 -374 1550 1483 143 297 714 93 -566 59 -320 -1516 -660 -434 -1105
1169 -1105 -1196 -868 -105 202 128 30 535 823 1434 820 134 386 1173 763 -521 77 107 -1055 -612 -29
1189 -29 -1141 -2062 -136 1106 -1369 -1252 1338 739 -836 1153 1841 -407 757 2845 62 -1160
$$ packed form
1068A471j004j05M58l68j035M65K68j252m33R76n6q07Q21P31p82n6J737kj483
1087d56J207J590j944n21J644J16k229L75J504j874j548K364j90k733J456K522
1103A283k076j146L072l0k449J625K271k528n25K950j021k524J634O66k146K24
1119g20J548k279q74K877n11k445K042J898k307k41K725j146j525K978K62l551
1135a269J309K911l048j535K940l45l564J901K080l104q17L002q3k435J568J422
1151I33j634R93J428j167r27J924o7j340J54M17o21o59O25l79j196Q56K26o71
1169a105r1L28P63L07p4r8N05K88O11o14o86K52P87m10j284N98L0j162M43N83
1189b9j112r21J926J242k475J17K590n99j575J989O88k248J164K088k783j222
$$ plain form
1205 -1160 1642 1380 -1609 -535 1127 -1113 -1594 309 -548 -2374 -254 1042 -972 -397 1329 98
1221 98 141 2413 466 -1278 1541 2203 -1203 -1001 1901 -107 -1945 116 245 -1856 -680 1129 -1368
1238 -1368 -1492 1111 587 -1247 821 1830 -332 -169 2270 1133 -713 664 1120 -329 -441 -417 -422
1255 -422 -1088 -443 -1018 -1136 -75 -315 -741 33 609 255 680 996 734 350 940 564 711 655 313 -275
1275 -275 -36 -365 -889 -454 -601 -1273 -686 -159 -859 -168 907 270 -255 1121 1107 -157 786 1547 -148
1294 -148 -259 1240 377 -1328 -74 582 -1414 -1435 331 -421 -1332 188 -129 -873 306 1470 -252
1311 -252 -274 1561 777 -118 630 1322 -351 -169 482 -701 -1004 206 -701 -1423 12 -350 -1084 -154 878
1330 878 -385 -761 1442 1152 -264 623 1428 190 152 1081 -110 -801 210 96 -1099 -760 -423 -711
$$ packed form
1205a160K802k62k989J074J662k240m81J903q57j826K120J296k014N75J726j231
1221I8M3K272j947j744K819O62l406K02K902k008j838K061J29k101J176J809k497
1238a368j24K603n24j834K068J009k162J63K439j137j846J377M56j449j12K4n
1255d22o66O45n75j18J061k40m26P74N76l54M25L16k62l84N90l76J47n6l42n88
1275b75K39l29n24M35j47o72N87N27p00O91J075o37n25J376j4j264R43P61j695
1294a48j11J499q63j705J254O56j996k1J766p52r11J520l17p44J179J164j722
1311b52k2J835p84q95P48O92j673J82O51j183l03J210r07p22J435l62p34R30J032
1330H78j263l76K203k90j416Q87Q05j238l8R29j191o91J011j14j195L39L37k88
$$ plain form
1348 -711 -424 -481 -809 -143 604 15 -219 739 880 335 747 944 -290 118 1308 -8 -928 -40 150
1367 150 -1237 -999 33 -839 -1013 113 -22 -598 54 881 495 366 622 97 1034 1300 295 -320 184
1386 184 678 -513 -318 -339 -1109 -959 -133 -806 -1211 28 289 -261 252 750 228 370 1196 852 -330
1405 -330 282 847 293 -139 -321 -162 -625 -465 -795 -766 -383 -694 -271 -221 -59 -241 679 711 -71 632 1011
1426 1011 465 243 468 813 -462 -161 161 -789 -928 -329 -366 -685 -296 -570 -188 256 260 -247 -49 941
1446 941 613 368 1131 534 120 649 758 -694 -411 484 -450 -1243 -464 91 -1294 -408 260 -262 -1010
1465 -1010 957 977 -443 399 1498 501 9 1156 591 -169 169 822 -768 -768 -19 -492 -1188 -513 -155
1484 -155 -495 -335 248 -205 273 489 503 169 816 1043 -60 296 1114 262 -935 -102 391 -809 -903 97
$$ packed form
1348g11K87n7l28O66P47n89k34R58J41n45M12J97j234M08J190j316r20Q88J90
1367A50j387K38J032q72j74J126j35n76O52Q27l86j29K56n25R37K66j005o15N04
1386A84M94j191J95k1p70J50Q26o73m05J239K61n50N13M98n22J42Q26l44j182
1405c30O12N65n54m32j82J59m63J60l30K9L83l11M23N0J62j82R20L2p82P03L79
1426A011n46k22K25L45j275L01L22r50j39N99l7l19L89k74L82M44Mn07J98R90
1446I41l28k45P63n97m14N29J09j452K83Q95r34p93P79N55j385Q86O68n22p48
1465a010J967K0j420Q42J099r97m92J147n65p60L38O53j590%P49m73o96O75L58
1484a55l40J60N83m53M78K16J4l34O47K27j103L56Q18q52j197Q33M93j200r4J000
$$ plain form
1504 97 -280 -1205 -406 357 -564 -147 713 651 -395 707 1301 373 -75 934 611 -268 -116 391 -714
1523 -714 -959 218 -534 -1200 -522 174 -953 -595 450 -51 235 560 836 124 529 1104 293 24 722
1542 722 -40 -665 196 -80 -845 -703 249 -644 -1203 65 491 -514 -245 938 61 34 1204 1225 -144
1561 -144 -28 1350 458 -793 1 432 -650 -735 95 -623 -806 11 232 -1094 -177 702 102 -44 637
1580 637 854 437 854 1092 -243 -81 761 182 -879 -460 324 -1000 -397 230 -887 -1147 51 554
1598 554 -749 86 1130 17 224 997 697 -472 794 1583 -220 -784 832 164 -1233 -453 235
1615 235 -1018 -1115 55 -139 -1096 190 510 -237 67 985 638 164 986 843 -159 266 737 -108 -613
1634 -613 349 -549 -1159 233 -184 -945 -635 189 -2 -501 324 296 -275 495 857 604 -264 856 453 -369
$$ packed form
1504I7l77r25P99P63r21M17Q60o2j046J102N94r28m48J009l23q79J52N07j105
1523g14k45J177p52o66O78O96j127L58J045n01K86L25K76p12M05N75q11k69O98
1542G22p62o25Q61k76p65J42R52q93n59J268M26j005K69J183q77k7J170K1j369
1561a44J16J378q92j251P94M31j082q5Q30p18j83Q17K21j326R17Q79o00j46O81
1580F37K17m17M17K38j335J62Q42n79j061M19P84j324O03O27j117k60J198N03
1598E54j303Q35J044j113K07P73l00j169J266P89j803n64J616o68j397P80O88
1615B35j253r7J170j94r57J286L20p47L04R18l47m74Q22j43j002M25M71q45n05
1634f13R62q98o10J392m17p61L10Q24j91m99Q25k8n71P70L62k53q68J120m03q22
$$ plain form
1654 -369 -282 549 -44 -1117 -240 -253 -665 -634 250 -509 -1019 -25 746 230 -19 627 651 185 570 848 55
1675 55 27 814 181 -609 -12 166 -1017 -299 -4 -552 -734 360 239 -663 285 895 -242 310 845 458
1695 458 -120 715 676 -842 -94 986 -772 -1229 382 139 -1290 -485 151 -192 -946 492 183 -539
1713 -539 531 1135 118 481 1080 286 -66 511 441 -302 -36 105 -715 -795 -54 -463 -548 -59 -200 81
1733 81 -165 435 144 103 536 722 54 177 707 4 -65 226 11 -709 -21 -151 -719 -696 -222 -306 -429 -373
1755 -373 125 41 -204 210 647 396 303 788 810 -201 -10 671 -205 -613 184 -69 -946 -597 254 -716 -694
1776 -694 177 58 -257 272 517 -151 398 867 153 230 788 605 -445 -42 126 -808 -529 414 -630 -1311
1796 -1311 -96 116 -775 -163 571 -312 98 850 183 -8 363 1036 -274 -192 974 -181 -691 -25 -38
$$ packed form
1654c69Q7Q31n93j073Q77j3m12L1Q84p59n10R94P71n16k49O46K4m66L85K78p93
1675E5k8P87o33p90N97J78j183P18K95n48j82J094j21r02R48O10j137N52N35l87
1695D58n78Q35l9j518P48J080j758m57J611k43j429Q05O36l43p54J438l09p22
1713e39J070O04j017L63N99p94l52N77p0p43K66J41q20q0P41m09q5M89j41K81
1733H1k46O00k91m1M33J86o68J23N30p03o9K91k15p20O88j30n68K3M74q4j23N6
1755c73M98q4k45M14M37k51r3M85K2j011J91O81q76m08P97k53q77L49Q51r70K2
1776f94Q71j19l15N29K45o68N49M69p14P7N58j83j050M03J68r34K79R43j044o81
1796a311J215K12q91O12P34q83M10P52o67j91L71O73j310Q2J166j155n10O66j3
$$ plain form
1815 -38 -872 -371 235 -417 -803 -171 -378 -154 401 465 27 732 682 15 126 573 176 90 360 3 -343
1836 -343 -139 220 -447 -543 -298 -293 -701 3 -195 -329 141 181 325 401 263 559 601 158 74 -156 207 -209
1858 -209 -187 -277 -451 -593 -674 -129 -431 -482 135 213 -165 -9 565 21 336 811 227 113 510 507 -370 -172
1880 -172 -118 -148 -359 -383 -414 -608 -187 -530 -492 334 132 -218 -111 596 17 62 707 660 76 208 466 -238
1902 -238 -179 27 -156 -574 -274 -397 -662 -216 30 -211 -136 161 -6 264 446 123 370 750 405 -2 27
1923 27 232 -257 -286 85 -277 -936 14 -330 -542 -394 133 31 -455 786 569 183 451 625 413 174
1943 174 459 255 -281 -230 -145 -585 -223 -464 -583 -369 31 -458 -321 171 341 -374 245 715 85 198 914
1964 914 500 82 397 764 -308 17 -2 -227 -605 -224 -352 -622 -39 -279 -325 -332 -90 310 108 169 425
$$ packed form
1815c8q34N01O06o52l86O32k07K24N55O4m38P05n0o67J11M47l97q6K70l57l46
1836c43K04L59o67r6K45Nm08P04j98j34M70M0J44P6j38K96M2m43q4k30L63m16
1858b09K2r0j74j42q1N45l02n1O17P8l78J56N74n44L15M75n84j14L97lq77J98
1880a72N4l0k11k4l1j94M21l43L8Q26k02l50J07P07n79M5O45m7n84J32K58p04
1902b38N9K06j83m18L00j23k65M46K46k41P5K97j67K70J82l23K47L80l45m07K9
1923B7K05m89k9L71l62o59R50l44k12J48N27j02m86J241k17l86K68J74k12k39
1943A74K85k04n36N1Q5m40L62k41j19K14M00m89J37M92J70p15O19M70o30J13P16
1964I14m14m18L15L67j072L25j9k25l78L81j28k70N83k40m6pK42M00k02O1K56
$$ plain form
1985 425 414 300 176 312 41 -19 54 47 -229 -421 -308 -293 -272 -357 14 -36 160 252 92 79 181 484 241 401
2009 401 307 -89 263 179 -20 -491 -297 -165 -698 -300 62 -281 -723 239 -3 -619 162 722 259 -58 525
2030 525 500 -217 375 763 -123 235 534 -90 -612 -62 -14 -859 -657 210 -274 -381 144 114 -217 226 299
2051 299 193 560 828 -133 -201 488 400 -59 -453 293 -241 -512 67 -334 -705 -140 -36 -398 -440 346 288
2072 288 22 281 1020 372 -149 607 357 -381 -28 99 -262 -511 -153 -333 -348 -169 2 -185 -461 375
2092 375 55 -154 23 481 427 300 435 298 -6 340 243 -202 81 179 -263 -771 -85 -229 -633 28 533
2113 533 -274 -345 408 411 -411 342 692 158 -108 666 103 -421 16 110 -420 -518 -182 -269 -628 -413 81 -455
2135 -455 -48 250 8 52 510 503 131 223 268 446 -58 162 171 -318 -92 283 -360 -309 134 -177 -630 -181 225
$$ packed form
1985D25j1j14j24J36k71o0P3pk76j92J13J5K1q5L71n0J96R2j60j3J02L03k43J60
2009D01r4l96L52q4j99m71J94J32n33L98L62l43m42R62k42o16P81N60m63l17N83
2030E25k5p17N92L88q86L58K99o24n22N50M8q45K02Q67m84j07N25l0l31M43P3
2051B99j06L67K68r61o8O89q8m59l94P46n34k71N79m01l71N65J04l62m2P86n8
2072B88k66K59P39o48n21P56k50p38L53J27l61k49L58j80j5J79J71j87k76Q36
2092C75l20k09J77M58n4j27J35j37l04L46r7m45K83R8m42n08O86j44m04O61N05
2113E33q07p1P53Lq22P53L50n34k66P74n63n24M37R4n30r8L36q7l59K15M94n36
2135d55M07K98k42M4M58pl72R2M5J78n04K20Rm89K26L75o43N1M43l11m53M49M06
$$ plain form
2158 225 -425 74 421 197 -56 515 458 303 130 750 141 -557 190 311 -388 -216 177 -381 -490 -85
2178 -85 168 -438 -386 305 386 -141 401 253 228 -53 407 187 86 613 100 -182 -155 131 -169 -481 44 -300
2200 -300 -228 83 128 -378 274 369 -29 187 605 358 90 148 528 -10 -118 366 61 -494 -237 12 -319
2221 -319 -235 -99 93 -480 -21 98 -74 7 532 344 119 386 451 -98 -50 151 426 -100 -312 -147 -207 -210
2243 -210 -107 -206 -200 -161 40 -170 -219 288 288 -265 402 285 -99 -49 396 -20 -134 201 -38 -328 -104 119 -575
2266 -575 -426 31 -311 -503 171 268 -93 23 425 507 -125 678 385 -80 -209 251 -117 -594 -75 -86 -489
2287 -489 -37 2 -440 -123 -249 -33 26 85 50 -228 242 568 45 -160 682 185 116 -39 50 -345 -322 -142
2309 -142 -373 -302 -269 18 -453 -280 303 273 -15 153 547 164 370 249 324 -35 249 101 153 -209 -220 -188
$$ packed form
2158B25o50M99L47k24k53N71n7j55j73O20o09o98P47J21o99J72L93n58j09M05
2178h5K53o06N2O91Q1n27N42j48k5k81M60k20j01N27n13k82K7K86l00l12N25l44
2200c00P2L11M5n06O52R5l98K16M18k47k68N8L80n38j08M84l05n55K57K49l31
2221c19Q4J36J92n73M59J19j72Q1N25j88k25K67O5n49M8K01K75n26k12J65o0l
2243b10J03r9OL9K01k10m9N07%n53O67j17l84N0M45m16j14L35k39k90K24K23o94
2266e75J49M57l42j92O74R7l61J16M02Q2o32Q03k93m65j29M60l68m77N19j1m03
2287d89M52L9m42L17j26K16N9N9l5k78M70L26n23k05Q42m97o9j55Q9l95K3J80
2309a42k31P1L3K87m71J73N83l0k88J68L94l83K06j21P5l59K84j48N2l62j1L2
$$ plain form
2331 -188 -320 -314 -409 -47 -547 -30 1 -143 -176 212 198 138 204 355 183 170 326 -118 -222 35 -163 -412 -77
2354 -77 -426 -236 -409 -45 -243 -187 -22 169 -151 328 470 211 -343 238 242 -135 141 160 242 -521 149 -159
2376 -159 -187 -180 32 -331 -229 -176 -62 -175 -59 385 68 366 115 60 352 339 -136 -194 18 -134 -210 -64 -412
2399 -412 -439 -509 -222 -126 -412 114 58 63 -42 249 217 189 408 321 165 96 360 123 -208 58 -400 -55 -92 -250
2423 -250 -112 25 -188 -231 231 220 24 256 321 46 206 309 -68 101 207 -116 -287 -249 192 -225 -117
2444 -117 -164 -187 -313 -264 131 -267 -226 90 -52 233 266 284 290 233 235 -25 60 -165 252 -343 -120 -165 -255 -146 -209
2469 -209 -347 -335 20 -44 162 158 230 130 263 373 638 283 -67 323 102 -235 -212 127 -216 -465 -248 -363
2491 -363 6 -191 -81 52 59 269 533 -93 -27 284 127 -133 228 154 -327 -213 288 -210 -122 74 -10 -74
$$ packed form
2331a88j32Or5L62n00N17L1j44l3L88j4o0O6J51j72j3J56m44j04K57j98k49L35
2354g7l49J90j73L64j98N6J65J91l20M79J42k59n54N81Ml77K76J9Q2p63O70l08
2376a59k8PK12l63J02N3J14j13J16M44l17K98k51n5K92j3m75n8K12j52p6J46l48
2399d12k7p0K87R6k86N26n6Nj05K91l2k8K19q7j56o9K64k37l31K66m58L45l7j58
2423b50J38J37k13m3M62j1j96K32O5k75J60J03l77J69J06l23j71L8M41m17J08
2444a17m7k3j26M9L95l98M1L16j42K85L3J8On7Kk60Q5k25M17n95K23m5r0J09o3
2469b09j38J2L55o4K06mP2j00J33J10K65l55l50L90k21l37K3L39l43k49K17j15
2491c63L69j97J10J33PK10K64o26O6L11j57k60L61p4m81J14N01m98Q8J96q4o4
$$ plain form
2513 -74 -131 94 -314 -60 82 34 -54 127 273 72 253 453 80 -83 367 -9 -340 -263 326 -290 -184 159
2535 159 -308 -162 1 54 -215 -41 161 371 -5 100 374 -5 41 272 -148 -97 -82 5 -476 -153 -254 -85
2557 -85 48 -73 178 -273 -20 -113 74 94 168 230 35 298 277 250 175 121 48 -127 -99 -294 -265 -322 -125 -201 -392
2582 -392 143 -59 -19 -10 229 63 184 194 250 -54 121 180 62 -79 285 -109 -268 -94 -275 -95 -287 16
2604 16 -64 -229 79 31 124 -111 323 279 23 204 242 38 152 140 161 -181 -22 -197 -213 -293 14 -134 -199 2
2628 2 -188 -202 331 407 128 -51 289 108 141 182 145 -85 -197 177 -27 -194 -90 -115 -25 -161 142 -64 -193
2651 -193 147 53 33 -147 158 -5 151 471 266 160 73 -192 -84 4 -89 -295 -253 -112 118 -113 -15 106
2673 106 -5 -354 74 236 -29 70 536 99 202 195 211 -144 -191 51 -108 -145 30 51 -21 -107 25 -95 -119
$$ packed form
2513g4n7K25m08K54J42m8q8J81J46k01J81K00l73j63M50l76l31P7N89o16J06L43
2535A59m67J46J63N3k69J74K02K10l76J05K74l79M6K31m20N1J5Q7m81L23j01J69
2557h5J33j21K51m51K53r3J87K0P4O2j95K63k1k7p5n4p3j75K8j95K9n7J97p6j91
2582c92N35k02M0RK39j66J21J0N6l04J75N9j18j41L64l94j59J74j81J80j92L03
2604A6q0j65L08m8R3k35M34m4k56J81L8k04J14j2K1l42J59j75j6q0L07j48o5K01
2628Bj90j4N33P6k79j79L40j81L3M1l7k30j12L74k04j67J04k5R0j36L03k06j29
2651a93L40r4k0j80L05j63J56L20k05j06q7k65J08Q8r3k06M2J41K30k31R8J21
2673A06j11l49M28J62k65R9M66m37J03pJ6l55m7K42j59l7J75K1p2q6J32j20k4
$$ plain form
2696 -119 -95 -37 151 20 63 239 43 253 81 89 -36 -33 -57 -127 -233 -61 38 -265 -89 -208 125 1 -173
2719 -173 175 232 393 63 -83 261 16 225 380 250 66 180 178 -1 -150 -1 -41 -151 -125 196 -155 -17
2741 -17 -15 67 -135 51 353 11 59 47 -66 138 49 42 59 -30 361 -404 -331 146 44 -304 -7 159 -207 -192
2765 -192 339 167 -52 144 269 63 -166 168 321 -147 -58 179 -209 -220 -3 -329 -676 -73 156 -396 32
2786 32 154 41 -67 -10 60 -241 172 156 127 -107 40 2 26 -32 177 -254 -235 -92 -47 13 -124 -99 -34 47 -86
2811 -86 -164 195 99 229 326 -9 164 7 -150 6 18 -95 -156 23 -257 -128 -33 92 46 -85 60 -11 96
2834 96 123 192 -113 156 623 325 -61 228 52 124 -379 -76 -174 -110 119 31 -143 -159 100 44 -143 312 -41
2857 -41 287 250 -42 75 175 297 103 -197 -34 -40 -431 325 181 -15 -101 12 -218 -75 32 -165 113 -26
$$ packed form
2696a19K4N8J88j31M3J76j96K10j72Qj25Lk4p0j06J72R9l03J76j19L33j24j74
2719a73L48N7J61l30j46L44k45K09J55j30j84J14kj79j49J49m0j10K6L21l51J38
2741a7KQ2k02J86L02l42M8j2j13K04q9pJ7q9L91p65P3M77j02l48K97J66l66J5
2765a92N31j72k19J96J25k06k29L34J53m68Q9K37l88j1K17l26l47O03K29n52M28
2786C2J22j13j08N7P0l01M13j6k9k34J47l8K4n8K09m31J9J43M5O0j37K5O5Q1j33
2811h6p8L59r6J30R7l35J73j57j57J56J2j13o1J79k80J29R5J25m6j31J45p1J07
2834I6K7O9l05K69M67k98l86K89j76P2n03L03r8O4K29q8j74j6K59n6j87M55l53
2857d1L28l7k92J17J00J22j94l00J63ol91P56j44j96q6J13k30J43J07j97K78j39
$$ plain form
2879 -26 463 198 -118 -27 168 113 -143 -12 19 -223 -259 -161 -274 -191 -107 -250 -78 49 -79 243 -48 -138 -119
2902 -119 261 272 138 296 -148 -35 188 -123 4 40 -78 -233 -139 -40 -266 4 97 -27 87 -28 153 59
2924 59 -54 210 328 315 314 179 -86 5 -285 106 -44 -130 26 -71 -96 -54 -260 -189 31 -80 -97 -74 -209 77
2948 77 352 -100 375 14 -40 -80 -151 -106 -12 -215 -75 -356 -534 -167 -179 -310 -6 -483 -167 203 7 224
2970 224 337 331 324 -115 -20 152 -164 -123 -44 71 -75 -23 -112 -147 -251 -6 48 -32 105 46 -299 376 -146 183
2994 183 -16 183 -73 241 57 -99 -155 -142 -116 -244 -48 -68 31 -122 -302 -8 101 164 474 137 -196 -93
3016 -93 143 414 198 29 -92 6 -252 -107 -39 -74 -119 -263 -328 -476 -132 119 32 130 -97 331 292 -175 -184 104
3040 104 30 0 9 118 -118 166 -102 -41 -23 -374 159 -398 -153 -167 -199 77 -26 229 69 -106 348 -176 -42
$$ packed form
2879b6M89k65l16R1J95n5k56J31L1k42l6R8j13Q3Q4j43J72J27j28L22k91r0J9
2902a19L80J1j34J58m44J13K23l11J27L6j18j55R4R9k26K70R3j24J14j15J81r4
2924E9j13K64J18j3jj35k65R1k90L91j50q6J56r7k5M2k06P1K20j11j7K3j35K86
2948G7K75m52M75l61n4m0p1M5R4k03J40k81j78L67j2j31L04m77L16L70j96K17
2970B24J13opm39R5J72l16M1P9J15j46N2q9l5j04K45N4q0J37n9l45O75n22L29
2994A83j99J99k56L14j84j56n6J3K6j28J96k0R9j53j80K94J09O3L10l37l33J03
3016i3K36K71k16j69j21R8k58J45O8l5m5j44o5j48L44K51q7R8k27M28l9m67rK88
3040A04p4l0RJ09k36K84k68O1J8l51N33n57K45j4l2K76j03K55j60j75M54n24J34
$$ plain form
3063 -42 88 19 85 -31 107 -104 -342 -177 -69 84 -188 171 -61 -245 -122 160 176 231 116 -40 -182 125
3085 125 401 -341 -81 -3 146 -178 256 -77 -384 -213 179 -53 -11 208 -174 1 259 135 -83 301 114
3106 114 -70 -116 222 148 -105 -17 125 -145 -36 -229 44 -170 -335 -143 -124 -318 128 133 -43 62 396 260
3128 260 164 250 -88 -61 84 -71 -317 -182 -134 -65 8 175 36 -247 -158 -105 -40 -57 -8 14 -39 318 194 16
3152 16 223 139 142 -90 117 186 193 35 131 43 -37 -186 -218 -49 -287 -221 91 24 210 299 79 -59 -12 -6 -122 -279
3178 -279 25 -102 -134 124 -411 -3 102 -173 -283 -14 159 -70 402 139 317 -56 190 37 242 127
3198 127 73 280 -64 -20 -57 54 -435 97 -273 -189 49 42 106 -177 -130 29 140 143 75 -177 223 160 -120 43
3222 43 150 127 -177 -57 -23 -196 202 131 -122 -243 204 133 -150 -189 358 71 -42 -156 -10 60 -204 118
$$ packed form
3063d2J30o9O6j16J38k11k38J65J08J53k72L59k32j84J23K82J6N5j15j56j42L07
3085A25K76p42K60P8J49l24M34l33l07J71L92k32M2K19l82J75K58j24k18L84j87
3106A14j84m6L38p4k53Q8J42k70J09j93K73k14j65J92J9j94M46Nj76J05L34j36
3128B60r6Q6l38K7J45j55k46J35M8O9P3J67j39k83Q9N3O5j7M9K2n3L57j24j78
3152A6K07q4Lk32K07O9Pj58R6q8q0j49l2J69k38O6L12o7J86Q9k20j38M7Oj16j57
3178b79L04j27l2K58n35M08J05k75j10K69J73k29M72k63J78l73K46j53K05j15
3198A27n4K07l44M4l7J11m89N32l70Q4K38pO4k83M7J59J11Lo8k52M00o3k80J63
3222D3J07k3l04J20L4j73L98p1k53j21M47p1k83l9N47k87j13j14J46P0k64L22
$$ plain form
3244 118 -157 -52 -72 -2 -328 -128 -4 -173 -152 -239 -136 -160 -396 -16 -106 80 173 116 93 211 38 -31 -48 384
3268 384 18 -128 -469 29 -158 68 4 -42 -198 -85 86 -231 -235 279 128 176 381 200 11 -86 44 -86
3290 -86 24 16 -85 -37 -140 -2 131 -356 187 -258 -26 -14 173 -44 185 136 -54 1 170 157 -28 -84 86
3313 86 -67 54 -316 -381 -204 -222 49 -542 -142 -213 -75 -67 209 74 -3 274 267 -52 -11 132 -169 91 -124
3336 -124 -44 -210 -5 116 -84 -135 -441 20 -138 -130 76 184 135 99 164 80 122 49 105 -82 -17 -31 211 229 7
3361 7 -171 46 -95 -79 -166 -7 -389 -34 55 -108 -12 -71 83 -100 293 -53 215 -41 103 -17 290 -338
3383 -338 -292 -31 -101 145 3 183 -80 -11 -169 242 -86 -157 65 2 85 50 25 -184 24 -37 -104 133 -38
3406 -38 -31 -148 -448 -82 -75 -461 -2 -58 -97 165 33 158 190 61 -15 153 116 -165 -215 -156 -112 165 -368 -250
$$ packed form
3244A18k75J05k0P0l26K00J24j69K1q7J03k4k36L80r0J86R3n7k3J18j73o9j7M32
3268C84l66j46l41M98j87K26o4m6j56J13J71l17mN14j51M8K05j81j89r7J30j30
3290h6J10qj01M8j03J38J33m87N43m45K32J2J87k17K29m9j90N5J69j3j85n6J70
3313H6j53J21l70o5J77j8K71n91M00p1J38QK76j35p7K77pl19M1J43l01K60k15
3336a24Q0j66K05J21k00n1l06M61j58QK06J08m9l6O5q4M2p3N6j87O5j4K42J8k22
3361Gj78K17j41J6q7J59l82L55Q9j63R6n9J54j83L93l46K68k56J44j20L07o28
3383c38M6K61p0K46j42J80k63O9j58M11l28p1K22o3Q3l5k5k09K08o1o7K37j71
3406c8Pj17l00L66Pl86M59n6l9K62j32J25L2j29p6J68l7k81n0N9M4K77n33J18
$$ plain form
3430 -250 -124 -70 110 80 -141 90 249 -44 91 12 -58 -52 228 69 -25 90 252 -97 -22 136 -256 -19 -237
3453 -237 34 -49 -241 -90 2 119 -35 94 -64 192 22 157 82 45 3 112 -151 -143 -91 160 203 -77 108
3476 108 -294 8 -293 72 228 -71 -63 -63 212 159 179 117 180 -43 90 4 114 14 -102 -142 143 -25 -138
3499 -138 -47 68 157 -75 335 150 -209 6 74 -25 158 -111 181 96 -62 -53 -76 268 -125 -241 -235 14 -102
3522 -102 47 19 225 -317 -124 -90 192 -18 51 -67 146 -49 -204 -54 -70 126 49 -101 -37 -146 146 -245
3544 -245 -12 -16 -166 156 -134 29 -240 34 -45 18 15 151 174 73 144 280 94 29 -72 114 -150 -138 -220 -21
3568 -21 -120 304 119 -236 115 191 161 10 336 -218 -123 -108 313 -214 143 -74 -153 -69 434 -131 -19 14 -94
3591 -94 -210 79 78 164 433 74 249 -72 230 38 3 210 252 -189 -105 -98 73 -200 -105 -84 22 -135 127 147
$$ packed form
3430b50J26N4J80l0k21K31J59k93J35p9p0OK80j59r4J15J62l49P5J58l92K37k18
3453b37K71q3j92J51R2J17j54J29j58K56j70J35p5l7m2J09k63QN2K51M3k80J85
3476A08m02L02l01L65J56k99Q%K75n3K0o2O3k23J33q6J10j00j16m0K85j68j13
3499a38R1J15Q9k32M10j85l59K15O8r9J83k69K92q5j58Rk3L44l93j16OK49j16
3522a02J49k8K06n42J93L4K82k10O9j18K13j95j55J50j6J96p7j50O4j09K92l91
3544b45K33mj50L22k90J63k69K74p9O3lJ36K3j01P1J36j86o5j01J86k64J2q2J99
3568b1r9M24j85l55L51P6l0j51L26n54R5J5M21n27L57k17p9Q4N03n65J12L3j08
3591i4j16K89jQ6K69l59J75l21L02j92l5K07M2m41Q4PJ71k73R5K1J06j57K62K0
$$ [...]
8191A07
##END NTUPLES=NMR FID
##END=
