##TITLE=1H_SAV-77-ybTf3-B
 CDCl3, 8 sc, 
 19.11.2020
##JCAMPDX= 6.0         $$ Bruker NMR JCAMP-DX V2.0
##DATA TYPE= NMR FID
##DATA CLASS= NTUPLES
##ORIGIN= UXNMR, Bruker Analytische Messtechnik GmbH
##OWNER= root
$$ XWIN-NMR		Version 3.5
$$ Thu Nov 19 10:30:38 2020 Russian Standard Time (UT+4h)  she@DPX200
##.OBSERVE FREQUENCY= 200.1315066352
##.OBSERVE NUCLEUS= ^1H
##.DELAY= (6, 6)
##.ACQUISITION MODE= SIMULTANEOUS
##.ACQUISITION SCHEME= undefined
##.AVERAGES= 8
##.DIGITISER RES= 18
##SPECTROMETER/DATA SYSTEM= spect
##.PULSE SEQUENCE= zg30
##.SOLVENT NAME= CDCl3
##.SHIFT REFERENCE= (INTERNAL, CDCl3, 0, 15.7039)
##AUDIT TRAIL= $$ (NUMBER, WHEN, WHO, WHERE, WHAT)
$$ ##TITLE= Audit trail, XWIN-NMR		Version 3.5
$$ ##JCAMPDX= 5.01
$$ ##ORIGIN= Bruker BioSpin GmbH
$$ ##OWNER= she
$$ F:/spectra/data/she/nmr/H-F/1/audita.txt
$$ ##AUDIT TRAIL=  $$ (NUMBER, WHEN, WHO, WHERE, WHAT)
(   1,<2020-11-19 10:29:26.78 +0400>,<she>,<DPX200>,
      <created by zg, POWCHK disabled, PULCHK disabled
       configuration hash MD5:
       00 E9 B6 7A A2 85 ED C7 34 08 36 98 17 FE 4E 26
       data hash MD5: 16K
       22 5F 06 82 78 A9 D9 0B 45 57 44 73 D7 65 1C 03>)
$$ ##END=
$$ 
$$ hash MD5
$$ 84 E6 CC D7 7F 72 87 01 26 46 5E E6 2A 5C 25 01
##$RELAX= 
##$RELAX= 
##$RELAX= 
##$RELAX= 
##$RELAX= 
##$RELAX= 
$$ Bruker specific parameters
$$ --------------------------
##$DU= <F:/spectra>
##$EXPNO= 1
##$NAME= <H-F>
##$PROCNO= 1
##$TYPE= <nmr>
##$USER= <she>
##$AMP= (0..31)
100 100 100 100 100 100 100 100 100 100 100 100 100 100 100 100 100 100 
100 100 100 100 100 100 100 100 100 100 100 100 100 100 
##$AQSEQ= 0
##$AQ_mod= 1
##$AUNM= <au_zg>
##$AUTOPOS= <>
##$BF1= 200.13
##$BF2= 200.13
##$BF3= 200.13
##$BF4= 200.13
##$BF5= 200.13
##$BF6= 200.13
##$BF7= 200.13
##$BF8= 200.13
##$BYTORDA= 1
##$CFDGTYP= 0
##$CFRGTYP= 5
##$CHEMSTR= <none>
##$CNST= (0..31)
1 1 145 1 1 1 1 1 1 1 1 1 1 1 1 1 1 1 1 1 1 1 1 1 1 1 1 1 1 1 1 1 
##$CPDPRG= <>
##$CPDPRG1= <>
##$CPDPRG2= <>
##$CPDPRG3= <>
##$CPDPRG4= <mlev>
##$CPDPRG5= <mlev>
##$CPDPRG6= <mlev>
##$CPDPRG7= <mlev>
##$CPDPRG8= <mlev>
##$CPDPRGB= <>
##$CPDPRGT= <>
##$D= (0..31)
0 1.2 0 0 0 0 0 0 0 0.06 0 0.03 0 0 0 0 0.0002 0 0 0 0 0 0 0 0 0 0 0 0 
0 0 0 
##$DATE= 1605767366
##$DBL= (0..7)
120 120 120 120 120 120 120 120 
##$DBP= (0..7)
150 150 150 150 150 150 150 150 
##$DBP07= 0
##$DBPNAM0= <>
##$DBPNAM1= <>
##$DBPNAM2= <>
##$DBPNAM3= <>
##$DBPNAM4= <>
##$DBPNAM5= <>
##$DBPNAM6= <>
##$DBPNAM7= <>
##$DBPOAL= (0..7)
0.5 0.5 0.5 0.5 0.5 0.5 0.5 0.5 
##$DBPOFFS= (0..7)
0 0 0 0 0 0 0 0 
##$DE= 6
##$DECBNUC= <off>
##$DECIM= 32
##$DECNUC= <off>
##$DECSTAT= 4
##$DIGMOD= 1
##$DIGTYP= 9
##$DL= (0..7)
0 120 120 120 120 120 120 120 
##$DP= (0..7)
150 150 150 150 150 150 150 150 
##$DP07= 0
##$DPNAME0= <>
##$DPNAME1= <>
##$DPNAME2= <>
##$DPNAME3= <>
##$DPNAME4= <>
##$DPNAME5= <>
##$DPNAME6= <>
##$DPNAME7= <>
##$DPOAL= (0..7)
0.5 0.5 0.5 0.5 0.5 0.5 0.5 0.5 
##$DPOFFS= (0..7)
0 0 0 0 0 0 0 0 
##$DQDMODE= 0
##$DR= 18
##$DS= 0
$$ [...]
##$SUBNAM2= <"">
##$SUBNAM3= <"">
##$SUBNAM4= <"">
##$SUBNAM5= <"">
##$SUBNAM6= <"">
##$SUBNAM7= <"">
##$SUBNAM8= <"">
##$SUBNAM9= <"">
##$SW= 16.9725356469052
##$SWIBOX= (0..15)
0 0 2 0 0 0 0 0 0 0 0 0 0 0 0 0 
##$SW_h= 3396.73913043478
##$TD= 16384
##$TD0= 1
##$TE= 0
##$TE2= 300
##$TE3= 300
##$TEG= 300
##$TL= (0..7)
0 120 120 120 120 120 120 120 
##$TP= (0..7)
150 150 150 150 150 150 150 150 
##$TP07= 0
##$TPNAME0= <>
##$TPNAME1= <>
##$TPNAME2= <>
##$TPNAME3= <>
##$TPNAME4= <>
##$TPNAME5= <>
##$TPNAME6= <>
##$TPNAME7= <>
##$TPOAL= (0..7)
0.5 0.5 0.5 0.5 0.5 0.5 0.5 0.5 
##$TPOFFS= (0..7)
0 0 0 0 0 0 0 0 
##$TUNHIN= 0
##$TUNHOUT= 0
##$TUNXOUT= 0
##$USERA1= <user>
##$USERA2= <user>
##$USERA3= <user>
##$USERA4= <user>
##$USERA5= <user>
##$V9= 5
##$VALIST= <valist>
##$VCLIST= <CCCCCCCCCCCCCCC>
##$VD= 0
##$VDLIST= <DDDDDDDDDDDDDDD>
##$VPLIST= <PPPPPPPPPPPPPPP>
##$VTLIST= <TTTTTTTTTTTTTTT>
##$WBST= 1024
##$WBSW= 4
##$XGAIN= (0..3)
0 0 0 0 
##$XL= 0
##$YL= 0
##$YMAX_a= 173246
##$YMIN_a= -178957
##$ZGOPTNS= <>
##$ZL1= 120
##$ZL2= 120
##$ZL3= 120
##$ZL4= 120
##$ABSF1= 10
##$ABSF2= 0
##$ABSG= 5
##$ABSL= 3
##$ALPHA= 0
##$AQORDER= 0
##$ASSFAC= 0
##$ASSFACI= 0
##$ASSFACX= 0
##$ASSWID= 0
##$AUNMP= <proc_1d>
##$AZFE= 0.1
##$AZFW= 0.1
##$BCFW= 1
##$BC_mod= 2
##$BYTORDP= 1
##$COROFFS= 0
##$CY= 11.3945322036743
##$DATMOD= 1
##$DC= 2
##$DFILT= <>
##$DTYPP= 0
##$F1P= 15.9154993809931
##$F2P= -4.1035820241983
##$FCOR= 0.5
##$FTSIZE= 0
##$FT_mod= 4
##$GAMMA= 1
##$GB= 0.15
##$INTBC= 1
##$INTSCL= 1
##$ISEN= 128
##$LB= 0.24
##$LEV0= 0
##$LPBIN= 0
##$MAXI= 10000
##$MC2= 0
##$MEAN= 0
##$ME_mod= 0
##$MI= 1.114404
##$NCOEF= 0
##$NC_proc= 0
##$NLEV= 6
##$NOISF1= 3.799351
##$NOISF2= 2.8
##$NSP= 1
##$NTH_PI= 0
##$NZP= 0
##$OFFSET= 15.70392
##$PC= 1
##$PHC0= -11052.54
##$PHC1= 19.4009
##$PH_mod= 1
##$PKNL= yes
##$PPARMOD= 0
##$PSCAL= 0
##$PSIGN= 0
##$REVERSE= no
##$SF= 200.130013532006
##$SI= 16384
##$SIGF1= 3
##$SIGF2= 2
##$SINO= 400
##$SIOLD= 16384
##$SREGLST= <1H.CDCl3>
##$SSB= 0
##$STSI= 0
##$STSR= 0
##$SW_p= 3612.71676300578
##$SYMM= 0
##$S_DEV= 0
##$TDeff= 0
##$TDoff= 0
##$TI= <>
##$TILT= no
##$TM1= 0
##$TM2= 0
##$TOPLEV= 0
##$USERP1= <user>
##$USERP2= <user>
##$USERP3= <user>
##$USERP4= <user>
##$USERP5= <user>
##$WDW= 1
##$XDIM= 8192
##$YMAX_p= 0
##$YMIN_p= 0
$$ End of Bruker specific parameters
$$ ---------------------------------
##NTUPLES= NMR FID
##VAR_NAME=  TIME,          FID/REAL,        FID/IMAG
##SYMBOL=    X,             R,               I
##VAR_TYPE=  INDEPENDENT,   DEPENDENT,       DEPENDENT
##VAR_FORM=  AFFN,          ASDF,            ASDF
##VAR_DIM=   8192,          8192,            8192
##UNITS=     SECONDS,       ARBITRARY UNITS, ARBITRARY UNITS
##FACTOR=    0.0002944,     1,               1
##FIRST=     0,             0,               0
##LAST=      2.4114304,     0,               0
##MIN=       0,             -178957,         0
##MAX=       2.4114304,     173246,          0
$$ Real data points
##PAGE= N=1
##DATA TABLE= (X++(R..R)), XYDATA
$$ plain form
0 0 0 0 0 0 0 0 0 0 0 0 0 0 6 -8 8 -8 8 -16 16 -17 24 -29 32 -40 48 -56 64 -73 86 -99 113 -129 151 -167
34 -167 191 -215 243 -272 306 -342 382 -424 471 -523 579 -640 706 -778 859 -947 1044 -1149
52 -1149 1266 -1395 1538 -1701 1882 -2089 2326 -2602 2929 -3316 3793 -4395 5174 -6233 7768
67 7768 -10207 14909 -48896 168824 -17581 -178957 64080 8869 6533 -64618 -35148 128977
79 128977 -25455 -48405 138639 15456 2444 34663 -6863 71366 269 -38627 92873
90 92873 17861 -25948 18090 -1434 19906 -28784 -20669 74742 -18638 -26938 48866 -23496 -23569
103 -23569 -7711 -34267 11014 -20546 -38293 10098 -26729 -41627 -23640 -18859 -1055 -29529
115 -29529 -1996 43445 -14059 -20242 23174 12336 -3175 -8445 30177 37255 -14133 6760 21910
$$ packed form
0@%%%%%%%%%%%%Oj4J6j6J6k4L2l3M1n3O1p2Q8j04J20j37J59j85K12k42K80l18
34a67L58m06M58n15N78o48P24q06Q95r94J102j219J346j484J637j806J991k193
52a149K415k661K933l239L583l971M415m928N531o245P109q188R569j1407J4001
67G768j7975K5116o3805K17720j86405j61376K43037n5211k336p1151K9470J64125
79A28977j54432k2950J87044j23183j3012L2219m1526P8229p1097l8896J31500
90I2873p5012m3809M4038j9524K1340m8690Q115R5411r3380q300P5804p2362p3
103b3569J5858k6556M5281l1560j7747M8391l6827j4898J7987M781J7804k8474
115b9529K7533M5441n7504o183M3416j0838j5511n270L8622P078n1388K0893J5150
$$ plain form
128 21910 -5370 2047 -6302 16906 41742 -8841 4736 46775 5158 -18583 7294 28201
140 28201 10018 -16812 12732 21119 -19432 -25066 -9399 -209 -14035 -23484 13238 11081 -19819
153 -19819 -6253 -1092 2883 1064 -14399 24043 25213 -17167 10444 13466 -14903 4584 4221
166 4221 5016 17059 6309 15694 8833 -1738 17166 3005 5048 28437 6966 7260 15657 -2628
180 -2628 -3972 -6450 -6707 2512 -8549 -418 2617 -18716 -5826 -4003 -22070 -3909 4696 -3666
194 -3666 -763 -1075 74 -7184 -17149 -2336 -25 -9769 562 2720 -4353 -3894 -7440 -6661 2224
209 2224 4587 1534 7391 14757 2331 -6852 2486 1112 -5489 -1934 2274 5495 -3286 -12527 -4547
224 -4547 -5129 -12524 -7248 -164 6051 804 -8436 1664 2104 -12354 -6528 5335 4647 -1674 -1344
$$ packed form
128B1910k7280P417q349K3208K4836n0583J3577M2039m1617k3741K5877K0907
140B8201j8183k6830K9544Q387m0551n634J5667R190j3826r449L6722k157l0900
153a9819J3566N161L975j819j5463L8442J170m2380K7611L022k8369J9487l63
166D221P95J2043j0750R385o861j0571J8904j4161K043K3389k1471K94Q397j8285
180b628j344k478k57R219j1061Q131L035k1333J2890J823j8067J8161Q605q362
194c666K903l12J149p258r965J4813K311r744J0331K158p073M59l546P79Q885
209B224K363l053N857P366j2426r183R338j374o601L555M208L221q781r241P980
224d547n82p395N276P084O215n247r240J0100M40j4458N826J1863o88o321L30
$$ plain form
239 -1344 6597 -2115 -11090 267 3621 1663 9102 8121 10077 11347 234 3391 11236 6291 6699
254 6699 11892 13008 5641 -2659 1938 941 -7831 1158 7099 -116 194 1984 -2164 -7711 -6953 -653
270 -653 -1868 -3814 208 -1906 -7505 -10822 -12681 -8391 -7784 -9007 -2823 139 -3544 -9192 -7175 927
286 927 -6556 -7614 10566 6769 -4581 3061 2211 -4538 -5468 -3868 5288 2297 -3098 5764 770
301 770 -5526 -2133 -4912 1981 4714 -2967 7352 5955 -7768 -1374 -2229 -6047 522 -1718 2313
316 2313 3963 -5148 -762 -1361 -6053 3586 2569 3149 13626 4988 1171 7718 2595 360 4608
331 4608 8570 9539 3252 6018 8507 -3766 -2170 6041 1705 3998 6815 4596 5227 -1255 -4641
346 -4641 1129 -1224 -4764 1224 2911 -2977 -7745 -5220 -5505 -11330 -7408 185 -2427 -3497 -525
$$ packed form
239a344P941q712q975J1357L354j958P439r81J956J270j1113L157P845m945M08
254F699N193J116p367q300M597r97q772Q989N941p215L10J790m148n547P58O300
270f53j215j946M022k114n599l317j859M290O07j223O184K962l683n648K017Q102
286I27p483j058J8180l797j1350P642q50o749r30J600R156k991n395Q862m994
301G70o296L393k779O893K733p681J0319j397j3723O394q55l818O569k240M031
316B313J650r111M386n99m692R639j017N80J0477q638l817O547n123k235M248
331D608L962R69o287K766K489j2273J596Q211m336K293K817k219O31o482l386
346d641N770k353l540N988J687n888m768K525k85n825L922P593k612j070K972
$$ plain form
361 -525 -2509 -5483 -5826 -2271 265 -549 2928 4094 -826 -483 -838 -2233 1580 2876 4267 8411
377 8411 5093 2846 4870 2140 2188 3067 6672 9054 2995 3323 6299 -3799 -3971 1337 -2321 1623
393 1623 1761 -2941 2606 -2973 -7794 -1461 -3467 -1796 1714 -2548 2913 -96 -7826 33 -3293
408 -3293 -3101 2497 -1367 5066 4236 -5800 3676 2239 -3851 5898 3617 5508 9301 -2128 3971
423 3971 5330 -5560 1945 3129 755 3919 -4015 424 390 -13059 -2255 468 -10241 -890 -976
438 -976 -6372 -5243 -11130 -5709 -6408 -14335 -796 -1900 -11937 -3085 -4378 -8902 -5862 -7158 1605
453 1605 1353 -4927 4939 5162 -2407 1099 2571 7006 6657 2269 11576 12320 857 5387 8410 5237
469 5237 7316 5456 8957 12132 4685 1573 6755 5006 -617 1185 6796 5139 -3820 -2877 3749
$$ packed form
361e25j984k974l43L555K536q14L477J166m920L43l55j395L813J296J391M144
377H411l318k247K024k730M8Q79L605K382o059L28K976j0098j72N308l658L944
393A623J38m702N547n579m821O333k006J671L510m262N461l009p730P859l326
408c293J92N598l864O433q30j0036R476j437o090R749k281J891L793j1429O099
423C971J359j0890P505J184k374L164p934M439l4j3449J0804K723j0709R351q6
438i76n396J129n887N421o99p927J3539j104j0037Q852j293m524L040j296Q763
453A605k52o280R866K23p569L506J472M435l49m388R307P44j1463M530L023l173
469E237K079j860L501L175p447l112N182j749n623J802N611j657q959R43O626
$$ plain form
484 3749 -2712 -11478 -2231 2498 -6289 -6834 -1181 -1960 -7538 -11524 -2427 -441 -10070 -3485 2168 -4228
500 -4228 -6583 -5198 -1247 -101 -9142 878 7890 -5969 -1639 6050 -3678 -1688 837 3471 6148
515 6148 -3334 2391 7960 -5361 -1228 2894 -2395 4249 -1887 -1352 8133 -6466 -6696 5541 -3816
530 -3816 -3396 1026 546 5824 -5731 -5341 8484 -4121 -6641 3793 1423 3489 -1437 -3150 8967
545 8967 -1940 -5671 9211 3545 1380 4251 1837 8467 -92 -4980 9993 3967 -2934 6077
559 6077 4315 2056 266 -2262 3709 107 -3372 4216 2234 -1694 -552 -1700 -181 -2403 -3614
574 -3614 1411 -407 -1928 490 -2169 -3779 -1935 -236 -1111 -1335 939 721 946 -36 -3232 1551
590 1551 1079 -1946 3403 1879 -1153 2307 -1026 -894 -335 -3098 4821 1744 -4610 3753 986 -2994
$$ packed form
484C749o461q766R247M729q787n45N653p79n578l986R097J986r629O585N653o396
500d228k355J385L951J146r041J0020P012j3859M330P689r728J990K525K634K677
515F148r482N725N569j3321M133M122n289O644o136N35R485j4599k30J2237r357
530c816M20M422m80N278j1555L90J3825j2605k520J0434k370K066m926j713J2117
545H967j0907l731J4882n666k165K871k414O630q559m888J4973o026o901R011
559F077j762k259j790k528N971l602l479P588j982l928J142j148J519k222j211
574c614N025j818j521K418k659j610J844J699q75k24K274k18K25r82l196M783
590A551m72l025N349j524l032L460l333J32N59k763P919l077o354Q363k767l980
$$ plain form
606 -2994 907 -3924 1141 1051 -3749 4701 -2379 -5309 4787 -4637 -3394 4535 -4014 1344 2527
621 2527 -2895 3935 -3281 -1666 7834 -3120 560 6412 -1463 4910 53 -3455 6998 -2008 67
636 67 7892 -3440 2288 3297 -4743 4831 -1862 -4448 6158 -1970 -1870 1322 -6355 2188 -1876
651 -1876 -8942 2556 -2798 -4031 -56 -6633 -1339 -2575 -8362 2254 -3136 -6089 2404 -4677 -2544
666 -2544 -179 -7309 478 481 -4295 2102 -1384 -529 2216 -3955 2408 1873 -3219 5291 2574 -456
682 -456 3526 -282 3377 2193 -2036 6206 3026 -1285 5897 1572 43 2912 1544 3867 364
697 364 430 7737 9 -1682 5428 1340 801 1477 1751 4746 -1488 -443 6490 -2403 -2393 4011 1020
714 1020 158 -621 757 2683 -3239 -1001 2209 -2847 -972 619 -1347 -1075 -2570 -962 -723 -3976
$$ packed form
606b994L901m831N065r0m800Q450p080k930J0096r424J243P929q549N358J183
621B527n422O830p216J615R500j0954L680N852p875O373m857l508J0453r006K075
636F7P825j1332N728J009q040R574o693k586J0606q128J00L192p677Q543m064
651a876p066J1498n354j233L975o577N294j236n787J0616n390k953Q493p081K133
666b544K365p130P787Lm776O397l486Q55K745o171O363n35n092Q510k717l030
682d56L982l808L659j184m229Q242l180m311P182m325j529K869j368K323l503
697C64O6P307p728j691P110m088n39O76K74K995o234J045O933q893J0O404k991
714A020q62p79J378J926n922K238L210n056J875J591j966K72j495J608K39l253
$$ plain form
730 -3976 -1102 -614 -3227 -856 -1746 -2626 -1882 -2936 -656 -1501 -2635 -155 -1476 -1588 -946 -2342 -336
747 -336 -746 -2023 1263 -613 -642 1572 -1334 873 1420 -594 1718 1594 888 1624 -229 2589 1579
764 1579 -1474 3391 1817 -108 2478 755 1558 2095 -737 2782 2580 -872 2422 1674 463 1062
780 1062 -1224 1859 1867 -2106 1477 2086 -880 377 -181 1446 -323 -2238 2394 74 -2582 1528
796 1528 -535 -1484 633 -1051 126 -9 -2119 176 -267 -1326 -140 -1552 441 -535 -3483 1267
812 1267 -117 -3523 522 -3 -1581 -635 -1201 776 -1106 -2663 1716 -349 -2248 736 -212 -795
828 -795 150 -1073 480 436 -1026 1260 -30 313 1158 -930 1639 1443 -1343 1934 2102 -885 1059
845 1059 1796 1172 1273 42 2316 1625 -580 1648 1836 -157 560 834 1247 361 -1101 1670 545
$$ packed form
730c976K874M88k613K371q90q80P44j054K280q45j134K480j321j12O42j396K006
747c36m10j277L286j876k9K214k906K207N47k014K312j24p06P36j853K818j010
764A579l053M865j574j925K586j723Q03N37k832L519k02l452L294p48j211N99
780A062k286L083Ql973L583O09k966J257n58J627j769j915M632k320k656M110
796A528k063r49K117j684J177j35k110K295m43j059J186j412J993r76k948M750
812A267j384l406M045n25j578R46n66J977j882j557M379k065j899K984r48n83
828g95R45j223J553m4j462K286j290L43Q45k088K569j96k786L277J68k987J944
845A059P37o24J01j231K274o91k205K228J88j993P17K74M13q86j462K771j125
$$ plain form
862 545 -2086 567 133 -1245 41 -857 -960 -874 -2512 -1519 -1152 -2371 -1609 -1985 -2585 -1828 -2845 -2777 -1695
881 -1695 -2627 -2651 -1482 -1608 -2328 -2011 -1677 -921 -2064 -1219 470 -1613 -937 1045 -1120 -731 1581 -191
899 -191 494 1731 852 1415 1164 746 2235 773 1196 3001 1250 1131 2512 1131 1661 1210 1176 2779
917 2779 923 640 3044 986 420 1722 550 997 1070 715 2422 758 -295 2855 439 -820 2150
934 2150 1309 332 1571 877 1148 1194 -795 1005 1183 -38 1569 493 116 1481 -1861 -271 1518
951 1518 -2366 -255 1655 -2190 -499 -1165 -1841 651 -3555 -1613 2197 -3666 -2325 522 -3472 -1385
967 -1385 -1405 -2737 1004 -2232 -1299 1531 -3703 -463 461 -3536 1869 371 -2191 3364 -1182 -1093 2138
984 2138 -2286 1980 1956 -2858 4473 1538 -2689 3543 -42 -295 2182 -1666 3221 1125 -3141 3644
$$ packed form
862E45k631K653m34j378J286q98j03Q6j638R93L67j219P62l76o00P57j017O8J082
881a695r32k4J169j26p20L17L34P56j143Q45J689k083O76J982k165L89K312j772
899a91O85J237q79N63k51m18J489j462M23J805j751j19J381j381N30m51l4J603
917B779j856k83K404k058n66J302j172M47P3l55J707j664j053L150k416j259K970
934B150q41r77J239o94K71M6j989J800J78j221J607j076l77J365l342J590J789
951A518l884K111J910l845J691o66o76K492m206J942L810n863J341K847l994K087
967a385k0j332L741l236R33K830n234L240R24l997N405j498k562N555m546Q9L231
984B138m424M266k4m814P331k935m227O232l585k53K477l848M887k096m266O785
$$ plain form
1000 3644 -361 -3476 2890 -681 -448 1261 -1982 2170 -715 -4252 3399 -881 -2723 2626 -995
1015 -995 -704 916 -2365 537 -406 -1673 1523 -851 32 1586 -2354 195 694 -2429 1114 720
1031 720 -1247 394 -817 -266 -618 -2707 -16 391 -2207 -894 0 -970 -1816 -2098 -547 -1213 -1088
1048 -1088 -78 -948 -484 -443 -1447 -503 -875 378 718 -390 1733 658 -479 2085 707 467 1816
1065 1816 2311 3460 928 643 4705 921 -46 4536 1996 1580 3053 1450 2907 210 -518 3905
1081 3905 -259 37 3720 -393 447 549 -1539 817 -1959 -1407 2010 -2060 -1252 410 -3404 -262
1097 -262 -1628 -3837 1290 -1202 -2090 476 -2722 -970 -1157 -2969 1265 -1404 -2012 2474 -1701 -1657
1113 -1657 -153 -2145 952 -793 -2191 2800 -445 -1374 1221 -1830 -261 -186 -747 2293 -761 -1056
$$ packed form
1000C644m005l115O366l571K33J709l243M152k885l537P651m280j842N349l621
1015i95K91J620l281K902r43j267L196k374Q83J554l940K549M99l123L543l94
1031G20j967J641j211N51l52k089K691M07k598J313Q94r70q46k82J551o66J25
1048a088J010q70M64M1j004R44l72J253L40j108K123j075j137K564j378k40J349
1065A816M95J149k532k85M062l784r67M582k540m16J473j603J457k697p28M423
1081C905m164K96L683m113Q40J02k088K356k776N52L417m070Q08J662l814L142
1097b62j366k209N127k492q88K566l198J752j87j812M234k669o08M486m175M4
1113a657J504j992L097j745j398M991l245r29K595l051J569P5n61L040l054k95
$$ plain form
1129 -1056 2154 -1878 -1056 760 -1084 1827 487 -143 2157 -1388 373 1256 -1362 1886 1395 -49
1145 -49 3733 236 -698 2516 381 1193 1341 812 2984 199 935 2510 -2084 1329 2751 -645 1937
1162 1937 390 -87 2395 -2194 -644 796 -1971 979 -10 -1890 709 -2510 -1274 -94 -3754
1177 -3754 -289 245 -2208 141 -2380 -2080 259 -3609 -565 254 -2874 1283 -536 -1841 587 -2640
1193 -2640 -174 1714 -1784 882 969 -756 924 -1546 105 1489 -1927 2143 1562 -1431 1909 147
1209 147 -908 1258 -1210 1642 2357 -1324 1780 -131 -1073 1844 -1368 494 1586 -1085 2584 892
1225 892 -1634 1467 -844 690 2171 -1264 2329 1867 -1819 1257 -370 -833 2028 -507 1559 1665
1241 1665 -1809 1692 -259 -1978 1068 -1009 464 876 -2514 727 -885 -2773 1195 -2826 -2132
$$ packed form
1129a056L210m032Q22J816j844K911j340o30K300l545J761Q83k618L248m91j444
1145d9L782l497r34L214k135Q12J48n29K172k785P36J575m594L413J422l396K582
1162A937j547m77K482m589J550J440k767K950r89j880K599l219J236J180l660
1177c754L465N34k453K349k521L00K339l868L044Q19l128M157j819j305K428l227
1193b640K466J888l498K666Q7j725J680k470J651J384l416M070n81k993L340j762
1209A47j055K166k468K852P15l681L104j911r42K917l212J862J092k671L669j692
1225H92k526L101k311J534J481l435L593m62l686L076j627m63K861k535K066J06
1241A665l474L501j951j719L046k077J473M12l390L241j612j888L968m021O94
$$ plain form
1256 -2132 1315 -1961 -644 -1096 -2892 143 -1838 -2191 1197 -2108 4 178 -2700 -477 -683 -1477
1272 -1477 1382 -1592 854 1615 -1408 687 187 -1724 1337 1190 600 2549 -222 1157 1362 -1398
1288 -1398 1554 724 179 3257 303 1005 1699 -895 1310 347 -935 1962 502 221 1860 -1291
1304 -1291 -233 661 -1446 771 395 -218 1140 -968 -292 284 -2015 651 494 -962 1412 -682
1320 -682 -639 203 -1620 -406 0 -1122 758 -437 -661 -79 -1518 -1152 -515 -1208 -415 -496 -716 -417 -2121
1339 -2121 -1333 -787 -1698 -434 -490 -722 -700 -1259 -641 -418 -1563 -205 468 316 56 107 679 -545 -903
1358 -903 1439 933 768 1832 1475 1597 876 617 1852 1480 971 2658 1984 1791 1261 368 1899 500
1376 500 85 2521 1372 777 1391 -119 696 -124 -1085 1597 771 -488 1332 -599 -581 -275 -2073 154
$$ packed form
1256b132L447l276J317m52j796L035j981l53L388l305K112J74k878K223k06p94
1272a477K859k974K446P61l023K095n00j911L061j47n90J949k771J379K05k760
1288a398K952q30n45L078k954P02O94k594K205r63j282K897j460k81J639l151
1304a291J058Q94k107K217l76o13J358k108O76N76k299K666j57j456K374k094
1320f82M3Q42j823J214M06j122J880j195k24N82j439L66O37o93P93q1k20K99j704
1339b121P88N46r11J264n6k32K2n59O18K23j145J358O73j52k60N1N72j224l58
1358i03K342n06j65J064l57J22p21k59J235l72n09J687o74j93n30q93J531j399
1376E00m15K436j149n95O14j510Q15q20r61K682q26j259J820j931J8L06j798K227
$$ plain form
1394 154 -242 -1686 1106 -470 -1758 -256 -1666 -617 -207 -1650 995 -277 -1581 209 -1248 -1429
1410 -1429 262 -1414 38 1344 -1564 19 -141 -1660 -353 -904 196 750 -1076 351 647 -1680
1426 -1680 -414 -57 -913 581 -218 277 919 -1302 -547 1029 -361 127 819 363 936 189 -450 778
1444 778 14 -471 1469 824 368 1151 7 562 437 -834 1044 1013 -119 851 700 127 -101 -1299
1462 -1299 492 692 -1033 672 785 -1476 31 -753 -1188 495 -1009 -116 920 -1087 -158 -527 -1327
1479 -1327 -621 -852 -362 881 -1148 -532 123 -1193 -581 -617 -433 620 -824 -518 898 -1147 -1092 -125
1497 -125 -262 -3 135 439 547 -694 -618 91 -95 -716 316 964 683 107 456 403 188 347 625 1552
1517 1552 980 1021 1431 440 844 679 166 1979 1305 1033 2193 623 458 960 -14 1331 922 231 2330
$$ packed form
1394A54l96j444K792j576j288J502j410J049M10j443K645j272j304J790j457j81
1410a429J691j676J452J306k908J583j60j519J307n51J100N54j826J427K96k327
1426a680J266L57q56J494p99M95O42k221P55J576j390M88O92m56N73p47o39J228
1444G78p64m85J940o45m56P83j144N55j25j271J878l1j132R70j51n73k28j198
1462a299J791K00j725J705J13k261J507p84m35J683j504Q93J036k007R29l69q00
1479a327P06k31M90J243k029O16O55j316O12l6J84J053j444L06J416k045N5R67
1497a25j37K59J38L04J08j241P6P09j86o21J032O48k81n76L49n3k15J59K78R27
1517A552n72M1M10r91M04j65n13J813o74k72J160j570j65N02r74J345m09o91K099
$$ plain form
1536 2330 633 -865 835 -311 72 135 -728 1398 -433 -1499 686 -1686 -1572 -89 -1809 64
1552 64 -509 -2271 54 -1481 -2319 109 -1268 -1114 -154 -1784 20 -807 -2126 411 -1269 -886 777
1569 777 -1031 840 310 -1614 717 -181 -1170 1287 -103 370 1040 -726 810 52 -1323 1278 166
1586 166 12 1199 -60 546 -48 -633 910 -303 15 1452 -824 467 1015 -998 568 328 -197
1603 -197 1213 122 576 1086 -781 470 74 -408 1220 341 446 1032 -712 607 -73 -1115 931
1620 931 169 -94 867 -813 -172 -442 -1783 166 -661 -1287 575 -1379 -1011 -958 -2073 -211 -1341 -1637
1638 -1637 390 -1180 -860 -372 -1931 -496 -457 -1798 659 -466 -591 474 -851 -631 205 -911 1328
1655 1328 129 418 1917 -29 785 1102 -301 1312 1149 610 2574 491 539 1929 -291 1217 1240
$$ packed form
1536B330j697j498J700j146L83O3q63K126j831j066K185k372J14J483j720J873
1552F4n73j762K325j535q38K428j377J54R60j630J804q27j319K537j680L83J663
1569G77j808J871n30j924K331q98r89K457j390M73O70j766J536p58j375K601j112
1586A66j54J187j259O06n94n85J543j213L18J437k276J291N48k013J566k40n25
1603a97J410j091M54N10j867J251l96m82J628q79J05N86j744J319o80j042K046
1620I31p62k63R61j680O41k70j341J949q27o26J862j954L68N3j115J862j130k96
1638a637K027j570L20M88j559J435L9j341K457j125j25J065j325K20Q36j116K239
1655A328j199K89J499j946Q14L17j403J613j63n39J964k083M8J390k220J508K3
$$ plain form
1672 1240 175 2051 846 545 1172 -509 781 744 -571 1175 417 -21 1030 -1190 -485 378 -1376
1689 -1376 1010 -33 -1192 669 -412 -669 57 -1949 589 292 -1040 1105 -859 -640 770 -1590
1705 -1590 -20 137 -851 1439 -521 -1024 643 -971 -70 608 -1249 885 67 -797 869 -1320 -873
1722 -873 606 -780 388 -308 -858 1357 -815 -676 1055 -1456 409 1065 -800 1044 48 16 1452
1739 1452 -1100 525 1645 -271 1724 912 -86 1435 -109 710 1477 -963 1671 1703 -116 1248
1755 1248 -242 -159 1803 -806 230 1259 -250 1319 -352 -1141 1389 -805 321 671 -1590 715
1771 715 -272 -1677 188 -1505 -1268 948 -1976 25 -45 -2227 182 -1166 -1385 -689 -1202 -909 -61
1788 -61 -2386 79 -810 -2231 337 -1062 -610 361 -843 463 -320 -1096 566 -462 203 1275 -873
$$ packed form
1672A240j065J876j205l01O27j681J290l7j315J746p58m38J051k220P05Q63j754
1689a376K386j043j159J861j081k57P26k006K538k97j332K145j964K19J410k360
1705a590J570J57r88K290j960n03J667j614R01O78j857K134q18q64J666k189M47
1722h73J479j386J168o96n50K215k172J39J731k511J865O56j865J844r96l2J436
1739A452k552J625J120j916J995q12r98J521j544Q19P67k440K634L2j819J364
1755A248j490Q3J962k609J036J029j509J569j671p89K530k194J126L50k261K305
1771G15r87j405J865j693K37K216k924K001p0k182K409j348k19O96n13K93Q48
1788f1k325K465q89j421K568j399M52R71j204J306p83p76J662j028O65J072k148
$$ plain form
1805 -873 700 926 -817 497 575 856 374 48 1437 916 -214 1737 458 8 1526 501 1438
1822 1438 657 -1264 1074 65 -646 978 -245 161 1192 -547 1027 -417 -906 1147 -896 -43
1838 -43 1041 -889 835 173 -1458 396 -416 -702 883 -1317 321 477 -797 1056 -57 -916 828
1855 828 -621 -152 950 -751 688 -106 -1196 1012 110 -701 1345 -593 38 874 -1406 136 -53
1872 -53 -1077 1440 -113 -140 314 -1417 426 132 -1121 1015 -84 -346 884 -741 320 494 -483
1889 -483 52 423 -926 732 511 700 1082 -482 243 1170 156 860 1180 833 1232 422 944 1364 668
1908 668 282 1037 610 984 205 -61 904 -81 239 344 97 -561 -603 -117 -685 -1019 -175 -839 -1225 -1150 -1434
1929 -1434 -892 -1413 -1949 -436 -1436 -1540 -551 -1264 -1291 -907 -1393 -629 -666 -747 81 -819 -349 61 -971 243
$$ packed form
1805h73J573K26j743J314P8K81m82l26J389n21j130J951j279m50J518j025R37
1822A438p81j921K338j009p11J624j223M06J031j739J574j444m89K053k043Q53
1838d3J084j930J724o62j631J854q12k86J585k200J638J56j274J853j113q59J744
1855H28j449M69J102j701J439p94j090K208r02q11K046j938O31Q36k280J542j89
1872e3j024K517j553k7M54j731J843k94j253K136j099k62J230j625J061J74r77
1889d83N35L71j349J658k21J89L82j564P25R27j014P04L20l47L99q10N22M20o96
1908F68l86P55m27L74p79k66R65r85L20J05k47o58m2M86n68l34Q44o64l86P5k84
1929a434N42n21n36J513j000j04R89p13k7L84m86P64l7q1Q28r00M70M10j032J214
$$ plain form
1949 243 146 -718 1160 479 -325 738 -35 609 872 -587 1254 1184 -266 1186 383 168 676 -38 794
1968 794 710 -492 1174 435 -455 777 47 31 551 -472 947 573 -537 303 503 -734 1269 308
1986 308 226 446 -492 294 185 86 328 -16 296 371 -380 -122 316 -676 -316 131 -361 -76 -472 66 222
2007 222 -941 -290 332 -597 -634 142 -290 -891 -424 -918 -566 68 -697 -606 -114 -385 -139 -452 -103 -266
2027 -266 -172 312 315 -270 296 377 257 556 200 918 901 396 904 529 446 450 869 495 827 665 812 927 246
2050 246 642 501 114 542 407 551 114 -104 453 -117 -257 -79 -464 -87 39 -363 -108 -443 -292 -884
2070 -884 -771 -340 -595 -875 -40 -541 -600 -35 -682 -436 -677 -702 56 -694 -1063 266 -562 -588 -120 -809 -28
2091 -28 -307 -256 344 -626 -25 353 -992 425 295 -374 267 73 -273 525 -329 247 414 -282 502 119
$$ packed form
1949B43r7q64J878o81q04J063p73O44K63j459J841p0j450J452q03k15N08p14Q32
1968G94q4j202J666p39q90J232p30j6N20j023J419l74j110Q40K00j237K003r61
1986C08q2K20r38P86j09r9K42l44L12P5p51K58M38r92L60M47m92K85l96N38J56
2007B22j163O51O22r29l7P76m32o01M67m94L52O34p65R1M92k71K46l13L49j63
2027b66R4M84Ln85N66Q1j20K99l56P18j7n05N08l75q3MM19l74L32j62J47J15o81
2050B46L96j41l87M28j35J44m37k18N57n70j40J78l85L77J26m02K55l35J51n92
2070h84J13M31k55k80Q35n01n9N65o47K46k41k5P58p50l69J329q28k6M68o89P81
2091b8k79N1O00r70O01L78j345J417j30o69O41j94l46P98q54N76J67o96P84l83
$$ plain form
2111 119 -226 458 -210 85 700 -432 478 264 -414 861 -141 -201 919 -185 100 774 -251 451
2129 451 84 99 832 -534 246 677 -323 571 366 -137 800 -137 214 470 -482 542 572 -686 561
2148 561 -46 -735 840 -489 40 147 -884 1 -576 -743 225 -991 -620 -108 -1087 -621 -612 -1413 -221
2167 -221 -968 -735 102 -1234 -163 -72 -1289 245 -285 -698 408 -686 -89 369 -853 703 69 -364
2185 -364 1368 -149 636 1155 -57 945 567 97 1520 274 398 1377 134 1045 1182 24 990
2202 990 521 191 1099 -483 676 1084 -832 614 -13 -561 597 -421 -278 465 -852 240 77
2219 77 -1202 140 -485 -542 332 -1404 -407 -283 -1041 477 -550 -1003 470 -1018 -427 456 -1262 77
2237 77 77 -746 474 -567 -173 618 -613 -36 409 -524 539 -239 -309 572 -476 339 716 -825 550
$$ packed form
2111A19l45O84o68K95O15j132R10k14o78J275j002o0J120j104K85O74j025P02
2129D51l67J5P33j366P80M31j000Q94k05n03R37r37L51K56r52J024L0j258J247
2148E61o07o89J575j329N29J07j031Q85n77j67R68j216L71N12r79M66Rq01J192
2167b21p47K33Q37j336J071R1j217J534n30m13J106j094N97M58j222J556o34m33
2185c64J732j517P85N19j212J002l78m70J423j246J24R79j243R11J37j158R66
2202I90m69l30R08j582J159M08j916J446o27n48J158j018J43P43j317J092j63
2219G7j279J342o25n7Q74j736R97J24p58J518j027m53J473j488N91Q83j718J339
2237G7%q23J220j041L94P91j231N77M45r33J063p78p0Q81j048Q15L77j541J375
$$ plain form
2256 550 457 -391 936 -383 -187 694 -141 701 352 -316 725 39 116 740 -229 460 798 -150 822 -163
2276 -163 302 1025 -546 554 853 -302 857 260 -98 644 -243 696 526 -652 714 496 -418 815
2294 815 -340 56 393 -1067 209 -211 -1128 575 -761 -767 411 -1422 -284 -319 -1637 26 -769 -995
2312 -995 49 -1775 -598 31 -1291 94 -477 -1429 492 -843 -493 343 -1244 379 426 -1031 761
2329 761 90 -386 1277 -362 577 1037 -152 1315 379 -100 1455 -142 360 1497 -115 578 1366
2346 1366 -116 1210 413 82 1158 -554 329 827 -344 726 640 -254 682 -155 76 576 -668 109
2364 109 32 -415 524 -306 -227 406 -468 72 182 -451 444 -461 -309 223 -829 119 35 -305 -61 -161 -228
2385 -228 115 -815 310 -53 -717 -43 -269 -583 -91 -465 -12 -246 -832 226 -110 -587 168 -584 105
$$ packed form
2256E50r3q48J327j319J96Q81q35Q42l49o68J041o86P7O24r69O89L38r48R72r85
2276a63M65P23j571J100K99j155J159n97l58P42q87R39j70j178J366k18r14J233
2294H15j155L96L37j460J276m20r17J703j336oJ178j833J138l5j318J663p95k26
2312i95J044j824J177O29j322J385n71r52J921j335L50Q36j587J623M7j457J792
2329G61o71m76J663j639R39M60j189J467r36m79J555j597N02J137j612O93P88
2346A366j482J326p97l31J076j712Q83M98j171J070q6q94R36q37K31N00j244P77
2364A09p7m47R39q30P9O33q74N40J10o33Q95r05J52N32j052R48q4l40K44j00o7
2385b28L43r30J125l63o64O74k26l14M92l74M53k34n86J058l36m77P55p52O89
$$ plain form
2404 105 86 -602 335 239 -430 724 -171 216 850 -473 805 661 -301 839 557 -50 904 257 275 1234
2424 1234 -15 828 918 -817 784 -461 -109 591 -574 344 306 -742 249 491 -564 130 -371 -569
2442 -569 -117 -684 -263 68 -853 199 -471 -652 249 -759 -190 128 -689 -83 -89 -493 -93 -360 -334 127
2462 127 -601 -13 -38 -472 132 62 102 98 -325 236 77 -184 351 380 19 325 43 358 164 -226 242 103
2484 103 285 140 188 380 358 -25 12 183 51 274 324 428 347 183 447 103 189 510 276 332 151 -160
2506 -160 430 305 93 304 165 254 222 -252 228 -158 238 342 -275 46 234 -146 -19 172 -191 123 84
2527 84 -218 -134 -366 -327 -23 -496 -230 -71 -517 20 -169 -176 -471 -768 -321 -443 -452 -399 -269 -573 -294 -301 -537
2550 -537 -559 -271 -384 -403 -202 -259 171 -394 -248 -207 92 37 223 202 415 243 192 314 128 473 334 387 551
$$ packed form
2404A05j9o88R37r6o69J154q95L87O34j323J278j44r62J140k82o07R54o47J8R59
2424A234j249Q43R0j735J601j245L52P00j165R18l8j048R91K42j055O94n01j98
2442e69M52n67M21L31r21J052o70j81R01j008N69L18q17O06om04M00k67K6M61
2462A27p28N88k5m34O04p0M0mm23N61j59k61N35K9l61L06k82L15j94l90M68j39
2484A03J82j45M8J92k2l83L7J71j32K23N0J04q1j64K64l44Q6L21k34N6j81l11
2506a60N90j25k12K11j39Q9l2m74M80l86L96J04o17L21J88l80J27J91l63L14l9
2527H4l02Q4k32L9L04m73K66J59m46N37j89pk95k97M47j22rN3J30l04K79pk36
2550e37k2K88j13j9K01n7M30n65J46M1K99n5J86k1K13j72n1J22j86L45j39N3J64
$$ plain form
2573 551 359 409 532 292 475 694 573 494 513 321 138 235 -114 487 318 64 299 -185 -47 -187 -376
2594 -376 -126 -130 -31 -226 -216 -384 53 -237 -394 -158 -550 -449 -231 -1064 -613 -105 -378 -873 -555 269 -43
2615 -43 -288 -143 -357 -410 457 29 108 158 -85 -294 33 -152 229 58 274 114 500 974 332 11 699
2636 699 -118 204 688 328 304 -113 229 417 795 379 498 307 876 138 381 487 1019 729 1492 -682
2656 -682 -28 964 179 797 -113 489 315 247 723 -227 -43 318 -234 -286 236 -501 -149 57 -766 -291 -18
2677 -18 -589 191 -774 -241 -91 -1644 -118 44 -750 71 -639 -696 -39 -493 530 -396 -205 -602 -414 -254
2697 -254 266 353 -382 88 -183 1031 461 -211 180 -506 249 241 1 94 606 -107 593 -85 255 639 118
2718 118 541 816 5 678 219 -76 676 221 385 671 108 615 464 137 385 178 60 554 -151 555
$$ packed form
2573E51j92N0J23k40J83K19j21p9J9j92j83R7l49O01j69k54K35m84J38j40j89
2594c76K50mR9j95J0j68M37k90j57K36l92J01K18q33M51N08k73m95L18Q24l12
2615d3k45J45k14n3Q67m28P9N0k43k09L27j85L81j71K16j60L86M74o42l21O88
2636F99q17L22M84l60k4m17L42J88L78m16J19j91N69p38K43J06N32k90P63k174
2656f82O54R92p85O18r10O02j74o8M76r50J84L61n52n2N22p37L52K06q23M75K73
2677a8n71P80r65N33J50j553J526J62p94Q21p10n7O57m54J023r26J91l97J88J60
2697b54N20Q7p35M70k71J214n70o72L91o86P55qk40R3N12p13P00o78L40L84n21
2718A18M23K75q11O73m59k95P52m55J64K86n63N07j51l27K48k07j18M94p05P06
$$ plain form
2738 555 376 -194 504 -420 105 231 -595 213 171 -352 97 -172 -405 250 -469 -34 87 -728 566 -258
2758 -258 -732 154 -551 -11 -143 -1203 12 -265 -644 416 -661 -237 523 -714 227 89 -723 332
2776 332 -440 -637 617 -583 249 604 -759 240 -129 -179 615 -182 82 591 -336 842 553 -377 666
2795 666 257 249 1022 -273 146 882 -283 613 375 147 897 9 93 534 -320 87 510 -671 698 896
2815 896 -92 579 -661 -229 -45 -558 320 -171 -560 340 -807 -166 93 -954 -164 -245 -642 -85 -594
2834 -594 -278 155 -793 -57 -191 -559 187 -116 -123 344 -628 500 185 -380 466 67 139 625 -726 10
2854 10 579 -397 647 245 236 678 -179 520 595 -630 600 117 -517 620 -361 243 659 -384 515 303
2874 303 -172 749 -310 -115 855 -486 294 476 -508 823 94 -26 581 -453 122 557 -524 370
$$ packed form
2738E55j79n70O98r24N25J26q26Q08m2n23M49k69k33O55p19M35J21q15J294q24
2758b58m74Q86p05N40j32j060J215k77l79J060j077M24P60j237R41j38q12J055
2776C32p72j97J254j200Q32L55j363R99l69n0P94p97K64N09r27J178k89r30J043
2795F66m09qP73j295M19P36j165Q96k38k28P50q88Q4M41q54M07M23j181J369J98
2815H96r88O71j240M32J84n13Q78m91l89R00j147O41K59j047P90q1l97N57n09
2834e94L16M33r48P36j34l68P46l03pM67r72J128l15n65Q46l99P2M86j351P36
2854A0N69r76J044m02rM42q57O99P5j225J230m83o34J137r81O04M16j043Q99k12
2874C03m75R21j059J95R70j341P80J82r84J331p29j20O07j034N75M35j081Q94
$$ plain form
2892 370 185 -205 658 -375 -277 236 -1038 186 278 -745 240 -291 -376 235 -653 -316 115 -1231 18
2911 18 -532 -528 260 -874 -485 -307 -707 -333 -304 -807 -1 -332 -279 191 -355 -48 344 -422 309 24 -209
2932 -209 265 -286 602 422 -175 691 167 92 583 -82 256 321 -49 724 227 -133 798 174 150 461 94
2953 94 643 285 -96 699 208 225 708 -230 547 583 -399 361 -27 -29 362 -243 80 148 -373 271 -61 -396
2975 -396 274 -488 -233 98 -458 174 -162 -561 -53 -424 -511 148 -614 -398 -308 -908 278 -143 -400 207
2995 207 -312 -351 -55 -390 31 -21 -588 190 17 -66 333 -86 139 386 -199 280 285 32 408 -89 282 337
3017 337 -50 463 199 15 263 374 298 404 39 270 203 -96 190 -234 -39 242 -129 -35 215 -336 79
3038 79 -72 -5 37 -299 -216 221 -409 -21 -5 -388 106 -77 -380 -89 -488 -38 -153 -330 34 -180 -273 -12
$$ packed form
2892C70j85l90Q63j033R8N13j274J224R2j023R85n31q5O11q88L37M31j346J249
2911A8n50MP88j134L89J78m00L74K9n03Q06l31N3M70n46L07L92p66P31k85k33
2932b09M74n51Q88j80n97Q66n24p5M91o65L38O5l70P73m97l60R31o24k4L11l67
2953I4N49l58l81P95m91J7M83r38P77L6r82P60l88kL91o05L23O8n21O44l32l35
2975c96O70p62K55L31n56O32l36l99N08l71q7O59p62K16R0o00J186m21k57O07
2995B07n19l9K96l35M21n2n67P78j73q3L99m19K25K47n85M79Nk53L76m97L71N5
3017C37l87N13k64j84K48J11p6J06l65K31o7k99K86m24J95K81l71R4K50n51M15
3038G9j51O7M2l36Q3M37o30L88J6l83M94j83l03K91l99M50j15j77L64k14r3K61
$$ plain form
3060 -12 -202 -306 -56 -431 -122 -248 -286 -253 -373 -213 -313 -279 112 0 140 -91 5 169 50 -23 97 137
3082 137 74 414 160 360 534 307 323 267 386 325 173 170 488 232 483 461 163 213 256 420 155 304 293
3105 293 275 382 -16 277 47 28 -98 -93 -30 -12 20 5 -240 121 194 -223 75 -122 -83 -115 -328 -178 -141 -39
3129 -39 66 -135 -173 -253 -202 -122 -10 -75 -233 -185 -597 -26 -115 -646 -162 -215 -371 -532 70 -555 250 -139 -118
3152 -118 434 -616 -181 443 -22 261 -460 -515 45 -59 -84 457 718 147 173 -33 266 189 153 433 233
3173 233 120 304 -62 173 255 456 411 248 369 35 102 145 246 36 211 15 -16 113 30 -67 -273 -203 -15
3196 -15 -13 -154 294 -195 -248 -59 -134 -403 -414 -184 -111 -384 -195 -92 -523 -175 -751 -406 -424 -334 -205 88 -412
3219 -412 110 -146 -353 245 139 -277 171 -361 306 292 -217 328 48 -32 279 -46 141 476 -121 342 426
$$ packed form
3060a2j90j04K50l75L09j26l8L3j20J60j00L4L91j12J40k31R6J64j19p3J20M0
3082A37o3L40k54K00J74k27J6n6J19o1j52lL18k56K51k2k98N0M3J64k65J49j1
3105B93j8J07l98K93k30j9j26NO3J8L2j5k45L61P3m17K98j97L9l2k13J50L7J02
3129c9J05k01l8q0N1Q0J12o5j58M8m12N71q9n31M84n3j56j61O02o25Q05l89K1
3152a18N52j050M35O24m65K83p21n5N60j04k5N41K61n71K6k06K99p7l6K80k00
3173B33j13J84l66K35Q2K01m5j63J21l34O7M3J01k10J75j96l1J29q3r7k06P0J88
3196a5Kj41M48m89n3J89p5k69j1K30P3k73J89J03m31L48n76L45j8R0J29K93n00
3219d12N22k56k07N98j06m16M48n32O67j4n09N45k80q0L11l25J87L35n97M63Q4
$$ plain form
3240 426 -90 346 -38 156 606 -97 411 394 90 228 79 234 297 80 86 549 -394 260 289 -349 358 -22
3262 -22 -145 204 -218 26 280 -248 312 -227 -345 261 -419 -92 -100 -411 116 609 -613 75 -159 -462 228
3283 228 -496 -82 -34 -440 -606 -693 13 149 -560 176 -19 -186 -115 -113 -128 190 -393 72 241 -418 93 131
3305 131 -161 122 -322 9 586 -129 192 64 -148 517 303 220 739 -101 567 639 52 357 110 196 426
3326 426 51 481 430 -324 596 229 -241 294 -292 13 373 -87 209 143 -264 287 33 -210 269 -478 -3
3347 -3 353 -803 117 52 -412 139 -669 -331 216 -713 -210 -19 -390 39 -309 -344 -142 -563 -111 173 -967
3368 -967 294 -257 -637 234 -416 -287 239 -493 95 48 -411 353 -358 -117 285 -440 138 142 -332 592 -150
3389 -150 -42 511 -35 34 185 -174 616 166 222 503 -27 203 309 -265 671 220 19 757 -47 -11 202
$$ packed form
3240D26n16M36l84J94M50p03N08j7l04J38j49J55O3k17OM63r43O54K9o38P07l80
3262b2j23L49m22K44K54n28N60n39j18O06o80L27ql11N27M93j222O88k34l03O90
3283B28p24M14M8m06j66q7P06J36p09P36j95j67P1Kj5L18n83M65J69o59N11L8
3305A31k92K83m44L31N77p15L21j28k12O65k14q3N19q40O68P2n87L05k47Q6K30
3326D26l75M30n1p54R20l67m70N35n86L05L60m60K96o6m07N51k54k43M79p47M75
3347cL56j156R20o5m64N51q08L38N47r29N03J91l71M29l48l5K02m21M52K84j140
3368i67J261n51l80Q71o50J29N26p32N88m7m59P64p11K41M02p25N78Mm74R24p42
3389a50J08N53n46O9J51l59P90m50N6K81n30K30J06n74R36m51k01P38q04L6K13
$$ plain form
3410 202 -364 -217 93 -122 377 -112 -36 259 -531 20 -74 -423 -75 -251 -282 241 -372 -117 270 -570 6
3431 6 -134 -261 304 -261 -265 140 -426 -126 -63 -619 370 -83 -127 212 -358 22 333 -214 392 -96 -302 467
3453 467 -220 -40 148 -163 286 105 -207 167 -371 65 440 -4 187 303 -36 424 298 -26 321 -233
3473 -233 510 195 -37 395 380 -86 403 6 252 218 -14 478 229 84 453 34 -21 522 -21 236 180
3494 180 -177 143 -53 -431 -24 -396 -140 171 -617 -86 -337 -504 -171 -363 29 -145 -607 -187 -223 -189 -6
3515 -6 -444 -241 -155 -256 -197 5 -236 284 -264 -382 148 -99 -67 213 -95 115 22 127 265 -329 158 161 266
3538 266 72 45 -258 270 -27 92 493 -153 363 133 107 86 63 56 283 1 384 -59 -34 309 244 170 448
3561 448 109 167 293 102 -74 192 -138 309 -120 261 19 -224 -109 130 -219 -134 -10 -187 186 -540 -196
$$ packed form
3410B02n66J47L10k15M99m89P6K95p90N51r4l49L48j76l1N23o13K55L87q40N76
3431Fj40j27N65n65mM05n66L00O3n56R89m53m4L39n70L80L11n47O06m88k06P69
3453D67o87J80J88l11M49j81l12L74n38M36L75m44J91J16l39M60j26l24L47n54
3473b33P43l15k32M32j5m66M89l97K46l4k32M92k49j45L69m19n5N43n43K57n6
3494A80l57L20j96l78M07l72K56L11p88N31k51j67L33j92L92j74m62M20l6L4J83
3515fm38K03Q6j01N9K02k41N20n48j18N30k47L2K80l08K10r3J05J38n94M87LJ05
3538B66j94k7l03N28k97J19M01o46N16k30k6k1k3pK27k82L83m43K5L43o5p4K78
3561D48l39N8J26j91j76K66l30M47m29L81k42k43J15K39l49Q5J24j77L73p26L44
$$ plain form
3582 -196 -111 -136 -13 42 -336 -142 -82 -253 -66 -377 116 33 -346 12 -284 -181 8 -107 18 106 45 39 -55
3605 -55 149 123 -99 -86 121 -116 449 -72 85 233 94 373 -9 48 382 151 76 330 95 204 146 39
3627 39 255 -26 45 271 31 21 230 -38 -32 284 29 62 -361 -172 50 -114 -241 8 -184 -26 95 -79
3649 -79 164 -165 -175 -93 -221 -298 -204 -257 -22 -181 -394 16 250 -57 272 -19 -45 -6 10 69 9 -184 207 60
3673 60 -268 208 130 373 -363 -516 -105 -157 535 991 749 -65 235 41 291 -34 -91 167 120 40 145 350
3695 350 166 143 177 19 224 349 358 215 226 277 362 98 7 49 -51 112 -143 310 128 -275 196 -72 -55
3718 -55 108 -218 -14 117 -186 152 -226 -143 109 372 -726 -52 -22 -266 43 -194 -368 -197 -194 278 -257
3739 -257 -402 105 -263 -324 95 -35 -54 -29 -81 -47 -171 80 51 98 73 -85 -67 -150 -135 150 175 -54 113 332
$$ packed form
3582a96Q5k5J23N5l78J94O0j71J87l11M93q3l79L58k96J03J89j15J25Q8o1or4
3605e5K04k6k22J3K07k37N65n21J57J48j39K79l82N7L34k31p5K54k35J09n8j07
3627C9K16k81P1K26k40j0K09k68OL16k55L3m23J89K22j64j27K49j92J58J21j74
3649g9K43l29j0Q2j28p7R4n3K35j59k13M10K34l07L29k91k6L9J6N9o0j93L91j47
3673F0l28M76p8K43p36j53M11n2O92M56k42q14L00j94K50l25n7K58m7q0J05K05
3695C50j84k3L4j58K05J25Rj43J1N1Q5k64r1M2j00J63k55M53j82m03M71k68J7
3718e5J63l26K04J31l03L38l78Q3K52K63j098O74L0k44L09k37j74J71LM72n35
3739b57j45N07l68o1M19j30j9K5n2L4j24K51k9M7k5j58J8q3J5K85K5k29J67K19
$$ plain form
3763 332 -118 292 267 73 -44 149 106 -51 -64 398 255 -28 291 -72 107 27 271 313 110 266 685 -200
3785 -200 277 32 104 108 -160 -85 136 -87 -120 111 -201 178 -89 -326 -59 -175 14 -83 -478 16 -89 -347
3807 -347 104 -402 -538 131 -277 -277 -134 -208 96 -398 -271 242 -149 -336 16 -189 -141 127 -66 202 -160
3828 -160 -90 248 -157 153 399 -84 183 58 33 251 -37 171 202 213 236 19 -84 167 110 15 141 187 158
3851 158 115 -2 348 -17 -106 351 -306 147 458 -218 172 303 128 211 -196 -51 116 97 217 -54 -45 287
3873 287 -254 160 -293 -433 228 -218 -270 74 -430 -261 35 -413 8 -59 -583 45 -171 -349 42 -682 -52
3894 -52 143 -178 -65 -340 -72 168 -124 47 147 -484 -142 184 -233 299 -68 -110 232 -218 190 215 -147
3915 -147 186 21 -190 530 95 4 25 -261 291 -78 126 403 -39 -1 302 -95 80 249 2 269 56
$$ packed form
3763C32m50M10k5j94j17J93m3j57j3M62j43k83L19l63J79q0K44M2k03J56M19q85
3785b00M77k45P2Mk68P5K21k23l3K31l12L79k67k37K67j16J89r7l95M94j05k58
3807c47M51n06j36O69m08%J43p4L04m94J27N13l91j87L52k05M8K68j93K68l62
3828a60P0L38m05L10K46m83K67j25k5K18k88K08L1J1K3k17j03K51n7r5J26M6k9
3851A58m3j17L50l65q9M57o57M53L11o76L90J31j75Q3m07J45J67j9J20k71RL32
3873B87n41M14m53j40O61m46n2L44n04J69K96m48M21o7n24O28k16j78L91p24O30
3894e2J95l21J13k75K68K40k92J71J00o31L42L26m17N32l67m2L42m50M08K5l62
3915a47L33j65k11P20m35r1K1k86N52l69K04K77m42L8L03l97J75J69k47K67k13
$$ plain form
3936 56 82 -3 -89 -10 219 -160 221 -218 -286 75 -422 -132 56 -129 54 -25 -186 443 -391 -151 145 -162
3958 -162 -82 -295 -300 162 -328 -297 173 -212 117 -4 -208 -228 -232 -301 102 -169 -96 57 -186 19 -48 -359 223
3981 223 74 -75 42 -261 252 136 -101 262 -88 -124 58 -165 264 192 -162 595 291 -65 609 24 312
4002 312 111 -39 483 318 -149 464 -35 -217 198 -242 415 92 -148 481 -48 -196 268 -246 -16 93
4022 93 -541 172 53 -215 86 -399 -220 163 -291 265 -326 -186 273 -227 -324 -150 -448 117 -365 -221 97
4043 97 -40 -489 122 -128 10 268 -143 -116 76 -121 169 -38 44 28 -55 -7 -19 -179 229 116 197 102 -185
4066 -185 120 49 -85 217 257 -1 373 -428 206 140 4 355 166 65 288 -85 123 128 75 505 270 -175
4088 -175 36 43 72 156 -96 -136 4 30 223 75 -325 442 -337 -107 -136 -200 116 -69 -194 194 40 -142 202
$$ packed form
3936E6K6q5q6P9K29l79L81m39o8L61m97K90J88j85J83p9j61O29q34K40K96l07
3958a62Q0k13nM62m90L1M70l85L29j21k04k0mo9M03k71P3J53k43K05o7l11N82
3981B23j49j49J17l03N13j16k37L63l50l6J82k23M29p2l54P57l04l56O74n85K88
4002C12k01j50N22j65m67O13m99j82M15m40O57l23k40O29n29j48M64n14K30J09
4022I3o34P13j19k68L01m85J79L83m54N56n91J40M59n00r7J74k98N65m82J44L18
4043I7j37m49O11k50J38K58m11K7J92j97K90k07Q2j6q3M8j2j60M08j13Q1r5k87
4066a85L05p1j34L02M0k58L74q01O34o6j36L51j89j01K23l73K08Nn3M30k35m45
4088a75K11PK9Q4k52m0J40K6J93j48m00P67p79K30k9o4L16j85j25L88j54j82L44
$$ plain form
4111 202 -67 58 153 -244 7 -430 -234 256 -167 -162 57 -45 38 -147 -139 -236 -18 -110 52 -107 -62 128 -200
4134 -200 156 -129 -25 -4 -10 178 184 -113 121 -135 145 233 -96 109 180 -285 -182 164 145 22 -289 107 164
4157 164 -291 -119 150 -75 24 -60 11 -13 -14 -56 300 -150 4 66 -70 -112 -254 -136 47 -16 -82 -86 -63 2 -34
4182 -34 -270 -63 -404 -211 -138 -174 -255 -91 -66 -213 -224 -185 37 -26 15 -76 -95 62 25 47 169 -11 58 -49 -107
4207 -107 125 182 148 48 -28 -23 117 70 280 -33 85 52 25 -93 144 -19 10 -66 330 430 40 17 275 209
4231 209 345 56 -20 -12 89 134 -19 1 76 269 -87 86 -100 -222 122 -59 -412 -107 -35 223 184 -68 -375
4254 -375 -64 -3 -74 47 -327 -12 -106 -321 -80 -239 -329 -265 18 -155 -26 49 -42 -70 -25 -278 -91 -361 60
4277 60 -109 -49 -132 -76 -40 -18 269 178 91 175 48 135 327 310 177 180 157 0 378 -177 339 186 -163 -58 151
$$ packed form
4111B02k69J25R5l97K51m37J96M90m23NK19j02Q3j85Qr7K18r2J62j59M5J90l28
4134b00L56k85J04K1oJ88Ok97K34k56K80Q8l29K05P1m65J03L46j9j23l11L96N7
4157A64m55J72K69k25R9q4P1k4jm2L56m50J54O2j36m2j42J18J83o3o6mK3O5l6
4182c4k36K07l41J93P3l6q1J64K5j47j1L9K22o3M1r1j9J57l7K2J22j80O9j07n8
4207a07K32N7l4j00p6NJ40m7K10l13J18l3k7j18K37j63K9p6L96J00l90k3K58o6
4231B09J36k89p6QJ01M5j53K0P5J93l56J73j86j22L44j81l53L05P2K58l9k52l07
4254c75L11O1p1J21l74L15r4k15K41j59r0O4K83j73J29P5r1k8M5k53J87k70M21
4277F0j69O0q3N6L6K2K87r1q7Q4j27Q7J92j7j33Lk3j57L78n55N16j53l49J05K09
$$ plain form
4302 151 2 153 -274 -72 -361 -77 53 70 166 -46 50 190 224 -190 281 19 -119 -3 -162 -170 -133 -147 188
4325 188 -47 68 -261 -129 58 276 -71 47 47 -215 -84 -105 -212 -31 -238 -130 -138 -214 151 -178 -8 272
4347 272 -310 -116 28 -275 172 -134 -169 75 -27 -210 250 -56 78 229 -145 125 -64 -133 186 -73 82
4368 82 200 -38 175 -123 -72 289 -62 174 87 -264 298 290 -254 187 -142 -26 277 -92 49 105 -359 -23
4390 -23 16 97 373 -213 205 177 93 178 -151 -214 38 16 -171 253 -316 56 89 -427 -19 82 -125 191 -354
4413 -354 -11 72 -732 -14 66 -357 -163 -246 -326 -61 -65 -34 -317 -570 57 -94 -271 206 -195 111 -147 7
4435 7 125 166 -71 480 43 -242 307 -112 390 290 161 380 -4 -2 164 -235 369 195 -172 211 -314 27
4457 27 557 106 47 406 -146 52 -99 35 229 -267 -27 83 -96 47 -147 -162 176 -102 46 251 -389
$$ packed form
4302A51j49J51m27K02k89K84J30J7R6k12R6J40L4m14M71k62j38J16j59qL7j4L35
4325A88k35J15l29J32J87K18l47J18%k62J31k1j07J81k07J08qp6L65l29J70K80
4347B72n82J94J44l03M47l06l5K44j02j83M60l06J34J51l74K70j89o9L19k59J55
4368H2J18k38K13k98N1L61l51K36q7l51N62qn44M41l29J16L03l69J41N6m64L36
4390b3L9Q1K76n86M18k8q4Q5l29o3K52k2j87M24n69L72L3n16M08J01k07L16n45
4413c54L43Q3q04P18Q0m23J94q3q0K65mL1k83k53O27j51j77M77m01L06k58J54
4435GJ18M1k37N51m37k85N49m19N02j00j29K19l84KJ66l99O04j74l67L83n25L41
4457B7N30m51n9L59n52J98j51J34J94m96K40J10j79J43j94j5L38k78J48K05o40
$$ plain form
4478 -389 -65 119 -264 161 -196 -212 -38 -89 143 -12 -381 -226 -238 -166 -28 5 44 -31 -281 127 69 -273 -199
4501 -199 -176 9 253 -191 -43 -24 93 -75 -4 -123 213 -42 146 244 -297 174 -38 -401 219 -11 32 74
4523 74 -66 275 -5 103 -17 -191 -311 85 -20 294 -42 -87 165 -292 -129 467 48 31 239 -11 313
4544 313 42 -175 73 -529 -96 163 -114 -233 -212 -292 76 -247 -165 172 -436 -77 158 -277 156 -280 -252
4565 -252 172 -9 -60 52 61 216 -61 -91 101 -241 -4 300 -155 51 -291 62 128 -14 86 351 -342 22
4587 22 -156 -14 288 -1 -51 526 -46 61 367 -45 185 203 108 -19 -232 406 244 -200 100 162 73 -507
4609 -507 367 662 365 -144 251 -111 130 344 -199 917 814 660 -596 616 58 -593 -292 -67 146
4628 146 -119 -158 210 -41 -125 52 -124 -11 -253 -79 43 -53 198 -54 -421 61 -110 -137 29 -53 -116 -160
$$ packed form
4478c89L24J84l83M25l57j6J74n1K32j55l69J55j2P2J38L3L9p5k50M08n8l42P4
4501a99K3J85K44m44J48J9J17j68P1j19L36k55J88R8n41M71k12l63O20k30M3M2
4523G4j40L41k80J08j20j74j20L96j05L14l36m5K52m57J63N96m19j7K08k50L24
4544C13k71k17K48o02M33K59k77j19K1q0L68l23Q2L37o08L59K35m35M33m36K8
4565b52M24j81n1J12RJ55k77l0J92l42K37L04m55K06l42L53O6j42J00K65o93L64
4587B2j78J42L02k89n0N77n72J07L06m12K30J8r5j27k13O38j62m44L00O2q9n80
4609e07Q74K95k97n09L95l62K41K14n43J116j03j54j256J212n58o51L01K25K13
4628A46k65l9L68k51q4J77j76J13k42J74J22r6K51k52l67M82j71k7J66q2o3m4
$$ plain form
4650 -160 -259 -208 -102 -305 145 148 35 17 -96 174 237 -1 121 -200 188 344 30 167 7 -142 150 -94
4672 -94 -86 305 -200 -59 -15 -93 215 107 54 -91 83 69 103 -94 202 39 -19 62 -8 -92 161 -91 -304 -26
4696 -26 -185 207 -225 243 -43 -175 136 -95 -174 84 -211 -332 -203 -320 163 201 -315 -234 -283 -188 31 3
4718 3 -494 51 -135 -321 -58 -131 43 -163 -134 -85 -236 -14 55 -202 -28 58 42 117 -181 -95 9 -134 166
4741 166 54 -2 -150 20 -164 48 29 151 4 -41 -45 236 223 8 147 -204 -36 1 -36 45 33 131 63 67 95
4766 95 -167 86 -198 -108 -86 499 -255 119 -292 163 -142 -108 169 -55 -326 171 186 -210 20 -159 -221 -206
4788 -206 -130 -79 -69 -141 -24 -267 -254 -151 -135 221 13 75 158 -247 -74 146 -125 0 29 104 23 -187 -149 -39
4812 -39 54 24 216 54 3 65 291 421 -19 294 -5 208 68 276 16 22 149 145 21 71 -10 322 86 -30
$$ packed form
4650a60r9N1J06k03M50Lj13j8j13K70O3k38J22l21L88J56l14J37j60j49K92k44
4672i4QL91n05J41M4p8L08j08n3j45J74j4L4j97K96j63n8Q1p0q4K53k52k13K78
4696b6j59L92m32M68k86j32L11k31p9K58k95j21J29j17M83L8n16Q1m9R5K19k8
4718Cm97N45j86j86K63p3J74k06K9M9j51K22O9k57J74Q6j6P5k98Q6J04j43L00
4741A66j12n6j48J70j84K12j9J22j47m5mK81j3k15J39l51J68L7l7Q1j2R8o8MK8
4766I5k62K53k84R0K2N85p54L74m11M55l05L4K77k24k71M97J5l96K30j79o2J5
4788b06P6N1J0p2J17k43J3J03J6L56k08O2Q3m05J73K20k71J25K9P5q1k10L8J10
4812c9R3l0J92j62n1O2K26J30m40L13k99K13j40K08k60OJ27mj24N0q1L32k36j16
$$ plain form
4836 -30 73 -21 181 -88 249 -8 -16 -102 132 -63 -59 152 -203 -39 -21 38 -44 15 -94 -191 -149 -82 -43 13 -101
4861 -101 89 -154 -382 -6 -210 -134 -182 -147 -16 -165 -203 88 -144 -23 264 -45 3 -134 81 66 -336 -33
4883 -33 -148 -4 93 13 -131 -85 -318 62 -16 -273 69 -39 44 281 53 -182 114 104 185 -173 -34 9 159
4906 159 100 224 265 -235 41 177 137 84 71 37 -299 -128 204 -57 194 -141 24 63 -110 -52 -118 -131 72
4929 72 -103 20 190 -281 -276 34 -22 -179 -89 -291 -143 -263 -82 104 -351 -269 54 -149 46 -99 -131 233
4951 233 -216 -294 75 -112 75 29 -179 22 209 261 19 -52 236 320 -13 123 -109 80 325 -6 172 50
4973 50 -3 98 -79 69 134 -219 71 200 -64 35 17 -70 180 -145 40 29 -294 -66 173 -95 292 -8
4995 -8 -175 266 32 -123 182 136 -73 2 -166 155 -257 -81 -156 -153 -349 -71 -49 65 53 -156 107 -100 129
$$ packed form
4836c0J03r4K02k69L37k57qq6K34j95MK11l55J64J8N9q2N9j09r7M2O7L9N6j14
4861a01J90k43k28L76k04P6m8L5J31j49l8K91k32J21K87l09M8j37K15j5m02L03
4883c3j15J44R7q0j44M6k33L80p8k57L42j08Q3K37k28k35K96j0Q1l58J39M3J50
4906A59n9J24M1n00K76J36m0n3j3l4l36J71L32k61K51l35J65L9j73N8o6j3K03
4929G2j75J23J70m71NL10n6j57R0k02J48j20J81J86m55Q2L23k03J95j45l2L64
4951B33m49p8L69j87J87m6k08K01J87N2k42p1K88Q4l33J36k32J89K45l31J78j22
4973E0n3J01j77J48O5l53K90J29k64R9j8q7K50l25J85j1l23K28K39k68L87l00
4995hj67M41k34j55L05m6k09P5j68L21m12J76p5Lj96K78K2J14j2k09K63k07K29
$$ plain form
5018 129 13 -143 -21 -192 114 65 -398 -121 -19 -184 260 44 -188 209 113 -88 339 -306 204 249 160
5039 160 247 -177 124 99 39 274 73 -32 382 -271 264 323 -47 59 61 -69 209 147 -80 72 15 97 256
5062 256 -10 26 160 -99 120 64 58 -239 -21 158 36 -115 -28 -70 -41 272 -448 243 141 -149 40 69 112
5085 112 255 -272 -159 21 -38 177 56 -115 -125 -228 -30 137 -291 -138 -274 -374 154 -69 -85 -96 -10 72
5107 72 -151 -29 79 217 228 174 -236 142 154 -26 325 273 -56 184 -37 -122 309 -210 214 176 -15 288
5129 288 221 207 371 -105 324 36 -215 280 -83 -10 -20 -66 -24 262 -238 -102 -21 -202 -10 124 -90 -75 -141
5152 -141 135 -37 -60 -115 -1 -197 -26 -336 227 63 -431 104 -112 79 182 398 42 236 -691 554
5172 554 -81 -121 -563 -250 -221 -326 354 -5 532 -61 148 115 -35 108 86 -60 273 -207 452 182 -124
$$ packed form
5018A29j16j56J22j71L06m9m63K77J02j65M44k16k32L97r6k01M27o45N10M5q9
5039A60Q7m24L01k5o0K35k01j05M14o53N35N9l70J06Kj30K78o2k27J52n7Q2J59
5062B56k66L6J34k59K19n6ok97K18J79j22j51Q7m2K9L13p20O91j02k90J89K9M3
5085A12J43n27J13J80n9K15j21j71j0j03J98J67m28J53j36j00N28k23j6j1Q6Q2
5107G2k23J22J08J38J1n4m10L78J2j80L51n2l29K40k21q5M31n19M24l8j91L03
5129B88o7j4J64m76M29k88k51M95l63P3j0m6M2K86n00J36Q1j81J92J34k14J5o6
5152a41K76j72k3n5J14j96J71l10N63j64m94N35k16J91J03K16l56J94r27J245
5172E54o35m0m42L13K9j05O80l59N37n93K09l3j50J43k2j46L33m80O59k70l06
$$ plain form
5193 -124 178 -197 -25 84 9 -106 -5 58 177 -152 -38 337 -88 -35 229 -138 391 -174 86 74 115 9
5215 9 -158 -19 1 -77 -303 34 80 -240 -217 -105 -216 30 -18 -7 39 89 -14 9 9 -168 45 -74 -298 18
5239 18 -52 2 -153 -83 120 -374 -233 -372 152 -119 -82 240 -274 -151 67 93 -11 -123 155 98 85 -129 -64
5262 -64 15 112 145 -283 167 7 26 -37 -102 93 316 190 218 17 -33 354 -87 143 61 -37 171 91 10 -82 129
5287 129 199 6 -71 243 -58 84 204 -134 178 196 606 136 191 -156 206 221 -120 69 -107 -75 -59 -52 -90
5310 -90 -165 17 5 -202 -248 54 -20 -18 -234 -104 38 -192 -96 -24 -212 -38 57 39 -26 -167 8 -258 173 40
5334 40 14 -139 306 -125 -75 -52 -73 57 65 35 391 157 102 18 73 62 45 -122 -107 131 139 -145 191 -5 -77 143
5360 143 -14 -81 160 237 27 181 -47 24 -29 -195 151 -30 64 -17 28 67 73 39 20 -164 -118 -62 75 -104 -6
$$ packed form
5193a24L02l75J72J09p5j15J01O3J19l29J14L75m25N3K64l67N29n65K60j2M1j06
5215Ij67J39K0p8k26L37M6l20K3J12j11K46m8J1M6N0j03K3%j77K13j19k24L16
5239A8p0N4j55P0K03m94J41j39N24k71L7L22n14J23K18K6j04j12K78n7j3k14O5
5262f4P9R7L3m28M50j60J9o3o5J95K23j26K8k01n0L87m41K30q2r8K08q0q1r2K11
5287A29P0j93p7L14l01J42J20l38L12J8M10m70N5l47L62J5l41J89j76L2J6Pl8
5310i0p5J82j2k07m6L02p4Kk16J30J42k30R6P2j88J74R5j8o5j41J75k66M31j33
5334D0k6j53M45m31N0K3k1J30Ql0L56k34n5q4N5j1j7j67J5K38Qk84L36j96p2K20
5360A43j57o7K41P7k10J54k28P1n3j66L46j81R4q1M5L9Ol4j9j84M6N6J37j79R8
$$ plain form
5385 -6 -2 -81 49 -78 181 1 114 -66 -105 56 -107 -91 -158 -117 -216 -346 -175 -68 -8 -112 107 200 -304 -33
5409 -33 200 157 -36 63 -4 -3 156 214 -187 5 211 15 -91 78 -20 59 -159 -125 233 159 190 -25 -8 283
5433 283 -97 354 235 210 72 29 -230 57 -71 26 72 42 184 -102 24 57 -164 -156 92 -271 22 -32 -49
5456 -49 -183 -50 -272 -54 -17 236 99 -2 -51 142 132 122 -88 97 -205 3 -235 -74 -299 -41 -73 -286
5478 -286 143 -240 155 63 -33 250 207 -174 -189 -110 -229 189 -200 2 217 16 147 47 -15 200 153 172 -70
5501 -70 -189 164 29 -253 240 78 -120 213 54 202 -1 -145 75 130 57 276 167 90 -97 -59 331 -14
5523 -14 25 182 58 -181 91 -204 -296 -137 -319 280 -166 157 197 -115 25 115 -108 -89 -233 81 -1 -155
5545 -155 49 14 -341 -335 -175 -41 111 -97 121 189 -321 -50 12 -120 111 13 94 32 -9 8 5 -296 99 -64
$$ packed form
5385fMp9J30j27K59j80J13j80l9J61j63J6o7M1r9j30J71J07O0j04K19R3n04K71
5409c3K33m3j93R9o7JJ59N8m01J92K06j96j06J69r8P9k18L4L58p4L1k15J7K91
5433B83l80M51j19k5j38m3k59K87j28R7M6l0J42k86J26L3k21QK48l63K93n4j7
5456d9j34J33k22K18L7K53j37j01m9J93j0j0k10J85l02K08k38J61k25K58l2k13
5478b86M29l83L95r2r6K83m3l81j5P9j19M18l89K02K15k01J31j00o2K15m7J9k42
5501g0j19L53j35k82M93j62j98L33j59J48k03j44K20N5p3K19j09p7j87L8L90l45
5523a4L9J57j24k39K72k95r2J59j82N99m46L23M0l12J40R0k23J9j44L14q2j54
5545a55K04l5l55OJ60J34J52k08K18O8n10K71O2j32K31r8Q1o2m1J7ll01L95j63
$$ plain form
5569 -64 28 120 18 68 293 -12 113 260 30 156 -41 95 204 159 18 11 74 148 -158 58 451 -53 -87
5592 -87 -26 -239 351 -345 -339 336 110 2 488 -269 350 188 -256 -50 118 -295 342 -54 -56 -122 -50 134 134
5615 134 -223 517 -742 -105 -71 -108 -149 -173 -148 -136 -319 -109 173 -351 -12 140 -283 -18 -521 23 356 -257
5637 -257 38 62 -189 313 263 -59 289 -36 214 116 -49 -183 104 16 269 88 133 142 -175 331 -61 80
5659 80 265 -81 -33 246 -291 42 -132 -139 63 -6 99 193 67 -30 278 177 133 199 -183 85 93 34 101 -594
5683 -594 24 -325 -169 -52 -143 -165 77 -457 200 -310 -326 71 -121 -155 257 -236 -63 521 -363 -233 2
5704 2 -173 177 -41 68 140 14 -82 -18 130 101 -179 -162 30 -24 339 -23 0 44 237 -23 275 3 -47 211
5728 211 -128 224 248 -91 407 -12 -93 212 -5 109 153 -11 -216 67 184 402 43 -150 245 -23 109
$$ packed form
5569f4R2R2j02N0K25l05J25J47k30J26j97J36J09m5j41pO3P4l06K16L93n04l4
5592h7O1k13N90o96OO75k26j08M86p57O19j62m44K06J68m13O37l96ko6P2J84%
5615A34l57P40j259O37L4l7m1k4K5J2j83K10K82n24L39J52m23K65n03N44L33o13
5637b57K95K4k51N02n0l22L48l25K50r8j65j34K87q8K53j81M5Rl17N06l92J41
5659H0J85l46M8K79n37L33j74pK02o9J05R4j26r7L08j01m4O6l82K68Qn9O7o95
5683e94O18l49J56J17r1k2K42n34O57n10j6L97j92l4M12m93J73N84q84J30K35
5704Bj75L50k18J09P2j26r6O4J48k9k80J7J92n4L63l62K3M4J93k60K98k72n0K58
5728B11l39L52K4l39M98m19q1L05k17J14M4j64k05K83J17K18l59j93L95k68J32
$$ plain form
5749 109 137 1 -169 -128 -158 -151 -143 -253 -128 -119 -189 83 -150 -245 -369 -73 -50 -315 -136 -86 -191 -74 -156 -206 133
5774 133 9 -11 67 -311 -188 -437 -52 31 -186 166 195 -5 187 201 -36 280 135 -161 -18 -123 -182 -80
5796 -80 -252 -88 -91 -166 155 -59 85 -206 252 189 -58 -238 552 -68 -160 163 5 94 65 76 30 -33 159 202
5820 202 -84 40 154 -157 27 -128 -45 -94 -22 86 -141 -307 197 -31 96 -113 102 -51 27 -9 -136 5
5842 5 -53 18 -102 42 62 119 -280 -360 -218 209 83 164 98 -99 -168 224 -14 113 -124 -39 -22 -176 -138 73
5866 73 81 270 65 -37 27 42 49 96 -12 65 61 -48 230 89 79 31 187 170 61 -169 -37 -196 62 256 -47
5891 -47 -4 -29 -132 -53 -121 -49 229 -2 217 69 129 -103 -36 -60 -166 0 -10 -159 16 -171 -261 -113 -70 -100
5915 -100 -120 16 -21 7 -76 -9 -19 -105 75 109 -161 -23 -30 -120 -72 -101 130 93 9 80 -29 -25 112 16 202 34
$$ packed form
5749A09K8j36j70M1l0PQj10J25Rp0K72k33r5j24K96K3k65J79N0j05J17q2n0L39
5774A33j24k0P8l78J23k49L85Q3k17L52K9k00J92J4k37L16j45k96J43j05n9J02
5796h0j72J64lp5L21k14J44k91M58o3k47j80P90o20r2L23j58Q9k9J1m6o3J92M3
5820B02k86J24J14l11J84j55Q3m9P2J08k27j66N04k28J27k09K15j53P8l6j27J41
5842En8P1j20J44K0N7l99q0J42M27j26Q1o6j97o9L92k38J27k37Q5J7j54L8K11
5866G3QJ89k05j02O4J5PM7j08P7mj09K78j41j0m8J56j7j09k30J32j59K58J94l03
5891d7M3k5j03P9o8P2K78k31K19j48O0k32O7k4j06J66j0j49J75j87r0J48M3l0
5915a00k0J36l7K8q3O7j0q6J80L4k70J38pr0M8k9K31l7q4P1j09MJ37r6J86j68
$$ plain form
5941 34 13 -59 64 244 -171 74 230 -233 45 -113 52 130 265 -35 219 -332 131 381 -18 162 166 239
5963 239 384 -97 265 77 -134 261 -21 -170 139 102 -18 129 -234 -146 -133 35 175 -227 -147 39 -116
5984 -116 -7 22 99 -22 60 -230 59 -113 -64 41 -227 -14 162 -76 -46 0 -191 -255 -212 -80 -91 -132 -56 -41
6008 -41 -41 -63 -202 78 119 -341 150 -136 -140 350 156 103 136 -81 3 325 139 -2 203 -98 68 -76 -89 163
6032 163 178 285 -18 182 237 -23 36 140 -35 -28 -2 -119 117 -212 -103 278 -16 31 -73 1 45 -310 106
6055 106 -154 -180 32 80 34 -287 -68 -100 198 -26 71 49 -253 25 -23 -275 80 -43 -74 47 -254 -55 54
6078 54 -113 70 -160 1 185 -132 4 128 -159 243 -244 22 233 96 -143 -27 -144 -96 -5 56 331
6099 331 -57 -6 149 -36 165 89 -25 -129 187 42 98 -51 94 126 -227 90 85 4 143 64 -43 -31 -227
$$ packed form
5941C4k1p2J23J80m15K45J56m63K78j58J65P8J35l00K54n51M63K50l99J80MP3
5963B39J45m81L62j88k11L95k82j49L09l7j20J47l63Q8J3J68J40m02Q0J86j55
5984a16J09K9P7j21Q2k90K89j72M9J05k68K13J76k38L0M6j91o4M3J32j1m1P6J5
6008d1%k2j39K80M1m60M91k86mM90j94n3L3k17Q4L22j86j41K05l01J66j44j3K52
6032A63J5J07l03K00N5k60N9J04j75PK6j17K36l29J09L81k94M7j04P4M4l55M16
6055A06k60k6K12M8m6l21K19l2K98k24R7k2l02K78m8k52L55j23l1J21l01J99J09
6078E4j67J83k30J61J84l17J36J24k87M02m87K66K11j37k39J16j17M8R1O1K75
6099C31l88N1J55j85K01p6j14j04L16j45N6j49J45L2l53L17nq1J39p9j07J2j96
$$ plain form
6122 -227 226 193 -184 375 97 10 12 -299 -41 -82 -135 78 -139 -240 206 -212 -78 190 -357 148 -281 11
6144 11 -93 -242 -71 118 -65 -88 -138 -466 121 -112 -66 8 -154 14 -16 -236 61 -195 -260 -51 -113 -10 157
6167 157 -75 129 402 97 281 -33 -87 83 -49 133 138 -90 117 321 -17 27 283 -2 231 -546 285
6188 285 117 300 -5 157 -117 394 243 -122 89 -81 153 161 25 405 -140 230 -42 26 -767 -310 -96
6209 -96 120 -50 129 356 403 279 -286 469 -38 89 -92 23 -80 133 -422 -659 41 415 -339 140 280
6230 280 -67 -260 -285 145 -72 -102 -76 -317 -260 31 -81 8 -123 -192 31 134 211 -365 -268 245 964 496 342
6253 342 280 510 -66 -171 641 180 180 48 224 40 119 -102 82 41 -375 307 72 63 39 -34 -210 70 -70
6276 -70 200 125 -177 265 -18 -107 60 187 -50 -60 -26 8 -250 -56 -43 -28 -141 -153 -147 129 -58 -162 245 -161
$$ packed form
6122b27M53l3l77N59k78q7Kl11K58m1n3K13k17j01M46m18J34K68n47N05m29K92
6144A1j04j49J71J89j83k3n0l28N87k33M6P4j62J68l0k20K97k56o5K09o2J03J67
6167A57k32K04K73l05J84l14n4J70j32J82Nk28K07K04l38M4K56k85K33p77Q31
6188B85j68J83l05J62k74N11j51l65K11j70K34Qj36L80n45L70k72O8p93M57K14
6209i6K16j70J79K27M7j24n65P55n07J27j81J15j03K13n55k37P00L74p54M79J40
6230B80l47j93k5M30k17l0K6k41N7K91j12Q9j31o9K23J03P7n76R7N13P19m68j54
6253C42o2K30n76j05Q12m61%j32J76j84P9k21J84m1m16O82k35rk4p3j76K80j40
6276g0K70p5l02M42k83q9J67J27k37j0L4L4k58J94J3J5j13j2OK76j87j04M07m06
$$ plain form
6300 -161 -45 -81 -56 27 13 -74 -169 -222 -43 -277 -114 -8 -53 77 -17 -210 139 -24 -47 308 230 223 167 -12 137
6325 137 -52 -237 -56 179 112 -49 113 -84 52 296 -67 217 92 30 309 62 -37 109 62 158 -164 241
6347 241 89 80 -15 80 5 -189 67 108 -6 -359 -202 78 -62 -261 -153 -187 54 -165 61 263 -286 -18
6369 -18 -351 -9 46 -6 22 60 28 228 -12 -112 184 14 -244 9 -333 -125 49 59 25 130 242 -75 -72
6392 -72 -147 345 -261 175 -191 -38 23 198 -117 71 368 217 180 457 -468 -292 -802 652 878 85 205
6413 205 64 -118 97 184 -53 145 -213 51 -1 -87 186 -168 33 86 26 21 -138 45 -255 -127 -339 34
6435 34 -18 95 -37 -14 -107 -318 -74 -60 244 -70 -153 185 -168 -321 -203 -127 -37 -272 131 -206 -119 -33 -106 37
6459 37 205 20 -154 72 -47 35 108 -179 -204 -52 -245 -138 76 -83 -240 45 -29 184 -1 86 161 -63
$$ packed form
6300a61J16l6K5Q3j4q7r5n3J79k34J63J06m5J30r4j93L49j63k3L55p8pn6j79J49
6325A37j89j85J81K35o7j61J62j97J36K44l63K84j25o2K79k47r9J46m7R6l22M05
6347B41j52rr5R5p5j94K56M1j14l53J57K80j40j99J08l4K41k19K26K02n49K68
6369a8l33L42N5n2K8L8l2K00k40j00K96j70k58K53l42K08J74J0l4J05J12l17L
6392g2p5M92o06M36l66J53O1J75l15J88K97j51l7K77r25J76n10J454K26p93J20
6413B05j41j82K15Q7k37J98l58K64n2q6K73l54K01N3o0nj59J83l00J28k12L73
6435C4n2J13j32K3r3k11K44J4L04l14q3L38l53j53J18P6R0k35M03l37Q7Q6p3J43
6459C7J68j85j74K26j19Q2P3k87k5J52j93J07K14j59j57K85p4K13j85Q7P5k24
$$ plain form
6481 -63 49 65 185 38 67 208 20 -1 -129 265 414 -93 237 95 116 41 203 -109 -199 -194 -230 214 -194
6504 -194 -212 101 -95 -133 117 -284 39 151 -34 81 -245 89 -84 -59 0 -289 -207 21 -53 -137 -255 -290 -56
6527 -56 -179 33 200 -43 -43 -84 -71 25 -230 119 23 -231 -135 91 -18 9 225 41 -9 271 17 -68 56 -12
6551 -12 166 -27 220 49 -187 -138 -329 76 247 89 44 276 151 143 75 -217 -143 40 168 -6 -89 98 67
6574 67 -64 357 -303 49 107 -82 266 29 56 -111 -91 -48 26 29 -235 -100 149 157 -251 -141 81 -264 -5
6597 -5 179 -149 -179 -301 -70 123 -321 -355 -185 -145 80 60 -74 -166 -81 -43 -109 -206 79 -107 129 48 -78 78
6621 78 -4 -191 243 38 -84 -12 120 -22 257 0 73 337 111 248 276 99 195 66 277 1 -69 237
6643 237 367 -6 73 -131 20 134 -89 168 237 64 276 331 -71 -65 -78 39 10 -221 -1 23 -216 -219 -332
$$ packed form
6481f3J12J6J20j47K9J41j88k1j28L94J49n07L30j42K1p5J62l12r0Nl6M44m08
6504a94j8L13j96l8K50m01L23J12j85J15l26L34j73K5N9k89Q2K28p4q4j18l5K34
6527e6j23K12J67k43%m1J3R6k55L49r6k54R6K26j09K7K16j84n0K80k54q5J24o8
6551a2J78j93K47j71k36M9j91M05J71j58m5K32j25qo8k92P4J83J28j74q3J87l1
6574F7j31M21o60L52N8j89L48k37K7j67K0M3P4Lk64J35K49Qm08J10K22l45K59
6597eJ84l28l0j22K31J93m44l4J70M0K25k0j34r2Q5L8o6r7K85j86K36q1j26J56
6621G8q2j87M34k05j22P2J32j42K79k57P3K64k26J37K8j77R6j29K11k76p0L06
6643B37J30l73P9k04J51J14k23K57O9j73K12N5m02Oj3J17k9k31K20K4k39lj13
$$ plain form
6666 -332 -195 169 -246 -151 110 65 -83 -149 -144 -27 -156 170 -149 -220 -181 -139 -95 -298 -124 25 153 -176 75
6689 75 -20 -44 -12 -47 -82 62 47 -219 -28 -245 445 200 113 83 152 20 183 -98 98 58 -40 197 151 335
6713 335 173 -107 90 124 -42 151 -52 -12 144 -152 205 -23 -75 160 135 209 -52 -54 49 42 14 363 -103
6736 -103 -222 99 -213 -28 33 -259 101 -200 -119 70 -321 -122 -135 -66 -150 51 -219 -104 -136 -98 159 -19
6758 -19 -56 93 -331 -91 3 132 235 -194 109 147 -29 193 69 -49 299 -168 81 -24 12 -9 -64 -47 66
6781 66 2 287 116 -42 215 358 -7 -168 149 -86 139 -217 8 133 -289 117 112 107 264 -53 54 119
6803 119 -71 -137 113 -101 -96 34 -235 108 -292 -176 144 -9 -31 -136 -60 -68 -67 -19 199 228 29 149 -270 -147
6827 -147 -130 -43 38 -374 30 -81 -134 85 -12 -101 160 -19 -82 -46 -205 -75 98 -20 192 -186 35 40 227
$$ packed form
6666c32J37L64m15R5K61m5j48o6NJ17j29L26l19p1L9M2M4k03J74J49J28l29K51
6689G5r5k4L2l5l5J44j5k66J91k17O90k45q7l0O9j32J63k81J96m0r8K37m6J84
6713C35j62k80J97L4j66J93k03M0J56k96L57k28n2K35k5P4k61kJ03pk8L49m66
6736a03j19L21l12J85O1k92L60l01Q1J89l91J99j3O9q4K01k70J15l2L8K57j78
6758a9l7J49m24K40R4J29J03m29L03L8j76K22j24j18L48m67K49j05L6k1n5J7J13
6781F6o4K85j71j58K57J43l65j61L17k35K25l56K25J25m22M06nnJ57l17J07O5
6803A19j90o6K50k14NJ30k69L43m00J16L20j53k2j05P6qJM8K18K9j99J20m19J23
6827a47J7Q7Q1m12M04j11n3K19r7q9K61j79o3L6j59J30J73j18K12l78K21NJ87
$$ plain form
6850 227 83 39 -42 243 122 -10 282 -67 8 170 -99 196 -20 13 58 51 152 86 -279 186 -77 14 121
6873 121 119 22 -14 65 -157 -305 3 42 -492 50 -417 -106 -30 -47 -134 445 96 13 509 107 396 97 -164
6896 -164 55 0 -117 95 -262 -119 -450 -406 -62 -233 -166 -112 -154 -131 192 33 -29 -16 -218 425 -41 35 125
6919 125 68 195 53 -168 -21 297 147 155 91 148 187 -220 77 31 144 217 115 246 47 60 47 9 -210 -58
6943 -58 -21 81 8 125 -139 128 -75 93 -6 52 133 135 -163 -87 -58 -18 -162 -15 -240 158 -70 201 -151 133
6967 133 -265 -433 -372 -522 -312 219 15 159 -131 -36 -222 -110 -89 -139 -279 268 -29 -78 -50 -84 -26 102 -15
6990 -15 12 -152 4 263 -78 -57 85 31 178 -185 -41 49 177 -88 77 75 5 91 61 236 -22 91 67 -90
7014 -90 47 14 61 -106 50 322 106 23 128 181 268 -69 18 -116 -106 -118 12 -196 -123 -50 100 -71 -22 -230
$$ packed form
6850B27j44m4q1K85j21j32K92l49P5J62k69K95k16L3M5pJ01o6l65M65k63R1J07
6873A21kr7l6P9k22j48L08L9n34N42m67L11P6j7q7N79l49q3M96m02K89k99k61
6896a64K19n5j17K12l57J43l31M4L44j71O7N4m2K3L23j59o2J3k02O43m66P6R0
6919A25n7J27j42k21J47L18j50Qo4N7L9m07K97m6J13P3j02J31j99J3j3l8k19J52
6943e8L7J02p3J17k64K67k03J68r9N8Q1Kk98P6K9M0j44J47k25L98k28K71l52K84
6967A33l98j68O1j50K10N31k04J44k90R5j86J12K1n0j40N47k97m9K8l4N8J28j17
6990a5K7j64J56K59l41K1J42n4J47l63J44R0J28k65J65kp0Q6l0J75k58J13k4j57
7014i0J37l3M7j67J56K72k16q3J05N3Q7l37Q7j34J0j2J30k08P3P3J50j71M9k08
$$ plain form
7038 -230 -185 -109 -110 121 -228 -27 -47 -219 -66 -183 -101 -28 2 -254 -205 -126 -33 -86 -115 133 294 -234 63 -45
7062 -45 169 -136 -410 40 -28 -51 41 -48 32 161 -168 39 -35 49 132 78 46 76 -104 -77 -216 -53 240 77
7086 77 77 357 58 -77 132 127 216 32 4 -93 -11 -142 -77 -5 87 252 163 118 26 -90 284 43 280 15 -138
7111 -138 -42 31 -72 -270 95 113 280 -284 -103 -229 -27 -210 -251 -48 -307 -260 84 61 -57 -53 21 -69 88
7134 88 -150 86 13 -214 374 179 41 228 -198 16 -43 -317 102 139 262 -34 -23 -6 145 53 98 54 61 79
7158 79 -191 191 442 -121 38 84 -118 66 337 261 -26 27 -223 523 209 430 -265 131 264 -309 389
7179 389 47 -72 -90 58 12 -193 12 -563 -57 -34 293 -74 25 559 172 224 379 184 -188 -101 -151 -236 -138
7202 -138 47 159 -65 149 447 -236 -25 141 96 -193 -128 -14 62 -350 90 99 47 113 127 -7 8 -4 41 188
$$ packed form
7038b30M5P6jK31l49K01k0j72J53j17Q2P3L0k56M9P9R3n3k9K48J61n28K97j08
7062d5K14l05k74M50o8k3R2q9Q0J29l29K07p4Q4Q3n4l2L0j80K7j39J63K93j63
7086G7%K80k99j35K09nQ9j84k8r7Q2j31O5P2R2J65q9m5r2j16L74k41K37k65j53
7111a38R6P3j03j98L65J8J67n64J81j26K02j83m1K03k59M7L44k3j18MP4r0J57
7134H8k38K36p3k27N88j95j38J87m26K14n9k74M19L7J23k96J1J7J51r2M5m4PJ8
7158G9k70L82K51n63J59M6k02J84K71p6k87N3k50P46l14K21o95L96J33n73O98
7179C89l42j19j8J48m6k05K05n75N06K3L27l67R9N34l87N2J55j95l72Q7n0q5R8
7202a38J85J12k24K14K98o83K11J66m5k89O5J14P6m12M40Rn2O6J4j34J5j2M5J47
$$ plain form
7226 188 -140 120 184 170 40 169 208 142 -122 131 47 198 354 51 -230 125 63 -28 325 173 303 20
7248 20 31 93 -92 183 110 -183 68 65 231 -53 -20 9 114 -48 -142 123 -148 -46 -283 -202 -64 -59 -81 149
7272 149 -157 98 -97 -193 156 -123 -235 -369 -21 99 228 -66 69 -55 -238 107 -257 -103 66 -265
7292 -265 135 -31 -53 77 -286 133 328 -191 -20 79 206 222 -148 -42 185 -208 221 -374 -209 285 149
7313 149 -13 127 -12 68 76 -118 238 27 165 310 -138 -299 281 -171 186 -3 13 21 -214 32 75 -197
7335 -197 -238 -27 -95 -110 -55 -132 -40 -140 4 -113 -89 -77 -365 -215 -69 -227 7 35 -418 -198 -89 32 -104
7358 -104 -119 229 -57 90 11 25 -30 -60 -152 3 -54 100 -126 61 -122 259 -96 -76 -18 210 98 -28 8
7381 8 439 -197 -66 187 -341 -24 278 -31 -305 -50 85 174 -28 171 120 -184 159 -72 26 149 -29 -156
$$ packed form
7226A88l28K60O4j4j30J29L9o6k64K53q4J51J56l03k81L55o2r1L53j52J30k83
7248B0J1O2j85K75p3k93K51lJ66k84L3K9J05j62r4K65k71J02k37Q1J38Nk2K30
7272A49l06K55j95r6L49k79j12j34L48J20J29k94J35j24j83L45l64J54J69l31
7292b65M00j66k2J30l63M19J95n19J71R9J27J6l70J06K27l93M29n95J65M94j36
7313A49j62J40j39Q0Qj94L56k11J38J45m48j61N80m52L57j89J6Qk35K46M3k72
7335a97m1K11o8j5N5p7R2j00J44j17K4J2k88J50J46j58K34K8m53K20J09J21j36
7358a04j5L48k86J47p9J4n5l0r2J55n7J54k26J87j83L81l55K0N8K28j12j26L6
7381HM31o36J31K53n28L17L02l09k74K55J35Q9k02J99n1l04L43k31R8J23j78j27
$$ plain form
7403 -156 166 131 132 148 -195 219 -12 -74 -38 -143 56 117 -278 -151 -142 -217 136 -76 -153 94 34 -139 281 -79
7427 -79 69 -265 27 -42 -74 35 136 -174 31 -104 -139 -155 -114 -60 303 118 -67 121 89 186 -22 71 84 -44
7451 -44 -156 5 50 14 15 -8 154 91 136 272 -210 48 190 161 66 -47 -32 255 -258 134 -209 -59 193 -136
7475 -136 186 -56 -5 53 81 -222 -124 -143 -44 -89 -170 -300 282 -184 254 94 -51 112 13 43 -119 -69 51 195
7499 195 25 -28 -327 -112 202 -190 -38 64 188 -198 -108 16 -155 94 -2 -5 -215 -39 -124 -123 303 175 45
7522 45 132 162 172 -82 -93 -80 20 -114 -42 97 196 36 207 4 116 48 182 169 -131 179 29 171 47
7545 47 20 69 -74 234 -74 104 85 198 337 19 334 120 -45 -289 22 -103 -57 -182 -45 -78 -222 -80
7567 -80 -66 -203 40 14 -145 -135 -289 -288 -193 -45 -51 -81 79 203 -27 -6 20 46 187 -225 -195 -155 173 205 90
$$ packed form
7403a56L22l5JJ6l43M14k31o2L6j05J99O1l95J27Rp5L53k12p7K47o0j73M20l60
7427g9J48l34K92o9l2J09J01l10K05j35l5j6M1N4L63j85j85J88l2R7k08R3J3j28
7451d4j12J61M5l6Jk3J62o3M5J36m82K58J42k9r5j13J5K87n13L92l43J50K52l29
7475a36L22k42N1N8K8l03R8j9R9m5q1j30N82m66M38j60j45J63r9L0j62N0J20J44
7499A95j70n3k99K15L14l92J52J02J24l86R0J24j71K49r6lk10J76q5JM26j28j30
7522D5Q7L0J0k54j1J3J00j34P2J39R9j60J71k03J12o8J34j3l00L10j50J42j24
7545D7k7M9j43L08l08J78j9J13J39l18L15k14j65k44L11j25M6j25J37l3j44J42
7567h0J4j37K43k6j59J0j54JR5J48ol0J60J24k30K1K6K6J41m12L0M0L28L2j15
$$ plain form
7592 90 -43 -255 5 -47 -59 -22 95 -198 -121 -66 106 -19 189 95 -85 -128 88 -69 -173 130 245 369 -46
7615 -46 194 -32 152 209 -253 -39 97 -39 -176 -16 165 94 116 82 -44 -160 30 -352 -79 -55 54 -7
7637 -7 -74 -74 123 -172 -97 -5 -150 -22 -216 147 -115 -88 -111 -22 4 -87 113 -368 -109 129 -325 -146 -139 -210 108
7662 108 -293 -143 -89 -157 54 -200 -52 67 -106 -314 -88 -12 191 85 -53 9 74 -103 106 348 143 111
7684 111 21 175 211 -62 145 -40 254 118 17 159 4 -52 60 73 133 224 169 -171 5 126 -395 121
7706 121 207 95 140 -267 -219 -336 -167 -482 35 248 -155 124 -25 138 438 -368 294 -20 -468 -7 232
7727 232 -343 186 -204 341 123 218 162 374 -73 -53 200 -129 -92 152 -261 174 80 -113 83 57 50 -39 -26
7750 -26 -116 -106 37 110 23 246 275 -157 -47 -179 -86 -181 32 -66 -126 -24 103 10 -79 120 -70 40 113 -270
$$ packed form
7592I0j33k12K60n2j2L7J17k93P7N5J72j25K08r4j80m3K16j57j04L03J15J24m15
7615d6K40k26J84N7m62K14J36j36j37J60J81p1K2l4j26j16J90l82K73K4J09o1
7637go7%J97k95P5R2j45J28j94L63k62K7k3Q9K6r1K00m81K59K38m54J79Pp1L18
7662A08m01J50N4o8K11k54J48J19j73k08K26P6K03j06j38O2O5j77K09K42k05l2
7684A11r0J54L6k73K07j85K94j36j01J42j55n6J12J3O0R1n5l40J76J21n21N16
7706A21Q6j12M5m07M8j17J69l15N17K13m03K79j49J63L00q06O62l14m48M61K39
7727B32n75N29l90N45k18R5n6K12m47K0K53l29L7K44m13M35r4j93J96k6pq9J3
7750b6r0J0J43P3q7K23K9m32J10j32R3r5K13r8o0J02J27r3q9J99j90J10P3l83
$$ plain form
7774 -270 127 136 -193 288 -153 -38 65 -98 20 65 65 -50 77 -74 -59 -120 -168 -205 -186 256 -14 -183 -44
7797 -44 -43 32 161 -150 47 -221 -86 -25 101 68 -92 -113 -54 -128 15 69 57 -77 128 -88 48 136 113 188 58
7822 58 -48 -110 0 162 98 -39 159 -129 42 118 35 130 -3 -119 249 184 72 263 83 -19 22 204 368
7845 368 -46 1 250 35 59 224 52 -208 -193 -120 154 63 -192 -29 35 -357 -65 -387 -5 133 8 5 -123
7868 -123 -49 118 -170 39 33 -236 -120 -100 -209 -157 -220 -42 -36 -87 -199 -62 -311 -52 -163 -259 144 -145 42
7891 42 74 -24 189 107 62 206 -241 18 27 -156 -52 45 -218 378 103 -133 222 49 -101 172 -127 9 97
7914 97 122 142 -79 -136 129 179 268 81 21 141 27 6 183 47 46 -96 -83 131 30 34 -53 3 -6 15 -220 75
7940 75 -321 -92 207 -152 229 238 -157 -39 -282 0 -147 -253 -207 -254 -307 231 4 -105 58 -123 -48 8 -221
$$ packed form
7774b70L97Rl29M81m41J15J03j63J18M5%j15J27j51J5o1m8l7J9M42k70j69J39
7797d4JP5J29l11J97k68J35O1J26l3j60k1N9p4J43N4j2j34K05k16J36Q8k3P5j30
7822E8j06o2J10J62o4j37J98k88J71P6q3R5j33j16L68o5j12J91j80j02M1J82J64
7845C68m14M7K49k15K4J65j72k60J5P3K74r1k55J63O4l92K92l22L82J38j25lj28
7868a23P4J67k88K09ok69J16K0j09N2o3J78On1j12J37k49K59j11r6M03k89J87
7891D2L2r8K13q2m5J44m47K59Rj83J04R7k63N96k75k36L55j73j50K73k99J36Q8
7914I7K5K0k21n7K65N0Q9j87o0J20j14k1J77j36jj42J3K14j01Mq7N6rK1k35K95
7940G5l96K29K99l59L81Rl95J18k43K82j47j06M6m7n3N38k27j09J63j81P5N6k29
$$ plain form
7963 -221 263 -14 -142 191 -296 61 44 14 -4 83 -236 298 31 -47 -15 -147 160 66 -42 12 244 -126 78
7986 78 29 44 288 93 1 -16 383 47 28 48 112 55 -58 104 -149 15 -157 -16 125 -87 -30 157 50
8009 50 36 -33 -120 112 -260 -186 -69 -289 151 -147 -98 62 183 16 -10 -173 147 -150 -190 -44 -212 -209 -357
8032 -357 45 90 -53 112 -126 11 -79 38 212 70 -4 130 -24 -17 24 -112 57 -73 -75 116 -196 -79 300
8055 300 -1 213 8 -93 -25 184 381 55 137 -93 159 8 -294 -108 -35 71 0 48 -129 -139 -89 -56 184
8078 184 -106 80 -184 -187 80 21 233 -15 174 -14 103 -92 -124 -119 -42 92 -190 35 82 -100 -230 -160 -184
8101 -184 -5 -320 4 126 29 -9 1 -45 -85 -3 -118 155 51 64 -183 172 -174 -127 156 -22 -93 118 -83
8124 -83 234 -167 67 77 -104 35 69 -47 -15 85 -8 7 163 295 99 -14 28 201 -111 315 174 -169
$$ packed form
7963b21M84k77j28L33m87L57j7l0j8Q7l19N34k67p8L2j32L07r4j08N4K32l70K04
7986G8m9J5K44j95r2j7L99l36j9K0O4n7j13J62k53J64j72J41J41k12N7J87j07
8009E0j4o9q7K32l72P4J17k20M40k98M9J60J21j67k6j63L20k97m0J46j68Lj48
8032c57M02M5j43J65k38J37r0J17J74j42p4J34j54PM1j36J69j30kJ91l12J17L79
8055C00l01K14k05j01O8K09J97l26Q2k30K52j51l02J86P3J06p1M8j77j0N0L3K40
8078A84k90J86k64lK67n9K12k48J89j88J17j95l2NP7J34k82K25M7j82j30P0k4
8101a84J79l15L24J22r7l8J0m6m0Q2j15K73j04J3k47L55l46M7K83j78p1K11k01
8124h3L17m01K34J0j81J39L4j16L2J00r3J5J56J32j96j13M2J73l12M26j41l43
$$ plain form
8146 -169 411 229 56 -68 -150 75 120 76 -24 -50 160 95 -267 1 -45 -197 103 -13 -197 -364 -20 128
8168 128 124 -169 176 -201 -55 23 -180 -136 -174 -62 -35 -282 -91 -159 -271 -76 -50 -202 -42 122 -150 80 -168
$$ packed form
8146a69N80j82j73j24q2K25M5m4j00k6K10o5l62K68m6j52L00j16j84j67L44J48
8168A28mk93L45l77J46P8k03M4l8J12K7k47J91o8j12J95K6j52J60J64k72K30k48
8191a68
$$ Imaginary data points
##PAGE= N=2
##DATA TABLE= (X++(I..I)), XYDATA
$$ plain form
0 0 0 0 0 0 0 0 0 0 0 0 -8 8 -8 8 -12 16 -16 24 -24 32 -40 48 -56 64 -80 88 -104 120 -139 160 -183 207 -235
33 -235 267 -299 338 -379 426 -474 528 -588 652 -723 800 -884 976 -1077 1187 -1307 1441
50 1441 -1586 1748 -1929 2128 -2353 2605 -2894 3227 -3617 4075 -4629 5313 -6179 7315 -8876
65 -8876 11167 -14845 21684 -38597 165593 173246 -163864 130426 112930 10281 7068 -382
77 -382 130453 48662 -76780 132786 53627 -46433 49944 12223 43341 38513 -49802 70442
89 70442 34038 -69180 -2070 -8840 -20977 -26352 -52887 34652 -20773 -81715 20366 -21213
101 -21213 -55289 6538 -17041 10064 12405 -29483 17760 1421 -34152 103 1218 6757 -8134
114 -8134 -9840 33764 -12675 -38069 20336 15006 -8151 -1384 22814 33748 -18275 -15354 18881
$$ packed form
0@%%%%%%%%%%qJ6j6J6k0K8l2M0m8N6p2Q8j04J20j44J68j92K24k59K99l43L90m42
33b35N02n66O37p17Q05r00J002j116J240j375J523j684J860k053K264k494K748
50A441l027L334l677M057m481M958n499O121o844P692q704R942j1492J3494j6191
65h876K0043k6012L6529o0281K04190P653l37110K94290j7496j02649l213p450
77c82J30835q1791j25442K09566p9159j00060R6377l7721L1118m828q8315J20244
89G0442l6404j03218O7110o770j2137n375k6535Q7539n5425o0942J02081m1579
101b1213l4076O1827k3579K7105K341m1888M7243j6339l5573L4255J115N539j4891
114h134j706M3604m6439k5394N8405n330k3157O767K4198J0934n2023K921L4235
$$ plain form
127 18881 -15658 -17627 -9613 -10599 9714 -33085 -44443 6206 -25998 -56209 -16761 5746 -10072
140 -10072 -33533 -10257 9177 -29125 -34285 -5624 288 -10830 -22894 1195 6139 -32116 -20531
153 -20531 -62 -4796 1158 -8131 13936 28985 -16697 -1353 23616 -9266 3009 16195 2177
166 2177 11414 -786 -6784 -2256 -18025 -3743 -4041 -13251 10676 -2788 -16236 2491 -9542
179 -9542 -12897 -1573 -3762 5959 -468 -4662 3794 -15792 -11146 3360 -13930 -1636 14982 994
193 994 2178 6430 5729 6001 889 14733 23052 8843 13172 17419 4712 3006 2847 1939 9248 9915
209 9915 4299 5041 10140 928 -7572 4774 10101 2880 7228 11530 9860 2057 -7168 709 4490
224 4490 -4060 847 7977 7818 2586 -6100 2078 8891 -2535 3060 18160 14987 6892 5845 11277
$$ packed form
127A8881l4539j969Q014r86K0313m2799j1358N0649l2204l0211L9448K2507j5818
140a0072k3461K3276J9434l8302n160K8661N912j1118j2064K4089M944l8255J1585
153b0531K0469m734N954r289K2067J5049m5682J5344K4969l2882J2275J3186j4018
166B177R237j2200n998M528j5769J4282k98r210K3927j3464j3448J8727j2033
179i542l355J1324k189R721o427m194Q456j9586M646J4506j7290J2294J6618j3988
193I94J184M252p01K72n112J3844Q319j4209M329M247j2707j706j59r08P309O67
209I915n616P42N099r212q500J2346N327p221M348M302j670p803r225P877L781
224D490q550M907P130j59n232q686Q178O813j1426N595J5100l173q095j047N432
$$ plain form
239 11277 6566 -4079 6336 12531 3799 5838 4684 -562 442 -7618 -6317 5357 1426 -1567
253 -1567 3717 2274 -4739 -11338 -6767 -3037 -10816 -6216 990 -9345 -13139 -9994 -13157 -15010 -11476
268 -11476 -3571 -1849 -5050 -1435 -1404 -6401 -6035 -3765 984 3467 787 3040 4551 -1797 -6019 -3845
284 -3845 4541 2004 -2741 12147 11658 -4842 2172 6991 -1037 947 4719 9761 7690 -2782 2610
299 2610 1292 -8932 -2915 -1147 862 5948 -2331 1557 6119 -7757 -2196 5879 464 6463 7092
314 7092 4434 6671 -2369 -2004 2979 -2739 4142 6725 538 7543 1835 -6350 2530 1290 -2442
329 -2442 4021 5859 3899 -2814 -4321 -406 -9534 -11262 -209 -4593 -7364 -3852 -7860 -9339 -11523
344 -11523 -13245 -5193 -3605 -7653 -2307 -399 -6980 -10650 -6549 -3924 -7537 -4785 2894 -453 -4855
$$ packed form
239A1277m711j0645J0415O195q732K039j154n246J004q060J301J1674l931k993
253a567N284j443p013o599M571L730p779M600P206j0335l794L145l163j853L534
268a1476P905J722l201L615L1m997L66K270M749K483k680K253J511o348m222K174
284c845Q386k537m745J4888m89j6500P014M819q028J984L772N042k071j0472N392
299B610j318j0224O017J768K009N086q279L888M562j3876N561Q075n415N999O29
314G092k658K237r040L65M983n718O881K583o187P005n708q185Q880j240l732
329b442O463J838j960o713j507L915r128j728J1053m384k771L512m008j479k184
344a1523j722Q052J588m048N346J908o581l670M101K625l613K752P679l347m402
$$ plain form
359 -4855 -1868 -2235 -4317 -1946 2303 5429 3802 4716 5699 575 -434 2070 857 3451 4597 2531
375 2531 3581 -140 -5028 -1962 -2945 -3086 -130 1692 2730 -2614 -4900 195 -5932 -7557 1393 -1242
391 -1242 -1691 1516 -5351 -2763 -2448 -8161 264 2111 356 5794 2052 3408 4711 -3426 5013 7740
407 7740 2850 9516 6728 5488 8576 -1945 3385 8010 -1419 6611 8376 2574 6960 -1529 -1047
422 -1047 6634 -3999 412 7353 -203 2496 -2570 -3519 2057 -9341 -2794 7347 -5297 -3
436 -3 5758 -3504 -406 -1160 1795 7124 -592 8471 13544 -751 5887 10266 2242 6676 8078 10946
452 10946 12796 3834 9363 13090 1839 5284 9918 9715 9972 3054 7281 9926 -3808 -2196 5052
467 5052 -948 -1854 -1194 -2831 -872 -7379 -13242 -5995 -5013 -10433 -9307 -3066 -5371 -13310 -12639 -5585
$$ packed form
359d855K987l67k082K371M249L126j627R14R83n124j009K504j213K594J146k066
375B531J050l721m888L066r83j41K956J822J038n344k286N095o127j625Q950k635
391a242m49L207o867K588L15n713Q425J847j755N438l742J356J303q137Q439K727
407G740m890O666k788j240L088j0521N330M625r429Q030J765n802M386q489M82
422a047P681j0633M411O941p556K699n066r49N576j1398O547J0141j2644N294
436cN761r262L098p54K955N329p716R063N073j4295O638M379q024M434J402K868
452A0946J850q962N529L727j1251L445M634k03K57o918M227K645j3734J612P248
467E052o000r06O60j637J959o507n863P247R82n420J126O241k305p939O71P054
$$ plain form
483 -5585 -8376 -17012 -7574 -639 -9949 -12437 -4702 -5116 -9249 -10284 -2636 2375 -7038 -4955 3591
498 3591 -3640 -7317 -1687 -388 1945 -3976 -781 7534 -5484 -7062 5471 -3546 -5670 1722 811
513 811 1439 -4810 -4702 4723 -6897 -7272 3214 -2509 -242 -906 -6055 3824 -4901 -10874 5763 -704
529 -704 -5674 3875 1255 2916 -2028 -5861 9607 2715 -5891 8611 6721 2711 2393 -1817 7888
544 7888 3524 -5380 9914 8101 -1474 4712 2590 3892 2167 -5515 7750 7428 -5129 3956 4627
559 4627 -1806 -322 -2562 2161 2531 -3525 3716 3710 -2651 118 191 1048 1923 -188 4628 4067 547
576 547 3228 2092 -45 2823 4362 3383 2166 4024 3817 1840 1699 724 2992 5455 388 3445
592 3445 4494 -284 2087 1349 -895 2092 -1141 3330 3943 -5853 1172 2637 -4180 740 -893 -172
$$ packed form
483e585k791q636R438O935r310k488P735m14m133j035P648N011r413K083Q546
498C591p231l677N630J299K333n921L195Q315j3018j578J2533r017k124P392r11
513H11O28o249J08R425j1620l75J0486n723K267o64n149R879q725n973J6637o467
529g04m970R549k620J661m944l833J5468o892q606J4502j890m010l18m210R705
544G888m364q904J5294j813r575O186k122J302j725p682J3265l22j2557R085O71
559D627o433J484k240M723L70o056P241oo361K769P3Q57Q75k111M816n61l520
576E47K681j136k137K868J539r79j217J858k07j977j41r75K268K463n067L057
592C445J049m778K371p38k244K987l233M471O13r796P025J465o817M920j633P21
$$ plain form
608 -172 3849 -3131 2129 1441 -6553 4281 847 -5068 6250 -535 -1948 4120 -3903 386 -47
623 -47 -4505 6443 -1037 -5007 5096 -3113 -2418 195 -7047 2425 -1251 -7106 3150 -4784 -6155
638 -6155 1335 -8217 -2370 -1534 -9971 1818 -3010 -8655 -810 -6631 -3201 -1150 -10196 785 435
653 435 -7309 56 -3122 -3588 1745 -5397 3045 2632 -5741 4656 838 -2506 3578 -1941 1834 6022
669 6022 -1295 3950 3666 59 5112 -263 1906 6173 -1587 4542 5443 -2035 2971 1559 951 3653
685 3653 -2006 3528 4658 -3303 2569 1885 -2994 2021 729 766 298 -2396 4151 -121 -6235 2786
701 2786 719 -3005 306 -717 1492 -2082 -4419 3602 -2100 -6134 2528 165 -3081 -1404 -1579
716 -1579 20 -3633 -3806 1926 -2601 -2971 814 -2010 -1895 -1846 -1629 539 -2444 -1117 1755 -1986 -327
$$ packed form
608a72M021o980N260o88p994J0834l434n915J1318o785j413O068q023M289m33
623d7m458J0948p480l970J0103q209O95K613p242R472l676n855J0256p934j371
638f155P490r552N847Q36q437J1789m828n645P845n821L430K051r046J0981l50
653D35p744P365l178m66N333p142Q442m13q373J0397l818l344O084n519L775M188
669F022p317N245k84l607N053n375K169M267p760O129R01p478N006j412o08K702
685C653n659N534J130p961N872o84m879N015j292L7m68k694O547m272o114R021
701B786k067l724L311j023K209l574k337Q021n702m034Q662k363l246J677j75
716a579J599l653j73N732m527l70L785k824J15M9K17K168k983J327K872l741J659
$$ plain form
733 -327 1281 -1048 370 167 1065 1782 -282 1958 1798 329 1959 837 1913 3072 520 2942
749 2942 2521 431 3199 1405 1426 3507 645 2137 2968 745 1869 421 1203 2269 -1363 1571
765 1571 2822 -1578 1066 950 -447 1316 -1107 474 2042 -2348 -114 1120 -1408 -110 -1116
780 -1116 13 1465 -2753 -515 2002 -2008 -1016 71 -111 -69 -2218 892 1014 -3305 793 831 -2205
797 -2205 623 -317 -552 910 -1431 2 850 -1472 190 -131 282 1071 -1840 1341 2201 -2834 764
814 764 2163 -1205 428 716 1103 1078 -1374 1873 1562 -1706 1427 1678 -543 1435 566 544 1502 -348
832 -348 932 955 -36 993 -417 126 1505 -1856 106 1837 -2088 -825 1238 -694 -584 -1117 -545
849 -545 -22 -3084 -1369 -262 -2583 -2387 -1493 -1794 -1955 -3613 -1871 -1395 -4339 -2103 -1109 -3509 -2607
$$ packed form
733c27J608k329J418k03Q98P17k064K240j60j469J630j122J076J159k552K422
749B942m21k090K768j794K1K081k862J492Q31k223J124j448P82J066l632K934
765A571J251m400K644j16j397J763k423J581J568m390K234J234k528J298j006
780a116J129J452m218K238K517m010R92J087j82M2k149L110J22m319M098L8l036
797b205K828r40k35J462k341J433Q48k322J662l21M13P89k911L181Q60n035L598
814G64J399l368J633K88L87k5k452L247l11l268L133K51k221J978q69k2R58j850
832c48J280K3r91J029j410N43J379l361J962J731l925J263K063j932J10n33N72
849e45N23l062J715J107k321J96Q94l01j61j658J742M76k944K236R94k400R02
$$ plain form
866 -2607 -1856 -2834 -2149 -3059 -2562 -1263 -2421 -1548 -1143 -2093 -804 -1040 -1516 334 151 -576 1087 948
884 948 231 821 1225 1524 1061 1454 3251 1815 1362 3254 1710 703 3516 2164 1324 3382 2047
901 2047 1484 2038 1158 2006 1696 790 3095 1353 176 1890 596 395 852 79 1841 724 -724
918 -724 1847 608 -1370 1123 572 -4 746 224 1105 382 -1376 1355 449 -1960 1241 1555 -1123
935 -1123 520 415 -429 215 -1242 -381 531 -1204 -285 -224 -1660 50 -1767 -2329 877 -1961 -2105 1398
953 1398 -2002 -2166 -453 -2144 489 -1418 -2087 3075 -1128 -2841 2755 -1300 -938 1831 -937 1970
969 1970 1246 -1226 3146 -660 -667 3791 -908 1938 3689 -1870 2905 1667 -2356 2995 -182 7
985 7 3476 -2686 1498 2566 -4996 1107 901 -2787 1295 -1644 -87 1201 -4886 507 1013 -5316
$$ packed form
866b607P51r78O85r10M97J299j158Q73M05r50J289k36m76J850j83p27J663j39
884I48p17N90M04K99m63L93J797j436m53J892j544j007K813j352q40K058j335
901B047n63N54q80Q48l10r06K305j742j177J714j294k01M57p73J762j117j448
918g24K571j239j978K493n51n76P50n22Q81p23j758K731r06k409L201L14k678
935a123J643j05q44O44j457Q61R12j735R19O1j436J710j817n62L206k838j44L503
953A398l400j64J713j691K633j907o69N162m203j713N596m055L62K769k768K907
969A970p24k472M372l806pM458m699K846J751n559M775j238m023N351l177J89
985GL469o162M184J068p562O103k06l688M082k939J557J288o087N393N06o329
$$ plain form
1001 -5316 1033 618 -2857 762 -2467 -588 308 -4648 1428 1192 -4098 1933 250 -2753 1055 -2064
1017 -2064 -695 1184 -2048 987 584 -1655 1330 -1755 -1390 1502 -2221 44 1638 -1849 -296
1032 -296 -343 -998 -302 -2028 134 1733 -1215 -619 938 -358 -446 -458 1134 1003 578 1807 1348 539
1050 539 1429 1029 1604 1923 2024 2674 1526 2266 2022 232 2497 2483 287 2550 2492 2047 87 -603 2627
1069 2627 591 -2264 2654 827 -1867 756 -1391 -686 -1734 -3251 602 -927 -3656 865 -2456
1084 -2456 -3616 -821 -3455 -1418 -1220 -2679 1388 -1579 -3310 613 -2797 -1195 673 -3332 1322
1099 1322 1275 -2265 1290 -704 -827 1343 -1090 1717 1409 -1789 2985 600 -1950 1828 17 1293
1115 1293 1757 -1684 2893 1694 -2372 1775 11 -535 2108 -37 1831 855 -1498 2159 -47 -1438
$$ packed form
1001e316O349m15l475L619l229J879Q96m956O076k36n290O031j683l003L808l119
1017b064J369J879l232L035m03k239K985l085L65K892l723K265J594l487J553
1032b96m7o55O96j726K162J599k948N96J557j296q8j2J592j31m25J229m59q09
1050E39Q90m00N75L19J01O50j148P40k44j790K265j4k196K263n8m45j960o90L230
1069B627k036k855M918j827k694K623k147P05j048j517L853j529k729M521l321
1084b456j160K795k634K037J98j459M067k967j731L923l410J602J868m005M654
1099A322m7l540L555j994j23K170k433K807l08l198M774k385k550L778j811J276
1115A293M64l441M577j199m066M147j764n46K643k145J868r76k353L657k206j391
$$ plain form
1131 -1438 2093 434 1305 1984 -805 1595 171 -671 2260 -432 1124 2416 -1193 2306 191 -2415
1147 -2415 1671 235 -511 1244 -304 930 -182 -2158 938 -2466 -1554 2027 -2211 -1007 -200 -2716
1163 -2716 -135 -2105 -2761 553 -2210 -1026 538 -3122 -786 -1389 -2336 1255 -1896 -814 2036 -1636
1179 -1636 -87 -217 -1824 2103 -474 -423 2711 -598 1045 1833 -1515 1827 280 247 3989 -315
1195 -315 721 2913 -267 819 202 -1 2679 -197 793 3052 -1935 1159 1548 -1932 1217 36
1211 36 215 2687 -1469 45 924 -2056 1247 325 -776 2397 -1269 554 1311 -2759 803 647 -818
1228 -818 2020 -1078 -272 2220 -2981 -140 725 -1897 1145 -152 -1238 668 -3078 -677 -394 -2890
1244 -2890 44 -55 -1490 898 -2281 -968 287 -3908 51 311 -2251 1521 44 -1497 417 -1507
$$ packed form
1131a438L531j659Q71O79k789K400j424q42K931k692J556J292l609L499k115k606
1147b415M086j436p46J755j548J234j112j976L096l404R12L581m238J204Q07k516
1163b716K581j970o56L314k763J184J564l660K336o03r47L591l151J082K850l672
1179a636J549j30j607L927k577N1L134l309J643P88l348L342j547l3L742m304
1195c15J036K192l180J086o17k03K680k876R90K259m987L094L89l480L149j181
1211C6J79K472m156J514Q79k980L303r22j101L173l666J823P57m070L562j56j465
1228h18K838l098Q06K492n201K841Q65k622L042j297j086J906l746K401K83k496
1244b890K934r9j435K388l179J313J255m195L959K60k562L772j477j541J914j924
$$ plain form
1260 -1507 362 1264 -1266 2591 -53 -101 2091 -1396 623 2131 57 2621 1625 -49 3276 -754
1276 -754 -273 1576 -905 1567 2519 -13 2028 592 44 1316 -742 700 1571 -932 1652 187
1292 187 -1540 561 -1701 -732 558 -1676 616 358 -1926 438 -1595 -1979 408 -1435 -352 723
1308 723 -1399 -58 -1010 -1847 249 -1834 -93 1182 -1326 -36 -563 -2411 -133 -1181 -885 630
1324 630 -1017 -46 -168 -1925 -525 -965 -1341 253 -359 92 58 -706 -213 -1042 -637 846 -155 330
1342 330 1324 426 486 14 272 1208 637 1434 2326 1252 1087 1015 1440 757 416 2023 2159 922 1863 1302
1362 1302 527 698 -83 1006 1124 107 875 696 -338 -328 -1105 -181 118 -1467 453 24 -1714 -588
1380 -588 -1532 -1309 -504 -2289 28 296 -2348 -233 -1045 -1899 -392 -1414 116 788 -1709 219 526
$$ packed form
1260a507J869R02k530L857k644m8K192l487K019J508k074K564r96j674L325m030
1276g54M81J849k481K472R52k532K041j436n48J272k058J442Q71k503K584j465
1292A87j727K101k262R69J290k234K292k58k284K364k033l84K387j843J083J075
1308G23k122J341r52q37K096k083J741J275k508J290n27j848K278j048K96J515
1324F30j647R71j22j757J400m40l76J594o12M51l4p64M93q29M05J483j001M85
1342C30R94q98O0m72K58R36n71P97Q92j074j65p2M25o83l41J607J36j237R41n61
1362A302p75J71p81J089J18j017P68j79j034J0p77R24K99j585J920m29j738J126
1380e88r44K23Q05j785K317K68k644K115q12q54J507j022J530O72k497J928L07
$$ plain form
1397 526 -2035 -95 -261 -696 921 -692 666 819 -1519 530 205 -1071 1303 17 84 2004 -746
1414 -746 -220 1519 -927 351 725 374 1299 -14 -75 1054 -1224 -62 1371 286 1021 889 307
1431 307 1102 -365 -798 1141 371 23 1638 557 326 68 -784 303 361 -521 931 772 -569 490
1449 490 -470 -772 26 -1029 23 928 -1146 -401 -436 -1264 -856 -1286 -444 568 -1576 -678 729 -1719
1467 -1719 -1153 -405 -1212 392 -214 -760 805 -1047 -1187 232 -1274 -105 250 -390 1017 -563 -717
1484 -717 658 -427 -356 692 55 1286 88 -339 879 -420 -528 989 414 676 1004 401 699 -51
1502 -51 -145 1062 756 418 1112 1611 497 181 322 1017 178 601 1089 1348 621 279 635 -31 116 273
1522 273 -96 811 631 -724 446 -497 -1381 95 -1174 -322 177 -1519 -348 -478 -2675 -602 -870
$$ packed form
1397E26k561J940j66m35J617j613J358J53k338K049l25j276K374j286O7J920k750
1414g46N26J739k446J278L74l51R25j313o1J129k278J162J433j085P35j32n82
1431C07P95j467m33J939p70l48J615j081k31k58q52J087N8q82J452j59j341J059
1449D90r60l02P98j055J052R05k074P45l5q28M08m30Q42J012k144Q98J407k448
1467a719N66P48q07J604o06n46J565j852j40J419j506J169L55o40J407j580j54
1484g17J375j085P1J048o37J231j198m27J218j299j08J517n75K62L28o03K98p50
1502e1r4J207l06l38O94M99j114l16J41O95q39M23M88K59p27l42L56o66J47J57
1522B73l69R07j80j355J170r43q84J476j269Q52M99j696J171j30k197K073k68
$$ plain form
1539 -870 -1620 -44 -1280 -69 -575 -2617 -368 -921 -2011 117 -690 -451 742 -1952 104 313 -2104
1556 -2104 940 721 -321 1710 93 627 940 -1015 1492 1459 -274 1917 851 630 1736 -692
1572 -692 804 1357 -625 1699 1065 -170 1327 -526 280 1154 -1117 1113 1159 -694 1061 71 -512
1589 -512 169 -650 505 249 -676 1169 -458 -686 701 -1251 -160 924 -553 549 84 -532 346
1606 346 -977 -597 328 -926 503 -56 -652 -157 -1006 -699 -267 -1487 232 87 -1569 101 -1118
1623 -1118 -1143 -108 -1786 -263 157 -1485 445 -659 -1332 100 -1117 -115 234 -933 1002 297
1639 297 -906 839 -615 225 1333 -62 1727 1520 90 1767 180 122 1351 151 1492 1479 322
1656 322 1677 376 -179 1797 -68 952 1630 11 1542 116 -821 926 -952 -432 843 -1588
$$ packed form
1539h70p50J576j236J211n06k042K249n53j090K128q07K39J193k694K056K09k417
1556b104L044k19j042K031j617N34L13j955K507l3j733K191j066k21J106k428
1572f92J496N53j982K324o34j235J497j853Q06Q74k271K230M6j853J755r90n83
1589e12O81q19J155k56r25J845j627k28J387j952J091J084j477J102m65o16Q78
1606C46j323L80R25j254J429n59n96M95q49L07M32j220J719j45j656J670j219
1623a118k5J035j678J523M20j642J930j104o73J432j217J002L49j167J935p05
1639B97j203J745j454Q40J108j395J789k07j430J677j587n8J229j200J341j3j157
1656C22J355j301n55J976j865J020O78j619J531j426r37J747j878N20J275k431
$$ plain form
1672 -1588 476 -532 -1782 -282 -1416 -780 148 -1592 105 -370 -1616 -219 -976 -1065 -161 -1152 -429
1689 -429 260 -1871 220 -476 -1327 660 -792 49 310 -1144 529 226 -996 731 -632 -200 981
1706 981 -473 935 218 -1672 797 170 -660 1228 -455 390 1120 -1001 801 47 -712 1382 143
1723 143 470 1082 -479 1136 367 -1096 1403 -5 221 2132 -184 722 919 -576 1347 -81 -444
1740 -444 1906 -406 314 1348 -1334 739 367 -779 1126 -774 98 1217 -1885 459 47 -1445
1756 -1445 721 -623 -957 -179 -1687 -798 -121 -2311 105 -929 -1865 1129 -1553 -775 -464 -2356 375
1773 375 -326 -1591 799 -895 -971 385 -1964 58 550 -1286 768 546 -373 1552 -1245 446 1087
1790 1087 -727 1177 648 174 1796 625 548 953 4 1136 1465 3 1543 445 548 1926 194
$$ packed form
1672a588K064j008j250J500j134O36R28j740J697m75j246J397p57q9R04r91P23
1689d29O89k131K091o96q51J987j452Q41K61j454J673l03j222J727j363M32J181
1706I81j454J408p17j890K469o27q30J888j683Q45P30k121J802p54p59K094j239
1723A43L27O12j561J615p69j463K499j408K26J911k316R06J97j495J923j428l63
1740d44K350k312P20J034k682K073l72j146J905j900Q72J119l102K344m12j492
1756a445K166j344l34P78j508Q89O77k190K416j034r36K994k682P78L11j892K731
1773C75p01j265K390j694p6J356k349K022M92j836K054k22r19J925k797J691O41
1790A087j814J904n29m74J622j171p7M05r49J132L29j462J540j098J03J378j732
$$ plain form
1807 194 631 919 -142 1583 415 830 981 -448 633 -32 -68 647 647 370 323 -1069 -311 90 -1565
1826 -1565 341 -365 -1032 232 -1287 -871 -769 -1618 114 -253 -1006 718 -1383 -716 -60 -1437 -124
1843 -124 92 -943 1377 -405 -204 1457 -1133 140 865 -762 491 587 -108 1458 -372 404 1138
1860 1138 -1402 489 617 -1299 867 -185 -393 317 -699 43 1780 -510 411 -146 -1146 552
1876 552 -1024 -741 1350 -764 -80 1276 -491 758 909 348 960 -42 181 1568 -139 107 1414
1893 1414 60 929 210 -259 1251 -231 14 456 91 439 -26 -498 284 -469 -519 41 -577 -358 -790
1912 -790 -978 -391 -946 -1351 -487 -1143 -1533 -1328 -976 -839 -1425 -419 -585 -1099 -615 -759 -372 -176 -872 710
1932 710 255 -629 656 220 -125 620 545 1223 874 544 1232 822 412 1468 593 868 1663 351 1331
$$ packed form
1807A94M37K88j061J725j168M15J51j429J081o65l6P15%k77m7j392P58M01j655
1826a565J906p06o67J264j519M16J02q49J732l67p53J724k101O67O56j377J313
1843a24K16j035K320j782K01J661k590J273P25j627J253R6o95J566j830P76P34
1860A138k540J891J28j916K166j052k08P10j016P42J737k290R21n57j000J698
1876E52j576K83K091k114O84J356j767J249J51n61O12j002K23J387j707K46J307
1893A414j354Q69p19m69J510j482K45M42l65L48m65m72P82p53n0N60o18K19m32
1912g90j88N87n55m05Q64o56l90K05L52J37n86J006j66n14M84j44L87J96o96J582
1932G10m55q84J285m36l45P45p5O78l49l30O88m10m10J056q75K75P95j312R80
$$ plain form
1951 1331 1403 -228 1135 602 280 1164 -70 790 1248 -819 293 784 -581 425 -281 180 629 -958
1969 -958 -111 312 -1055 208 110 -683 237 -353 -212 501 -891 119 114 -412 242 265 -450 159 -546 -897
1989 -897 43 -361 -431 -304 -281 35 -420 -362 164 -545 -294 121 -256 -629 -735 -120 -704 -893 -813 -141 256
2010 256 -770 221 -232 -444 -185 106 21 911 428 93 503 187 502 270 559 751 451 632 1006 637
2030 637 850 678 435 625 377 494 652 -145 575 680 190 -168 253 -193 83 -35 -198 -211 -594 164
2050 164 -400 -727 -552 -332 -281 -680 -944 -529 -952 -819 -492 -495 -562 -407 -793 -327 -423 -342 -245 -513 28 -32 -583
2073 -583 61 -486 -67 396 -75 -241 416 -119 317 296 -86 651 -4 78 698 290 369 537 246 441 278
2094 278 151 780 -210 651 927 -211 454 709 -308 576 219 196 636 -335 251 611 -505 697 206
$$ packed form
1951A331P2j631J363n33l22Q84j234Q60M58k067J112M91j365J006p06M61M49j587
1969i58Q47M23j367J263r8p93R20n90J41P13j392J010nn26O54K3p15O09p05l51
1989h97R40m04p0J27K3L16m55N8N26p09K51M15l77l73j06O15n84j89Q0O72L97
2010B56j026R91m53k12K59K91q5Q90m83l35M10l16L15k32K89J92l00J81L74l69
2030F37K13j72k43J90k48J17J58p97P20J05m90l58M21m46K76j18j63j3l83P58
2050A64n64l27J75K20N1l99k64M15m23J33L27lo7J55l86M66r6Q1R7k68N41o0n51
2073e83O44n47M19M63m71j66O57n35M36k1l82P37o55Q2O20m08P9J68k91J95j63
2094B78j27O29r90Q61K76j138O65K55j017Q84l57k3M40r71N86L60j116J202m91
$$ plain form
2113 206 -383 594 -108 46 454 -678 77 329 -391 724 -109 -280 681 -403 104 258 -478 347 -38
2132 -38 -663 465 -724 -234 333 -655 23 -169 -638 281 -438 -705 575 -1071 -417 -199 -1092 45 -409
2151 -409 -886 79 -830 -462 -310 -906 71 -321 -796 467 -640 -302 708 -473 316 14 -237 1082
2169 1082 -323 9 1065 -137 419 1075 109 1003 503 519 1405 -158 924 1432 -60 1015 511 -111
2187 -111 1116 78 199 883 -447 728 197 -696 757 -212 -286 766 -987 -231 -15 -916 -1 -852
2205 -852 -867 275 -1320 -586 -129 -1471 -58 -520 -1257 101 -817 -550 220 -1076 -258 -210 -1034 533
2223 533 -532 -550 634 -564 288 501 -776 951 168 -490 1375 -567 333 1125 -503 425 489 -124
2241 -124 834 -143 -172 1047 -450 440 593 -649 479 -113 -321 744 -479 192 871 -800 464 231
$$ packed form
2113B06n89R77p02J54M08j132P55K52p20J115q33j71R61j084N07J54p36Q25l85
2132c8o25J128j189M90N67r88O78j92m69R19p19k67J280j646O54K18q93J137m54
2151d09m77R65r09L68J52n96R77l92m75J263j107L38J010j181P89l02k51J319
2169A082j405L32J056j202N56O56r66Q94n00J6Q86j563J082N08j492J075n04o22
2187a11J227j038J21O84j330J175n31q93J453r69p4J052j753P56K16r01R15q51
2205h52j5J142j595P34M57j342J413m62p37J358r18K67P70j296Q18M8q24J567
2223E33j065j8J184j198Q52K13j277J727p83o58J865j942R00P92j628R28O4o13
2241a24R58r77k9J219j497Q90J53j242J128n92k08J065j223O71O79j671J264k33
$$ plain form
2259 231 -383 923 -56 133 566 -640 415 402 -602 710 -52 234 645 -259 -45 109 -258 763
2277 763 -471 -420 792 -635 -128 205 -701 35 -209 -372 271 -1189 -306 360 -1180 -238 -521 -953 139
2296 139 -1089 -651 340 -1272 61 -326 -1193 152 -630 -475 529 -1026 93 556 -717 620 -204
2313 -204 -443 1244 -262 330 1185 -648 1051 606 13 1643 -122 451 1995 -323 1031 1385 -13
2330 -13 1493 731 164 1291 -315 575 1152 -506 921 263 -686 1132 -485 -143 675 -707 -180 146
2348 146 -942 759 -659 -765 537 -796 -628 -79 -757 -123 -569 -561 108 -794 -350 459 -1092 -217 -364
2367 -364 -653 396 -729 -502 288 -605 -128 -114 -420 309 -458 -503 182 -480 -180 -15 -125 112 -221 20
2387 20 672 -815 -41 308 -445 205 -128 -119 313 -345 468 429 -586 340 263 27 581 -135 662 828 -455
$$ packed form
2259B31o14J306r79J89M33j206J055j3j004J312p62K86M11r04K14J54l67J021
2277G63j234N1J212j427N07L33r06P36k44j63O43j460Q83O66j540R42k83m32J092
2296A39j228M38R91j612J333l87q67J345p82J55J004j555J119M63j273J337q24
2313b04k39J687j506N92Q55j833J699m45n93J630j765N73J544k318J354L54j398
2330a3J506p62n67J127j606Q90N77j658J427o58r49J818j617L42Q18j382N27L26
2348A46j088J701j418j06J302j333J68N49o78O34m46QO69r02M44Q09j551Q75j47
2367c64k89J049j125K27P90q93M77J4l06P29p67m5O85o62L00J65j10K37l33K41
2387B0O52j487P74L49p53O50l33RM32o58Q13l9j015R26p7k36N54p16P97J66j283
$$ plain form
2408 -455 816 522 -191 1016 -21 344 654 -282 287 535 -638 756 -485 -111 -94 -667 -138 -254
2426 -254 -355 -358 428 -1492 438 -637 -546 137 -1112 -576 72 -1336 -156 -69 -624 53 -552 -283 256
2445 256 -575 -128 388 -283 231 -164 -411 530 -54 41 422 -125 323 21 -91 733 275 49 771 -13
2465 -13 93 689 305 201 310 94 394 383 248 358 82 174 439 315 390 68 288 328 383 471 214 -30
2487 -30 307 165 36 64 129 169 -84 118 78 -206 80 -33 -181 -16 -91 -206 -322 -148 171 52 -350 -163
2509 -163 -88 -538 -101 -271 -403 -184 -436 -91 -356 -649 -212 -454 -538 -221 -737 -359 -159 -687 -179 -457 -214
2530 -214 6 -560 -230 235 -351 -15 116 -127 -85 -449 -124 24 -176 76 242 -120 233 124 -248 147
2550 147 85 351 388 410 555 454 213 110 417 526 460 434 565 381 503 542 540 267 425 287 83 101 409
$$ packed form
2408d55J271k94p13J207j037L65L10r36N69K48j173J394j241L74J7n73N29j16
2426b54j01lP86j920J930j075R1O83j249N36O48j408J180Q7n55O77o05K69N39
2445B56q31M47N16o71N14l95k47R41n84R5L81n47M48l02j12Q24m58k26P22p84
2465a3J06N96l84j04J09k16L00j1j35J10k76R2K65j24P5l22K20M0N5Q8k57k44
2487c0L37j42j29K8O5M0k53K02m0k84K86j13j48J65p5j15j16J74L19j19m02J87
2509a63P5m50M37j70j32K19k52L45k65k93M37k42q4L17n16L78K00n28N08k78K43
2530b14K20n66L30M65n86L36J31k43M2l64L25J48k00K52J66l62L53j09l72L95
2550A47o2K66L7K2J45j01k41j03L07J09o6k6J31j84J22L9kk73J58j38k04J8L08
$$ plain form
2573 409 173 -147 232 -250 138 40 -366 -147 -34 -158 -302 -547 -240 -27 -584 -277 -317 -675 -681 -306 -502
2594 -502 -440 -157 -86 -44 -470 110 118 -333 402 -667 242 95 -623 -362 154 100 -143 -474 249 738 284 -22
2616 -22 -256 180 715 -450 708 696 306 -347 742 217 385 627 102 75 401 319 -203 223 956 -89
2636 -89 733 800 2 496 -166 108 672 100 21 -215 94 414 -472 -215 1078 -677 -431 -62 -205 -417
2656 -417 -4 -837 -356 108 -335 17 -329 -202 -429 -713 -113 -304 -600 172 -442 -488 -16 -265 304 -27
2676 -27 -108 67 -211 -585 -245 -280 -72 224 -636 581 -87 -45 1522 -265 381 847 -329 852 805 -160
2696 -160 1435 12 296 1625 408 324 765 126 549 378 -238 1246 449 104 750 -198 251 474 68
2715 68 299 -40 137 474 -494 -19 154 -312 -46 -25 -418 10 -532 -222 -384 -547 126 -308 -588 254 -693
$$ packed form
2573D09k36l20L79m82L88r8m06K19J13j24j44k45L07K13n57L07m0l58oL75j96
2594e02O2K83P1M2m26N80Qm51P35j069R09j47p18K61N16n4k43l31P23M89m54l06
2616b2k34M36N35j165J158j2l90o53J089n25J68K42n25k7L26q2n22M26P33j045
2636h9Q22O7p98M94o62K74N64n72p9k36L09L20q86K57J293j755K46L69j43k12
2656d17M13q33M81M64m43L52l46J27k27k84O00j91k96P72o14m6M72k49N69l31
2676b7q1J75k78l74L40l5K08K96q60J217o68M2J567j787O46M66j176J181m7r65
2696a60J595j423K84J329j217q4M41o39M23j71o16J484p97l45O46r48M49K23m06
2715F8K31l39J77L37r68M75J73m66K66K1l93M28n42L10j62j63O73m34k80Q42r47
$$ plain form
2736 -693 -184 87 -622 -116 -619 -542 17 -383 -266 79 -649 -228 -432 -566 76 -495 52 237 -808 124
2756 124 131 -552 174 -63 -459 307 -167 -161 724 -410 121 78 -575 586 70 288 811 -340 231 373 -308
2777 -308 863 -89 50 993 -344 435 1002 -46 448 299 -32 836 -60 87 721 -536 46 306 -221
2796 -221 778 -238 -445 850 -344 64 473 -532 364 -7 -439 331 -598 -775 156 -780 -52 -445 -470
2815 -470 43 -715 -558 393 -419 -319 -17 -596 239 95 -304 439 -223 -12 456 -248 423 229 18 272
2835 272 -90 -30 348 -53 445 267 -5 895 15 258 641 -226 352 297 159 729 -259 208 666 -12 -49
2856 -49 250 -330 474 -298 -152 411 -475 25 299 -758 124 -34 -233 583 -588 -186 558 -445 500
2875 500 -70 -670 573 -289 -62 422 -651 176 510 -590 273 -539 -871 546 -856 -289 483 -707
$$ packed form
2736f93N09K71p09N06n03P7N59m00J17L45p28M21k04j34O42n71N47J85j045R32
2756A24Po83P26k37l96P66m74OQ85j134N31m3o53J161n16K18N23j151N71J42o81
2777c08J171r52J39R43j337P79N67j048M94j49l31Q68q96J47O34j257N82K60n27
2796b21R99j016k07J295j194M08M09j005Q96l71m32P70r29j77R31r36P28l93k5
2815d70N13p58J57R51q12J00L02n79Q35j44l99P43o62K11M68p04O71j94k11K54
2835B72l62O0L78m01M98j78k72R00q80K43L83q67N78n5j38N70r88M67M58o78l7
2856d9K99n80Q04p72J46N63q86N00K74j057Q82j58j99Q16j171M02P44j003R45
2875E00n70o00J243q62K27M84j073Q27L34j100Q63q12l32J417j402N67P72j190
$$ plain form
2893 -707 142 -342 -825 75 -712 -490 324 -996 -435 42 -584 228 -437 -570 301 -677 -10 580 -251 349
2913 349 254 -321 677 158 -134 609 -86 275 648 121 756 135 217 980 -114 511 586 245 709 228 306
2934 306 773 -108 524 662 -148 236 110 -86 597 -255 32 504 -374 268 -108 -215 265 -153 82 208
$$ packed form
2893g07Q49m84m83R00p87K22Q14j320N61M77o26Q12o65j33Q71r78O67N90q31O00
2913C49r5n75R98n19k92P43o95L61L73n27O35o21Q2P63j094O25P5l41M64m81P8
2934C06M67q81O32J38q10L84j26j96O83q52K87M72q78O42l76j07M80m18K35J26
$$ [...]
8191B84
##END NTUPLES=NMR FID
##END=
