##TITLE=1H_SAV-77-YbTf3-B(filtr)
 CDCl3, 8 sc, 
 24.11.2020
##JCAMPDX= 6.0         $$ Bruker NMR JCAMP-DX V2.0
##DATA TYPE= NMR FID
##DATA CLASS= NTUPLES
##ORIGIN= UXNMR, Bruker Analytische Messtechnik GmbH
##OWNER= root
$$ XWIN-NMR		Version 3.5
$$ Tue Nov 24 10:39:02 2020 Russian Standard Time (UT+4h)  she@DPX200
##.OBSERVE FREQUENCY= 200.1315066352
##.OBSERVE NUCLEUS= ^1H
##.DELAY= (6, 6)
##.ACQUISITION MODE= SIMULTANEOUS
##.ACQUISITION SCHEME= undefined
##.AVERAGES= 8
##.DIGITISER RES= 18
##SPECTROMETER/DATA SYSTEM= spect
##.PULSE SEQUENCE= zg30
##.SOLVENT NAME= CDCl3
##.SHIFT REFERENCE= (INTERNAL, CDCl3, 0, 15.7039)
##AUDIT TRAIL= $$ (NUMBER, WHEN, WHO, WHERE, WHAT)
$$ ##TITLE= Audit trail, XWIN-NMR		Version 3.5
$$ ##JCAMPDX= 5.01
$$ ##ORIGIN= Bruker BioSpin GmbH
$$ ##OWNER= she
$$ F:/spectra/data/she/nmr/H-F/1/audita.txt
$$ ##AUDIT TRAIL=  $$ (NUMBER, WHEN, WHO, WHERE, WHAT)
(   1,<2020-11-24 10:37:39.14 +0400>,<she>,<DPX200>,
      <created by zg, POWCHK disabled, PULCHK disabled
       configuration hash MD5:
       00 E9 B6 7A A2 85 ED C7 34 08 36 98 17 FE 4E 26
       data hash MD5: 16K
       17 AE 2B 76 E2 6C EB F8 C2 5F 8C 4D 09 A5 CE 39>)
$$ ##END=
$$ 
$$ hash MD5
$$ 21 A9 40 DF 17 F7 B5 64 DB AC F6 A7 2D 0D C0 1F
##$RELAX= 
##$RELAX= 
##$RELAX= 
##$RELAX= 
##$RELAX= 
##$RELAX= 
$$ Bruker specific parameters
$$ --------------------------
##$DU= <F:/spectra>
##$EXPNO= 1
##$NAME= <H-F>
##$PROCNO= 1
##$TYPE= <nmr>
##$USER= <she>
##$AMP= (0..31)
100 100 100 100 100 100 100 100 100 100 100 100 100 100 100 100 100 100 
100 100 100 100 100 100 100 100 100 100 100 100 100 100 
##$AQSEQ= 0
##$AQ_mod= 1
##$AUNM= <au_zg>
##$AUTOPOS= <>
##$BF1= 200.13
##$BF2= 200.13
##$BF3= 200.13
##$BF4= 200.13
##$BF5= 200.13
##$BF6= 200.13
##$BF7= 200.13
##$BF8= 200.13
##$BYTORDA= 1
##$CFDGTYP= 0
##$CFRGTYP= 5
##$CHEMSTR= <none>
##$CNST= (0..31)
1 1 145 1 1 1 1 1 1 1 1 1 1 1 1 1 1 1 1 1 1 1 1 1 1 1 1 1 1 1 1 1 
##$CPDPRG= <>
##$CPDPRG1= <>
##$CPDPRG2= <>
##$CPDPRG3= <>
##$CPDPRG4= <mlev>
##$CPDPRG5= <mlev>
##$CPDPRG6= <mlev>
##$CPDPRG7= <mlev>
##$CPDPRG8= <mlev>
##$CPDPRGB= <>
##$CPDPRGT= <>
##$D= (0..31)
0 1.2 0 0 0 0 0 0 0 0.06 0 0.03 0 0 0 0 0.0002 0 0 0 0 0 0 0 0 0 0 0 0 
0 0 0 
##$DATE= 1606199858
##$DBL= (0..7)
120 120 120 120 120 120 120 120 
##$DBP= (0..7)
150 150 150 150 150 150 150 150 
##$DBP07= 0
##$DBPNAM0= <>
##$DBPNAM1= <>
##$DBPNAM2= <>
##$DBPNAM3= <>
##$DBPNAM4= <>
##$DBPNAM5= <>
##$DBPNAM6= <>
##$DBPNAM7= <>
##$DBPOAL= (0..7)
0.5 0.5 0.5 0.5 0.5 0.5 0.5 0.5 
##$DBPOFFS= (0..7)
0 0 0 0 0 0 0 0 
##$DE= 6
##$DECBNUC= <off>
##$DECIM= 32
##$DECNUC= <off>
##$DECSTAT= 4
##$DIGMOD= 1
##$DIGTYP= 9
##$DL= (0..7)
0 120 120 120 120 120 120 120 
##$DP= (0..7)
150 150 150 150 150 150 150 150 
##$DP07= 0
##$DPNAME0= <>
##$DPNAME1= <>
##$DPNAME2= <>
##$DPNAME3= <>
##$DPNAME4= <>
##$DPNAME5= <>
##$DPNAME6= <>
##$DPNAME7= <>
##$DPOAL= (0..7)
0.5 0.5 0.5 0.5 0.5 0.5 0.5 0.5 
##$DPOFFS= (0..7)
0 0 0 0 0 0 0 0 
##$DQDMODE= 0
##$DR= 18
##$DS= 0
$$ [...]
##$SUBNAM2= <"">
##$SUBNAM3= <"">
##$SUBNAM4= <"">
##$SUBNAM5= <"">
##$SUBNAM6= <"">
##$SUBNAM7= <"">
##$SUBNAM8= <"">
##$SUBNAM9= <"">
##$SW= 16.9725356469052
##$SWIBOX= (0..15)
0 0 2 0 0 0 0 0 0 0 0 0 0 0 0 0 
##$SW_h= 3396.73913043478
##$TD= 16384
##$TD0= 1
##$TE= 0
##$TE2= 300
##$TE3= 300
##$TEG= 300
##$TL= (0..7)
0 120 120 120 120 120 120 120 
##$TP= (0..7)
150 150 150 150 150 150 150 150 
##$TP07= 0
##$TPNAME0= <>
##$TPNAME1= <>
##$TPNAME2= <>
##$TPNAME3= <>
##$TPNAME4= <>
##$TPNAME5= <>
##$TPNAME6= <>
##$TPNAME7= <>
##$TPOAL= (0..7)
0.5 0.5 0.5 0.5 0.5 0.5 0.5 0.5 
##$TPOFFS= (0..7)
0 0 0 0 0 0 0 0 
##$TUNHIN= 0
##$TUNHOUT= 0
##$TUNXOUT= 0
##$USERA1= <user>
##$USERA2= <user>
##$USERA3= <user>
##$USERA4= <user>
##$USERA5= <user>
##$V9= 5
##$VALIST= <valist>
##$VCLIST= <CCCCCCCCCCCCCCC>
##$VD= 0
##$VDLIST= <DDDDDDDDDDDDDDD>
##$VPLIST= <PPPPPPPPPPPPPPP>
##$VTLIST= <TTTTTTTTTTTTTTT>
##$WBST= 1024
##$WBSW= 4
##$XGAIN= (0..3)
0 0 0 0 
##$XL= 0
##$YL= 0
##$YMAX_a= 124385
##$YMIN_a= -120512
##$ZGOPTNS= <>
##$ZL1= 120
##$ZL2= 120
##$ZL3= 120
##$ZL4= 120
##$ABSF1= 10
##$ABSF2= 0
##$ABSG= 5
##$ABSL= 3
##$ALPHA= 0
##$AQORDER= 0
##$ASSFAC= 0
##$ASSFACI= 0
##$ASSFACX= 0
##$ASSWID= 0
##$AUNMP= <proc_1d>
##$AZFE= 0.1
##$AZFW= 0.1
##$BCFW= 1
##$BC_mod= 2
##$BYTORDP= 1
##$COROFFS= 0
##$CY= 11.3945322036743
##$DATMOD= 1
##$DC= 2
##$DFILT= <>
##$DTYPP= 0
##$F1P= 15.9154993809931
##$F2P= -4.1035820241983
##$FCOR= 0.5
##$FTSIZE= 0
##$FT_mod= 4
##$GAMMA= 1
##$GB= 0.15
##$INTBC= 1
##$INTSCL= 1
##$ISEN= 128
##$LB= 0.24
##$LEV0= 0
##$LPBIN= 0
##$MAXI= 10000
##$MC2= 0
##$MEAN= 0
##$ME_mod= 0
##$MI= 1.114404
##$NCOEF= 0
##$NC_proc= 0
##$NLEV= 6
##$NOISF1= 3.799351
##$NOISF2= 2.8
##$NSP= 1
##$NTH_PI= 0
##$NZP= 0
##$OFFSET= 15.70392
##$PC= 1
##$PHC0= -11056.86
##$PHC1= 21.40089
##$PH_mod= 1
##$PKNL= yes
##$PPARMOD= 0
##$PSCAL= 0
##$PSIGN= 0
##$REVERSE= no
##$SF= 200.130013532006
##$SI= 16384
##$SIGF1= 3
##$SIGF2= 2
##$SINO= 400
##$SIOLD= 16384
##$SREGLST= <1H.CDCl3>
##$SSB= 0
##$STSI= 0
##$STSR= 0
##$SW_p= 3612.71676300578
##$SYMM= 0
##$S_DEV= 0
##$TDeff= 0
##$TDoff= 0
##$TI= <>
##$TILT= no
##$TM1= 0
##$TM2= 0
##$TOPLEV= 0
##$USERP1= <user>
##$USERP2= <user>
##$USERP3= <user>
##$USERP4= <user>
##$USERP5= <user>
##$WDW= 1
##$XDIM= 8192
##$YMAX_p= 0
##$YMIN_p= 0
$$ End of Bruker specific parameters
$$ ---------------------------------
##NTUPLES= NMR FID
##VAR_NAME=  TIME,          FID/REAL,        FID/IMAG
##SYMBOL=    X,             R,               I
##VAR_TYPE=  INDEPENDENT,   DEPENDENT,       DEPENDENT
##VAR_FORM=  AFFN,          ASDF,            ASDF
##VAR_DIM=   8192,          8192,            8192
##UNITS=     SECONDS,       ARBITRARY UNITS, ARBITRARY UNITS
##FACTOR=    0.0002944,     1,               1
##FIRST=     0,             0,               0
##LAST=      2.4114304,     0,               0
##MIN=       0,             -120512,         0
##MAX=       2.4114304,     124385,          0
$$ Real data points
##PAGE= N=1
##DATA TABLE= (X++(R..R)), XYDATA
$$ plain form
0 0 0 0 0 0 0 0 0 0 0 0 0 0 0 0 0 -8 8 -8 8 -14 16 -16 24 -24 32 -32 40 -48 56 -64 72 -82 94 -108 121 -137
36 -137 154 -174 195 -216 242 -271 300 -332 368 -406 450 -497 549 -604 666 -732 807 -889 981
55 981 -1084 1198 -1329 1482 -1655 1859 -2105 2401 -2777 3256 -3906 4829 -6260 8880 -28992
70 -28992 124385 -21097 -120512 54045 6450 -4916 -43119 -16683 75619 -23333 -20232 86259
82 86259 229 11584 30646 -4543 47507 7839 -9314 66046 9219 -10435 18600 -463
94 -463 4461 -25681 -9824 40093 -30062 -19839 29580 -26434 -20801 -5578 -18900 12285 -13394
107 -13394 -15674 22631 -12633 -22601 -6679 -8661 -997 -21487 -3436 20701 -22902 -13721 10729
120 10729 -13264 -9090 190 12937 16492 -6794 15055 24531 -7126 3417 15862 15673 16697
$$ packed form
0@%%%%%%%%%%%%%%%qJ6j6J6k2L0l2M0m8N6o4P2q8J04j20J36j54J76k02K29k58
36a37K91l28L69m11M58n13N71o32P00p74Q56r47J046j153J270j398J539j696J870
55I81k065K282k527K811l137L514l964M506n178O033p162Q735j1089J5140l7872
70b8992J53377j45482r9415J74557m7595j1366l8203K6436R2302r8952L101J06491
82H6259q6030J1355J9062l5189N2050l9668j7153P5360n6827j9654K9035j9063
94d63M924l0142J5857M9917p0155J0223M9419n6014N633J5223j3322L1185k5679
107a3394k280L8305l5264r968J5922j982P664k0490J8051K4137m3603R181K4450
120A0729k3993M174R280J2747L555k3286K1849R476l1657J0543J2445j89J024
$$ plain form
133 16697 164 16006 27032 -11695 -13423 15636 4955 -13913 -1963 12743 1159 -12895
145 -12895 -9306 -2132 1075 -9343 -7333 15603 9072 -7125 228 3069 3453 -4528 -6874 17161
159 17161 8863 -10359 9796 5149 -11351 305 2350 2634 5921 6524 12763 2543 921 9565
173 9565 -1258 4038 12706 2734 9546 9635 -2855 -1184 -3479 -2735 -2749 -7031 3796 217 -11679
188 -11679 -3559 -7025 -14707 -4776 -3065 -4393 1086 2555 -427 -4969 -2504 1045 -2277 -473 6295
203 6295 6420 1532 -1926 319 -1095 -5490 -2443 1626 4283 1896 -4930 1025 1261 -9535 -4176
218 -4176 3803 681 2135 1390 -262 1168 -5226 -6683 -2487 207 97 -4062 -14 2196 -8955
233 -8955 -8533 -281 -2298 -3170 846 5874 4933 -3360 1085 5914 -938 2635 8835 7464 7801 5402
$$ packed form
133A6697j6533J5842J1026l8727j728K9059j0681j8868J1950J4706j1584j4054
145a2895L589P174L207j0418K010K2936o531j6197P353K841L84p981k346K4035
159A7161q298j9222K0155m647j6500J1656K045K84L287O03O239j0220j622Q644
173I565j0823N296Q668r972O812Q9j2490J671k295P44j4m282J0827l579j1896
188a1679Q120l466p682R931J711j328N479J469k982m542K465L549l322J804O768
203F295J25m888l458K245j414m395L047M069K657k387o826N955K36j0796N359
218d176P979l122J454p45j652J430o394j457M196K694j10m159M048K210j1151
233h955M22Q252k017q72M016N028r41q293M445M829o852L573O200j371L37k399
$$ plain form
249 5402 2866 3942 733 -20 1878 4746 5520 -151 333 2859 -5850 -5430 1646 -563 -950 1563
265 1563 1040 -321 -5516 -3997 -2281 -4979 -1354 -271 -1830 -295 -5712 -6826 -2895 -7658 -5232
280 -5232 1769 -1482 -2101 461 -1105 -3282 -4590 482 3984 -548 3288 7554 -530 -1421 1639 -2097
296 -2097 -110 1906 -79 3575 1659 -4645 -3120 -2574 -4791 -4558 -768 3585 -1405 -4166 2617 -2200
312 -2200 -8212 980 2073 -1567 3366 3360 214 776 -2116 -1286 2120 967 3120 4794 4458 2321 -328
329 -328 2550 2830 208 6013 8165 3166 5104 5242 94 539 2381 1097 2219 3193 2052 -897
345 -897 -2232 -1899 -4298 -4698 -317 -957 -3208 -164 -1426 -5352 -4410 -2919 -3324 -1349 476 -279 116
362 116 -501 -3425 -2814 393 -1121 -750 4113 3416 -905 449 1640 -696 -514 3301 3969 3038 3015 3269
$$ packed form
249E402k536J076l209p53J898K868P74n671M84K526q709M20P076k209l87K513
265A563n23j361n195J519J716k698L625J083j559J535n417j114L931m763K426
280e232P001l251o19K562j566k177j308N072L502m532L836M266q084q91L060l736
296b097J987K016j985L654j916o304J525N46k217K33L790M353m990k761O783m817
312b200o012R192J093l640M933ol146N62k892Q30L406j153K153J674l36k137k649
329c28K878K80k622N805K152m999J938J38n148M45J842j284J122R74j141k949
345h97j335L33k399m00M381o40k251L044j262l926R42J491m05J975J825p55L95
362A16o17k924O11L207j514L71M863o97m321J354J191k336J82L815O68r31k3K54
$$ plain form
380 3269 1885 181 905 1874 2190 3270 3492 2389 785 -756 -1021 -872 -1208 1141 537 -332 1432
397 1432 -2198 -3752 -544 -2313 -2355 1591 347 686 630 -1547 -634 -1882 -1875 2022 -399 684 2767
414 2767 -2151 -1100 -1283 -2827 931 -1692 -521 5279 -1676 -3084 2082 -1708 -1821 -1165 245 4604
430 4604 -1689 -2225 3431 -3037 -3548 -433 -2579 2267 -7 -3853 2474 -1334 -4440 -1166 -2700 1329
446 1329 430 -3551 3695 -2 -5188 1249 -2044 -2166 2398 -2024 1212 1173 -3648 605 -1217 -3339
462 -3339 1320 -616 1635 1611 -2952 3600 320 -4518 3553 1285 672 4133 -360 3202 3245 -2887
478 -2887 2043 2664 1647 4010 451 4092 4687 -2377 1924 2568 -781 3594 1568 1101 2811 -869
494 -869 930 -1242 -2475 4084 -1111 -3802 2671 -452 -3305 -3930 -3674 665 -4494 -5709 1333 -1910
$$ packed form
380C269j384j704P24R69L16J080K22j103j604j541k65J49l36K349o04q69J764
397A432l630j554L208j769m2L946j244L39n6k177R13j248PL897k421J083K083
414B767m918J051j83j544L758k623J171N800o955j408N166l790j13O56J410M359
430D604o293n36N656o468n11L115k146M846k274l846O327l808l106L274j534M029
446A329q99l981P246l697n186O437l293j22M564m422L236l9m821M253j822k122
462c339M659j936K251k4m563O552l280m838Q071k268o13L461m493L562M3o132
478b887M930O21j017K363l559L641N95p064M301O44l349M375k026m67J710l680
494h69J799k172j233O559n195k691O473l123k853o25K56M339n159j215P042l243
$$ plain form
510 -1910 -4606 -4401 -4438 -481 -4244 -4854 1633 -1206 -2091 -469 -3133 70 -12 -2038 2250 1359 1650
527 1650 2414 -770 2171 1724 -174 4322 1581 1563 6040 945 949 2687 1120 3871 317 1030 6818
544 6818 434 -703 2010 -426 1509 -1137 -1679 4244 31 -1784 530 -2136 563 -1048 -4013
559 -4013 2861 154 -1921 1985 -2807 -961 2069 -3640 -537 2300 530 776 -2666 162 3136
574 3136 -3894 -1271 3187 255 881 -1152 -243 2796 -2633 -2411 1934 -5 493 -268 -1209 2025 -1684
591 -1684 -3088 858 -396 -494 362 -717 405 -900 -2272 140 -821 -544 898 2 775 -147 -291
608 -291 1132 -625 -503 2499 1688 45 406 2153 1436 -875 -77 2558 1547 106 703 1678 362
625 362 -1017 -435 673 403 664 -448 -513 860 -1286 -2430 -1376 -155 -862 -2987 81 886 -2596
$$ packed form
510a910k696K05l7L957l763o10O487k839q85J622k664L203q2k026M288q91K91
527A650P64l184K941m47j898M496k741j8M477n095MJ738j567K751l554P13N788
544F818o384j137K713k436J935k646n42N923m213j815K314k666K699j611k965
559d013O874k707k075L906m792J846L030n709L103K837j770K46l442K828K974
574C136p030K623M458k932O26k033R09L039n429K22M345j939M98p61r41L234l709
591a684j404L946j254r8Q56j079J122j305j372K412r61K77J442q96P73r22j44
608b91J423j757J22L002q11j643L61J747p17k311P98K635j011j441N97R75j316
625C62j379N82J108k70K61j112o5J373k146j144J054J221p07k125L068Q05l482
$$ plain form
642 -2596 -1897 -941 -1283 -885 -1328 -740 51 -1675 -307 -661 -2759 261 785 -1614 -340 909 1367 -1473
660 -1473 -2200 2680 791 -2918 1499 1771 -634 -234 -621 675 209 -1936 1152 965 -1350 368 -152
677 -152 -419 192 -1883 1037 1493 -1406 451 1558 -282 -95 -1097 1358 1482 -2018 1821 2836 -828
694 -828 -285 1007 1767 816 -1434 2617 3090 -1566 681 2803 279 -314 472 2412 1244 -1231 2605
711 2605 1374 -2006 277 588 -658 598 682 366 -202 -1090 764 523 -2140 239 217 -946 -178 -842
729 -842 -688 -558 -1565 -90 -429 -1271 307 -818 -1094 7 -1615 -759 239 -735 -572 52 -551 121
747 121 -833 -1013 396 -82 -816 290 777 -134 -723 290 925 -549 -152 1123 550 -701 682 549
765 549 285 -225 330 952 557 -50 638 1188 601 226 575 1492 1194 -387 901 1932 -504 -298 1961
$$ packed form
642b596O99R56l42L98m43N88P91j726J368l54k098L020N24k399J274J249M58k840
660a473p27M880j889l709M417K72k405M00l87J296m66k145L088j87k315J718n20
677a52k67O11k075K920M56k899J857J107j840J87j002K455J24l500L839J015l664
694h28N43J292P60r51k250M051M73m656K247K122k524n93P86J940j168k475L836
711B605j231l380K283L11j246J256Q4l16n68q88J854k41k663K379k2j163P68o64
729h42J54J30j007J475l39q42J578j125k76J101j622Q56R98r74J63O24o03O72
747A21r54j80J409m78p34J106M87r11n89J013O35j474L97J275n73j251J383j33
765E49k64n10N55O22l95o07O88N50n87l75L49R17k98j581J288J031k436K06K259
$$ plain form
784 1961 156 -1121 750 1147 -564 -379 576 241 -509 94 74 -577 -285 -251 -334 -245 -816 -493 0 -764
804 -764 -514 -170 -853 -369 -445 -669 -602 -496 -595 -427 -402 -64 -58 -746 412 -67 -743 961 26 -175 529 -246
826 -246 851 76 -234 1238 110 107 778 570 450 393 106 698 69 -33 841 162 -95 608 339 249 171
847 171 -73 486 -19 -395 581 -86 -332 442 340 -564 128 50 -154 -314 -286 -155 -686 -420 -183 -826 -580
868 -580 -349 -671 -613 -272 -366 -763 -588 73 -677 -1088 -38 -354 -734 48 -335 -606 -25 191 -491 -640 329
889 329 468 -924 -61 411 -629 -196 316 -295 -74 -14 -349 -138 -269 314 -205 -434 570 202 -199 264
909 264 44 326 120 20 1354 559 -258 1186 420 316 1184 423 1320 834 548 1483 140 568 1806
928 1806 229 452 1407 788 1362 23 730 1707 -852 -91 1327 -606 736 113 -838 1028 -764
$$ packed form
784A961j805j277J871L97j711J85R55l35p50O03k0o51K92L4q3Q9n71L23M93p64
804g64K50L44o83M84p6k24O7J06r9J68K5L38Oo88J158m79o76J704r35k01P04p75
826b46J097p75l10J472j128lO71k08j20n7k87N92o29j02Q74o79k57P03k69r0p8
847A71k44N59n05l76R76o67k46P74j02r04O92p8k04j60K8J31n31K66K37o43K46
868e80K31l22N8L41r4l97J75O61p50m11J050l16l80P82l83k71N81K16o82j49R69
889C29J39j392Q63M72j040M33N12o11K21O0l35K11j31N83n19k29J004l68m01M63
909B64k20K82k06j00J334p95q17J444p66j04Q68p61Q97m86k86R35j343M28J238
928A806j577K23R55o19N74j339P07R77k559P61J418j933J342o23r51J866j792
$$ plain form
945 -764 -823 801 -932 39 150 -1842 185 -378 -1590 -244 -882 -516 76 -1719 35 -454 -1454 267
963 267 -1088 -887 1024 -1272 -628 805 -680 -95 -539 -491 1195 -465 -393 904 -438 201 -66 -746
981 -746 1123 19 143 548 -611 949 310 -1767 685 1086 -525 -277 84 821 -208 -1320 530
998 530 645 -349 367 -215 349 203 -428 188 -145 330 537 -279 206 1253 -251 -237 -209 185 229 -809
1018 -809 -83 705 -515 -452 -570 -640 240 -682 -692 -181 -531 146 -1324 -1606 455 -684 -1555 -248 16
1037 16 -35 -958 -1226 490 -669 -763 17 -284 822 80 -995 746 430 -344 915 311 965 1419 -370
1056 -370 853 632 359 1202 292 793 1703 402 355 186 284 1176 -354 -202 2165 440 -501 113 -236
1075 -236 411 -641 -548 1351 -208 -405 568 -510 18 35 -1173 391 -90 -228 428 -943 -184 653
$$ packed form
945g64n9J624j733R71J11j992K027n63j212J346o38L66N92j795J754m89j000J721
963B67j355K01J911k296O44J433j485N85m44M8J686j660P2J297j342O39k67o80
981g46J869j104J24M05j159J560o39k077K452M01j611K48L61P37j029j112J850
998E30J15r94P16n82N64j46o31O16l33M75K07q16M85J047j504J4K8L94M4j038
1018h09P26P88j220O3j18p0Q80r22j0N11l50O77j470k82K061j139q71J307K64
1037A6n1r23k68J716j159r4P80l01J106p42j075J741l16p74J259o04O54M54j789
1056c70J223k21k73Q43r10N01R10j301m7j69R8Q92j530J52K367j725r41O14l49
1075b36O47j052R3J899j559j97R73j078N28J7j208J564m81j38O56j371P59Q37
$$ plain form
1093 653 -978 68 57 35 579 -741 -146 619 -996 -303 388 -121 417 -361 -656 769 -749 -512 -679
1112 -679 -448 487 -1014 -580 629 -923 -984 146 -892 191 280 -227 348 -352 -172 33 -896 216
1130 216 634 -140 680 131 61 612 -406 395 1455 153 633 725 617 648 6 161 1117 493 786 663
1150 663 138 1075 -58 -271 370 -213 86 361 -374 143 -43 -383 269 -835 -7 457 -624 183 328
1169 328 -816 -102 10 -381 139 -372 184 -95 -298 74 -281 -409 551 -670 -6 539 -384 -43 -76 -378
1189 -378 167 -645 -232 420 -809 177 -209 -780 -242 -237 -233 428 -877 121 266 -357 -239 -104 60 385 -242
1210 -242 -52 593 -765 -245 1093 -242 307 216 457 1402 819 38 657 701 447 633 254 863 763 -135
1230 -135 867 98 -166 495 77 276 390 -4 171 -445 -994 -90 -267 -254 -60 -257 -418 -119 -543 -607
$$ packed form
1093F53j631J046j1k2N44j320N95P65j615O93O91n09N38p78k95J425j518K37j67
1112f79K31R35j501M34J209j552o1J130j038J083Q9n07N75p00J80K05r29J112
1130B16M18p74Q20n49p0N51j018Q01J060j302M80R2j08L1o42J55R56o24K93j23
1150F63n25R37j133k13O41n83K99K75p35N17j86l40O52j104Q28M64j081Q07J45
1169C28j144P14J12l91N20n11N56k79k03L72l55j28R60j221O64N45r23L41l3l02
1189c78N45q12M13O52j229R86l86n71N38NMO61j305R98J45o23J18J35J64L25o27
1210b42J90O45j358N20J338j335N49r1K41R45n83p81O19M4k54J86l79O09j00q98
1230a35J002p69k64O61m18J99J14l94J75o16n49R04j77J3J94j97j61K99m24o4
$$ plain form
1250 -607 -527 -500 -150 -221 31 -23 -350 -268 -363 -440 15 242 -101 -28 -40 -88 0 -358 8 355 76 431 504 7
1274 7 -78 202 -23 -298 105 344 315 -275 37 -14 -143 26 67 315 249 39 131 345 -313 160 162 92 366 446
1298 446 261 253 121 199 336 175 241 588 476 247 -93 288 261 -316 99 601 272 63 233 117 -152 -56
1320 -56 -339 -22 -267 -289 -233 -286 -380 -497 -352 -505 -668 -157 217 -202 -540 -336 -579 -598 -435 -130 79 -118
1342 -118 -114 -114 -57 -296 -88 149 205 171 266 101 299 -36 -14 542 473 273 434 699 218 -250 203 146 -114 150
1366 150 101 539 232 87 301 103 -100 245 685 189 -443 90 -90 -660 -514 -16 839 217 226 -454 581
1387 581 19 -407 498 110 436 123 105 27 68 -759 -320 -384 -356 -14 250 -161 -235 -247 -257 -599 -371 30 -348
1410 -348 -614 429 -547 -484 -240 -423 37 -240 -397 233 119 -55 -347 -767 204 24 32 477 182 219 139
$$ packed form
1250f07Q0K7L50p1K52n4l27Q2r5p7M55K27l43P3j2m8Q8l58L66L47k79L55P3m97
1274Gq5K80k25k75M03K39k9n90L12n1j29J69M1K48o6k10R2K14o58M73Kp0K74Q0
1298D46j85qj32P8J37j61O6L47j12k29l40L81k7n77M15N02l29k09J70j16k69R6
1320e6k83L17k45k2N6n3r4j17J45j53j63N11L74m19l38K04k43j9J63L05K09j97
1342a18M%N7k39K08K37N6l4R5j65J98l35K2N56o9k00J61K65m81m68M53n7k60K64
1366A50m9M38l07j45K14j98k03L45M40m96o32N33j80n70J46M98Q55o22Ro80J035
1387E81n62m26R05l88L26l13j8p8M1q27M39o4K8L42K64m11p4j2j0l42K28M01l78
1410c48k66J043r76O3K44j83M60k77j57O30j14j74k92m20R71j80QM45k95L7q0
$$ plain form
1431 139 -442 409 253 -181 339 214 295 838 -539 -6 324 -104 364 -206 313 610 -152 -189 464 -288
1451 -288 68 -281 314 741 -109 -362 390 -530 -254 104 -121 771 -369 -291 -67 -668 -180 182 -3 978
1471 978 179 426 256 -309 231 256 -1031 -300 11 13 447 -148 791 493 -1265 -106 564 -1141 256
1490 256 -1028 444 324 -490 -1078 -300 -854 14 -1 -115 599 -483 65 -690 -1111 373 291 1078 661
1509 661 -99 -116 268 -120 906 578 100 1271 214 316 -19 -413 1115 871 -23 1080 597 526 1358
1528 1358 -522 506 769 191 298 -451 270 377 -1065 -575 -114 -314 577 -167 -89 573 -740 -876 492
1547 492 97 -322 35 -553 -151 545 -364 318 -94 501 -41 -440 1054 137 -103 -117 -752 -350 -288 10
1567 10 515 633 -257 -40 -317 -119 346 -42 68 515 -532 -32 271 -523 621 -346 -388 603 -29 -20 75
$$ packed form
1431A39n81Q51j56m34N20j25Q1N43j377N33L30m28M68n70N19K97p62l7O53p52
1451b88L56l49N95M27q50k53P52r20K76L58k25Q92j140P8K24o01M88L62j85R81
1471I78p99K47j70n65N40K5j287P31L11KM34n95R39k98j758J159O70j705J397
1490B56j284J472j20q14n88P78n54Q68j5j14P14j082N48p55m21J484q2P87m17
1509F61p60j7L84l88J026l28m78J171j057J02l35l94J528k44q94J103m83p1Q32
1528A358j880J028K63n78J07p49P21J07j442M90M61k00Q91p44P8O62j313j36J368
1547D92l95m19L57n88M02O96r09O82m12N95n42l99J494r17k40j4o35M02O2K98
1567A0N05J18q90K17k77J98M65l88J10M47j047N00L03p94J144r67m2R91o32RR5
$$ plain form
1588 75 -370 552 -246 -130 527 -110 79 787 -388 349 299 -190 474 10 468 508 -232 248 439 -377 168
1609 168 -16 148 595 -431 139 348 -307 -165 -104 -475 494 -36 -189 -135 -386 -65 -306 -360 292 -118 -339
1630 -339 -98 -344 -174 -176 -354 -70 222 -305 -109 22 -44 -52 -295 -13 120 -125 105 15 165 -40 -463 -61
1652 -61 245 -193 158 224 -243 -17 61 16 0 39 446 151 -133 486 363 -89 57 382 150 -163 295 1032
1674 1032 265 142 222 323 336 470 245 127 229 220 116 47 95 61 39 189 80 -195 -350 -170 65 -364
1696 -364 -57 -40 -219 -281 -91 -95 -818 -137 -49 -297 -494 459 -3 20 210 -370 105 -504 -92 -125 421 -316
1718 -316 129 -17 40 48 875 629 186 -83 116 -523 -240 -219 123 0 -2 459 412 19 -86 -197 16 -209
1740 -209 14 103 -25 196 -120 -77 11 -5 -27 102 207 338 85 97 17 -106 200 91 204 193 130 124 364 174
$$ packed form
1588G5m45R22p98J16O57o37J89P08j175P37n0m89O64m64M58M0p40M80J91q16N45
1609A68j84J64M47j026N70K09o55J42O1l71R69n30j53N4k51L21k41n4O52m10k21
1630c39K41k46J70kj78K84K92n27J96J31o6qk43K82J33k45K30r0J50k05m23M02
1652f1L06m38L51O6m67K26P8m5j6L9M07k95k84O19j23m52J46L25k32l13M58P37
1674A032p67j23Q0J01J3J34k25j18J02rj04o9M8l4k2J50j09k75j55J80K35m29
1696c64L07J7j79o2J90mp23O81Q8k48j97R53m62K3J90n80M75o09M12l3N46p37
1718c16M45j46N7QQ27k46m43k69J99o39K83K1L42j23kM61m7l93j05j11K13k25
1740b09K23Q9j28K21l16M3Q8j6k2J29J05J31k53J2q0j23L06j09J13j1o3oK40j90
$$ plain form
1764 174 183 -6 281 129 31 20 370 -40 -215 -176 -255 -182 -67 -28 -247 -403 -247 -246 -430 -412 -125 -326 -469 -413
1788 -413 -458 -228 -384 -323 -286 -551 -72 -94 -379 -570 -278 -19 -378 -171 -66 -26 -54 309 -325 261 131 316
1810 316 -115 389 542 113 558 334 -2 -138 458 334 -14 161 133 550 48 34 211 640 30 235 74
1831 74 -76 74 -107 112 -48 -278 -209 658 -263 -139 -201 96 -463 273 616 81 162 -334 -339 -230 -95 -352
1853 -352 -223 201 -595 358 316 -454 -155 -422 -487 179 49 68 172 74 291 193 28 300 66 72 244 -254
1875 -254 42 440 -122 79 474 -200 87 133 87 350 -145 61 190 25 372 -180 29 277 -287 36 245
1896 245 -9 179 -202 -131 193 -158 -177 119 -388 237 252 -320 295 -44 -97 132 -335 192 395 -405 542
1917 542 244 -126 393 -207 41 136 -228 203 -129 -144 -83 -613 -511 31 -173 -236 -98 -293 -23 -620 -721
$$ packed form
1764A74Rj89K87j52r8j1L50m10j75L9p9P3J15L9k19j56J56Jj84J8K87k01j43N6
1788d13m5K30j56O1L7k65M79k2k85j91K92K59l59K07J05M0k8L63o34N86j30J85
1810C16m31N04J53m29M45k24l36j36N96j24l48J75k8M17n02j4J77M29o10K05j61
1831G4j50J50j81K19j60k30O9Q67r21J24o2K97n59P36L43n35Q1m96nJ09J35k57
1853c52J29M24p96R53m2p70K99k67o5O66j30J9J04r8K17r8j65K72k34OJ72m98
1875b54K96L98n62K01L95o74K87M6m6K63m95K06J29j65L47n52K09K48n64L23K09
1896B45k54J88l81P1L24l51j9K96n07O25J5n72O15l39n3K29m67N27K03q00R47
1917E42k98l70N19o00K48R5l64M31l32j5O1n30J02N42k04o3J38j95K70n97j01
$$ plain form
1938 -721 104 -666 -426 -24 -476 172 -236 -708 28 -502 -343 -117 -360 98 54 -472 -18 -67 47 121 -192
1959 -192 298 393 -206 174 136 115 614 33 146 698 -28 407 130 59 625 192 52 602 329 245 327 -55
1981 -55 617 -49 -230 453 -63 216 -286 -510 420 -344 -1006 -255 -235 358 132 -506 265 -84 -424 329 -365
2002 -365 -16 277 -678 -363 335 -28 179 -273 -173 598 -179 -243 188 -196 184 -96 -148 485 -98 -122 -101
2023 -101 -251 197 16 -262 220 -52 -43 -13 -229 273 89 -562 260 102 -329 208 -130 71 453 -287 46
2044 46 173 285 142 -179 134 463 -42 63 479 130 495 133 187 598 -49 28 348 52 264 231 -131
2065 -131 189 49 -38 -107 -248 49 -140 -506 -21 2 -184 73 -383 55 -145 -346 -3 -275 -430 -315 -726
2086 -726 -351 -21 -519 -177 -188 -200 -84 -462 -138 114 -234 25 -284 -270 109 -299 -105 222 -197 -43 -82
$$ packed form
1938g21Q25p70K40M02m52O48m08m72P36n30J59K26k43M58m4n26M54m9J14P4l13
1959a92M90R5n99L80l8k1M99n81J13N52p26M35k77p1N66m33j40N50k73q4Q2l82
1981e5O72o66j81O83n16K79n02k24R30p64o62P51K0N93k26o38P71l49l40P53o94
2002c65L49K93r55L15O98l63K07m52J00P71p77o4M31l84L80k80n2O33n83k4K1
2023a01j50M48j81k78M82k72RL0k16N02j84o51Q22j58m31N37l38K01L82p40L33
2044D6J27J12j43l21L13L29n05J05M16l49L65l62N4M11o47P7L20k96K12l3l62
2065a31L20j40q7o9j41K97j89l66M85K3j86K57m56M38k00k01L43k72j55J15m11
2086g26L75L30m98L42j1j2J16l78L24K52l48K59l09J4L79m08J94L27m19J54l9
$$ plain form
2107 -82 43 585 -49 -221 134 215 525 327 235 450 287 286 244 43 248 135 -58 351 342 307 92 78 209
2130 209 -60 -85 -36 -67 -7 192 23 -371 14 -315 -199 -175 41 -132 -296 -111 17 -311 -111 64 -400 -177
2152 -177 -489 -95 -14 -154 -306 -126 -229 302 -238 -295 1 5 -25 214 -42 116 127 6 148 139 -66 53 43
2175 43 -19 -78 -223 124 -92 52 261 112 -75 79 -98 262 -22 -167 27 -317 -28 342 -141 137 144 -102
2197 -102 230 18 318 -16 -88 53 364 -79 -2 -77 408 41 391 139 177 63 48 94 -122 129 171 61
2219 61 132 -29 62 204 71 -45 -103 -87 -207 -157 -313 55 -34 -78 -84 -107 -298 -432 -60 -188 -220 -372 -475 -145
2243 -145 60 -171 -320 -164 -104 44 -241 -192 -26 31 -161 46 85 127 123 265 181 141 378 162 295 103 89
2266 89 162 172 352 148 280 106 217 339 40 207 307 66 31 229 8 58 191 -28 76 -128 -278 -29
$$ packed form
2107h2J25N42o34j72L55Q1L10j98r2K15j63jm2k01K05j13j93M09rl5k15j4J31
2130B09k69k5M9l1O0J99j69l94L85l29J16K4K16j73j64J85J28l28K00J75m64K23
2152a77l12L94Q1j40j52J80j03N31n40n7K96Ml0K39k56J58J1j21J42rk05J19j0
2175D3o2n9j45L47k16J44K09j49j87J54j77L60k84j45J94l44K89L70m83K78Pk46
2197a02L32k12L00l34p2J41L11m43P7p5M85l67L50k52L8j14j5M6k16K51M2j10
2219F1P1j61R1J42j33j16n8J6j20N0j56L68q9m4ok3j91j34L72j28l2j52j03L30
2243a45K05k31j49J56O0J48k85M9J66N7j92K07L9M2mJ42q4m0K37k16J33j92j4
2266H9P3J0J80k04J32j74J11J22k99J67J00k41l5J98k21N0J33k19J04k04j50K49
$$ plain form
2288 -29 -208 -141 -199 -197 -269 -149 -304 -152 -370 -52 -67 -258 -268 -121 -346 -209 50 -587 46 -51 -443 -171 -377
2311 -377 -230 2 -53 56 -50 19 -65 -50 -51 -19 -38 145 -125 110 178 -86 186 33 84 49 24 -94 61 -178
2335 -178 -76 72 -142 139 -41 -144 -31 -123 139 34 -144 -33 31 11 261 -64 224 229 -152 349 80 216
2357 216 335 -132 217 583 48 348 153 243 625 10 20 70 14 163 -111 -178 375 43 -333 126 -291 -131
2379 -131 -144 -497 37 9 -369 -18 -217 120 -80 -483 -219 104 -610 -112 -369 -129 70 -127 -203 130 -144
2400 -144 60 -105 -67 420 140 -185 69 204 146 -51 -125 398 9 -21 195 -117 150 29 149 714 -58
2421 -58 -210 177 -115 83 95 -355 -145 17 -429 -38 -129 244 189 -300 -130 -196 167 84 -241 38 199 155
2443 155 -21 87 32 102 -241 -66 533 -120 -136 -99 -38 355 -271 11 347 -127 50 -12 -549 74 -198 -479
$$ packed form
2288b9j79O7n8Kp2J20j55J52k18L18j5j91j0J47k25J37K59o37O33r7l92K72k06
2311c77J47K32n5J09j06O9q4J5jL2j9J83k70K35O8k64K72j53N1l5k5j18J55k39
2335a78J02J48k14K81j80j03J13r2K62j05j78J11O4k0K50l25K88Nl81N01k69J36
2357B16J19m67L49L66n35L00j95R0L82o15J0N0n6J49k74o7N53l32l76M59m17J60
2379a31j3l53N34k8l78L51j99L37k00m03K64L23p14M98k57K40J99j97p6L33k74
2400a44K04j65L8M87k80l25K54J35n8j97p4N23l89l0K16l12K67j21J20N65p72
2421e8j52L87k92J98J2m50K10J62m46L91r1L73n5m89J70o6L63q3l25K79J61m4
2443A55j76J08n5P0l43J75N99o53j6L7O1L93o26K82L36m74J77o2n37O23k72k81
$$ plain form
2465 -479 -38 -134 103 -277 -420 87 98 -472 -35 112 89 9 -414 152 249 -232 -8 22 85 387 -472 -158
2487 -158 580 103 375 -32 -37 495 68 84 462 113 398 292 53 619 168 -186 272 -132 526 94 -240
2508 -240 411 192 28 -102 51 207 218 -144 269 -107 -218 77 -342 44 111 -882 117 -108 -329 -171 -179
2529 -179 -23 -146 -421 -124 208 -341 14 -458 -411 152 -372 -280 -85 -182 0 15 -505 378 -98 -259 222
2550 222 21 102 -201 -137 241 49 -303 70 -539 176 395 -56 283 128 181 288 -233 169 345 -49 279
2571 279 244 85 457 -345 48 405 225 -330 -77 107 21 -42 -177 -552 1087 348 -756 -703 346 57
2591 57 -168 -126 28 171 -196 -206 -51 156 -107 -112 -112 -52 -54 -360 36 109 -464 -39 245 91 202 35 -154 445
2615 445 -93 50 -38 81 29 53 30 164 -76 232 220 -199 125 222 -309 -31 -280 -4 -114 -112 194 70 -104
$$ packed form
2465d79M41r6K37l80j43N07J1n70M37J47k3q0m23N66R7m81K24L0O3L02q59L14
2487a58P38m77K72m07nN32m27J6L78l49K85j06k39N66m51l54M58m04O58m32l34
2508b40O51k19j64j30J53J56J1l62M13l76j11K95m19L86O7r93R99k25k21J58q
2529a79J56j23k75K97L32n49L55m72M7N63n24R2J95r7J82J5n20Q83m76j61M81
2550B22k01Q1l03O4L78j92l52L73o09P15K19m51L39j55N3J07n21M02J76l94L28
2571B79l5j59L72q02L93L57j80n55K53J84q6o3j35l75J639p39j104N3J049k89
2591E7k25M2J54J43l67j0J55K07k63n%O0kl06L96P3n73M25K84j54J11j67j89N99
2615D45n38J43q8J19n2K4k3J34k40L08j2m19L24R7n31K78k49K76j10KL06j24j74
$$ plain form
2638 -104 205 -192 -52 241 -311 340 254 45 207 238 -138 219 -25 202 -8 81 201 310 -236 91 -159
2659 -159 -76 227 173 2 -13 -175 91 -51 -22 -97 29 178 -212 -483 35 -64 -100 -64 -98 62 -159 -201 -130 -50
2683 -50 -230 6 -560 25 -140 -185 -118 -71 -481 -139 164 76 -216 -167 -118 127 24 22 189 235 336 242 28 -76
2707 -76 301 -243 146 -12 231 126 35 84 86 158 195 193 185 143 126 110 209 232 268 112 259 -65 84 305 354 157
2733 157 152 4 126 180 105 14 346 39 -9 223 14 101 -213 91 205 -38 198 115 -129 -80 -89 -172 -19 -95
2757 -95 -145 93 -10 -177 -77 -237 -52 -43 -52 52 -206 -236 -169 -131 105 -209 72 -23 41 17 -186 -135 13 68 20
2782 20 -43 176 78 -43 148 74 183 143 234 9 70 150 271 -47 -12 322 -74 -38 139 -77 163 107 111 21 27
2807 27 183 -35 110 -160 -100 -29 -207 -29 -51 -35 -121 70 -103 -377 25 26 -32 -22 -123 -119 209 71 -207 -350
$$ packed form
2638a04L09l97J40K93n52O51q6k09J62L1l76L57k44K27k10Q9J20J09n46L27k50
2659a59Q3L03n4j71j5j62K66j42K9p5J26J49l90k71N18r9l6L6l4J60k21m2P1Q0
2683e0j80K36n66N85j65m5O7M7m10L42L03q8k92M9M9K45j03kJ67M6J01r4k14j04
2707g6L77n44L89j58K43j05r1M9KP2L7kqm2j7j6R9K3L6j56J47l24J49K21M9j97
2733A57nj48J22N4p5r1L32l07m8K32k09Q7l14L04J14k43K36q3k44M9rq3J53p6
2757i5n0K38j03j67J00j60J85RrJ04k58l0O7L8K36l14K81r5O4k4k03N1J48N5m8
2782B0o3K19r8j21J91p4J09m0R1k25O1Q0J21l18L5L34l96L6J77k16K40n6Mr0O
2807B7J56k18J45k70O0P1j78J78k2J6q6J91j73k74M02Jn8J0j01ML28j38k78j43
$$ plain form
2831 -350 -188 -43 116 -165 38 -63 -95 130 -81 81 51 -76 -62 -108 -39 109 -143 153 76 -206 133 36
2853 36 -124 240 -150 -57 108 293 40 101 20 -9 -53 -57 393 -135 -157 -33 -185 61 114 -138 178 135 82 18
2877 18 180 48 70 163 301 161 -154 292 -82 101 31 -125 -99 -249 -90 179 -236 -21 144 -5 -172 -86
2899 -86 -68 -7 -24 -219 35 -125 -173 12 -226 13 -68 -93 -149 -61 119 34 -355 172 -257 -173 -121 -231 -154 372
2923 372 -208 -113 -71 -31 -15 -269 -380 173 -200 -82 463 -117 268 -52 2 374 53 181 246 163 433 -7
2945 -7 -58 397 20 -26 173 -132 433 206 -190 326 -274 -156 115 -3 164 217 61 96 -60 30 232 -231
2967 -231 -103 109 -179 106 -29 62 82 -266 -217 134 -231 -77 -61 -504 210 -94 -348 63 -15 -131 -39 -152
2989 -152 131 -147 -189 26 -52 303 -101 -295 -5 117 -298 -72 -1 100 229 -304 67 400 -322 17 -165
$$ packed form
2831c50J62J45J59k81K03j01l2K25k11J62l0j27J4m6O9J48k52K96p7k82L39r7
2853C6j60L64l90R3J65J85k53O1q1k9m4mM50n28k2J24j52K46N3k52L16m3n3o4
2877A8J62j32K2R3J38j40l15M46l74J83p0j56K6j50J59K69m15K15J65j49j67Q6
2899h6J8O1j7j95K54j60m8J85k38K39q1k5n6Q8J80q5l89N27m29Q4N2j10P7N26
2923C72n80R5M2M0J6k54j11N53l73J18N45n80L85l20N4L72l21J28O5q3K70m40
2945gn1M55l77m6J99l05N65k27l96N16o00J18K71j18J67N3j56L5j56R0K02m63
2967b31J28K12k88K85j35R1K0l48M9L51l65J54J6m43P14l04k54M11p8j16R2j13
2989a52K83k78m2K15p8L55m04j94K90J22m15K26P1J01J29n33L71L33p22L39j82
$$ plain form
3010 -165 40 379 6 75 274 2 24 -36 2 268 -16 -256 174 146 112 35 -386 279 38 187 -65 -121 20
3033 20 -42 -233 -115 80 -81 90 33 -40 99 -353 -14 -6 9 24 -162 -65 60 -517 -221 -211 -90 116 -107
3056 -107 -290 80 -84 -1 74 -263 -142 -59 -296 -34 88 -352 -232 -59 89 -6 -30 91 20 133 115 -25
3078 -25 -29 109 85 59 113 -108 -59 -267 219 290 48 398 254 207 204 49 70 99 -99 202 476 85 61 11 243
3103 243 8 201 147 227 119 40 97 203 271 101 179 38 -46 93 -117 -104 -34 -21 -71 -105 61 -198 -22 -161
3127 -161 -101 -83 -126 -52 132 -170 245 -165 -274 -11 107 -74 81 147 63 -104 -290 -149 -209 -118 -6 -222 -167
3150 -167 -197 -207 -24 30 -190 -162 -186 17 -55 -206 110 -17 30 -96 135 12 -40 28 -85 187 -51 -15 248
3173 248 231 125 65 105 249 195 -200 99 2 230 -39 35 -74 180 -94 144 -263 154 60 112 74 12 -56 -6
$$ packed form
3010a65K05L39l73O9J99k72K2o0L8K66k84k40M30k8l4p7m21O65k41J49k52n6J41
3033B0o2j91J18J95j61J71n7p3J39m52L39QJ5J5j86R7J25n77K96J0J21K06k23
3056a07j83L70j64Q3P5l37J21Q3k37K62J22m40J20J73J48r5k4J21p1J13j8j40
3078b5mJ38k4k6N4k21M9k08M86P1k42L50j44m7lj55K1K9j98L01K74l91k4n0K32
3103B43k35J93n4Q0j08p9N7J06O8j70P8j41q4J39k10J3P0J3n0l4J66k59J76j39
3127a61O0J8m3P4J84l02M15m10j09K63J18j81J55O6q4j67j86J41o0R1J12k16N5
3150a67l0j0J83N4k20K8k4K03p2j51L16j27M7j26K31j23n2O8j13K72k38L6K63
3173B48j7j06o0M0J44n4l95K99r7K28k69P4j09K54k74K38m07M17r4N2l8o2o8N0
$$ plain form
3197 -6 62 54 -47 -34 54 294 -45 95 204 -161 70 -26 65 -21 -181 110 -36 -19 -62 -29 38 -5 66 -199 26
3222 26 -77 267 -149 96 170 115 118 66 177 -3 61 69 98 -16 317 19 55 127 273 54 96 -127 6 -47 31
3247 31 -25 140 120 -10 -21 -260 -230 300 -243 57 49 12 98 -128 -202 -7 -96 19 198 -21 12 81 217 -25
3271 -25 28 -78 -106 -178 -175 -68 38 -175 98 123 62 -23 -219 18 -337 -14 -103 137 77 -148 -125 -111 -200 -117 114
3296 114 -206 204 -343 -7 38 91 -77 42 -170 63 163 -91 255 201 19 312 62 -175 -8 23 260
3317 260 108 233 -20 -19 48 81 -67 132 130 -123 121 -29 128 260 204 81 33 -48 294 -122 -97 21 21 -232
3341 -232 -202 -69 12 -143 -328 -238 -227 -87 -241 -128 47 78 -61 136 7 -195 -29 -160 -116 -16 -98 91
3363 91 40 -144 -35 -58 -184 -75 -263 -27 -127 -115 76 -4 -4 -160 143 64 -19 -165 -128 -136 -124 -120 12 91 198
$$ packed form
3197fO8qj01J3Q8K40l39J40J09l65K31r6R1q6j60K91j46J7m3L3O7m3P1k65K25
3222B6j03L44m16K45P4n5Ln2J11j80O4QK9j14L33k98L6P2J46k19M2k23J33n3P8
3247C1n6J65k0j30j1k39L0N30n43L00ql7Q6k26p4J95q9J15J79k19L3O9J36k42
3271b5N3j06k8p2LJ07J06k13K73K5o1q5j96K37l55L23q9K40o0k25K3J4q9Q3K31
3296A14l20M10n47L36M5N3j68J19k12K33J00k54L46n4j82K93k50k37J67L1K37
3317B60j52J25k53JO7L3j48J99kk53K44j50J57J32n6j23m8q1L42m16K5J18%k53
3341b32L0J33Q1j55j85R0J1J40j54J13J75L1j39J97j29k02J66j31M4J00q2J89
3363I1n1j84J09k3j26J09j88K36j00J2J91q0%j56L03p9q3j46L7qJ2MJ32P9J07
$$ plain form
3388 198 33 -40 238 -98 216 72 151 399 18 156 388 29 351 114 24 290 -97 70 123 36 14 -11
3410 -11 108 188 216 -110 133 -105 -142 53 -124 -149 -111 -109 -217 143 144 64 -48 -230 86 10 -18 -134 -56 61 18
3435 18 -106 121 -23 16 -86 -133 286 -206 45 -151 19 -91 59 -53 136 117 -74 -318 -174 208 19
3456 19 -45 113 45 25 49 -73 325 236 -11 -162 127 -34 40 -14 92 146 111 329 97 -77 122 211 -93 -146
3480 -146 -168 14 196 -85 65 129 33 132 -86 -161 219 -48 443 -85 -179 364 -106 46 -193 -22 -104 214
3502 214 -242 -169 49 -7 -222 -88 79 -40 -215 260 -205 59 -135 -156 -119 132 -297 -77 138 75 -140 -196
3524 -196 35 105 -14 189 -12 -91 73 -155 -93 31 -81 168 345 -117 224 86 -158 71 -3 84 113 -22
3546 -22 351 325 143 164 -128 -133 207 -180 -27 100 81 180 110 78 219 -144 196 210 52 -31 -66 199 -121 102
$$ packed form
3388A98j65p3K78l36L14j44P9K48l81J38K32l59L22k37r0K66l87J67N3q7k2k5
3410a1J19Q0K8l26K43k38l7J95j77k5L8Kj08L60Jq0j12j82L16p6k8j16P8J17m3
3435A8j24K27j44L9j02m7M19m92K51j96J70j10J50j12J89j9j91k44J44L82j89
3456A9o4J58o8k0K4j22L98q9k47j51K89j61P4n4J06N4l5K18k32j74J99Q9l04n3
3480a46k2J82J82k81J50O4r6R9k18p5L80k67M91n28r4N43m70J52k39J71q2L18
3502B14m56P3K18n6k15J34J67j19j75M75m65K64j94k1L7K51m29K20K15o3k15n6
3524a96K31P0j19K03k01p9J64k28O2J24j12K49J77m62L41j38k44K29p4Q7K9j35
3546b2L73k6j82K1k92nL40l87J53J27j9R9p0l2J41l63L40J4j58q3l5K65l20K23
$$ plain form
3570 102 -98 36 -62 -11 67 157 -134 -14 15 -16 113 -2 -247 -134 -39 46 170 14 -49 117 125 214 -127 61
3594 61 -2 -221 32 -8 54 -284 212 226 -71 78 102 162 -120 267 -137 -101 243 23 -73 -12 72 -12 153 -269
3618 -269 490 93 268 214 3 106 852 -347 227 433 493 344 35 707 -62 304 258 259 14 193 114 23
3640 23 109 163 -77 14 -29 -43 177 265 128 -66 9 -181 183 249 17 -1 -164 -35 -169 -199 -73 20 154 -150
3664 -150 -258 124 186 -190 -115 -198 -59 -151 100 -288 -149 64 -16 94 -176 255 157 262 146 14 -168 108
3686 108 61 -59 18 55 -45 -51 135 -93 -18 -55 101 -51 -65 -157 -50 31 104 326 96 -134 88 149 127 -200
3710 -200 -68 77 -87 265 -107 -224 -104 159 118 -141 101 -241 -79 -113 -70 65 51 22 222 113 -163 -75
3732 -75 -7 -92 -153 106 -88 -131 -77 -83 -127 -116 -24 0 -15 -97 -210 109 -187 49 8 108 110 35 -136 88 91 147 -8
$$ packed form
3570A02k00J34r8N1P8R0k91J20K9l1J29j15k45J13R5Q5J24j56o3J66QQ9l41J88
3594F1o3k19K53m0O2l38M96J4k97J49K4O0k82L87m04L6L44k20r6O1Q4q4J65m22
3618b69P59l97J75n4k11J03P46j199N74K06O0j49l09O72p69L66m6Jk45J79p9r1
3640B3Q6N4k40R1m3j4K20Q8j37j94P5j90L64O6k32j8j63J29j34l0J26R3J34l04
3664a50j08L82O2l76P5q3J39r2K51l88J39K13q0J10k70M31r8J05j16j32j82K76
3686A08m7j20P7L7j00oJ86k28P5l7J56j52j4r2J07Q1P3K22k30k30K22O1k2l27
3710b00J32J45j64L52l72j17J20K63m1k59K42l42J62l4M3J35j4k9K00j09k76Q8
3732g5O8q5o1K59j94m3N4om4J1R2K4j5q2j13L19k96K36m1J00Kp5j71K24LN6j55
$$ plain form
3759 -8 -88 -51 66 178 194 89 97 -138 -7 111 -28 24 46 218 16 151 -135 95 134 24 135 16 226
3782 226 126 -59 -32 -34 28 305 202 20 26 -35 22 -62 16 -21 -285 163 128 -195 128 318 -171 10 -70 76
3806 76 218 -235 -15 5 -16 -52 45 36 110 52 -57 -14 -289 116 -137 27 -93 -88 83 -249 -55 112 87 198
3830 198 -37 -2 150 -217 -110 171 -11 204 -98 112 220 290 -46 -9 -6 -192 55 159 130 -23 8 94 354
3853 354 50 113 -168 -27 38 -21 31 44 -227 -83 45 -36 171 21 110 166 -151 299 -119 -112 333 144 -58
3876 -58 173 -115 15 26 33 -145 402 -145 -265 -23 -369 59 -200 -24 -214 -226 261 62 -84 -48 -131 -214 112
3899 112 -229 -75 25 -141 48 -44 82 310 -123 149 213 234 -243 -155 117 22 142 82 159 36 -197 38
3921 38 5 66 -145 -99 285 203 36 -28 -17 -24 64 -75 134 -112 -122 88 140 -10 56 -45 203 -217 162 230 32
$$ packed form
3759hq0L7J17J12J6j05Qk35J31J18j39N2K2J72k02J35k86K30L9j10J11j19K10
3782B26j00j85K7kO2K77j03j82Oo1N7q4P8l7k64M48l5l23L23J90m89J81q0J46
3806G6J42m53K20K0k1l6R7rP4n8j09M3k75M05k53J64j20NJ71l32J94J67k5J11
3830A98k35L5J52l67J07K81j82K15l02K10J08P0l36L7Lj86K47J04k9j53L1Q6K60
3853C54l04O3k81J41O5n9N2J3k71J44J28q1K07j50Q9N6l17M50m18PM45j89k02
3876e8K31k88J30J1Pj78N47n47j20K42l46M28k59J76j90j2M87j99j46L6q3q3L26
3899A12l41J54J00j66J89r2J26K28m33K72O4K1m77Q8K72r5J20o0P7j23k33K35
3921C8l3O1k11M6L84q2j67o4J1pQ8j39K09k46j0K10N2j50O6j01K48m20L79O8j98
$$ plain form
3946 32 -29 50 -37 211 -259 -225 -155 15 49 -113 109 193 -173 -62 97 -76 -66 -150 214 51 30 -119 -53 -319
3970 -319 -250 -51 36 208 -244 -97 -37 8 -87 179 -203 -3 -22 -66 9 -162 -8 80 -111 51 6 -17 286 -213
3994 -213 -156 171 96 147 76 -122 -185 56 37 277 -129 -166 -48 -118 43 -16 58 -117 72 -64 86 -174 232
4017 232 30 58 16 42 -76 -68 -253 36 -174 -168 209 -263 58 89 23 -125 76 -210 15 -77 -231 -114 -24 -17
4041 -17 1 -99 2 -132 -115 53 63 181 -8 162 -118 39 -92 -22 -88 9 -193 -25 -64 109 0 -218 -227
4064 -227 -220 161 266 0 -46 -354 68 -65 -234 76 147 -153 -20 -17 -178 147 -142 19 -190 134 201 -144
4086 -144 -323 108 244 33 -50 12 87 132 45 71 44 199 15 235 36 29 23 117 -190 -176 -196 -356 164 -68 -344
4111 -344 189 10 -82 -314 -112 124 -85 -49 175 -138 127 -15 -347 -119 -114 91 -152 -60 -46 -189 119 -36
$$ packed form
3946C2o1P9q7K48m70L4P0J70L4j62K22Q4l66J11J59j73J0q4L64j63k1j49O6k66
3970c19O9J99Q7J72m52J47O0M5r5K66l82K00j9m4P5j71J54Q8j91J62m5k3L03m99
3994b13N7L27p5N1p1j98o3K41j9K40m06l7J18p0J61n9P4j75J89j36J50k60M06
4017B32k02K8m2K6j18Qj85K89k10OL77m72L21L1o6j48K01k86K25r2j54J17R0P
4041a7J8j00J01j34J7J68J0J18j89J70k80J57j31P0o6R7k02J68l9J73j09k18r
4064b27PL81J05k66m6l08M22j33j69L10P1l00J33Lj61L25k89J61k09L24O7l45
4086a44j79M31J36k11q3O2P5M5q7K6k7J55j84K20j99poR4l07J4k0j60N20k32k76
4111c44N33j79r2k32K02K36k09L6K24l13K65j42l32K28NK05k43R2J4j43L08j55
$$ plain form
4133 -36 98 -176 -41 -136 147 104 176 125 182 -7 -132 199 62 66 -47 -152 -307 -96 241 268 144 45 58 112
4157 112 4 216 202 -70 4 266 130 205 11 118 52 -19 35 178 -66 -120 -157 163 200 116 108 -186 90 44
4181 44 -184 189 -343 -367 -14 29 77 20 -51 -95 73 -15 -196 97 -178 233 23 -240 -28 309 -36 7 49
4204 49 117 92 89 69 -93 93 48 23 33 -86 -62 313 0 154 -128 71 -33 -120 -52 237 -306 141 30 -5
4228 -5 93 -172 -41 44 -105 -21 148 161 95 94 -8 -95 58 4 -78 -34 98 77 -134 -44 129 176 -32 -322 -1
4253 -1 -128 300 -181 -253 236 22 -102 -137 -40 -70 -31 57 56 -129 -162 85 17 -115 137 -40 -203 165 85 -103
4277 -103 134 -109 41 2 -100 159 229 176 -111 139 -84 -2 353 46 165 -27 29 163 131 119 72 -213 -51
4300 -51 52 -54 -15 129 -167 151 -3 -202 116 -97 181 111 -5 111 -174 -179 -44 -220 -96 98 -7 138
$$ packed form
4133c6J34k74J35r5K83m3P2n1N7j89j25L31j37Mj13j05j55K11L37K7j24r9J3N4
4157A12j08K12j4k72P4K62j36P5j94J07o6p1N4J43k44n4l7L20L7q4qk94K76m6
4181D4k28L73n32k4L53M3M8n7p1m4J68q8j81K93k75M11k10k63K12L37l45M3M2
4204D9O8k5lk0j62J86m5k5J0j19K4L75l13J54k82J99j04q7O8K89n43M47j11l5
4228eR8k65J31Q5j49Q4J69J3o6jj02q7J53n4q2M4J32k1k11R0J73M7k08k90L21
4253aj27M28m81p2M89k14j24l5R7l0L9Q8jj85l3K47o8j32K52j77j63L68q0j88
4277a03K37k43J50l9j02K59P0n3k87K50k23Q2L55l07J19j92N6J34l2j2m7k85J62
4300e1J03j06L9J44k96L18j54j99L18k13K78p0j16J16k85nJ35j76J24J94j05J45
$$ plain form
4322 138 320 -55 -187 63 71 38 57 -283 -222 10 -113 91 39 -31 -290 -189 -189 -169 -176 160 -2 -113 19 105
4346 105 136 -268 -79 0 156 98 -66 -280 249 250 -300 116 96 -24 -75 129 229 160 133 -6 -62 -180 221
4369 221 -28 -50 34 18 -77 49 8 75 -268 39 194 52 127 -33 138 61 -97 -167 213 90 9 104 -150 199
4393 199 44 172 -9 30 -68 225 -123 -427 -12 -27 16 -198 2 4 -201 -107 -57 -67 244 -92 -21 -46 -36 -199
4417 -199 38 -255 -140 -54 170 430 -37 23 63 -85 128 209 43 -99 83 -21 -19 -42 -9 222 51 58 120 46
4441 46 229 38 -241 13 -197 -181 -145 -15 243 248 76 145 26 26 -19 90 213 -131 9 19 -217 110 -4
4464 -4 -75 42 -98 304 37 -107 -87 140 54 -75 -63 -9 -135 10 377 -129 -333 27 -33 -88 -80 -309 23 -49
4488 -49 142 -157 -162 69 -166 113 -21 291 68 -93 -90 -235 19 28 26 -19 -77 -150 46 188 97 -60 -105 -296 190
$$ packed form
4322A38J82l75j32K50Ql3J9l40O1K32j23K04n2p0k59J01%K0pL36j62j11J32Q6
4346A05L1m04J89P9J56n8j64k14N29Jn50M16k0j20n1K04J00o9k7j39n6j18M01
4369B21k49k2Q4j6r5J26m1O7l43L07J55j42P5j60J71p7j58p0L80j23q1R5k54L49
4393A99j55J28j81L9r8K93l48l04M15j5M3k14K00Kk05R4N0j0L11l36P1k5J0j63
4417a99K37k93J15Q6K24K60m67O0M0j48K13Q1j66j42J82j04Kk3L3K31j71PO2p4
4441D6J83j91k79K54k10J6L6J30K58Nj72O9j19%m5J09J23l44J40J0k36L27j14
4464dp1J17j40M02k67j44K0K27q6j29J2N4j26J45L67n06k04L60o0n5Qk29L32p2
4488d9J91k99nK31k35K79j34L12k23j61Lj45K54Rkm5n8p3J96J42r1j57m5j91M86
$$ plain form
4513 190 126 251 185 -54 263 -164 -23 -1 -1 -8 73 51 257 176 -10 87 -3 -41 -59 65 24 51 -1 304 140 172
4539 172 141 -64 6 25 -146 -126 307 58 -4 34 -43 -53 175 15 -112 -167 -138 -248 -165 22 33 67 -147 -113 -25
4564 -25 -82 -302 -33 135 -72 -168 -200 -106 -55 151 -24 19 -179 -32 -46 110 87 79 28 49 23 28 -29 101 -117 -41
4590 -41 124 266 -38 187 -36 35 92 56 -43 127 109 -176 83 69 -11 -108 106 14 16 110 125 21 179 -60 8
4615 8 25 -15 -221 -97 59 -3 1 -193 -42 -136 -234 283 -158 -153 193 126 13 -326 -25 -126 -96 -7 -21 53 -63
4640 -63 186 112 -121 123 -32 195 -84 -85 -274 139 -245 98 -29 -38 250 -117 179 -30 -65 84 57 -133 -54
4663 -54 124 169 184 -9 -65 146 199 6 119 60 -195 19 -46 254 -55 -85 -83 68 53 -21 123 -335 128 -92
4687 -92 -17 -119 -85 -278 80 -5 -70 39 27 30 -67 -38 115 -84 97 30 59 251 62 -174 -31 -179 89 176
$$ packed form
4513A90o4J25o6k39L17m27J41K2%pQ1k2K06q1j86R7r0l8j8J24m1K7n2L05j64L2
4539A72l1k05P0J9j71K0M33k49o2L8p7j0K28j60j27n5K9j10Q3J87J1L4k14L4Q8
4564b5n7k20K69J68k07r6l2R4N1K06j75M3j98J47j4J56k3qn1K1k6Nn7J30k18P6
4590d1J65J42l04K25k23P1N7l6r9J70j8k85K59j4q0r7K14r2KR4J5j04J58k39O8
4615HJ7m0k06J24J56o2Mj94J51r4r8N17m41NL46o7j13l39L01j01L0Q9j4P4j16
4640f3K49p4k33K44j55K27k79jj89M13l84L43j27rK88l67K96k09l5J49k7j90P9
4663e4J78M5J5j93n6K11N3j93J13n9k55K14o5L00l09l0KJ51j5p4J44m58M63k20
4687i2P5j02L4j93L58q5o5J09j2Lr7K9J53j99J81o7K9J92j89k36J43j48K68Q7
$$ plain form
4711 176 -100 -61 -155 -123 -32 -38 -59 267 -67 130 30 32 -81 -194 136 21 94 -24 25 61 28 45 44 -13 126 -133
4737 -133 31 16 -45 42 120 -213 -19 267 -7 35 -41 334 -160 78 89 120 -43 6 74 -97 165 152 -216 -31
4761 -31 -53 5 -15 286 71 -106 214 84 37 -297 21 159 54 -63 -199 -225 219 -66 156 -397 68 178
4783 178 -20 46 -208 56 43 -171 104 -1 395 -57 75 -20 244 -321 -392 173 -260 -70 -211 180 -29
4804 -29 -111 -40 53 -122 -63 -167 -58 48 -113 -50 118 40 -195 180 47 15 -67 -243 56 104 315 -29 120
4827 120 159 8 229 -161 230 165 -130 149 -35 204 62 102 -3 103 211 -18 -167 -135 35 43 193 17
4849 17 256 87 -38 9 67 -94 38 209 -68 -75 -21 -221 21 -136 127 153 -8 -176 -262 21 211 -87 129
4872 129 64 -80 -71 56 35 72 155 117 165 -309 -14 -163 190 57 214 -30 31 -18 141 -43 40 55 -32 80
$$ packed form
4711A76k76L9r4L2R1ok1L26l34J97j00Kj13j13L30j15P3j18M9L6l3J7jn7J39k59
4737a33J64j5o1Q7P8l33J94K86k74M2p6L75m94K38J1L1j63M9O8j71K62j3l68J85
4761c1k2N8k0L01k15j77L20j30m7l34L18J38j05j17j36k6M44k85K22n53M65J10
4783A78j98O6k54K64j3k14K75j05L96m52J32r5K64n65p1N65m33J90j41L91k09
4804b9q2P1R3j75N9j04J09J06j61O3J68p8k35L75j33l2q2j76K99M8K11l44J49
4827A20L9j51K21l90L91o5k95K79j84K39j42M0j05J06J08k29j49L2J70QJ50j76
4849A7K39j69j25M7N8j61J32J71k77pN4k00K42j57K63K6j61j68q6K83J90k98K16
4872A29o5j44RJ27k1L7Q3l8M8m74K95j49L53j33J57k44O1m9J59j84Q3J5q7J12
$$ plain form
4896 80 95 -8 201 -187 149 57 46 108 -1 57 161 98 -28 160 -64 216 135 17 -76 81 -59 189 157
4919 157 100 -209 33 -148 27 4 -292 -257 -620 42 76 23 337 -422 122 -801 -747 -574 -729 -422 -87 88
4941 88 96 -148 -87 204 10 61 -125 -27 -21 53 0 -153 -85 21 -129 205 -23 122 -99 149 217 -75 69 -22
4965 -22 -60 50 119 -77 47 112 153 146 -3 206 -135 -64 -130 -305 64 172 141 -306 -8 -41 -306 -25 -59 133
4989 133 153 12 -22 174 125 35 -56 98 19 -216 -168 -126 332 -44 -155 21 24 -135 -118 -140 24 -102 -188 58
5013 58 -87 135 -73 -62 -116 -33 -216 -109 37 -101 123 -168 -91 95 89 7 75 -51 6 32 298 150 222 -71
5037 -71 34 288 163 137 -212 23 103 -82 -9 -88 136 140 102 -52 -236 136 -80 -62 44 49 -43 46 -232 1
5061 1 -8 -198 125 -50 -91 106 42 93 235 128 13 -33 -15 -51 -151 222 -249 -174 16 89 -2 -19 -68 102 -43
$$ packed form
4896H0J5j03K09l88L36r2j1O2j09N8J04o3j26J88k24K80q1j18r3J57j40K48l2
4919A57n7l09K42j81J75k3k96L5l63O62L4n3L14p59N44r23N4J73j55L07L35J75
4941H8Qk44O1K91j94N1j86R8OP4n3j53O8J06j50L34k28J45k21K48O8k92J44r1
4965b2l8J10O9j96J24O5M1pj49K09l41P1o6j75L69J08l1m47K98l3k65K81l4J92
4989A33K0j41l4J96m9r0r1J54p9k35M8M2M58l76j11J76Lj59J7k2J64j26q6K46
5013E8j45K22k08J1n4Q3j83J07J46j38K24k91P7J86oq2O8j26N7K6K66j48P2k93
5037g1J05K54j25k6l49K35Q0j85P3p9K24Ml8j54j84L72k16J8J06Nr2Q9k78K33
5061Arj90L23j75m1J97o4N1J42j07j15m6J8l6j00L73m71P5J90P3r1j7m9J70j45
$$ plain form
5086 -43 62 -73 -119 28 -125 -47 60 -15 2 111 -49 -317 115 -36 -66 16 69 -232 -101 -58 -28 148 164 -305
5110 -305 191 111 -169 382 -139 -51 -186 71 20 -25 46 -41 106 274 -8 118 43 -91 -141 -72 -31 -56 85 -25
5134 -25 -44 -181 87 287 -68 153 -233 20 -183 152 -24 119 165 145 -168 116 49 97 35 -16 36 29 284 -91
5158 -91 159 124 95 -387 -169 -215 -76 22 -33 -72 9 238 -81 90 121 -52 56 -65 -92 -20 -261 129 35 43 -308
5183 -308 -9 -53 -8 -93 -22 201 -201 -7 31 -221 -108 153 -62 20 -204 30 -70 -32 -98 49 -155 -46 -9
5206 -9 -28 13 -4 24 218 119 -122 15 -113 -129 -124 -102 -104 16 54 -154 -97 32 -22 144 23 59 137 -30 -77 -195
5232 -195 -41 159 -96 -34 -69 -139 -7 125 0 -71 -32 125 55 0 -43 -8 50 -93 -123 217 206 -34 143 -32
5256 -32 78 146 37 -50 134 -194 27 22 -110 59 7 -7 -151 159 -57 126 130 69 154 -10 124 573 97 -108
$$ packed form
5086d3J05j35m6J47j53P8J07p5J7J09j60k68M32j51l0Q2N3l01J31M3L0J76J6m69
5110c05M96q0k80N51n21Q8j35K57n1m5P1q7J47J68k82J26p5j34n0O9M1k5J41j10
5134b5j9j37K68K00l55K21l86K53k03L35j76J43M6k0l13K84o7M8o2n1N2pK55l75
5158i1K50l5k9m82K18m6J39R8n5l9Q1K29l19J71L1j73J08j21k7P2k41L90r4Ql51
5183c08K99m4M5q5P1K23m02J94L8k52J13K61k15Q2k24K34j00L8o6J47k04J09L7
5206ij9M1j7K8J94r9k41J37j28j6NK2kJ20L8k08N7J29n4J66j21L6P8j67m7j18
5232a95J54K00k55O2l5p0J32J32j25p1L9J57p0n5m3L5N8j43l0L40j1k40J77j75
5256c2J10O8j09q7J84l28K21nj32J69n2j4j44L10k16J83Mo1Q5j64J34M49m76k05
$$ plain form
5280 -108 162 -56 -97 -64 -300 102 -74 140 -71 -248 -294 -81 -145 25 300 -134 25 243 140 91 308 132
5302 132 -186 -242 326 -43 -102 -65 7 -140 38 282 -14 -56 152 -80 -4 -101 125 49 89 174 141 -78 30 -48
5326 -48 -179 20 -13 -30 -45 230 -21 -18 94 204 -49 -55 77 337 -292 81 210 12 -289 -51 -86 127 113
5349 113 23 99 -151 155 33 -152 105 -99 143 -117 -116 -56 142 -164 73 -15 99 81 120 115 69 -60 52 -239
5373 -239 178 59 35 121 49 -39 56 164 -99 75 -143 1 -168 -141 37 133 77 83 110 97 -40 38 168 67
5397 67 -217 166 -235 31 3 -103 177 -15 -10 48 11 -36 16 -20 44 35 -179 23 111 119 12 146 31 133 172
5422 172 -179 192 -7 -11 -146 168 175 -152 56 -147 -100 -32 174 176 82 -84 -124 -219 -65 -82 46 -92 -76 46
5446 46 -97 -4 2 -148 -61 -26 54 27 -70 -152 96 -232 -37 13 136 169 -40 -57 236 -47 -243 107 31 4 -9
$$ packed form
5280a08K70k18m1L3k36M02j76K14k11j77m6K13o4J70K75m34J59K18j03m9K17j76
5302A32l18n6N68l69n9L7P2j47J78K44k96m2K08k32P6r7K26p6M0Q5l3k19J08p8
5326d8j31J99l3j7j5K75k51LJ12J10k53oJ32K60o29L73J29j98l01K38l5K13j4
5349A13r0P6k50L06j22j85K57k04K42k60JO0J98l06K37q8J14j8L9nm6j29J12k91
5373b39M17j19k4Q6p2q8R5J08k63J74k18J44j69K7J78R6n6OK7j3j37P8J30j01
5397F7k84L83m01K66k8j06K80j92NN8l7m7N2l6O4rk14K02Q8Qj07J34j15J02L9
5422A72l51L71j99mj35L14Pl27K08k03M7O8K06Kr4j66m0r5J54j7J28j38J6J22
5446D6j43R3Oj50Q7L5Q0k7r7q2K48l28J95N0J23L3k09j7K93k83j96L50p6k7j3
$$ plain form
5471 -9 5 44 -64 93 -16 -89 89 180 -124 -55 -47 6 142 -71 207 45 -86 58 110 -6 67 30 -181 67
5495 67 -18 -175 34 121 -288 -83 146 -33 130 -42 281 26 -58 -5 308 212 -61 2 103 14 -164 30 130
5518 130 100 0 265 -66 185 60 -187 18 56 -119 -79 174 16 -31 34 -114 378 171 -11 -220 56 -261
5540 -261 -161 -39 -39 -399 132 -131 -27 116 -34 -42 -25 -66 88 205 179 -50 107 -234 -30 79 26 92 40
5563 40 101 -11 -252 -96 -76 -151 61 -127 -137 91 -153 -177 173 73 -174 53 70 -50 15 106 -150 57 100
5586 100 -254 68 -112 50 173 163 -69 -61 -14 300 228 68 -264 -148 116 -120 77 -124 166 -273 -125 -320
5608 -320 196 302 -25 85 5 -82 -34 123 -49 -59 -243 -117 -78 168 198 73 -157 -30 -37 -26 -73 -171 59 84
5632 84 150 -80 104 74 146 5 -131 243 70 161 -157 67 64 309 -17 -147 -99 161 135 41 30 103 -58 -261
$$ packed form
5471iJ4L9j08J57j09p3J78R1l04O9QN3J36k13K78j62j31J44N2j16P3l7k11K48
5495F7q5j57K09Q7m09K05K29j79J63j72L23k55q4N3L13r6k73O3J01q9j78J94J00
5518A30l0j00K65l31K51j25k47K05L8j75M0K53j58m7O5j48M92k07j82k09K76l17
5540b61J00J22%l60N31k63J04J43j50qJ7m1J54J17k6k29J57l41K04J09n3O6n2
5563D0O1j12k41J56K0p5K12j88j0K28k44k4L50j00k47K27J7j20O5R1k56K07M3
5586A00l54L22j80J62J23j0k32QM7L14p2j60l32J16K64k36J97k01K90m39J48j95
5608c20N16J06l27J10q0q7M8J57j72j0j84J26L9K46L0j25k30J27pJ1m7r8K30K5
5632H4O6k30J84l0P2j41j36L74j73R1l18K24lK45l26j30M8K60k6r4j1P3j61k03
$$ plain form
5656 -261 262 9 116 94 160 37 -382 -191 22 -60 -277 149 21 126 27 9 99 91 -47 -35 12 -159 330
5679 330 -130 -160 8 -67 48 118 114 -74 47 259 -242 -196 144 -249 27 -16 -16 -30 -176 16 210 575 298
5702 298 240 -108 -206 -16 -243 -210 -12 125 154 91 26 2 -613 44 -299 132 -44 -345 524 -181 449 374 22
5725 22 -39 -189 -162 355 251 -144 -153 36 -158 46 165 -117 -182 -11 -74 153 -301 -83 131 541 31 -295
5747 -295 -16 -39 -110 34 -461 -17 159 400 -493 -240 265 92 93 135 142 -301 182 242 5 -31 138 -104 6
5770 6 -132 66 84 32 53 92 -23 -242 82 130 -104 -66 121 34 9 -105 -233 111 -129 -175 -210 -70 168 -120
5794 -120 4 272 -132 133 128 -53 -65 96 114 6 124 95 6 5 -54 -132 -27 35 -208 131 -53 37 -276 155
5818 155 21 139 -57 -116 7 -41 -123 83 144 115 59 -100 100 27 -71 141 375 81 -78 -65 171 -73 -145
$$ packed form
5656b61N23k53J07k2O6j23m19J91K13q2k17M26j28J05r9j8R0qj38J2M7j71M89
5679C30m60l0J68p5J15P0mj88J21K12n01M6L40l93K76m3%j4j46J92J94L65k77
5702B98n8l48r8J90k27L3J98J37K9o3o5k4o15O57l43M31j76l01Q69p05O30p5l52
5725B2o1j50K7N17j04l95rJ89j94K04J19k82o5J71o3K27m54K18K14M10n10l26
5747b95K79k3p1J44m95M44J76K41q93K53N05j73JM2Pm43M83O0k37l6J69k42J10
5770Fj38J98J8n2K1L9j15k19L24M8k34L8J87q7k5j14j28L44k40m6l5J40K38k88
5794a20J24K68m04K65nj81j2J61J8j08J18k9q9jn9p8J05O2k43L39j84R0l13M31
5818A55j34J18j96n9J23m8q2K06O1k9n6j59K00p3r8K12K34k94j59J3K36k44p2
$$ plain form
5841 -145 -88 40 20 -133 198 250 56 -410 -158 -2 -36 18 -246 71 -22 -246 -177 -223 107 -90 153 19 -44
5864 -44 -108 -44 340 161 3 39 32 143 -22 155 -36 -134 17 -409 -60 101 72 -336 88 94 128 67 603 387
5888 387 -20 568 -451 -104 463 444 -62 118 -58 676 162 727 362 -838 95 -278 -83 166 -115 40
5908 40 -116 -72 204 -210 -206 300 -12 -132 -229 -71 -18 -437 39 -9 96 -178 -159 -198 -30 16 -135 39 -82
5931 -82 -38 124 -94 -109 -150 -71 20 121 91 29 -164 -85 178 26 -244 -80 -105 -251 -13 137 -56 218 -88
5954 -88 -240 56 -132 334 137 46 -8 -46 122 14 -46 151 199 211 -75 -57 122 -98 171 174 117 -85 130 1
5978 1 -42 -51 180 222 82 119 32 148 -336 11 -27 -8 -131 -145 240 -9 -176 0 -174 11 208 113 -47 198
6002 198 63 -73 103 63 -4 147 -51 -55 -52 -66 134 -75 144 22 -156 -113 342 -1 233 141 -136 -4 192
$$ packed form
5841a45N7J28k0j53L31N2j94m66K52J56l4N4k64L17r3k24O9m6L30j97K43j34o3
5864d4o4O4L84j79j58L6pJ11j65J77j91r8J51m26L49J61k9m08M24OL4o1N36k16
5888C87m07N88j019L47N67j9n06J80j76P34n14N65l65j200R33l73J95K49k81J55
5908D0j56M4K76m14MN06l12j20r7J58N3m19M76m8J05k74J9l9J68M6j51J74j21
5931h2M4J62k18j5m1P9R1J01l0o2j93P9K63j52k70J64k5j46K38J50j93K74l06
5954h8j52K96j88M66j97r1n4l8J68j08o0J97M8J2k86J8J79k20K69Ln7k02K15j29
5978Am3rK31M2j40L7q7J16m84L47l8J9j23j4L85k49j67J76j74J85J97r5j60K45
6002A98j35j36J76m0o7J51j98mLj4K00k09K19j22j78M3M55l43K34r2k77J32J96
$$ plain form
6025 192 141 -65 170 19 161 -182 -36 97 33 80 63 58 128 -180 -86 63 9 -71 128 14 -82 99 209 -71
6049 -71 -61 178 42 -279 40 38 180 -64 22 52 176 204 67 158 8 255 -219 -84 303 -59 -30 281 45
6072 45 25 -161 -144 25 166 -185 -173 -148 -53 4 201 -160 -7 -48 26 32 -169 -140 -102 14 -23 43 52 -52 -174 94
6098 94 291 -212 -2 131 76 -82 -182 -146 -92 69 116 218 80 -48 -163 164 58 119 203 47 -32 29 -56
6121 -56 -8 44 -194 -43 -32 -115 -32 134 113 8 112 -29 21 33 -52 -107 139 -135 212 8 74 211 6 251
6145 251 67 -244 82 104 -87 111 142 -130 -119 51 48 5 -191 -175 169 -28 31 163 189 174 12 102 -39 116
6169 116 -161 25 80 -33 -61 106 150 8 172 -99 -104 75 40 83 -122 -105 94 185 -9 100 -169 24 -52
6192 -52 36 -34 62 -95 -81 194 123 258 -42 125 67 119 -205 -298 -27 64 22 103 175 -77 -75 104 129 189 -204 63
$$ packed form
6025A92n1k06K35j51J42l43J46J33o4M7j7nP0l08R4J49n4q0J99j14r6J81J10k80
6049g1J0K39j36l21L19kJ42k44Q6L0J24K8j37R1j50K47m74J35L87l62K9L11k36
6072D5k0j86J7J69J41l51J2K5R5N7J97l61J53m1P4Ok01K9L8J16l7O6Rj04j22K68
6098I4J97n03K10J33n5j58j00L6N4J61M7J02j38j28j15L27j06O1Q4j56p9O1q5
6121e6M8N2k38J51J1q3Q3J66k1j05J04j41N0J2q5n5K46k74L47k04O6J37k05K45
6145B51j84l11L26K2j91J98L1k72J1J70lm3j96J6L44j97N9J32K6j5j62R0j41J55
6169A16k77J86N5j13k8J67M4j42J64k71nJ79l5M3k05J7J99R1j94J09k69J93p6
6192e2Q8p0R6j57J4K75p1J35l00J67n8N2l24r3K71R1m2Q1P2k52KJ79K5O0l93K67
$$ plain form
6218 63 139 268 109 23 80 119 -120 -46 -77 171 145 174 -100 122 291 -153 -24 75 94 6 306 -194 -146 -50 -151
6243 -151 -112 4 64 -62 -37 -110 -7 14 -171 -28 -59 -79 266 -304 -64 8 -13 -135 -20 -18 -198 -69 -176 1
6267 1 -107 24 49 127 98 89 -52 59 63 99 113 134 -93 57 101 -75 30 41 -130 36 -17 -44 108 -55 -91 -18
6293 -18 182 135 -42 64 -56 -17 98 -154 -48 -62 -67 143 10 132 82 -160 -150 -21 -107 288 143 -171 -64
6316 -64 86 124 90 -134 -60 -36 -123 1 -85 -51 87 44 19 3 301 -144 -128 43 96 243 -181 171 248 -101 -23
6341 -23 -18 -267 -117 77 -62 136 19 -106 7 136 7 -175 -160 147 -294 -264 -9 -69 -256 41 -112 95
6363 95 211 -60 -25 -13 -6 442 -108 94 136 -49 25 -183 -189 107 -57 97 -111 -163 7 50 29 5 -128 -94 -107
6388 -107 -195 8 -50 -150 139 -107 10 93 -34 68 -41 -282 -204 -25 -180 -63 -161 -366 114 191 -207 135
$$ packed form
6218F3P6J29j59q6N7L9k39P4l1K48k6K9k74K22J69m44J29R9J9q8L00n00M8R6j01
6243a51L9J16O0j26K5p3J03K1j85J43l1k0L45n70K40P2k1j22J15Kj80J29j07J77
6267Aj08J31K5P8k9rj41J11ML6J4K1k27J50M4j76J05J1j71J66n3k7J52j63l6P3
6293a8K00m7j77J06j20L9J15k52J06j4nK10j33J22n0k42J0J29q6L95j45l14J07
6316f4J50L8l4k24P4K4q7J24q6L4J38m3k5j6K98m45J6J71N3J47m24L52P7l49P8
6341b3Nk49J50J94j39J98j17j25J13J29j29j82J5L07m41L0K55o0j87K97j53K07
6363I5J16k71L5J2PM48n50K02M2j85P4k08oK96j64J54k08n2J70M3k1k4j33L4j3
6388a07q8K03n8j00K89k46J17Q3j27J02j09k41P8J79j55J17r8k05M80P7l98L42
$$ plain form
6410 135 -49 -85 -388 119 -17 -212 0 -103 105 177 -88 -103 212 -102 -52 139 272 44 65 -103 -124 109
6432 109 76 172 215 -65 -7 -164 -43 -39 136 -83 149 -138 -26 -19 126 -56 176 167 1 126 138 41 -114 -4
6456 -4 -157 172 -44 -55 -39 -47 38 -9 -15 -84 16 100 82 100 -3 -15 -185 -25 188 -141 -82 117 173 -140 38 246
6482 246 19 83 -24 -91 -49 205 -36 86 216 133 -35 55 125 -80 -78 149 -43 84 -241 180 -57 -15 53
6505 53 190 40 -167 -8 197 1 34 -84 -78 -93 -110 -16 -221 25 153 3 72 264 34 147 50 31 64 -62
6529 -62 126 79 244 -97 -111 -333 15 -294 48 171 49 -202 5 -119 -130 59 161 -90 -18 -231 -395 -165
6551 -165 46 183 -50 112 139 53 -10 -35 141 24 -213 -10 -157 -262 -217 -113 -10 71 333 214 89 -11
6573 -11 -9 -116 192 -118 98 31 -256 -24 55 -117 -30 54 -263 -122 -11 79 -101 -29 17 -159 96 82 28 -464
$$ packed form
6410A35j84l6l03N07j36j95K12j03K08P2k65j5L15l14N0J91J33k28K1j68k1K33
6432A09l3R6M3k80N8j57J21MJ75k19K32k87J12PJ45j82K32rj66J25J2r7j55J10
6456dj53L29k16j1J6qQ5m7oo9J00Q4j8J8j03j2j70J60K13l29N9J99N6l13J78K08
6482B46k27O4j07o7M2K54k41J22J30q3j68R0P0k05KK27j92J27l25M21k37M2O8
6505E3J37j50k07J59K05j96L3j18Oj5j7R4k05K46J28j50O9J92k30J13r7j9L3j26
6529f2J88m7J65l41j4k22L48l09L42J23j22k51K07j24j1J89J02k51P2k13j64K30
6551a65K11J37k33J62K7q6o3k5J76j17k37K03j47j05M5J04J03Q1K62j19j25j00
6573a1Kj07L08l10K16o7k87K32P9j72Q7Q4l17J41J11R0j80P2M6j76K55j4n4m92
$$ plain form
6597 -464 -42 202 101 46 -158 -37 -215 -166 -57 -80 -11 -42 -195 2 289 -113 92 69 -178 1 51 5 -104
6620 -104 178 -133 -46 89 68 206 271 -52 70 -24 -98 51 -179 -280 -44 -105 238 -35 68 27 -227 -45
6642 -45 86 -168 50 -91 -220 121 -146 87 68 -126 -63 -14 -24 -53 35 -71 -104 167 -27 -140 0 86 264
6665 264 -104 210 -44 -37 -167 129 152 32 -94 127 125 -321 59 162 -105 108 57 -127 168 80 150 -159 -33
6688 -33 -176 -212 -79 -235 -125 -187 17 70 27 -51 -29 -52 95 -255 115 -132 -136 -180 0 112 -139 52 -20 13
6712 13 203 61 -202 -11 230 162 53 -126 -78 238 73 105 65 -73 -221 130 -97 49 -108 -287 44 -22
6734 -22 229 125 -148 228 -264 150 -29 13 145 414 -159 109 248 126 -259 -184 82 365 36 -250 -147
6755 -147 -561 -155 163 139 -117 -618 103 230 -356 -353 -204 -160 -387 203 529 26 -371 -556 150 19 8 -167
$$ packed form
6597d64M22K44j01n5k04J21j78M9J09k3O9l1j53J97K87m02K05k3k47J79N0m6j09
6620a04K82l11Q7J35k1J38O5l23J22r4p4J49k30j01K36o1L43k73J03m1k54J82
6642d5J31k54K18j41j29L41k67K33j9j94O3M9j0k9Q8j06l3K71j94j13J40Q6J78
6665B64l68L14k54Pj30K96K3j20j26K21km46L80J03k67K13n1j84K95q8P0l09J26
6688c3j43l6J33j56J10o2K04N3m3p8K2k3J47l50L70k47mm4J80J12k51J91p2L3
6712A3J90j42k63J91K41o8j09j79M8L16j65L2m0j38j48L51k27J46j57j79L31o6
6734b2K51j04k73L76m92M14j79M2J32K69n73K68J39j22l85P5K66K83l29k86J03
6755a47m14M06L18k4k56n01P21J27n86LJ49M4k27N90L26n03l97j85P06j31j1j75
$$ plain form
6777 -167 -81 450 459 69 195 133 229 87 224 525 -502 -444 -599 -368 -494 -239 427 -303 97 309 400 -67
6799 -67 49 188 196 42 -14 25 301 104 -14 -201 66 -44 29 86 -42 -89 84 -329 78 222 88 -36 52
6822 52 35 100 17 87 -87 -97 -205 -108 205 -223 -8 40 41 268 53 -18 -12 133 3 -16 -130 -262 -172 -9 60
6847 60 -184 130 -123 250 -138 48 -124 -194 31 96 -64 -51 18 -10 -66 132 -40 -82 120 78 32 104 138 17
6871 17 -57 -15 -342 52 -191 308 -38 -22 41 -133 115 134 -88 207 5 154 -233 174 111 48 64 -87 21
6894 21 -34 -10 159 82 12 14 -103 308 45 82 -146 -223 -36 217 -262 -77 -66 181 -152 143 112 -49 31 -75
6918 -75 53 22 267 -103 -125 -73 219 -303 219 -149 188 160 -158 241 83 -43 34 1 81 65 -49 60 264
6941 264 -17 -202 135 286 211 -43 -34 120 117 216 99 121 31 175 344 142 121 -303 109 33 -1 163 268 -130
$$ packed form
6777a67Q6N31Rl90J26o2R6j42J37L01j027N8j55K31j26K55O66p30M00K12R1m67
6799f7J16J39Qj54n6L9K76j97j18j87K67j10P3N7j28m7J73m13M07J44j34j24Q8
6822E2j7O5q3P0j74j0j08R7L13m28K15M8JK27k15p1OJ45j30j9j14j32R0J63O9
6847F0k44L14k53L73l88J86j72p0K25O5j60J3O9k8n6J98j72m2K02m2m6P2L4j21
6871A7p4M2l27L94k43M99l46J6O3j74K48J9k22K95k02J49l87M07o3o3J6j51J08
6894B1n5K4J69p7p0Kj17M11k63L7k28p7J87K53m79J85J1K47l33K95l1j61Q0j06
6918g5J28l1K45l70k2N2K92n22N22l68L37k8l18L99j58j26P7l3Q0j6j14J09K04
6941B64k81j85L37J51p5k54RJ54lR9j17K2r0J44J69k02k1m24M12p6l4J64J05l98
$$ plain form
6965 -130 125 -260 224 170 83 17 -111 224 -189 -31 32 -14 -32 -125 99 -55 -174 63 -39 -172 -156 -183 -24
6988 -24 -118 87 107 -60 -77 -96 -117 130 -252 -75 -143 10 39 76 70 -75 203 -42 -170 16 -220 188 85 280
7012 280 -66 -39 2 134 117 -335 45 -246 -45 -143 -118 202 73 -107 -188 102 -223 -133 -173 -7 140 125 55
7035 55 82 159 -100 28 27 -226 -30 -66 -156 -208 -12 144 120 69 -230 -105 198 -65 12 -101 -35 0 256 3
7059 3 36 108 74 54 -82 -78 -97 58 239 327 94 151 -113 -237 -142 -238 -249 4 -76 90 -121 24 67 -145 38
7084 38 107 -51 14 100 -156 48 68 90 44 -87 -32 39 -215 -29 250 71 26 -342 325 -69 -213 280 263 -49
7108 -49 144 -49 2 122 -47 87 131 -150 -7 16 115 82 -20 -193 91 81 155 -225 92 39 -56 -3 191 248
7132 248 -69 -241 57 24 -147 110 112 262 -70 -144 -4 103 -224 197 41 20 -148 134 -165 -144 10 75
$$ packed form
6965a30K55l85M84n4q7o6j28L35m13J58O3m6j8r3K24j54j19K37j02j33J6k7J59
6988b4r4K05K0j67j7j9k1K47l82J77o8J53K9L7oj45K78k45j28J86k36M08j03J95
7012B80l46K7M1J32j7m52L80k91K01r8K5L20j29j80q1K90l25R0m0J66J47j5p0
7035E5K7P7k59J28jk53J96l6r0n2J96J56k4n1k99J25L03k63P7j13O6L5K56k53
7059CL3P2l4k0j36Mj9J55J81Q8k33N7k64j24R5r6j1K53q0J66k11J45M3k12J83
7084C8O9j58O5Q6k56K04K0K2m6j31N5P1k54J86K79j79m5l68O67l94j44M93j7l12
7108d9J93j93N1J20j69J34M4k81J43K3R9l3j02j73K84j0P4l80L17n3r5N3J94N7
7132B48l17j72K98l3j71K57KJ50l32p4J40J07l27M21j56k1j68K82k99K1J54O5
$$ plain form
7154 75 -25 98 121 -111 147 67 131 -214 122 -102 -57 -99 111 127 -52 -78 25 -340 -117 -158 -32 -52 -42 -156
7178 -156 -28 19 -243 -44 -48 208 -130 59 -3 142 54 21 69 82 106 -168 75 45 6 -172 -115 -88 6 -150 -64
7203 -64 -171 -53 -122 184 171 103 -84 44 -60 79 -138 108 101 -35 1 -12 30 -66 104 -2 144 1 -47 35
7227 35 -85 -54 -40 -6 -98 45 -180 85 -167 135 16 -53 81 192 -66 7 31 49 -145 27 -20 137 -95
7250 -95 -5 -32 26 -17 57 -101 -62 -79 -24 -169 194 -138 -126 182 -150 -205 36 140 -195 -257 245 -112 78 155
7274 155 40 -53 185 -227 40 202 -189 264 65 139 -79 21 115 -117 -192 266 29 -83 -52 -104 80 43
7296 43 46 -44 205 23 188 79 -101 157 76 -261 -185 268 187 -43 -88 -270 -164 -237 -121 -44 36 -131 11 -263
7320 -263 -12 -108 128 7 5 -6 -188 80 -51 -216 135 197 -152 98 -269 55 233 223 64 -299 259 89
$$ packed form
7154G5j00J23K3k32K58q0O4l45L36k24M5m2K10J6j79k6J03l65K23m1J26k0J0j14
7178a56J28M7k62J99mK56l38J89o2J45q8l3M8J3K4k74K43l0l9j78N7K7R4j56Q6
7203f4j07J18o9L06j3o8j87J28j04J39k17K46pj36L6j3M2r6J70j06J46j43m8Q2
7227C5j20L1J4L4r2J43k25K65k52L02j19o9J34J11k58P3K4J8j94J72m7J57k32
7250i5R0k7N8m3P4j58L9j7N5j45L63l32J2L08l32n5K41J04l35o2N02l57J90P7
7274A55j15r3K38m12K67J62l91M53j99P4k18J00R4k32p5M58k37j12L1n2J84l7
7296D3Lr0K49j82J65j09j80K58q1l37P6M53q1k30m5j82J06p3J16P7Q0j67J42k74
7320b63K51r6K36j21kj1j82K68j31j65L51O2l49K50l67L24J78j0j59l63N58j70
$$ plain form
7342 89 68 105 188 1 -189 36 121 -122 105 -123 143 -42 128 -113 123 -104 -52 -37 -176 257 81 -50
7364 -50 226 249 -311 101 -19 -20 28 -51 301 38 -21 20 -99 -16 -82 119 -166 -54 138 128 -129 234 -82 -237
7388 -237 204 29 63 -178 73 -70 94 -173 36 94 -68 -102 30 11 -32 -36 -32 -55 -177 96 -86 -74 99 -94
7412 -94 152 -20 76 -102 -44 -96 -87 -208 -102 -237 -184 121 31 -58 18 62 -238 148 136 84 -49 -152 -7 -211
7436 -211 -373 273 153 41 -103 -288 10 -135 -100 162 50 4 -32 60 133 49 -16 -198 -107 121 -39 -122 -24
7459 -24 -62 163 78 -262 43 -91 91 -72 193 354 -310 -311 -66 -110 -506 -562 124 13 245 -203 -31 -157
7481 -157 -22 -99 9 -159 157 41 36 -10 -27 108 -7 5 -60 -147 30 48 -77 -57 -18 47 99 -62 -115 8 -27
7506 -27 -34 79 -224 159 54 49 116 117 4 -94 93 -76 124 133 -227 -48 -27 68 -67 -99 -360 84 -71 20 93
$$ packed form
7342H9k1L7Q3j87j90K25Q5k43K27k28K66j85J70k41K36k27N2J5j39M33j76j31
7364e0K76K3n60M12j20jM8p9L52k63n9M1j19Q3o6K01k85J12J92j0k57L63l16j55
7388b37M41j75L4k41K51j43J64k67K09N8j62l4J32j9m3mMk3j22K73j82J2J73j93
7412i4K46j72R6j78N8n2Rj21J06j35N3L05r0q9P6M4l00L86j2n2j33j03J45k04
7436b11j62O46j20j12j44j85K98j45L5K62j12m6l6R2P3q4o5j82R1K28j60q3R8
7459b4l8K25q5l40L05j34J82j63K65J61o64jK45m4l96n6O86j11K32m48J72j26
7481a57J35p7J08j68L16j16nm6j7J35j15J2o5q7J77J8j25K0L9O5N2j61n3J23l5
7506b7pJ13l03L83j05nO7Jj13r8J87j69K00Rl60J79K1R5j35l2k61M44j55R1P3
$$ plain form
7531 93 101 -160 9 165 178 42 210 26 -17 9 -193 -94 41 19 -88 -132 66 163 -94 88 62 136 -155 -87
7555 -87 -239 177 185 15 -98 -207 33 -13 20 39 -69 68 -173 -22 -344 -113 65 -91 119 27 -6 9 -159
7578 -159 -57 -10 -50 -184 -119 -113 176 26 249 113 1 51 -93 177 -2 76 -66 -74 -137 111 -56 162 -73
7601 -73 -27 -122 231 -30 -42 -28 -158 200 -11 -182 -115 -32 -139 -151 140 25 -38 -147 -36 15 -49 -19 -66 284
7625 284 -103 239 66 -385 171 213 18 75 -23 152 3 243 94 -99 193 -220 -197 27 -46 -45 -51 164 -5
7648 -5 239 136 -10 -322 54 214 -43 203 -217 127 -58 243 27 26 -33 -34 242 62 -245 2 125 -45
7670 -45 129 -78 -74 -150 419 -59 -17 41 36 -74 74 -69 -125 -69 60 225 42 -72 -5 18 182 102 -63 -52 52
7695 52 -366 -22 164 156 232 75 -19 -65 -68 65 -24 -133 -118 -29 54 98 -217 -181 78 188 14 185 141 78 70 39
$$ packed form
7531I3Qk61J69J56J3j36J68j84m3K6k02R9J35k2j07m4J98R7k57J82k6P4k91O8
7555h7j52M16Qj70j13j09K40m6L3J9j08J37k41J51l22K31J78j56K10r2l3J5j68
7578a59J02M7m0j34O5OK89j50K23j36j12N0j44K70j79P8j42qo3K48j67K18k35
7601g3M6r5L53k61j2J4j30L58k11j71O7Q3j07j2K91j15o3j09J11N1o4L0m7L50
7625B84l87L42j73m51N56M2j95N7r8J75j49K40j49j93K92m13K3K24p3JoK15j69
7648eK44j03j46l12L76J60k57K46m20L44j85L01k16jn9jK76j80l07K47J23j70
7670d5J74k07Mp6N69m78M2N8nj10J48j43n6N6J29J65j83j14O7K3J64q0j65J1J04
7695E2m18L44J86qP6j57r4m6lJ33q9j09J5Q9Q3M4l15L6K59J10j74J71m4o3ql1
$$ plain form
7721 39 44 33 45 -165 151 -203 169 204 92 9 -258 -156 71 81 64 -247 -92 368 53 18 -104 50 -78
7744 -78 66 116 130 36 226 14 -18 129 -121 -11 12 -49 -24 69 -24 109 7 158 135 -25 -58 -21 -122 -16
7768 -16 -88 -20 -60 -8 0 -100 2 144 -102 69 -47 -242 97 264 -38 -60 -221 -88 -116 -257 90 -15 169
7791 169 16 47 -71 186 -263 -248 48 -31 -39 30 -59 -50 188 45 -152 -30 -37 155 -100 -61 -35 -117 130 246 26
7816 26 60 -182 19 -38 -291 -85 -12 -62 -35 -126 -138 161 196 33 95 225 -135 -138 72 -196 -85 -225 41 27
7840 27 246 2 -198 -67 -121 -23 -15 -92 -193 -193 27 -79 84 293 -191 -185 -34 115 27 -133 40 -45 46 -249
7864 -249 43 31 -35 34 -27 119 258 -12 -192 3 -117 -59 62 -78 -30 -23 -58 -70 -28 30 107 -6 -146 -120 -129
7889 -129 56 29 -45 332 -104 -14 25 66 63 -30 76 -180 -251 -49 -137 -250 -141 -66 -45 -61 -91 93 42 56 96 -80
$$ packed form
7721C9Nj1J2k10L16l54L72L5j12q3k67J02K27J0j7l11J55M60l15l5j22J54j28
7744g8J44N0J4r4J90k12l2J47k50J10K3o1K5R3r3J33j02J51k3j60l3L7j01J06
7768a6p2O8m0N2Qj00J02J42k46J71j16j95L39J67l02k2j61J33k8j41L47j05J84
7791A69j53L1j18K57m49J5K96p9qO9q9RK38j43j97J22pJ92k55L9K6q2K47J16k20
7816B6L4k42K01n7k53K06P3n0K7r1j2K99L5j63O2J30l60lK10k68J11j40K66j4
7840B7K19k44k00J31n4R8Qp7j01%K20j06J63K09m84OJ51J49q8j60J73q5R1k95
7864b49K92j2o6O9o1J46J39k70j80J95j20N8J21j40M8Pl5j2M2N8P7j13j40K6r
7889a29J85k7p4L77m36R0L9M1lr3J06k56p1K02q8j13J09P5K1j6l0J84n1J4M0j76
$$ plain form
7915 -80 -200 -88 3 27 -118 158 195 -158 23 -60 130 -105 66 -38 55 140 -15 -71 -128 -125 -78 107 9 28 80
7940 80 60 10 52 -3 -24 93 -29 -395 -64 29 152 214 -11 -201 181 -77 -51 -79 -40 -104 -47 -32 -174 243 -198
7965 -198 -62 61 112 114 53 57 28 150 99 -12 61 -48 42 113 -68 42 -57 -16 -19 -93 108 163 93 143 267 96
7991 96 45 -249 39 73 -258 -134 -95 31 83 -722 -15 -471 -392 298 418 415 -251 -420 244 495 434 139 357
8014 357 223 173 26 -137 16 351 165 -50 637 -64 42 -212 -78 206 143 -114 -217 -425 203 -55 -2
8035 -2 96 211 8 -60 -315 42 -42 67 156 47 115 -117 187 -80 -118 21 -19 -17 149 -21 -74 -155 -67 11 -137
8060 -137 25 -3 207 46 -130 -41 116 184 -113 0 74 -85 -234 66 -21 15 106 -24 182 26 -81 127
8082 127 -74 -47 -164 -125 167 -248 43 -143 -84 -108 -246 -38 -278 217 -44 -40 -53 201 16 -31 1 -102 -225
$$ packed form
7915h0j20J12R1K4j45K76L7l53J81q3J90k35J71j04R3Q5j55n6n7LM7J85r8J9N2
7940H0k0n0M2n5k1J17j22l66L31R3J23O2k25j90L82k58K6k8L9o4N7J5j42M17m41
7965a98J36J23N1Ko1Mk9J22n1j11P3j09R0P1j81J10r9M1lp4K01N5p0N0J24j71
7991I6n1k94K88L4l31J24L9J26N2q05P07m56P9O90J20lo66j69O64K51o1k95K18
8014C57j34n0j47j63J53L35j86k15O87p01J06k54J34K84o3k57j03k08O28k58N3
8035bR8J15k03o8k55L57q4J09Q9j09O8k32L04k67l8J39m0KJ66j70n3q1Q8P8j48
8060a37J62k8K10j61j76Q9J57O8k97J13P4j59j49L00q7L6R1j30K06j56j07K08
8082A27k01K7j17L9K92m15K91j86N9k4j38K08k40M95k61Mj3K54j85m7L2j03j23
$$ plain form
8105 -225 45 -2 123 -110 -109 -38 105 -90 -241 -36 87 155 50 -230 120 8 -79 -15 101 32 -136 217 -52
8128 -52 59 151 -158 -95 61 -98 40 130 -103 -107 39 154 192 -284 68 -72 134 -228 86 250 -69 -28 74
8151 74 122 -50 -25 -57 -222 -117 -30 107 174 60 14 -80 -158 -9 -117 -226 92 -17 61 -150 -147 45 -102 33
8175 33 -156 -274 -78 -156 75 -271 216 157 -144 -43 -58 -149 -137 109 79 8
$$ packed form
8105b25K70m7J25k33JP1J43j95j51K05J23O8j05k80L50j12q7O4J16o9j68L53k69
8128e2J11R2l09O3J56j59J38R0k33mJ46J15L8m76L52j40K06l62L14J64l19M1J02
8151G4M8j72K5l2j65J05Q7J37O7j14m6r4p8J49j08j09L18j09P8k11LJ92j47J35
8175C3j89j18J96p8K31l46M87n9l01J01j5r1J2K46l0p1
8191H
$$ Imaginary data points
##PAGE= N=2
##DATA TABLE= (X++(I..I)), XYDATA
$$ plain form
0 0 0 0 0 0 0 0 0 0 0 0 0 6 -8 8 -8 8 -16 16 -17 24 -32 32 -40 48 -56 64 -74 88 -101 114 -131 152 -169 192
34 192 -217 244 -274 307 -342 382 -425 471 -522 579 -639 707 -779 859 -947 1043 -1147 1265
52 1265 -1394 1541 -1701 1883 -2093 2333 -2613 2945 -3344 3837 -4460 5277 -6397 8040 -10664
67 -10664 15539 -27550 119357 112298 -113751 102550 78508 1057 7063 10039 82953 24341
79 24341 -42536 84561 17186 -28791 34070 -3923 19757 25552 -26177 46176 15419 -38356
91 -38356 10691 -907 -12183 -13472 -20951 28269 -22314 -50028 18007 -25326 -46471 -1208 -19112
104 -19112 -1262 -4170 -26124 15718 -3629 -27442 6990 7262 9265 2578 2859 30296 -6387
117 -6387 -17289 20116 -3040 -10695 6458 4734 5080 -17240 -11064 8128 -23450 -19874 5416
$$ packed form
0@%%%%%%%%%%%Oj4J6j6J6k4L2l3M1n6O4p2Q8j04J20j38J62j89K15k45K83l21L61
34A92m09M61n18N81o49P24q07Q96r93J101j218J346j486J638j806J990k190K412
52A265k659K935l242L584l976M426m946N558o289P181q297R737j1674J4437j8704
67a0664K6203m3089J46907p059k26049K16301k4042p7451O006K976P2914n8612
79B4341o6877J27097o7375m5977O2861l7993K3680N795n1729P2353l0757n3775
91c8356M9047j1598j1276j289p479M9220n0583k7714O8035m3333k1145M5263j7904
104a9112J7850k908k1954M1842j9347k3813L4432K72K003o687K81K7437l6683
117f387j0902L7405k3156p655J7153j724L46k2320O176J9192l1578L576K5290
$$ plain form
130 5416 -2698 -4116 -13057 -8527 8191 -21850 -28777 7690 1990 -21953 -10864 4106 -9846
143 -9846 -26079 -18636 -8403 -7497 -13978 -14944 3652 501 -20069 -10042 407 -1755 -1962 -3102
157 -3102 14725 13521 -11213 4140 11051 -10066 249 8738 1192 2772 -273 -362 -6807 -13875
171 -13875 -1962 -6812 -8652 5032 -4675 -4601 2087 -9711 -6559 -377 -527 3633 78 5715 6768
186 6768 -8070 -1496 3131 -6501 2700 7389 1415 4451 4855 497 -1367 1866 7341 6146 6727
201 6727 12661 11567 5193 2948 5789 6569 2992 5641 9167 7718 3591 -3169 -1137 2745 -6336
216 -6336 -3294 7387 2458 143 955 -1147 730 -1210 -1485 5911 7927 7354 3917 4759 8076 -445
232 -445 -1862 8719 6781 2610 5414 6554 3978 -3852 -2373 5256 -440 -454 7159 3934 922 -25
$$ packed form
130E416q114j418q941M530J6718l0041o927L6467n700k3943J1089J4970j3952
143i846j6233P443J0233R06o481r66J8596l151k0570J0027J0449k162k07j140
157c102J7827j204k4734J5353O911k1117J0315Q489p546J580l045q9o445p068
171a3875J1913m850j840J3684r707P4O688j1798L152O182j50M160l555N637J053
186F768j4838O574M627r632R201M689n974L036M04m358j864L233N475j195N81
201F727N934j094o374k245K841P80l577K649L526j449m127o760K032L882r081
216f336L042J0681m929k315Q12k102J877j940k75P396K016n73l437Q42L317q521
232d45j417J0581j938m171K804J140k576p830J479P629n696j4P613l225l012r47
$$ plain form
248 -25 -2584 -667 -953 -1805 1116 1777 906 -4825 -7005 -2688 -8572 -10146 -1127 -2602 -6198 -3823 -4948
265 -4948 -6435 -8441 -6323 -1202 -1964 -9 2397 -278 327 -1550 -3323 2590 1169 169 7172 3621
281 3621 -1039 1315 -166 -2462 -2093 1628 5303 269 13 4902 -2105 -4707 1712 364 220 4295
297 4295 1129 1940 1500 -4862 -3125 181 -1581 -1243 2225 3798 -651 -4883 1187 670 -5961 2732
313 2732 7524 637 3833 4953 322 1234 1057 1569 5418 4456 3532 4323 1661 -747 -2851 -1147 842
330 842 -2441 144 2763 -4027 -4813 -2610 -6980 -6208 -2014 -2902 -2840 -1714 -3330 -5386 -6282 -4417 -5092
347 -5092 -4298 -735 -973 -4432 -3182 -2656 -6100 -4807 -1007 -918 -334 1773 461 -432 -18 -1477 -364
364 -364 3323 3016 1693 4569 3718 -1439 -625 1361 -361 -1055 2524 2493 -52 -1002 -998 -2225 -2739 -1541
$$ packed form
248b5k559J917k86q52K921O61q71n731k180M317n884j574R019j475l596K375j125
265d948j487k006K118N121p62J955K406k675O05j877j773N913j421j000P003l551
281C621m660K354j481k296L69L721L675n034k56M889p007k602O419j348j44M075
297D295l166Q11m40o362J737L306j762L38L468J573m449m232O070n17o631Q693
313B732M792o887L196J120m631R12j77N12L849r62r24P91k662k408k104J704J989
330H42l283K585K619o790p86K203m370P72M194q88O2J126j616k056q96J865o75
347e092P94L563k38l459J250N26l444J293L800Q9N84K107j312q93M14j459J113
364c64L687l07j323K876q51n157Q14J986j722o94L579l1k545r50Mj227n14J198
$$ plain form
382 -1541 383 222 198 127 -1225 -2013 -2528 -1763 -769 -36 994 823 -1258 75 -1391 -3591 439 820
400 820 -526 3436 2302 234 1617 -511 657 1865 1310 5014 3631 1962 4398 433 230 3170
416 3170 1095 3798 3499 934 6008 995 -3095 3456 1716 -574 2534 2758 5003 1435 -2259 4354
432 4354 1115 -1836 4036 2306 3576 4083 -1743 2938 2647 -3104 2144 2354 2465 3913 -1739 2702
448 2702 2930 -4428 1990 2744 -699 4498 1486 598 3535 -2234 559 2381 -1632 3014 2596 1045
464 1045 2420 -2652 1155 1615 -5156 1964 3227 -2512 1861 -1253 -1974 1185 -4914 -1280 2033 -2152
480 -2152 17 -2494 -3270 -436 -6876 -4744 -241 -5071 -2758 -2579 -6108 -3488 -6290 -6491 -4790 -7194
496 -7194 -1741 -3665 -8781 -1856 -2917 -7872 -5465 -4010 -761 -2816 -6381 762 -383 -5250 -2346
$$ packed form
382a541J924j61k4p1j352p88n15P65R94P33J030j71k081J333j466k200M030L81
400H20j346L962j134k068J383k128J168J208n55L704j383j669K436l965k03K940
416C170k075K703k99k565N074n013m090O551j740k290L108K24K245l568l694O613
432D354l239k951N872j730J270N07n826M681k91n751N248K10J11J448n652M441
448B702K28p358O418P54l443N197l012q88K937n769K793J822m013M646m18j551
464A045J375n072L807M60o771P120J263n739M373l114p21L159o099L634L313m185
480b152K169k511p76K834o440K132M503m830K313J79l529K620k802k01J701k404
496g194N453j924n116O925j061m955K407J455L249k055l565P143j145m867K904
$$ plain form
511 -2346 -1452 1198 407 -2363 3433 2509 -1640 1816 451 1330 3641 335 3616 4342 1404 3072
527 3072 837 1404 3225 77 3286 2871 -676 3756 231 -2439 1669 9 1087 312 -1755 3938
543 3938 -488 -4619 1202 -308 -521 588 -1505 3113 1389 -3083 1160 -3 111 1841 -1720 3534
559 3534 3672 -1959 2609 663 -638 4491 -69 315 5563 1933 1447 455 901 4959 -459 -696 5688
576 5688 2196 595 930 -38 3130 -380 -2359 3723 1823 -200 747 -599 1667 525 -2366 2168
592 2168 2245 136 1167 231 1028 808 -694 1470 1409 612 2010 811 570 387 -83 1031 236 -358
610 -358 2043 1411 -1119 -634 385 -152 -2460 -1556 1091 -218 -2556 -1836 -749 -1389 -3172 -2722 -1265
627 -1265 -1498 -2147 -2034 -2216 -1241 -2497 -3586 -1673 -497 -2000 -2831 -982 653 -2887 -2162 190 -649
$$ packed form
511b346Q94K650p91k770N796r24m149L456j365Q79K311l306L281P26k938J668
527C072k235N67J821l148L209m15l547M432l525k670M108j660J078p75k067N693
543C938m426m131N821j510k13J109k093M618j724m472M243j163J14J730l561N254
559C534J38n631M568j946j301N129m560L84N248l630m86r92M46M058n418k37O384
576E688l492j601L35r68L168l510j979O082j900k023R47j346K266j142k891M534
592B168P7k109J031r36P97k20j502K164o1p97J398j199k41j83m70J114p95n94
610c58K401o32k530M85J019n37k308R04K647j309k338P20J087o40j783M50J457
627a265k33o49J13j82R75j256j089J913J176j503q31J849J635l540P25K352q39
$$ plain form
644 -649 -469 -395 -313 467 -929 -823 269 -1803 187 1823 -1284 -194 1184 570 -1142 -1882 1937 1587
662 1587 -2543 933 2687 -1556 -909 -38 52 678 -1215 474 2072 -1489 47 840 -336 713 -533
679 -533 266 2483 -700 11 1965 -250 -256 141 1548 2485 -1046 678 3792 -859 -797 1591 1138 798
697 798 -974 1215 2827 -2264 -1139 2710 -606 -1515 -105 1059 482 -2465 -606 1253 -3183 -1145
713 -1145 1317 -1477 -887 -12 -827 -662 -2210 -878 621 -2182 -242 516 -1376 -476 -414 -642 52 -686
731 -686 -17 581 -457 398 372 -516 728 69 -301 1556 312 -50 794 -169 549 378 -281 1323 990
750 990 54 756 1559 613 -3 682 1618 224 -155 1718 1139 -473 711 1137 496 216 815 1017 611
769 611 37 446 968 359 -90 321 900 138 -495 51 799 -1127 -1106 1094 90 -1787 78 651 -1124
$$ packed form
644f49J80P4Q2P80j396J06J092k072J990J636l107J090J378o14j712p40L819l50
662A587m130L476J754m243O47Q71R0O26j893J689J598l561J536P93j176J049j246
679e33P99K217l183P11J954k215oL97J407R37l531J724L114m651O2K388m53l40
697G98j772K189J612n091J125L849l316r09J410J164n77k947J859J859m436K038
713a145K462k794N90Q75q15J65j548J332J499k803J940P58j892R00O2k28O94p38
731f86O69N98j038Q55k6q88J244o59l70J857j244l62Q44r63P18j71o59J604l33
750I90r36P02Q03r46o16O85R36j394l79J873n79j612J184M26o41k80N99K02m06
769F11n74M09N22o09m49M11N79p62o33N46P48j926K1K200j004j877J865N73j775
$$ plain form
788 -1124 -1121 -10 -98 -1079 -449 165 -916 -406 -5 -520 -154 -209 -226 -30 -107 -384 346 -244 -101 346 -1
809 -1 191 337 93 596 29 480 431 179 1174 619 -406 431 488 244 744 485 97 309 -202 687 620 -944
831 -944 129 627 -54 235 290 279 -223 -741 -249 -116 -810 -777 -23 -594 -354 -891 -340 -777 -1247 -430 -316
852 -316 -1542 -206 -344 -1326 -701 -424 -978 -688 -520 -711 -996 -717 -615 -785 -451 -184 -468 -365 -68 -323
872 -323 -666 -484 220 225 -696 133 542 -535 182 402 70 219 439 478 257 631 430 -153 140 1179 64
893 64 278 1295 508 326 689 422 495 549 881 838 391 1191 991 234 689 900 995 1012 485 1582 1210 -181
915 -181 1180 1148 169 1333 694 788 1004 48 809 211 -379 1348 -296 -768 686 -100 -456 -560 -655 553
935 553 -1115 -1185 900 -1120 -1033 -271 -1716 -157 -522 -1663 310 -544 -1056 3 -1577 -277 496 -1371
$$ packed form
788a124LJ111q8r81O30O14j081N10M01n15L66n5j7J96p7k77P30n90J43M47l47
809aJ92J46k44N03n67M51m9k52R95n55j025Q37N7k44N00k59l88K12n11Q89o7j564
831i44J073M98o81K89N5j1n02n18M92J33o94L3P54n71K40n37N51m37m70Q17J14
852c16j226J336j38r82O25K77n54K90J68j91k85K79J02j70L34K67k84J03K97k55
872c23l43J82P04Nr21Q29M09j077P17K20l32J49K20L9k21L74k01n83K93J039j115
893F4K14J017p87j82L63k67P3N4L32m3m47Q00k00p57M55K11R5J7n27J097l72j391
915a81J361l2r79J164o39R4K16r56P61n98n90J727j644m72J454p86l56j04r5J208
935E53j668p0K085k020Q7P62j445J559l65j141J973q54n12J059j580J300P73j867
$$ plain form
953 -1371 -48 234 -522 644 -747 -121 704 -944 620 699 -546 1778 496 -633 1164 -109 -379
970 -379 310 -49 1091 356 -698 1052 -357 -543 495 -423 676 396 -656 319 -600 -276 342 -1505
988 -1505 -80 1445 -832 -705 324 437 -103 -1331 326 1061 -721 -203 228 -430 86 -737 -393 -22
1006 -22 -121 281 -958 -404 491 -836 -1106 -133 84 113 -974 -725 83 -711 -782 -667 -551 260 -542 -992
1026 -992 206 -382 -131 -758 -1057 1048 782 -1073 622 862 161 -54 -158 1563 731 144 1220 643
1044 643 997 1037 -211 942 1630 326 1339 748 617 1377 -261 206 1034 -218 522 -17 -120 1075
1062 1075 -326 -827 -177 -264 471 -566 -1208 990 -179 -1740 -269 -301 -171 -472 -1202 909 102 -1481
1080 -1481 -31 -68 -541 492 -847 213 175 -687 259 -518 -550 716 -450 -183 778 -167 195 -472 -656
$$ packed form
953a371J323K82p56J166j391O26Q25j648J564P9j245K324j282j129J797j273k70
970c79O89l59J140p35j054J750j409j86J038r18J099k80j052R75r19L24O18j847
988a505J425J525k277J27J029J13n40j228J657P35j782N18M31o58N16q23L44L71
1006b2r9M02j239N54Q95j327k70R73K17K9j087K49Q08p94p1J15J16Q11q02m50
1026i92J198n88K51o27k99K105k66j855J695K40p01k15j04J721q32n87J076n77
1044F43L54M0j248J153O88j304J013n91j31P60j638M67Q28j252P40n39j03J195
1062A075j401n01O50q7P35j037o42K198j169j561J471l2J30l01p30K111q07j583
1080a481J450l7m73J033j339J060l8q62R46p77l2J266j166K67R61r45L62o67j84
$$ plain form
1099 -656 1022 -794 -807 752 -216 170 -223 -1076 269 -572 -842 102 63 532 4 -997 503 -179 -772
1118 -772 365 -293 169 960 103 111 601 148 531 53 720 1268 -151 635 748 308 671 -61 66 1604
1138 1604 -6 -114 503 -24 476 -180 -366 751 33 -414 9 -686 -346 -613 -908 17 -274 -589 -158
1157 -158 -630 -368 -337 -1067 -44 -382 -193 498 -517 -364 572 -927 -233 433 -149 202 -185 220 142 -366
1177 -366 -154 -204 -639 748 98 -384 412 -213 -301 -134 -408 53 -74 -326 249 -71 -207 710 -134 -38 719
1198 719 70 369 246 362 600 -116 223 288 268 962 495 636 575 33 -12 927 54 -232 1575 1003 646
1219 646 117 -1177 290 -196 617 458 571 294 -423 -584 -45 -360 -886 250 -160 -854 -518 -619 -593
1238 -593 -613 -726 -339 -266 -514 -162 -116 -394 -282 -464 -22 21 -71 125 314 247 124 -30 27 80 350 322 381
$$ packed form
1099f56J678j816j3J559r68L86l93q53J345q41k70R44l9M69n28j001J500o82n93
1118g72J137o58M62P91q57QM90m53L83m78O67N48j419P86J13m40L63p32J27J538
1138A604j610j08O17n27N00o56j86J117p18m47M23o95L40k67k95R25k91l15M31
1157a58m72K62L1p30J023l38J89O91j015J53R36j499O94O66n82L51l87M05p8n08
1177c66K12n0m35J387o50m82P96o25q8J67k74M61j27k52N75l20j36R17q44R6P57
1198G19o49K99j23J16K38p16L39O5k0O94m67J41o1n42m5R39q73k86J807n72l57
1219F46n29j294J467m86Q13j59J13k77p17j61N39l15n26J136m10o94L36j01K6
1238e93k0j13L87P3k48L52M6k78J12j82M42M3r2J96J89o7j23j54N7N3K70k8N9
$$ plain form
1261 381 294 274 30 -69 249 -71 198 398 189 -84 626 -253 -238 143 282 247 278 536 337 -373 51 -92
1283 -92 -183 -99 175 386 48 249 -38 228 -265 -134 509 400 209 242 57 -123 -258 -212 -172 132 -277 -21
1305 -21 143 -269 -420 -267 -289 -486 -525 -106 -164 -501 -457 -512 -610 -767 -341 -110 -339 -435 -444 -672 -635 -514 -227 -237
1329 -237 -235 -186 228 -39 -179 -53 281 -1 240 400 515 277 28 309 474 -45 389 557 487 623 334
1350 334 400 289 -2 68 418 183 334 64 329 -63 -327 -62 56 112 235 528 273 2 -100 -220 128
1371 128 -163 -5 -35 -287 -131 265 159 -437 -85 321 -85 -22 -508 287 247 -520 -264 -83 248 -631 39
1392 39 294 -512 -354 -193 -49 147 246 614 -308 -454 -209 -117 -206 -559 -313 630 216 -89 556 254 -440
1413 -440 -28 -16 178 133 293 965 180 145 243 -171 547 595 249 537 185 103 187 -180 -82 384 -269 333 266
$$ packed form
1261C81q7k0k44r9L18l20K69K00k09k73P10q79J5L81J39l5L1K58j99p10M24j43
1283i2r1Q4K74K11l38K01k87K66m93J31O43j09j91L3j85j80j35M6M0L04m09K56
1305b1J64m12j51J53k2j97l9M19n8l37M4n5r8j57M26K31k29r6rk28L7J21K87j0
1329b37KM9M14k67j40J26L34k82K41J60J15k38k49K81J65n19M34J68p0J36k89
1350C34O6j11k91P0L50k35J51k70K65l92k64K65J18N6J23K93k55k71j02j20L48
1371A28k91J58l0k52J56L96j06n96L52M06m06O3m86P95m0p67K56J81L31q79O70
1392C9K55q06J58J61J44J96R9L68r22j46K45R2q9l53K46R43m14l05O45l02o94
1413d40M12J2J94m5J60O72p85l5R8m14P18M8l46K88l52q2Q4l67R8M66o53O02o7
$$ plain form
1436 266 -76 110 -714 -351 370 -380 -108 -30 -215 374 -913 -588 -45 -382 -76 -357 -448 304 -490 -695
1456 -695 267 -564 39 325 -41 263 343 -637 364 -139 -431 -215 -361 1288 189 -689 354 -597 -84
1475 -84 175 -612 138 867 51 130 -270 -145 639 -969 326 -358 97 318 468 -816 -352 -783 -60 1216
1495 1216 253 929 -281 -143 827 374 269 1072 35 1240 1010 -717 425 1102 217 494 413 1069
1513 1069 881 -527 800 605 -618 -29 -954 371 409 1 736 313 -882 273 -236 -947 1023 340
1531 340 -271 239 -595 796 -1007 -855 881 753 -1384 -520 -112 45 -247 -1800 211 -196 -906 249
1549 249 347 876 211 150 451 -169 337 854 -578 420 577 -674 311 319 -262 840 -258 91 777 -696
1569 -696 344 279 9 873 -277 -418 616 130 -400 -35 -462 723 28 -480 610 136 -69 95 -465
$$ packed form
1436B66l42J86q24L63P21p50K72P8j85N89j287L25N43l37L06k81r1P52p94k05
1456f95R62q31O03K86l66L04Q0r80J001n03k92K16j46J649j099q78J043r51N13
1475h4K59p87P50P29q16P9m00J25P84j608J295o84M55K21J50j284M64m31P23J276
1495A216r63O76j210J38R70m53j05Q03j037J205k30j727J142O77q85K77q1O56
1513A069j88j408J327j95j223N89r25J325L8m08P35m23j195J155n09p11J970o83
1531C40o11N10q34J391j803J52J736j28k137Q64M08J57k92j553K011m07p10J155
1549B49R8N29o65o1L01o20N06N17j432R98J57j251R85Qn81J102j098L49O86j473
1569f96J040o5k70Q64j150j41J034m86n30L65m27J185o95n08J090m74k05J64n60
$$ plain form
1588 -465 626 214 -93 639 364 -24 -143 -580 93 588 -351 112 150 10 170 -353 -364 232 -472 -147
1608 -147 55 -292 7 -481 -380 291 -342 -384 -83 -246 157 -141 -576 -415 -277 -248 -346 -322 462 177 -425
1629 -425 305 -258 -566 459 -129 35 460 42 -134 -78 8 299 -254 120 440 366 128 156 298 9 -8
1650 -8 145 430 -26 87 393 148 50 357 76 112 155 491 172 -77 145 90 -109 268 124 60 139 238 185
1673 185 39 -551 65 167 72 -141 89 45 -415 -154 -5 -312 -277 -108 -213 -89 -219 -202 -131 -397 -146 -205
1695 -205 -172 213 -216 -114 4 -157 -207 -101 -140 -326 50 174 35 81 129 178 483 202 1493 312 64
1716 64 467 401 -68 1227 778 -152 186 105 592 481 219 574 -74 -78 -792 -544 13 37 199 -189 -13 -249
1738 -249 128 24 208 -304 25 -95 -7 17 -249 -59 -41 183 -144 -52 -135 -124 -118 -83 -18 -108 -54 -102 -300 -311 -90
$$ packed form
1588d65J091m12l07P32k75l88j19m37O73M95r39M63L8j40J60n23j1N96p04L25
1608a47K02l47K99m88J01O71o33m2L01j63M03k98m35J61J38K9r8K4P84k85o02
1629d25P30n63l08J025n88J64M25m18j76N6Q6K91n53L74L20p4k38K8J42k89j7
1650hJ53K85m56J13L06k45r8L07k81L6M3L36l19k49K22n5j99L77j44o4P9R9n3
1673A85j46n90O16J02r5k13K30m4m60K61J49l07L5J69j05J24j30J7P1k66K51n9
1695b05L3L85m29J02J18j61n0J06l9j86L76J24j39M6M8M9L05k81J291j181k48
1716F4M03o6m69J295m49r30L38q1M87j11k62L55o48mp14K48N57K4J62l88J76k36
1738b49L77j04J84n12L29j20Q8K4k66J90J8K24l27R2q3J1OL5O5r0N4m8j98j1K21
$$ plain form
1763 -90 -63 -95 -182 -78 -33 -553 -255 -477 -390 -297 -173 -117 -202 -111 -483 -457 -100 -338 -466 -230 152 -238 99 -93
1787 -93 -51 -172 100 215 -1 219 239 184 232 91 380 446 422 369 323 479 336 361 -4 278 437 256 60
1810 60 697 464 4 28 180 339 349 302 405 255 -386 330 364 83 416 90 249 -426 -25 -446 389 64
1832 64 -250 -14 -374 221 -372 -368 -555 -764 -273 -29 -420 -168 -67 957 -388 426 24 -347 198 -600
1852 -600 228 451 22 -518 766 296 -19 441 -319 621 492 -239 83 346 284 66 -81 148 122 38 563
1873 563 98 -50 279 -170 -108 204 -71 192 -35 -440 189 -131 -130 173 -105 229 -139 -285 219 -121 -329
1894 -329 223 62 -116 163 -230 254 265 -117 267 -146 64 396 -321 283 366 -337 47 -24 -48 49 -516 128
1916 128 37 -267 106 -129 -148 159 -309 -376 -260 -494 -165 -116 -572 89 -123 -370 -80 -397 -49 -371 -491
$$ packed form
1763i0K7l2q7J04M5n20K98k22Q7R3J24N6q5R1l72K6L57k38j28K36L82l90L37j92
1787i3M2j21K72J15k16K20K0n5M8j41K89O6k4n3m6J56j43K5l65K82J59j81j96
1810F0O37k33m60K4J52J59J0m7J03j50o41P16L4k81L33l26J59o75M01m21Q35l25
1832F4l14K36l60N95n93Mj87k09M91K44l91K52J01J024j345Q14m02l71N45p98
1852f00Q28K23m29n40J284m70l15M60p60R40j29p31L22K63o2k18j47K29k6q4N25
1873E63m65j48L29m49O2L12k75K63k27m05O29l20JL03k78L34l68j46N04l40k08
1894c29N52j61j78K79l93M84J1l82L84m13K10L32p17O04Q3p03L84p1k4R7n65O44
1916A28r1l04L73k35j9L07m68o7J16k34L29M9m56O61k12k47K90l17L48l22j20
$$ plain form
1937 -491 243 -160 -153 188 -377 171 210 -324 118 346 121 494 92 338 456 12 414 668 117 777 117
1958 117 351 480 -145 353 282 120 591 98 -99 544 6 40 -63 -229 164 -100 -414 60 -200 -540 83
1979 83 -402 70 -163 -715 -15 -6 -293 69 -770 338 266 -712 -536 -864 -22 206 -489 -198 320 -258 -57
2000 -57 -207 165 525 -365 -19 459 -129 28 -80 -167 686 -219 -404 442 46 186 -96 -411 524 266 -407
2021 -407 168 48 70 37 -306 302 352 -234 294 106 125 396 -373 108 484 -76 -3 122 12 443 -154 -188
2043 -188 145 53 449 186 -188 496 -163 -160 267 -128 348 -141 -385 406 133 -418 246 -136 29 99 -528
2064 -528 -211 -273 -238 -273 -62 -79 -62 -619 -206 -157 -314 -246 -290 -215 336 -164 -148 -51 -341 195 -198 -103 241 -270
2088 -270 107 158 273 352 246 144 374 -88 95 423 130 311 66 -28 439 281 259 209 175 438 147 -159
$$ packed form
1937d91P34m03PL41n65N48L9n34M42K28k25L73m02K46J18m44M02K54n51O60o60
1958A17K34J29o25M98p1j62M71m93j97O43n38L4j03j66L93k64l14M74k60l40O23
1979H3m85M72k33n52P00Rk87L62q39J108p2r78J76l28Q42K28o95K91N18n78K01
2000e7j50L72L60q90L46M78n88J57j08q7Q53r05j85Q46l96J40k82l15R35k58o73
2021d07N75j20K2l3l43O08N0n86N28j88J9K71p69M81L76n60P3J25j10M31n97l4
2043a88L33r2L96k63l74O84o59LM27l95M76m89k44P91k73n51O64l82J65P0o27
2064e28L17o2L5l5K11j7J7n57M13M9j57O8m4P5N51n00J6R7k90N36l93R5L44n11
2088b70L77N1J15P9j06j02K30m62J83L28k93J81k45r4M67j58k2n0l4K63k91l06
$$ plain form
2110 -159 262 29 158 220 170 274 173 65 225 -101 -64 374 -233 -118 120 -279 111 -340 -343 -272 -382 -317
2132 -317 -148 -301 -271 -102 -378 -148 -395 -304 69 -253 -130 77 -282 203 -192 -302 95 -89 -132 56 222
2153 222 177 151 -120 225 76 87 240 -104 142 158 91 274 -56 266 16 -145 287 235 42 -61 225 39
2175 39 -78 -109 284 -152 42 247 -26 -15 329 36 -65 -98 -109 -124 -29 42 292 112 -332 136 124 133 -37 257
2199 257 -154 227 92 160 44 185 -55 -129 -52 79 -219 -67 -193 -52 290 -49 -61 -4 -96 8 -194 -395
2221 -395 -297 -277 -265 -106 -255 -124 -145 -131 13 -100 12 -57 -347 -103 -139 60 118 196 -149 -11 -61 166 123 149
2245 149 98 49 59 -140 151 190 101 263 450 170 189 250 411 468 299 96 468 127 30 76 106 -2 203 -216
2269 -216 40 32 -33 158 -64 -324 34 -230 -384 -106 -240 -84 -110 -367 -140 -209 -302 -230 -391 -83 -247 -299 -138
$$ packed form
2110a59M21k33J29O2n0J04j01j08J60l26L7M38o07J15K38l99L90m51lP1j10O5
2132c17J69j53L0J69k76K30k47R1L73l22J23K07l59M85l95j10L97j84m3J88J66
2153B22m5k6k71L45j49J1J53l44K46J6o7J83l30L22k50j61M32n2j93j03K86j86
2175C9j17l1L93m36J94K05k73J1L44k93j01l3j1j5R5P1K50j80m44M68j2Rj70K94
2199B57m11L81j35O8j16J41k40p4P7J31k98J52j26J41L42l39j2N7r2J04k02k01
2221c95R8K0J2J59j49J31k1J4J44j13J12o9k90K44l6J99N8P8l45J38n0K27m3K6
2245A49n1m9J0j99K91L9q9J62J87k80J9O1J61N7j69k03L72l41r7M6L0j08K05m19
2269b16K56qo5J91k22k60L58k64j54K78j34J56k6k57K27o9r3P2j61L08j64n2J61
$$ plain form
2292 -138 -228 -202 -90 -188 -110 117 50 -207 28 -102 -64 29 159 106 29 58 394 345 -28 244 134 279 -108 -24
2316 -24 26 259 21 -15 183 284 -2 93 330 49 238 34 103 249 -40 -351 313 246 -30 36 7 -91 75
2339 75 137 290 3 31 -9 5 71 -163 160 439 -120 -53 454 -38 -36 190 -37 27 -6 -28 -15 -309 -130 -89 -403
2364 -403 289 -266 -241 -170 -179 -308 -292 -376 148 -34 -416 -43 -141 -243 64 -302 -150 -122 -256 -111 -176 28 -26
2387 -26 -31 -38 121 -367 -28 232 281 219 -219 -97 353 -187 337 294 -108 429 240 87 257 -78 248 50 -122
2410 -122 491 -25 -288 90 -49 -1 -63 -209 27 -132 -265 -123 -202 -163 5 -119 -312 46 -288 -84 -29 -4
2432 -4 161 -183 -139 296 91 -68 24 -205 500 -71 -400 45 -39 211 -278 70 300 -83 -220 11 -348 33
2454 33 -142 -173 318 170 -145 67 -295 246 28 -306 -17 61 -48 217 -274 81 277 -346 331 391 165
$$ packed form
2292a38r0K6J12r8P8K27o7k57K35j30L8R3J30n3p7K9L36m9l73K72j10J45l87Q4
2316b4N0K33k38l6J98J01k86R5K37k81J89k04O9J46k89l11O64o7k76O6k9r8J66
2339G5O2J53k87K8m0J4O6k34L23K79n59O7N07m92KK26k27O4l3k2J3k94J79M1l14
2364d03O92n55K5P1rj29J6q4N24j82l82L73r8j02L07l66J52K8j34J45o5K04n4
2387b6npJ59m88L39K60M9o2m38J22M50n40N24m3m02N37j89j53J70l35L26j98j72
2410a22O13n16k63L78j39M8o2j46K36j59j33J42p9L9J68j24j93L58l34K04N5K5
2432dJ65l44M4M35k05j59R2k29P05n71l29M45q4K50m89L48K30l83j37K31l59L81
2454C3j75l1M91j48l15K12l62N41k18l34K89P8j09K65m91L55J96o23O77O0k26
$$ plain form
2475 165 433 -84 284 515 69 133 300 114 358 58 -80 398 160 143 339 101 334 77 -302 285 38
2496 38 -207 50 -287 233 -200 -157 160 -310 -77 122 -487 -224 -126 -407 -75 -290 -164 80 -341 -185 65
2517 65 -341 -86 -110 -73 52 -163 -280 281 -333 -280 -325 -286 196 -393 -106 -81 -121 -67 230 -144 114 128 -233
2540 -233 92 69 173 230 -196 157 294 -34 -110 54 21 190 -145 283 399 -24 367 -62 -20 199 105 91
2562 91 237 267 27 -128 -102 15 -275 -3 126 -498 27 -262 -201 100 -441 -456 -237 -38 78 119 -1040 -11
2584 -11 402 -56 -144 -746 -164 -191 -517 -21 -158 -60 360 -184 73 330 -121 25 -14 -206 308 57 132 221
2606 221 34 -11 405 193 268 -27 -101 348 25 -105 2 90 198 -129 -268 267 46 193 40 138 -8 87
2628 87 -109 98 361 69 90 85 0 -32 242 135 -87 14 -16 -122 244 91 -177 8 18 64 60 -72 4 14
$$ packed form
2475A65K68n17L68K31m46O4J67j86K44l00j38M78k38j7J96k38K33k57l79N87k47
2496C8k45K57l37N20m33M3L17m70K33J99o09K63R8k81L32k15J26K44m21J56K50
2517F5m06K55k4L7J25k15j17N61o14N3m5L9M82n89K87K5m0N4K97l74K58J4l61
2540b33L25k3J04N7m26L53J37l28p6J64l3J69l35M28J16m23L91m29M2K19r4j4
2562I1J46L0k40j55K6J17k90K72J29o24N25k89O1L01n41j5K19J99J16M1j159J029
2584a1M13m58q8o02N82k7l26M96j37R8M20n44K57K57m51J46l9j92N14k51P5Q9
2606B21j87m5M16k12P5k95p4M49l23j30J07Q8J08l27j39N35k21J47j53R8j46R5
2628H7j96K07K63k92K1nq5l2K74j07k22J01l0j06L66j53k68J85J0M6mj32P6J0
$$ plain form
2652 14 -152 13 59 -275 -48 8 -391 -21 -209 -306 73 -101 -275 -32 -353 -27 -281 -283 218 -368 -33 0
2674 0 -124 -173 -229 -55 -103 -103 2 -48 44 100 121 68 121 -44 180 389 -97 147 378 60 88 133 68 66 -92 -39
2700 -39 66 -195 294 146 167 183 78 58 449 104 376 290 124 139 98 -164 2 201 181 -71 46 -43 -131
2723 -131 -104 35 -19 41 31 136 -204 37 -46 -38 -182 -224 -414 -163 65 12 74 -40 28 -97 -159 -300 -106 -143
2747 -143 -165 -129 -29 -147 -3 -374 -175 -50 -36 -135 63 45 -74 -153 -181 331 -76 -123 147 -70 -90 112 -37
2770 -37 -17 90 32 228 124 -42 -116 240 111 282 92 114 110 -258 206 189 13 57 53 292 -46 91 127 -81
2794 -81 223 -4 136 7 80 -18 -162 121 -248 91 9 -130 -211 -262 -69 -175 263 -355 -197 -29 -117 29
2816 29 -84 -240 -20 -8 -70 81 -172 -178 96 -19 69 146 199 189 -7 270 274 -9 -74 153 -35 68 140 150 268
$$ packed form
2652A4j66J65M6l34K27N6l99L70j88r7L79j74j74K43l21L26k54kN01n86L35L3
2674@j24m9n6J74m8%J05n0R2N6K1n3N3j65K24K09m86K44K31l18K8M5o5kj58N3
2700c9J05k61M89j48K1J6j05k0L91l45K72q6j66J5m1k62J66J99k0k52J17q9q8
2723a31K7J39n4O0j0J05l40K41q3Qj44m2j90K51K28n3O2j14O8j25o2j41J94l7
2747a43k2L6J00j18J44l71J99J25J4r9J98j8j19p9k8N12m07m7K70k17k0K02j49
2770c7K0J07n8J96j04j66p4L56j29J71j90K2ml68M64j7j76M4mK39l38J37L6k08
2794h1L04k27J40j29P3r8j44K83l69L39q2j39q1n1J93j06M38o18J58J68q8J46
2816B9j13j56K20J2o2J51k53oK74j15Q8P7N3j0j96K77Mk83o5K27j88J03P2J0J18
$$ plain form
2841 268 51 -76 117 -129 279 90 -52 94 47 189 69 13 147 -79 -115 189 -168 4 75 101 99 73 -282
2864 -282 189 -169 48 -110 -259 -48 260 -162 32 36 37 282 -210 -12 -25 -74 2 75 -23 128 57 -203 -87
2887 -87 -105 -92 -221 -496 192 -77 -341 -43 -27 -279 -136 -301 45 6 -389 209 -62 45 191 -448 -60 231
2909 231 23 -200 -152 0 258 -171 -151 135 71 163 -92 167 454 174 -175 299 115 345 167 -235 332
2930 332 149 101 444 -29 287 83 226 109 369 -120 195 -19 110 290 -278 1 85 -181 -236 -94 -104
2951 -104 104 -64 -13 117 26 98 -233 -61 225 -414 -89 27 -81 -64 -272 -156 328 -305 -293 60 -15 -104
2973 -104 -357 -291 -45 56 -255 -88 -421 70 182 -184 47 -4 -126 -32 -289 219 530 -201 -85 258 -29
2994 -29 427 -331 -162 187 59 -129 27 -55 379 38 -211 313 -69 223 1 -276 186 -91 -66 337 0
$$ packed form
2841B68k17j27J93k46M08j89j42J46m7J42j20n6J34k26l6L04l57J72P1K6kk6l55
2864b82M71l58K17j58j49K11L08m22J94MJK45m92J98j3m9P6P3r8J51p1k60J16
2887h7j8J3j29k75O88k69k64K98J6k52J43j65L46l9l95N98k71J07J46o39L88K91
2909B31k08k23M8J52K58m29K0K86o4R2k55K59K87k80l49M74j84K30j78m02N67
2930C32j83m8L43m73L16k04J43j17K60m89L15k14J29J80n68K79Q4k66n5J42j0
2951a04K08j68N1J30r1P2l31J72K86o39L25J16j08J7k08J16M84o33J2L53p5q9
2973a04k53O6K46J01l11J67l33M91J12l66K31n1j22R4k57N08L11p31J16L43k87
2994b9M56p58J69L49j28j88J56q2M34l41k49N24l82K92k22k77M62k77K5M03l37
$$ plain form
3015 0 1 -31 -204 -21 -21 -243 113 -126 -119 -55 -259 -30 256 -469 25 -175 -132 -11 -141 60 322 -306 114 140
3039 140 -170 243 -197 8 134 -128 18 20 -175 210 -76 -188 232 -154 -126 -39 119 56 -96 -192 220 -137
3061 -137 57 196 -21 147 249 -140 160 6 76 84 -176 117 399 -90 -100 241 -143 87 -230 274 152
3082 152 37 193 96 100 56 -187 41 170 -89 15 258 -25 51 -40 41 103 -7 -43 -255 -301 -175 -29 10 -298
3106 -298 -280 -174 -211 -263 -99 -210 -223 -302 -280 -45 -73 -57 -81 -41 -426 -36 -12 67 74 -144 -49 111 0 195 -210
3131 -210 -54 43 -101 19 -30 67 -56 -43 224 10 164 146 136 -20 -93 157 168 6 -133 95 -51 26 93
3154 93 -51 73 219 -23 191 -4 80 108 9 -102 -51 -19 230 90 -155 -72 323 86 27 -141 -77 -51 26 6
3178 6 -2 39 -292 -45 -133 -166 -194 -168 -106 -247 138 -137 -162 53 -163 -151 20 -351 106 106 -251 -101 -59 43 -25
$$ packed form
3015@Jl2j73J83%k22L56k39PO4k04K29K86p25M94k00M3J21j30K01K62o28M20K6
3039A40l10M13m40K05J26k62J46Kj95L85k86j12M20l86K8Q7J58o3j52r6M12l57
3061a37J94J39k17J68J02l89L00j54P0Qk60K93K82m89j0L41l84K30l17N04j22
3082A52j15J56r7Mm4k43K28J29k59J04K43k83P6r1Q1O2j10l6k12m6J26J46L9l08
3106b98J8J06l7n2J64j11j3p9K2K35k8J6k4M0l85L90K4P9Pk18R5J60j11J95m05
3131b10J56R7j44J20m9R7j23J3K67k14J54j8j0j56p3K50J1j62j39K28j46P7O7
3154I3j44J24J46k42K14j95Q4K8r9j11N1L2K49j40k45Q3L95k37n9j68O4K6P7k0
3178FqM1l31K47q8l3k8K6O2j41L85k75k5K15k16J2J71l71M57%l57J50M2J02o8
$$ plain form
3203 -25 -165 48 -197 61 -91 309 64 113 268 -86 59 91 133 157 16 55 -7 15 137 10 178 187 90 169
3227 169 300 165 379 -171 302 163 167 -37 61 -21 -131 50 241 135 89 72 -66 -165 -289 81 201 -71
3249 -71 84 -251 -216 -208 134 -206 -122 117 -383 33 -274 -130 -106 104 -247 -148 -1 123 107 -5 -342 -40 -145
3272 -145 -285 80 -137 -85 -175 -185 -65 26 -120 95 -94 155 -174 75 7 -24 41 -29 -111 53 -15 -227 156
3295 156 -112 -75 121 -177 235 126 233 357 120 150 161 218 59 -163 341 149 202 89 302 -56 -38 17
3317 17 -60 -61 -158 -75 181 -66 -103 85 -208 147 -47 -226 -114 -239 -230 270 -112 -105 -128 -214 49 -121 61 9 -328
3342 -328 -65 174 -104 -196 -101 18 -53 -150 -41 375 -301 -207 5 -111 -141 54 62 131 48 42 231 37 -32 54 13
3367 13 158 99 6 60 118 39 394 17 122 185 126 78 -223 15 155 -233 -68 413 -29 69 -5 98 279 -70
$$ packed form
3203b5j40K13k45K58j52M00k45M9J55l54J45L2M2K4j41L9o2K2J22j27J68Rr7P9
3227A69J31j35K14n50M73j39Mk04R8q2j10J81J91j06m6j7j38r9j24L70J20k72
3249g1J55l35L5QL42l40Q4K39n00M16l07J44K4K10l51R9J47J24j6j12l37L02j05
3272a45j40L65k17N2r0j0J20R1j46K15j89K49l29K49o8l1O5p0q2J64o8k12L83
3295A56k68L7J96k98M12j09J07J24k37L0J1N7j59k22N04j92N3j13K13l58J8N5
3317A7p7jr7Q3K56k47l7J88k93L55j94j79J12j25RN00l82Pk3q6K63j70J82n2l37
3342c28K63K39k78r2R5J19p1r7J09M16o76R4K12j16l0J95QO9q3oJ89j94o9Q6m1
3367A3J45n9r3N4N8p9L55l77J05O3n9m8l01K38J40l88J65M81m42R8p4J03J81l49
$$ plain form
3391 -70 204 -47 -20 -84 -117 160 177 -224 25 -121 -174 -95 70 -193 69 140 -114 -293 -191 -153 -190 -97 59 39
3415 39 -1 -24 -22 -142 -185 -162 -173 -68 117 -176 -138 -149 63 -16 16 -111 108 177 122 28 58 -214 77 -103 -256
3440 -256 269 75 -102 222 52 141 98 -234 273 49 -45 219 199 238 -237 -96 129 -55 -165 155 134 -81
3462 -81 168 -224 10 185 -16 -359 15 51 -15 -181 -13 -55 -96 -144 -168 -52 148 -124 119 -90 -24 7 -65
3485 -65 -266 -171 5 -227 164 203 -150 -420 0 -115 53 -167 -215 27 -186 -18 -22 -96 -159 -84 -302 -132 20
3508 20 234 -389 -135 170 -77 232 -63 -90 90 -50 446 26 51 215 -29 -117 47 146 -165 352 183 -117
3530 -117 97 101 177 44 -59 19 -191 82 337 -66 34 231 -91 100 -24 125 495 9 23 -35 258 -288
3552 -288 164 59 19 -116 61 271 -142 193 -221 283 -144 -457 -224 -188 -41 236 -76 -1 48 -105 4
$$ packed form
3391g0K74k51K7o4l3K77J7m01K49j46n3P9J65k63K62P1k54j79J02L8l7R3J56k0
3415C9m0k3Kj20m3K3j1J05J85k93L8j1K12p9L2j27K19O9n5r4L0k72K91j80j53
3440b56N25j94j77L24j70Q9m3l32N07k24r4K64k0L9m75J41K25j84j10L20k1k15
3462h1K49l92K34J75k01l43L74L6o6j66J68m2m1m8k4J16K00k72K43k09O6L1p2
3485f5k01R5J76k32L91L9l53k70M20j15J68k20m8K42k13J68mp4o3P5k18J70J52
3508B0K14o23K54L05k47L09k95k7J80j40M96m20K5J64k44q8J64R9l11N17j69l00
3530a17K14MP6j33j03P8k10K73K55m03J00J97l22J91j24J49L70m86J4n8K93n46
3552b88M52j05m0j35J77K10m13L35m14N04m27l13K33L6J47K77l12P5M9j53J09
$$ plain form
3573 4 21 -38 219 -219 -6 23 67 -40 6 -213 -87 13 -122 80 -156 -172 5 49 -152 149 219 -41 126
3596 126 193 117 108 61 23 -102 129 153 -228 98 34 -91 328 -88 206 63 78 -85 -55 98 -29 114 80 309
3620 309 159 -588 -299 264 -221 192 305 789 -61 409 -533 -150 -193 348 -346 -655 139 167 104 146 111 -42
3642 -42 -97 121 -204 -73 -223 198 -11 -215 54 -415 366 -133 46 -26 12 -153 -262 74 -297 -278 106 -279
3664 -279 -63 -48 146 161 170 -18 -158 -8 227 -32 -5 -322 102 157 -70 57 -8 -194 -117 -103 -166 182 194 -34
3688 -34 153 89 80 33 234 -52 -109 186 -46 105 -126 152 -103 -15 -43 153 -98 -11 -233 -186 -60 -370 -97
3711 -97 -89 -251 18 -24 -59 136 3 -107 85 108 61 -68 -132 47 -13 89 -30 4 -256 -28 134 13 -34 -82
3735 -82 -99 30 61 -234 -132 48 96 229 -22 7 102 -218 -106 -213 331 29 148 -169 -48 245 151 34
$$ packed form
3573DJ7n9K57m38K13K9M4j07M6k19J26J00j35K02k36j6J77M4k01L01P0k60J67
3596A26O7p6rm7l8j25K31K4l81L26o4j25M19m16K94j43J5j63L0J53j27J43l4K29
3620C09j50p47K89N63m85M13J13M84q50M70r42L83m3N41o94l09P94K8o3M2l5j53
3642d2n5K18l25J31j50M21k09k04K69m69P81m99J79p2L8j65j09L36l71J9L84l85
3664b79K16J5J94J5Rj88j40J50K35k59K7l17M24N5k27J27o5j86P7J4o3L48J2k28
3688c4J87o4rm7K01k86n7K95k32J51k31K78k55Q8k8J96k51Q7k22M7J26l10K73
3711i7Qj62K69m2l5J95j33j10J92K3m7j29o4J79o0J02j19L4k60K28J62j21m7m8
3735h2j7J29L1k95J02J80M8J33k51K9R5l20J12j07N44l02J19l17J21K93r4j17
$$ plain form
3757 34 246 123 257 -208 14 -1 -276 -202 -2 -1 55 -197 -115 -169 111 265 112 -190 286 167 -186 -120 48
3780 48 2 -118 -70 96 102 -19 33 189 -42 -69 -55 -44 37 -99 86 -3 -158 22 -310 137 152 50 261 56
3804 56 -87 188 -71 73 -94 79 108 48 -99 -22 -371 51 -77 -112 -203 50 163 -154 68 130 -73 -93 90
3827 90 234 -38 72 -59 -145 80 -49 -4 184 -110 -19 -1 59 128 -21 54 152 -50 161 99 -230 245 160 -194
3851 -194 38 -126 -60 46 -116 262 109 -139 -100 -203 -153 147 -58 98 19 -158 -98 -46 78 114 -37 -108 194
3874 194 -222 238 158 -80 -68 28 -55 -265 -149 25 -155 -93 109 146 -94 50 -90 212 -1 175 102 -87
$$ packed form
3757C4K12j23J34m65K22j5k75P4K00JN6k52Q2n4K80J54j53l02M76j19l53O6J68
3780D8m6j20M8J66Oj21N2J56k31k7J4J1Q1j36J85q9j55J80l32M47J5j02K11k05
3804E6j43K75k59J44j67J73K9o0j47P7l49M22j28l5r1K53J13l17K22O2k03k0J83
3827I0J44k72J10j31q6K25j29M5J88k94R1J8O0O9j49P5R8k02K11o2l29M75q5l54
3851a94K32j64O6J06j62L78j53k48L9j03N0L00k05J56p9j77O0N2J24L6j51p1L02
3874A94m16M60q0k38J2R6q3k10J16J74j80O2K02L7k40J44j40L02k13J76p3j89
$$ [...]
8191b4
##END NTUPLES=NMR FID
##END=
