##TITLE=1H_SAV-77-YbTf3-A
 CDCl3, 8 sc, 
 17.11.2020
##JCAMPDX= 6.0         $$ Bruker NMR JCAMP-DX V2.0
##DATA TYPE= NMR FID
##DATA CLASS= NTUPLES
##ORIGIN= UXNMR, Bruker Analytische Messtechnik GmbH
##OWNER= root
$$ XWIN-NMR		Version 3.5
$$ Tue Nov 17 13:26:46 2020 Russian Standard Time (UT+4h)  she@DPX200
##.OBSERVE FREQUENCY= 200.1315066352
##.OBSERVE NUCLEUS= ^1H
##.DELAY= (6, 6)
##.ACQUISITION MODE= SIMULTANEOUS
##.ACQUISITION SCHEME= undefined
##.AVERAGES= 8
##.DIGITISER RES= 18
##SPECTROMETER/DATA SYSTEM= spect
##.PULSE SEQUENCE= zg30
##.SOLVENT NAME= CDCl3
##.SHIFT REFERENCE= (INTERNAL, CDCl3, 0, 15.7039)
##AUDIT TRAIL= $$ (NUMBER, WHEN, WHO, WHERE, WHAT)
$$ ##TITLE= Audit trail, XWIN-NMR		Version 3.5
$$ ##JCAMPDX= 5.01
$$ ##ORIGIN= Bruker BioSpin GmbH
$$ ##OWNER= she
$$ F:/spectra/data/she/nmr/H-F/1/audita.txt
$$ ##AUDIT TRAIL=  $$ (NUMBER, WHEN, WHO, WHERE, WHAT)
(   1,<2020-11-17 13:25:22.48 +0400>,<she>,<DPX200>,
      <created by zg, POWCHK disabled, PULCHK disabled
       configuration hash MD5:
       00 E9 B6 7A A2 85 ED C7 34 08 36 98 17 FE 4E 26
       data hash MD5: 16K
       31 23 8D 8F 64 6F B3 8C 94 82 E8 B7 B5 70 5F 61>)
$$ ##END=
$$ 
$$ hash MD5
$$ 09 F2 3B 56 EB 10 57 57 FF C0 97 1E 87 35 1B 2D
##$RELAX= 
##$RELAX= 
##$RELAX= 
##$RELAX= 
##$RELAX= 
##$RELAX= 
$$ Bruker specific parameters
$$ --------------------------
##$DU= <F:/spectra>
##$EXPNO= 1
##$NAME= <H-F>
##$PROCNO= 1
##$TYPE= <nmr>
##$USER= <she>
##$AMP= (0..31)
100 100 100 100 100 100 100 100 100 100 100 100 100 100 100 100 100 100 
100 100 100 100 100 100 100 100 100 100 100 100 100 100 
##$AQSEQ= 0
##$AQ_mod= 1
##$AUNM= <au_zg>
##$AUTOPOS= <>
##$BF1= 200.13
##$BF2= 200.13
##$BF3= 200.13
##$BF4= 200.13
##$BF5= 200.13
##$BF6= 200.13
##$BF7= 200.13
##$BF8= 200.13
##$BYTORDA= 1
##$CFDGTYP= 0
##$CFRGTYP= 5
##$CHEMSTR= <none>
##$CNST= (0..31)
1 1 145 1 1 1 1 1 1 1 1 1 1 1 1 1 1 1 1 1 1 1 1 1 1 1 1 1 1 1 1 1 
##$CPDPRG= <>
##$CPDPRG1= <>
##$CPDPRG2= <>
##$CPDPRG3= <>
##$CPDPRG4= <mlev>
##$CPDPRG5= <mlev>
##$CPDPRG6= <mlev>
##$CPDPRG7= <mlev>
##$CPDPRG8= <mlev>
##$CPDPRGB= <>
##$CPDPRGT= <>
##$D= (0..31)
0 1.2 0 0 0 0 0 0 0 0.06 0 0.03 0 0 0 0 0.0002 0 0 0 0 0 0 0 0 0 0 0 0 
0 0 0 
##$DATE= 1605605121
##$DBL= (0..7)
120 120 120 120 120 120 120 120 
##$DBP= (0..7)
150 150 150 150 150 150 150 150 
##$DBP07= 0
##$DBPNAM0= <>
##$DBPNAM1= <>
##$DBPNAM2= <>
##$DBPNAM3= <>
##$DBPNAM4= <>
##$DBPNAM5= <>
##$DBPNAM6= <>
##$DBPNAM7= <>
##$DBPOAL= (0..7)
0.5 0.5 0.5 0.5 0.5 0.5 0.5 0.5 
##$DBPOFFS= (0..7)
0 0 0 0 0 0 0 0 
##$DE= 6
##$DECBNUC= <off>
##$DECIM= 32
##$DECNUC= <off>
##$DECSTAT= 4
##$DIGMOD= 1
##$DIGTYP= 9
##$DL= (0..7)
0 120 120 120 120 120 120 120 
##$DP= (0..7)
150 150 150 150 150 150 150 150 
##$DP07= 0
##$DPNAME0= <>
##$DPNAME1= <>
##$DPNAME2= <>
##$DPNAME3= <>
##$DPNAME4= <>
##$DPNAME5= <>
##$DPNAME6= <>
##$DPNAME7= <>
##$DPOAL= (0..7)
0.5 0.5 0.5 0.5 0.5 0.5 0.5 0.5 
##$DPOFFS= (0..7)
0 0 0 0 0 0 0 0 
##$DQDMODE= 0
##$DR= 18
##$DS= 0
$$ [...]
##$SUBNAM2= <"">
##$SUBNAM3= <"">
##$SUBNAM4= <"">
##$SUBNAM5= <"">
##$SUBNAM6= <"">
##$SUBNAM7= <"">
##$SUBNAM8= <"">
##$SUBNAM9= <"">
##$SW= 16.9725356469052
##$SWIBOX= (0..15)
0 0 2 0 0 0 0 0 0 0 0 0 0 0 0 0 
##$SW_h= 3396.73913043478
##$TD= 16384
##$TD0= 1
##$TE= 0
##$TE2= 300
##$TE3= 300
##$TEG= 300
##$TL= (0..7)
0 120 120 120 120 120 120 120 
##$TP= (0..7)
150 150 150 150 150 150 150 150 
##$TP07= 0
##$TPNAME0= <>
##$TPNAME1= <>
##$TPNAME2= <>
##$TPNAME3= <>
##$TPNAME4= <>
##$TPNAME5= <>
##$TPNAME6= <>
##$TPNAME7= <>
##$TPOAL= (0..7)
0.5 0.5 0.5 0.5 0.5 0.5 0.5 0.5 
##$TPOFFS= (0..7)
0 0 0 0 0 0 0 0 
##$TUNHIN= 0
##$TUNHOUT= 0
##$TUNXOUT= 0
##$USERA1= <user>
##$USERA2= <user>
##$USERA3= <user>
##$USERA4= <user>
##$USERA5= <user>
##$V9= 5
##$VALIST= <valist>
##$VCLIST= <CCCCCCCCCCCCCCC>
##$VD= 0
##$VDLIST= <DDDDDDDDDDDDDDD>
##$VPLIST= <PPPPPPPPPPPPPPP>
##$VTLIST= <TTTTTTTTTTTTTTT>
##$WBST= 1024
##$WBSW= 4
##$XGAIN= (0..3)
0 0 0 0 
##$XL= 0
##$YL= 0
##$YMAX_a= 5034
##$YMIN_a= -5192
##$ZGOPTNS= <>
##$ZL1= 120
##$ZL2= 120
##$ZL3= 120
##$ZL4= 120
##$ABSF1= 10
##$ABSF2= 0
##$ABSG= 5
##$ABSL= 3
##$ALPHA= 0
##$AQORDER= 0
##$ASSFAC= 0
##$ASSFACI= 0
##$ASSFACX= 0
##$ASSWID= 0
##$AUNMP= <proc_1d>
##$AZFE= 0.1
##$AZFW= 0.1
##$BCFW= 1
##$BC_mod= 2
##$BYTORDP= 1
##$COROFFS= 0
##$CY= 11.3945322036743
##$DATMOD= 1
##$DC= 2
##$DFILT= <>
##$DTYPP= 0
##$F1P= 15.9154993809931
##$F2P= -4.1035820241983
##$FCOR= 0.5
##$FTSIZE= 0
##$FT_mod= 4
##$GAMMA= 1
##$GB= 0.15
##$INTBC= 1
##$INTSCL= 1
##$ISEN= 128
##$LB= 0.24
##$LEV0= 0
##$LPBIN= 0
##$MAXI= 10000
##$MC2= 0
##$MEAN= 0
##$ME_mod= 0
##$MI= 1.114404
##$NCOEF= 0
##$NC_proc= 0
##$NLEV= 6
##$NOISF1= 3.799351
##$NOISF2= 2.8
##$NSP= 1
##$NTH_PI= 0
##$NZP= 0
##$OFFSET= 15.70392
##$PC= 1
##$PHC0= -11127.17
##$PHC1= 10.00089
##$PH_mod= 1
##$PKNL= yes
##$PPARMOD= 0
##$PSCAL= 0
##$PSIGN= 0
##$REVERSE= no
##$SF= 200.130013532006
##$SI= 16384
##$SIGF1= 3
##$SIGF2= 2
##$SINO= 400
##$SIOLD= 16384
##$SREGLST= <1H.CDCl3>
##$SSB= 0
##$STSI= 0
##$STSR= 0
##$SW_p= 3612.71676300578
##$SYMM= 0
##$S_DEV= 0
##$TDeff= 0
##$TDoff= 0
##$TI= <>
##$TILT= no
##$TM1= 0
##$TM2= 0
##$TOPLEV= 0
##$USERP1= <user>
##$USERP2= <user>
##$USERP3= <user>
##$USERP4= <user>
##$USERP5= <user>
##$WDW= 1
##$XDIM= 8192
##$YMAX_p= 0
##$YMIN_p= 0
$$ End of Bruker specific parameters
$$ ---------------------------------
##NTUPLES= NMR FID
##VAR_NAME=  TIME,          FID/REAL,        FID/IMAG
##SYMBOL=    X,             R,               I
##VAR_TYPE=  INDEPENDENT,   DEPENDENT,       DEPENDENT
##VAR_FORM=  AFFN,          ASDF,            ASDF
##VAR_DIM=   8192,          8192,            8192
##UNITS=     SECONDS,       ARBITRARY UNITS, ARBITRARY UNITS
##FACTOR=    0.0002944,     1,               1
##FIRST=     0,             0,               0
##LAST=      2.4114304,     0,               0
##MIN=       0,             -5192,           0
##MAX=       2.4114304,     5034,            0
$$ Real data points
##PAGE= N=1
##DATA TABLE= (X++(R..R)), XYDATA
0 0 0 0 0 0 0 0 0 0 0 0 0 0 0 0 0 0 0 0 0 0 0 0 0 0 0 0 0 0 0 8 -8 8 -8 8 -8 8 -8 8 -15 16 -16 16 -16 24 -24 24 -28
47 -28 32 -32 39 -40 47 -49 56 -62 68 -75 84 -94 106 -121 140 -162 192 -235 296 -397 581 -1041 4439
70 4439 4853 -5192 3857 2035 -172 1862 -1552 3027 2573 -3571 3759 2101 -3021 1762 979 432
86 432 1113 -1478 2474 1002 -2649 1546 350 -1419 610 -666 943 -557 -3015 1744 104 -3354
102 -3354 688 688 -837 -468 -581 709 -860 -1110 1737 -242 -876 944 325 -30 -1194 23 1374
119 1374 -1713 -62 1443 -1689 -332 -73 -873 529 -1619 -303 1900 -1571 -897 733 -430 52
135 52 -832 291 1286 -1407 160 939 -1341 -30 26 93 502 -1473 686 855 -2225 523 697 -1298
153 -1298 683 -124 -53 543 -1665 547 896 -1779 549 564 -752 290 -916 -17 272 -1520 865
170 865 335 -1498 837 -49 -717 269 -637 961 370 -1147 1528 274 -1219 953 120 -10 290 -450
188 -450 1082 -137 -1307 759 -88 -621 164 -242 573 -394 -943 943 -358 -824 795 136 152 -42
206 -42 -251 972 -439 -602 1302 75 -219 650 99 364 -245 -135 1135 -106 -26 1001 -11 233
224 233 141 -197 866 -14 -97 976 -161 -117 252 -343 287 -190 -195 743 -422 -360 387 -426 -159 10 94
245 94 482 -386 186 585 -686 106 513 -179 321 92 187 262 -667 138 305 -658 214 238 -369 -36 -415
266 -415 -202 -78 -603 90 107 -415 7 -298 -227 -33 -577 162 278 -491 98 75 -339 -70 -251 206 259 -364
288 -364 366 344 -460 85 297 -35 107 228 332 11 -136 202 -47 -128 147 60 108 -65 -143 51 -263 -166
310 -166 141 -99 100 80 -186 158 -18 -213 282 212 21 193 224 92 -113 71 298 -16 53 329 54 -127
332 -127 -81 28 2 -236 70 217 -278 -170 28 -296 -234 -57 -117 -35 -127 -243 -87 -210 -352 -65 7 -159 -60
355 -60 -8 -129 -139 -142 -27 129 -40 25 234 -16 -150 71 103 -49 6 242 72 -168 5 -24 -122 -62 -29 164
379 164 1 -255 157 24 -352 136 182 -74 163 68 50 91 -162 126 234 -65 177 179 -24 10 -86 66 31
402 31 -109 195 10 -138 -13 -256 -39 -88 -371 204 -35 -464 55 -183 -368 -87 -227 19 -19 -292 107
423 107 -96 -273 97 -17 60 170 105 249 -33 87 349 -28 267 437 86 403 164 -31 437 43 27
444 27 425 71 213 163 -176 262 1 -200 286 48 -13 96 -135 78 -123 -121 273 -163 52 281 -268 70
466 70 36 -178 271 -133 28 427 -292 15 233 -232 192 43 -24 347 -179 -50 162 -233 96 -73 -126 286
488 286 -246 -132 73 -377 58 -44 -347 197 -125 -181 60 -451 31 124 -473 130 59 -298 40 -273 -88
509 -88 67 -374 117 28 -301 163 -280 -222 233 -287 -28 22 -216 270 -286 -314 321 -243 -10 161 -323 269
531 269 -3 -319 227 -139 24 203 -271 282 37 -355 339 -77 -121 236 -209 231 116 -395 216 -47 -112
552 -112 313 -298 20 250 -300 119 -94 -227 392 -145 -132 237 -222 150 -2 -278 432 -87 -164 450 -149
573 -149 5 135 -212 426 7 -282 412 -71 20 161 -395 238 168 -223 240 -226 -27 319 -390 39 81
594 81 -200 372 -204 -181 333 -347 114 254 -350 320 87 -130 411 -204 9 381 -109 357 97 -195 538
615 538 34 -79 298 -134 344 258 -283 312 -19 -72 363 -349 82 316 -423 233 42 -473 189 -170 -110
636 -110 138 -491 118 72 -462 148 -272 -267 301 -335 -105 -33 -355 263 -247 -357 304 -316 12 190 -548 198
658 198 61 -392 291 -182 -155 271 -280 96 21 -347 350 -53 -202 288 -222 41 215 -227 190 -72 -22
679 -22 457 -335 -24 401 -286 204 138 -259 397 -80 -111 371 -289 84 261 -244 256 -65 -176 380 -234
700 -234 -84 203 -230 186 -61 -205 291 -310 -21 290 -437 119 132 -306 237 -204 -179 331 -316 7 170
721 170 -300 179 -48 -220 239 -221 -34 191 -263 92 -39 -177 237 -226 -53 224 -291 141 55 -319 289
742 289 -77 -166 304 -222 29 207 -261 220 24 -182 333 -95 -25 232 -175 196 74 -176 310 -83 -38
763 -38 260 -211 143 106 -228 324 -64 -174 323 -175 -41 185 -232 157 0 -211 226 -146 -116 153 -216
784 -216 15 20 -196 133 -120 -115 140 -206 1 59 -229 133 -74 -171 179 -199 -64 149 -226 57 47 -158 126
807 126 -121 -57 159 -168 41 101 -137 106 -21 -24 148 -125 88 128 -152 138 51 -52 144 -61 57 155 -104
830 -104 120 118 -69 144 1 11 137 -77 101 105 -79 121 36 3 91 -60 80 90 -101 110 52 -75 66 -27
854 -27 -5 30 -96 39 -8 -127 39 -51 -90 1 -78 -26 -34 -94 10 -78 -94 8 -74 -68 -28 -65 -41 -69 -72 -5 -42 -42 -18 -5
884 -5 -6 -54 -18 15 -40 -20 13 -15 -2 -38 5 -14 -79 64 11 -31 -14 25 -5 -38 -9 34 -12 -5 19 9 27 -28 1 74 -13 19
916 19 73 -7 65 9 -31 115 1 15 108 -1 64 28 -79 31 -8 11 87 -107 50 52 -128 23 -45 -46 79 -156
942 -156 -6 72 -200 -3 -30 -143 63 -100 -86 73 -119 -13 -6 -124 86 -42 -95 82 -79 22 23 -130 144
965 144 23 -81 146 -60 45 107 -135 170 97 -93 198 9 -10 197 -108 116 151 -66 202 -4 -21 234
987 234 -119 50 179 -67 183 -37 -52 264 -156 -19 198 -147 145 -19 -200 229 -132 -150 163 -178 43
1008 43 38 -269 132 -88 -188 128 -208 -18 112 -247 52 -47 -149 153 -228 -30 223 -283 35 63 -193 180
1030 180 -151 -89 308 -215 -15 143 -211 166 -47 -157 261 -165 -35 158 -260 143 34 -195 220 -120
1050 -120 -12 174 -278 163 96 -261 259 -33 -77 235 -233 103 196 -259 206 60 -82 268 -184 -6 229
1071 229 -209 141 49 -150 274 -138 -90 191 -243 119 56 -268 246 -103 -213 231 -230 1 125 -306 223
1092 223 2 -300 202 -175 -27 177 -328 148 106 -266 177 -142 -82 260 -263 86 109 -265 255 -97 -198
1113 -198 296 -206 38 202 -282 154 -14 -192 288 -183 -62 275 -203 108 55 -233 273 -28 -63 256 -208
1134 -208 128 202 -267 194 9 -77 320 -195 20 238 -280 178 74 -215 241 -101 -27 212 -338 75 144
1155 144 -252 190 -97 -140 261 -242 6 93 -280 266 -4 -248 223 -161 -19 158 -289 138 76 -215 243
1176 243 -159 -137 211 -216 80 54 -264 236 -58 -186 174 -230 32 170 -242 123 -30 -165 235 -185 -81
1197 -81 215 -175 150 65 -224 241 -55 -53 252 -184 119 195 -176 216 -41 -96 316 -131 29 195 -202 197
1219 197 33 -203 217 -96 5 217 -253 71 65 -210 176 -123 -120 224 -192 25 58 -254 162 -29 -141 196
1241 196 -165 7 159 -260 90 28 -163 216 -110 -94 153 -213 68 41 -224 172 -42 -135 126 -208 -16
1262 -16 82 -208 116 -36 -150 200 -140 -57 117 -196 147 59 -160 201 -71 -72 193 -153 86 142 -120 190
1284 190 -14 -85 196 -107 38 145 -129 160 24 -111 158 -126 -8 152 -168 88 56 -175 140 -90 -100
1305 -100 144 -136 43 75 -183 116 -31 -130 140 -109 -9 105 -142 66 -18 -136 139 -90 -29 125 -161
1326 -161 39 21 -181 96 -70 -95 131 -152 -21 62 -177 56 -20 -114 111 -102 -39 86 -133 44 32 -86
1348 -86 127 -34 -12 113 -113 67 88 -85 150 34 -23 149 -61 45 115 -78 111 68 -59 120 -41 -24
1370 -24 91 -98 64 68 -74 80 -40 -57 69 -89 25 46 -98 81 -33 -98 75 -82 -34 61 -88 48 -16
1393 -16 -126 58 -41 -89 54 -65 -5 8 -106 20 -33 -76 42 -51 -7 17 -97 8 -23 -73 57 -39 -16 79 -58
1418 -58 2 25 -40 62 10 -7 115 -17 -15 44 -19 51 32 -25 64 -3 -19 47 4 -24 54 29 49 62 -18 59 -64 32 67
1447 67 -46 17 56 -5 18 -72 -113 47 61 0 47 65 -48 -96 20 -13 2 -116 22 -3 -51 -64 -61 21 -11 35 20 22
1475 22 -41 -7 -34 -102 -14 -38 57 -30 -14 14 -76 -87 -7 21 -35 18 -28 21 -84 -48 46 10 -19 41 -1 35 31 -47 35 43 17
1506 17 49 -70 22 47 -57 -2 24 19 57 -6 -10 93 -14 3 19 -46 101 -2 -54 69 6 -55 -13 -48 76 19 -52
1533 -52 14 -15 -55 14 -80 28 82 -72 39 -30 -54 35 -95 -50 55 -54 38 -40 -100 -8 -97 -89 68 -68 8 -7 -105
1560 -105 71 -21 -35 36 -41 37 34 -100 90 16 -81 84 12 23 110 -101 97 47 -78 81 16 9 89 -87 57 32
1586 32 -106 111 -1 -56 141 -67 -15 86 -93 105 6 -66 152 -33 -58 117 -44 43 62 -78 124 -15 -69
1609 -69 119 -105 18 34 -119 101 -6 -115 96 -121 -58 97 -147 36 19 -130 77 -98 -99 85 -152 5
1631 5 59 -124 69 -67 -99 129 -136 -15 102 -110 88 -6 -121 130 -62 -15 139 -118 86 78 -126 117 -27
1654 -27 -38 165 -92 45 103 -131 101 6 -96 144 -75 23 119 -159 89 63 -111 138 -56 -36 175 -117 61
1677 61 55 -154 165 4 -87 154 -99 27 95 -174 99 13 -110 154 -113 -50 102 -153 67 -4 -168 152 -63
1700 -63 -98 102 -169 16 78 -173 100 -47 -117 147 -143 -54 87 -143 106 10 -138 146 -66 -44 126 -163
1722 -163 69 90 -118 146 -53 -71 195 -106 30 106 -122 148 8 -118 152 -82 0 154 -140 81 67 -109
1744 -109 151 -70 -45 173 -102 64 51 -161 139 -17 -79 139 -125 23 115 -173 67 -15 -106 150 -95 -61
1766 -61 97 -155 61 17 -171 112 -49 -72 104 -175 0 72 -156 89 -37 -96 132 -98 -39 78 -158 96
1788 96 35 -130 120 -61 -23 125 -153 77 89 -100 155 -21 -47 89 -64 42 91 -127 125 36 -121 156
1810 156 -83 55 80 -100 111 29 -37 220 -31 -51 171 -106 85 66 -124 95 -43 -47 116 -106 15 77 -135
1833 -135 65 -30 -89 115 -90 -25 79 -126 54 21 -131 86 -71 -45 98 -120 28 48 -106 86 -36 -56
1855 -56 107 -86 11 65 -112 72 -9 -70 107 -62 -18 73 -116 34 14 -98 82 -40 -47 76 -95 14 14 -103
1879 -103 63 -13 -60 63 -68 10 51 -85 69 23 -32 93 -49 5 80 -69 54 40 -27 106 -20 -15 95 -51
1903 -51 41 38 -32 83 -20 -29 74 -50 3 31 -68 49 -16 -79 44 -43 -31 23 -87 12 -8 -96 18 -48 -47 15 -82 -7
1931 -7 20 -70 15 -23 -34 25 -75 -2 29 -66 10 -26 -39 35 -57 -17 45 -33 23 7 -20 66 -20 -3 48 -2 39 11 -25 78
1961 78 -16 -8 42 16 67 23 -21 46 31 -15 35 -19 45 30 -31 16 14 -9 16 -33 2 14 -44 -16 -26 -19 -3 -38 -9 9 -38 -7
1993 -7 -25 -32 10 -37 -27 11 -35 -17 -21 -15 29 -31 -19 16 -19 8 -16 -14 26 -10 -9 4 -6 26 -25 -38 29 -12 -5 -10 -25 28 -6 -43
2027 -43 17 -5 6 1 -29 40 6 -17 16 2 26 31 -22 34 31 -12 35 -14 25 65 -24 32 39 -4 38 -6 8 64 -22 11 28 -24
2059 -24 40 -20 -30 55 -38 -10 18 -52 15 -34 -62 38 -44 -34 10 -96 8 -24 -76 25 -47 -35 16 -68 4 17 -71 23
2087 23 -25 -39 46 -64 3 37 -71 42 9 -27 60 -47 3 59 -50 41 23 -24 83 -20 -12 77 -40 36 37 -39 77
2114 77 10 -23 80 -37 25 55 -59 73 10 -43 80 -46 6 63 -86 49 12 -78 69 -46 -16 66 -86 17
2138 17 15 -91 51 -45 -64 60 -87 -3 32 -105 42 -29 -76 61 -63 -21 42 -95 41 -6 -99 88 -49 -39 75
2163 75 -79 38 44 -87 74 -13 -42 104 -73 27 70 -82 81 9 -69 95 -55 1 92 -105 48 24 -77 89
2187 89 -37 -39 103 -84 17 48 -79 94 -7 -50 96 -64 19 84 -91 79 12 -58 111 -42 -10 98 -82
2210 -82 68 37 -84 110 -19 -28 92 -90 33 61 -101 63 -29 -69 101 -93 -27 46 -117 54 -6 -120 70
2233 70 -64 -28 38 -116 28 19 -118 75 -55 -66 91 -82 11 54 -101 138 -9 -125 77 -83 25 102 -114
2256 -114 87 64 -57 127 -56 -28 120 -60 58 54 -90 108 0 -46 101 -82 30 89 -101 63 0 -69 128
2279 128 -65 -25 88 -96 67 26 -105 93 -43 -34 80 -119 6 51 -115 76 -48 -84 108 -96 -17 54 -119
2302 -119 67 3 -104 84 -67 -25 77 -129 32 44 -96 94 -42 -70 95 -81 19 48 -107 83 13 -64
2324 -64 97 -69 3 98 -92 62 34 -68 113 -33 -35 101 -66 50 49 -98 106 1 -47 104 -81 25 70
2347 70 -91 69 2 -80 109 -44 -9 73 -90 55 37 -88 79 -15 -29 85 -90 2 58 -89 69 -10 -62 102
2371 102 -70 -7 62 -82 54 5 -76 82 -52 -47 79 -89 11 17 -89 71 -35 -70 67 -70 0 39 -95 49
2395 49 10 -55 72 -58 -3 79 -64 40 37 -39 84 -27 -17 103 -49 35 61 -53 67 -5 -31 99 -32 -2 60
2420 60 -55 52 15 -62 74 -30 -18 56 -68 19 21 -78 29 -26 -54 44 -66 -20 36 -87 27 -7 -63 45 -56
2445 -56 -14 42 -71 9 17 -49 46 -37 -31 69 -40 3 19 -60 41 -16 -40 52 -39 -16 19 -42 39 -6 -65 41 -19 -23 20
2474 20 -58 18 18 -61 23 1 -32 35 -49 13 40 -34 30 1 -2 57 -10 2 53 -14 17 18 -16 57 6 -13 55 -8 14 25 -29 18
2506 18 -3 -38 27 -21 -9 20 -36 10 16 -33 7 -11 -17 17 -46 -5 20 -38 -9 -7 -13 25 -38 -28 18 -19 -11 -6 -20 17 -18 -23 14 -10
2540 -10 3 -16 -36 8 -6 -36 -2 -16 -23 -11 -42 -4 6 -17 2 -9 0 13 -17 -1 19 -6 4 12 2 14 5 -6 22 6 5 23 -8
2573 -8 19 20 -10 29 14 7 13 0 -1 11 -12 1 7 -22 1 -19 -11 7 -34 -22 -2 -26 -6 -16 -39 3 -24 -33 4 -29 -13 1 -55 3
2607 3 -11 -23 3 -14 7 17 -37 9 10 -26 16 -7 -7 33 -34 3 11 -20 23 -4 -20 39 -25 -7 25 -30 16 6 -43 36 1 0 30
2640 30 -17 25 24 -30 36 3 -12 49 -20 18 52 -19 44 22 -20 50 -11 -4 54 -36 18 29 -44 34 -15 -24 35 -52 0 23 -58 18
2672 18 -22 -60 26 -39 -24 21 -58 -2 -11 -72 17 -45 -41 31 -67 -2 6 -67 26 -23 -35 54 -38 11 34 -53 47 12 -40 61 -25
2703 -25 -14 63 -49 30 20 -48 54 -19 -19 61 -48 11 35 -63 38 -7 -43 53 -25 -5 55 -53 33 13 -58 67 -38
2730 -38 -19 63 -69 27 30 -65 58 -4 -36 58 -49 7 35 -61 62 -12 -58 49 -47 -22 43 -82 19 3 -71 44 -45
2757 -45 -32 51 -76 9 10 -83 55 -19 -57 65 -50 10 53 -65 47 0 -53 79 -36 -22 69 -53 46 32 -60 72
2783 72 -16 -31 63 -64 23 42 -78 54 -11 -31 72 -52 -14 53 -73 49 8 -76 75 -30 -14 69 -68 31 37 -60
2809 -60 68 -33 -34 81 -51 17 33 -80 65 0 -70 58 -60 -12 46 -104 32 -6 -78 59 -56 -46 44 -96
2833 -96 12 -21 -114 61 -81 -35 71 -128 -21 79 -96 -33 -43 -63 98 20 -36 52 -93 97 36 -48 67 39
2857 39 36 38 -64 37 27 -78 54 -31 -42 82 -47 6 47 -83 70 12 -58 64 -42 -17 49 -86 30 18 -67
2882 -67 65 -36 -34 55 -66 3 26 -81 63 -19 -46 66 -57 -1 47 -57 49 -21 -66 73 -50 -34 40 -68 35
2907 35 6 -85 37 -39 -47 38 -94 3 21 -81 29 -36 -56 50 -67 -3 28 -76 30 3 -52 59 -48 -10 57 -50
2933 -50 27 26 -46 71 -23 -35 79 -50 27 31 -53 58 6 -40 71 -47 9 31 -65 39 17 -60 53 -26 -24 42 -70
2960 -70 22 26 -71 31 -32 -32 50 -68 8 30 -65 29 -20 -48 57 -52 -13 45 -60 29 3 -60 48 -34 -31 38 -48 15 1
2989 1 -60 49 -9 -28 46 -46 -1 24 -63 35 -1 -50 46 -30 2 40 -40 35 19 -18 57 -11 -4 64 -35 24 35 -23 52 -6 -21
3020 -21 62 -25 17 29 -29 33 4 -30 43 -27 -13 22 -42 19 -7 -44 20 -26 -32 7 -48 8 7 -49 3 -16 -29 8 -46 -11 10
3051 10 -43 10 -2 -33 24 -26 -4 33 -11 3 15 -15 29 -20 -19 25 -23 -3 -1 -25 14 -11 -31 11 -16 6 8 -26 2 -18 -28 5
3083 5 -26 -18 2 -23 13 3 -19 15 -17 -8 7 -15 1 6 -15 2 4 1 19 4 1 11 -6 3 0 -11 9 -1 -7 2 -12 -1 -8 -20 -2 -1 -17
3120 -17 -17 -13 -5 -8 -16 -10 -14 -4 -13 -23 -2 -12 -11 -18 -8 -10 -21 -14 2 -17 -1 -9 -10 10 -19 -7 2 -17 1 -3 0 9 -8 -12 6 -11 3 2 -9 -3 -1
3161 -1 -16 7 -7 0 12 -20 5 14 -5 17 -12 4 28 -9 19 14 -19 22 -5 -8 14 -17 7 16 -18 12 -14 -32 14 -30 -7 7 -29
3194 -29 4 -13 -37 9 -23 -25 10 -44 -11 -8 -48 7 -30 -23 26 -33 -6 8 -46 12 -18 -34 23 -23 -9 21 -41 21 2 -36 42 -16
3226 -16 -17 30 -29 7 4 -51 34 -8 -31 33 -27 6 20 -35 23 1 -18 39 -26 -3 43 -36 17 21 -22 49 -9 -10 48 -17 28 26 -37
3259 -37 43 3 -27 47 -23 -1 25 -56 32 0 -37 34 -34 -19 28 -54 1 7 -60 28 -28 -38 19 -60 -15 14 -66 19 -13 -49 36
3290 36 -43 -7 31 -43 16 9 -38 44 -16 -18 41 -44 19 32 -45 50 -7 -19 50 -38 -6 35 -47 30 0 -49 47 -25 -10 34 -68
3321 -68 11 18 -48 41 -29 -38 45 -42 20 20 -48 43 0 -41 46 -27 -9 41 -51 24 4 -43 50 -23 -29 49 -47 21 22 -63 34 -14 -31
3354 -31 42 -63 -8 36 -58 20 -19 -45 44 -59 -48 27 -57 6 -1 -63 33 -23 -26 49 -47 3 37 -43 50 -2 -33 67 -14 16
3384 16 48 -43 42 24 -47 46 -21 -13 59 -52 14 29 -39 40 -20 -31 42 -44 3 30 -51 42 -11 -39 41 -43 -13 40 -47 14
3414 14 0 -54 55 -23 -36 27 -46 20 9 -57 34 -5 -28 47 -54 -6 23 -68 9 -13 -60 33 -45 -29 25 -61 -5 0 -71 27
3444 27 -48 -36 42 -61 -16 11 -55 36 -20 -53 52 -27 -12 21 -51 29 4 -44 48 -13 -15 46 -42 15 22 -44 35 -8 -12 37 -39
3475 -39 12 28 -46 24 -2 -18 32 -40 -29 38 -42 7 -8 -42 31 -22 -32 31 -28 -2 10 -46 29 -13 -33 27 -39 0 13 -47
3505 -47 20 -8 -39 17 -28 -10 14 -38 14 2 -48 14 -17 -18 30 -36 -10 14 -41 12 -11 -27 30 -27 -13 32 -32 23 20 -22 39
3536 39 -7 -7 31 -22 29 15 -27 28 6 -20 32 -22 3 17 -24 31 6 -22 28 -20 1 20 -16 9 8 -23 24 -21 -8 25 -39
3567 -39 0 -4 -28 22 -2 -25 21 -25 -11 4 -23 15 -2 -11 17 -24 -9 23 -20 2 1 -24 19 -13 -9 14 -25 3 7 -29 9 -4 -19
3600 -19 6 -5 2 18 -24 4 1 -8 19 0 1 2 -14 7 7 -6 20 2 4 25 -6 12 22 4 25 24 8 24 6 -3 10 -15 12 6 -15
3635 -15 2 -7 -12 -2 -22 -11 3 -19 -2 -16 -10 -3 -25 -14 -4 -19 1 -3 2 0 -11 -2 -9 -15 -3 -3 -5 9 -10 -3 -6 -3 0 -4 -11 -1 -8 7 0 7 -3
3676 -3 -1 15 -9 -4 5 -5 5 -7 -10 1 -13 -9 1 8 14 7 7 13 12 11 16 6 14 7 13 21 12 7 8 0 11 12 -12 21 10 3 12 1 -5 4 -11 2 12 -17
3720 -17 3 -19 -10 5 -22 -5 -7 -26 0 -8 -20 11 -24 -8 11 -20 2 3 -13 23 -9 2 24 -20 16 6 -17 19 -16 -10 27 -17 7
3753 7 24 -20 19 0 -24 13 -16 0 17 -21 10 6 -25 17 -10 -13 22 -18 6 10 -29 26 -6 -13 33 -7 8 23 -16 36 15 -9 25
3786 25 -19 0 22 -21 26 14 -23 29 -15 -18 24 -34 4 10 -37 12 -16 -31 25 -25 -1 9 -43 14 -1 -36 18 -28 -6 26 -37
3817 -37 21 18 -34 43 -3 -10 41 -40 10 26 -50 9 -4 -33 55 -56 -63 54 -41 30 7 -22 40 -30 -5 42 -29 19 9 -34 29
3848 29 -13 -18 48 -25 17 20 -45 39 0 -31 42 -24 -3 38 -34 38 12 -32 40 -14 -9 30 -31 18 31 -32 40 -11 -25 37 -42 -13
3880 -13 18 -47 21 -5 -43 42 -29 -4 27 -50 19 0 -40 46 -25 -35 40 -27 16 1 -44 48 6 -28 40 -19 17 38 -43 32
3910 32 18 -25 53 -19 2 37 -34 18 17 -44 32 -13 -25 39 -39 7 28 -49 29 -8 -18 48 -31 -10 31 -36 35 15 -22 52 -12
3941 -12 7 42 -25 31 29 -42 45 -14 -25 41 -34 10 13 -45 27 -6 -43 27 -42 -7 30 -61 18 2 -43 28 -43 -29 35 -43 2
3972 2 14 -35 33 -17 -24 47 -31 8 37 -32 43 15 -20 55 -7 4 45 -34 36 41 -36 46 -11 -10 52 -43 15 27 -41 30 -6 -30
4004 -30 45 -26 -22 17 -42 29 4 -34 32 -21 -17 40 -50 11 9 -41 28 -16 -16 47 -37 4 16 -53 29 6 -37 31 -34 -5 34 -57
4036 -57 9 8 -44 37 -29 -28 31 -48 1 9 -47 23 -15 -26 35 -30 -9 29 -38 26 -1 -41 37 -24 -7 23 -22 10 21 -30 41 -1
4068 -1 -8 38 -25 12 30 -33 27 0 -12 35 -19 0 15 -39 15 -4 -22 26 -26 -18 7 -27 7 18 -36 29 -17 -13 23 -28 -13 12
4100 12 -29 23 11 -26 37 -9 -1 14 -28 19 7 -33 25 -17 -8 11 -25 -8 1 -28 20 -17 -14 24 -22 -8 3 -27 -5 -11 -14 16 -8
4133 -8 0 12 -12 17 10 -10 23 9 -4 23 1 22 22 -2 18 6 -2 20 -6 9 25 -14 15 7 -13 13 -2 -9 13 -27 1 1 -27 2
4167 2 -11 -19 17 -10 -4 8 -22 -9 3 -15 3 -15 -16 0 -9 3 1 -2 3 -6 -7 13 -6 5 1 -7 11 5 -11 -4 -4 -7 0 -16 4 -10 -18 -11 -18 -6
4207 -6 -7 -18 -4 -11 -4 5 -11 -4 6 -3 0 8 -7 2 3 0 2 -4 9 3 6 7 5 12 8 12 3 5 -5 1 -6 12 -3 -4 0 -4 -8 -10 -1 -6 -17 -11 -12 -10 -11 -13 -17 3 -11
4256 -11 -11 -7 -5 -2 -9 -3 0 -4 -9 -7 -1 1 3 -5 5 -8 -10 6 -4 -5 -3 -11 2 -4 -9 15 5 -14 5 -14 6 8 -16 9 -7 -12 11 -2 1 17 -8 21
4298 21 21 2 26 11 8 25 -5 21 16 4 25 7 2 26 -7 9 21 -5 15 -4 -11 12 -1 -1 -2 -20 6 -5 -26 10 -4 -16 12 -22
4332 -22 2 4 -25 0 -4 -8 10 -20 2 11 -11 24 8 3 24 -3 15 30 -15 10 26 -2 28 -2 6 24 -12 10 8 -14 17 -2 -8 24
4366 24 -10 7 9 -35 20 2 -25 20 -10 -9 12 -11 16 20 -11 20 0 -2 18 -11 19 22 -21 17 1 -13 22 -17 2 25 -20 11 6
4399 6 -31 18 -17 -14 6 -30 7 2 -36 17 -16 -32 24 -24 -5 6 -34 15 -4 -14 22 -22 6 29 -27 4 19 -12 29 -7 3 35
4431 35 -18 10 20 -22 41 4 -13 24 -16 -4 25 -21 22 -3 -19 43 -13 -14 15 -26 15 12 -24 23 -3 -5 27 -14 16 27 -24 32
4463 32 -1 -12 28 -11 14 26 -24 16 11 -12 29 -19 -10 32 -35 1 4 -22 26 -17 -22 29 -14 -4 10 -36 19 8 -28 26 -23 -9
4495 -9 16 -32 10 14 -13 28 -3 -7 30 -21 19 16 -28 31 3 -9 24 -29 10 35 -19 29 5 -24 27 -24 -9 18 -21 20 17 -20 23
4528 23 -15 -19 29 -20 5 15 -17 36 -9 -15 30 -7 10 8 -33 19 1 -34 25 -15 -2 29 -24 20 11 -23 28 -10 -20 21 -28 -1
4560 -1 14 -40 17 -18 -29 26 -28 -17 5 -34 9 -7 -32 14 -13 -10 20 -12 13 23 -25 25 2 -3 24 -7 1 33 -42 -13 26 -11
4592 -11 31 -18 6 12 -15 22 10 -14 24 -8 -4 18 -19 -6 17 -18 21 -3 -16 28 -18 -4 18 -28 18 -6 -23 22 -15 -10 21 -18
4624 -18 9 9 -17 28 -12 -13 28 -26 12 14 -23 16 -7 -19 13 -16 -4 7 -23 6 -15 -19 6 -30 -18 6 -28 1 -1 -26 6 -21 -11
4657 -11 1 -22 0 4 -20 28 -3 -3 21 0 -2 14 -10 30 8 -17 18 -1 -4 29 3 15 22 -79 40 31 -28 9 -6 -52 18 -35
4689 -35 -4 11 -22 12 -19 -5 8 -20 9 -2 -19 10 -10 -3 9 -14 4 -4 -11 -8 -4 -9 9 -10 4 8 -10 14 -2 -16 4 -8 -11 -2 -12
4724 -12 -10 -9 -5 0 -4 -5 8 -5 -7 -1 -8 0 -4 -15 0 -23 21 -8 4 19 -41 32 6 13 -5 -19 -3 -3 -45 2 -10 24 9 18 5 6 2 -4 3
4763 3 0 -9 -6 -1 -11 -1 -2 -9 7 1 -8 -12 -1 -14 -15 -12 -1 3 -14 -2 -2 -7 3 -4 2 -6 -7 -11 2 -2 3 3 -19 2 -12 5 2 -5 0 -6 -17 2 -9 -8
4807 -8 -4 -9 1 -6 -17 -6 -14 -21 -11 -4 -11 -6 -12 0 10 -16 7 6 10 22 2 1 11 -13 10 -5 4 6 -8 3 15 -6 16 -18 -9 16 -16 -3
4845 -3 8 -20 4 -2 -17 14 -3 -9 -5 -31 -8 8 -22 -3 -18 -5 7 -19 -9 5 -14 10 1 -13 16 -1 -2 10 -4 9 12 -21 16 -9
4879 -9 -14 27 -10 11 7 -27 4 -16 -22 -6 -19 -4 1 -20 7 -8 -29 10 -16 -11 11 -24 7 7 -14 12 9 -7 21 -17 -2 17 -8 24
4913 24 4 -18 16 -7 0 22 -21 16 -2 -15 11 -8 -31 6 -28 -4 -4 -52 3 -16 -32 18 -25 -2 6 -41 2 -1 -25 12 -20 -7
4945 -7 16 -21 -5 13 -20 20 -12 -8 28 -20 4 12 -28 5 0 -12 24 -13 -4 18 -23 16 -2 -34 9 -24 -17 16 -28 5 -2 -28 19 -3
4979 -3 -8 22 -6 6 10 -21 30 15 -2 30 -19 8 28 -11 13 8 -15 16 -12 -15 20 -27 -10 17 -31 22 -4 -25 23 -29 -11 6 -29
5012 -29 4 -13 -31 19 -24 -13 4 -30 -2 -2 -31 19 -17 -23 24 -15 9 16 -12 19 3 -10 25 -8 1 16 -23 12 8 -22 23 -5 -22
5045 -22 20 -29 3 3 -22 20 -13 -30 15 -26 -8 23 -21 15 12 -14 16 -14 -1 23 -17 12 16 -14 25 -4 -13 33 -12 10 10 -19 29
5078 29 -7 -7 23 -15 -9 1 18 21 -8 -33 12 -13 -11 13 -34 8 2 -18 12 -11 -9 27 -27 2 11 -31 22 -5 -12 27 -23 -5 21 -14
5112 -14 24 17 -9 23 -4 -4 33 -11 19 19 -18 11 0 -10 12 -18 -15 9 -37 3 1 -22 8 -21 -14 11 -16 2 3 -20 9 -10 -8 25
5146 25 -21 8 9 -26 14 -2 -17 18 -21 -1 13 -25 10 -8 -30 14 -25 0 18 -22 -4 7 -33 2 -17 -20 1 -29 -8 2 -27
5177 -27 -1 -4 -22 9 -22 -10 8 -17 -6 3 -12 17 -12 -1 28 0 3 25 -9 24 -1 -20 6 -6 3 7 -21 16 -2 -4 19 -20 -22 4
5211 4 -6 4 -10 -9 -36 -1 -16 6 -14 -11 7 -12 1 -4 -12 21 -10 -8 1 -8 10 4 -3 18 -3 -5 7 -18 5 4 -20 9 -15 -5 5 -22
5247 -22 -1 3 -14 0 -8 -28 -5 -24 -5 10 -23 -1 6 -4 9 -11 -4 12 -5 -4 5 -7 4 12 -5 15 1 -3 23 -10 23 10 0 10
5281 10 -1 -1 15 -7 3 -10 -18 4 -11 -9 1 -10 -16 -3 -17 0 -4 -7 -1 -1 -7 5 -7 -5 -5 -3 5 -10 -5 8 -7 3 4 -9 6 6 1 11 -4
5320 -4 3 3 4 -10 -4 -7 -3 -11 -11 -5 -22 -6 -7 -4 -10 -12 -13 -3 -13 -4 3 -2 8 5 -7 -5 13 7 4 2 10 12 12 1 3 10 3 7 6 7 5 1 8 -4 -7 -4 5 -6 -1 -17
5370 -17 -3 -6 -9 -2 -20 -5 0 -19 -15 -4 -12 -5 -12 5 -7 -6 -14 1 -6 8 -7 -7 10 5 0 11 -7 7 9 -7 12 -9 -11 4 -12 5 -4 -6 -9 -9
5410 -9 -6 -7 -11 -17 -3 -23 -8 -12 -15 -14 -12 -20 8 -13 -7 7 -5 18 7 -3 10 -1 11 8 -2 15 9 -2 7 3 4 8 1 9 11 -23 14 1 -12 -4 -18
5451 -18 -11 0 -21 3 -7 -18 -3 -25 0 12 -16 1 -11 -9 13 -7 -7 12 -6 -2 13 -5 18 7 -2 29 0 0 24 -1 14 3 -13
5484 -13 13 2 -8 3 -13 8 0 -10 4 -8 -25 12 -22 -12 3 -30 -6 -10 -1 9 -10 -3 15 -7 5 -3 -10 14 -3 -2 27 -9 21 10
5518 10 -11 17 4 -4 20 -5 6 10 -19 16 -6 -18 5 -18 -19 6 -19 -4 -6 -27 5 -16 -17 14 -19 -9 5 -17 12 -7 -11 18 -14
5551 -14 1 14 -15 16 -3 -4 19 2 6 16 -8 5 14 -14 3 -5 0 21 -16 -7 9 -18 7 -4 -16 8 -16 -6 5 -11 2 -4 -26 30
5585 30 0 0 30 -7 9 8 -15 18 -7 -8 23 -5 7 11 -11 15 4 -14 20 -6 -9 8 -17 -2 2 -20 1 -13 -13 -1 -25 -9 -10 -32
5619 -32 -6 -16 -24 5 -16 -14 14 -22 11 11 -6 23 -14 -4 18 -14 10 16 -16 25 9 -7 32 -5 2 19 -10 9 7 -18 6 -15 -2
5652 -2 5 -14 1 3 -19 11 -9 -6 14 -15 13 18 -7 10 -3 -12 24 0 2 10 -6 10 3 0 21 1 3 16 -12 8 14 8 18 3 -1 14 -3
5689 -3 3 11 -24 9 2 -8 0 -27 -5 10 -15 -6 -4 -17 8 -5 -2 4 -7 7 15 -1 10 5 1 21 6 7 13 -13 19 19 6 29 -8 2 12 -10
5727 -10 11 2 -8 18 -11 -3 14 -7 -3 9 -1 5 -5 -17 7 -9 -9 7 -6 21 1 -4 9 -1 9 11 1 15 10 1 3 -6 -9 9 -3 -2 5
5764 5 -8 -8 -3 -11 6 -4 1 -8 -11 -5 0 -13 -2 0 -9 10 -12 -3 6 -1 -4 -8 -1 8 -4 12 7 4 14 2 3 24 13 8 0 9 29 17 8 14 3 17 20 5
5808 5 -8 8 -5 0 2 -7 7 -14 -6 2 0 9 -1 -4 6 -9 4 0 -8 3 3 1 8 6 9 16 2 7 8 0 3 9 3 -1 5 4 5 4 9 2 -3 -12 -1 7 -10 -11 -5 -5
5856 -5 -3 -7 -9 -3 1 -6 6 2 2 3 -5 7 14 5 -1 8 5 7 12 17 3 13 9 -6 14 -4 25 -7 -34 45 -10 57 41 57 12 -9 -5 -13 13 -15 -4
5897 -4 -3 1 1 7 -6 5 -14 2 0 -16 3 5 0 20 4 3 7 -1 11 8 4 6 4 0 -3 -4 6 2 5 1 6 7 8 0 0 4 -4 -3 -7 1 1 -5 -5 2 -7 5 5 -11 5
5946 5 5 6 9 -1 9 1 5 19 14 16 13 3 3 18 -5 20 16 -1 10 2 -4 9 7 1 8 1 6 5 -5 0 -5 4 -6 -9 3 8 -5 -12 -4 0 2 -5 4 11 -5 14
5992 14 -3 13 2 -4 3 6 -7 14 -1 -9 13 4 -6 1 -4 16 4 -12 8 -17 4 -3 -9 7 -10 -13 3 -8 -1 9 -12 0 2 -5 8 1 -8 8
6030 8 -6 9 10 -1 23 9 -3 13 2 12 14 -1 17 11 -1 9 -2 0 3 -16 -1 10 -22 3 -10 -5 5 -24 -9 -1 -24 2 5 -18 2
6065 2 -11 -8 3 -13 3 5 1 15 -6 -2 17 -6 8 11 -6 17 5 -6 13 -10 0 5 -8 14 7 -4 8 -6 -7 5 -13 -2 -2 -5 3 -9
6101 -9 -11 8 -18 5 4 -15 10 -3 -5 12 -2 8 13 10 12 13 4 16 6 -11 19 -9 4 6 -16 12 3 6 12 -14 2 -3 -23 2 3 -12 12 -15
6139 -15 2 15 -17 -2 -4 -14 15 -1 -8 8 -24 -5 6 -11 10 -1 -8 7 -2 15 19 -10 18 1 -2 26 -6 5 11 1 10 3 -8 12 3
6174 3 -3 9 -10 0 2 -15 9 -1 1 20 -15 8 8 -14 6 1 -3 18 -1 10 15 -4 14 12 -5 21 7 8 27 -4 8 16 -13 7 5 -6
6210 -6 13 -9 -1 12 0 8 -4 -12 5 -5 -4 13 -10 -3 -5 -11 18 4 -3 8 2 3 16 -5 15 4 6 30 -6 -3 17 -7 12 3 -2 21 -9 20
6248 20 13 -2 8 9 -11 21 -7 0 16 -3 -1 10 -9 5 1 -17 9 -17 -3 17 -2 9 8 -7 12 8 6 21 9 -5 3 -3 16 6 -4
6283 -4 10 4 15 18 -5 16 0 -3 14 -15 -13 11 -8 8 4 -17 5 4 -6 7 -3 -3 20 -7 9 11 -3 16 -3 4 17 2 5 14 -2 25
6319 25 14 13 29 10 15 19 1 7 12 0 17 -1 0 16 -11 2 5 -7 -6 -2 -13 -3 -7 11 7 -11 8 -11 -7 1 -4 -3 8 -4 5 7 -1 26 22 9
6359 9 17 4 12 5 8 15 12 3 8 -17 -1 5 -6 0 4 0 4 -5 -8 -6 -12 -2 -5 -14 -5 -6 3 3 -6 14 11 -2 2 7 3 2 0 10 11 8 14 5 3 17 5 10 9 1 4 9 6
6410 6 11 -6 6 12 1 -5 7 8 7 -9 4 -12 -15 -14 5 -6 2 8 -8 -5 10 6 9 4 -3 4 14 10 6 10 11 -1 8 1 3 1 11 13 5 5 -4 7 -7 -8 6
6455 6 -2 -2 3 2 -2 -8 -6 -15 -1 -7 8 -1 3 3 4 2 9 5 9 2 3 -4 10 19 10 15 17 14 14 15 -1 5 1 -3 8 14 0 5 5 -10 -7 4 12 5 -9 -7 -2 1 -7 -10 -5 -6
6507 -6 -2 -2 2 -11 9 -3 -7 6 -1 6 14 -1 8 5 3 16 8 -4 6 -4 14 0 -4 13 -13 -14 -2 -4 -3 -13 -1 0 -49 -14 14 -42 -26 2 -4
6546 -4 -5 -2 0 0 -1 3 13 14 4 8 -2 17 17 -9 7 6 0 9 3 15 19 -1 7 -6 -1 5 2 0 7 -7 11 -10 -2 1 -3 -12 -12 -12 1 0 -1 -7 -9 4 4 3 13
6593 13 9 -7 17 8 -7 6 5 6 7 7 14 9 5 24 -6 10 9 -7 8 3 -8 5 -6 2 -1 -6 12 7 -3 -1 -9 -7 11 -5 -7 4 -1 1 2 5 13 6 8
6636 8 17 -5 12 8 4 18 21 9 28 4 3 7 -2 1 10 -5 16 -3 -18 4 -3 6 -7 -2 -3 -12 -13 3 -11 -4 2 -16 1 -8 5 7 -2 -2 4 2 19 8
6678 8 3 13 5 11 24 0 14 6 3 26 -2 0 11 -13 4 -2 -14 3 -1 7 13 -13 -3 -5 -9 11 -7 -6 1 -6 -3 -3 -4 9 6 14 18 4 4 18 8 11
6720 11 15 3 19 12 10 22 11 10 14 -13 14 9 5 10 10 8 9 -1 11 -3 -18 11 5 -9 12 -1 5 6 -15 7 -3 -3 6 1 1 9 -3 15 7 6 10
6761 10 5 5 18 0 10 6 -1 13 5 6 5 8 2 11 4 17 4 -3 8 -7 -3 1 -7 14 4 1 1 4 6 4 -2 6 1 3 16 6 6 9 3 20 18 8 14 16 6
6806 6 14 4 -1 14 0 4 -1 -5 4 -8 -4 4 -13 -8 1 2 1 5 3 1 -4 -8 3 -13 12 5 0 7 2 -1 5 1 14 8 -1 18 11 5 18 7 4 7 5 0 1 0 1 -9
6854 -9 -3 6 2 0 4 -12 6 -3 -9 4 -9 0 -1 -10 -2 -3 -5 -1 1 1 3 -9 14 11 5 7 7 14 6 -5 6 12 2 4 -2 4 1 3 8 -4 -1 -2 -7 -2 -4 -10 -8 -2 4 -9
6904 -9 6 -11 -9 0 5 2 -2 10 -8 -3 4 1 -3 10 6 15 2 4 19 1 7 11 18 13 13 10 3 4 18 8 -3 -5 -1 -13 -4 -8 -5 -1 -5 1 -5 -15 3 -3 -11 15
6950 15 0 -10 9 -11 4 17 -6 11 7 12 8 14 8 13 8 2 8 7 19 8 1 8 12 5 7 0 5 -7 -12 -4 -18 -9 -2 -8 -1 1 -5 -9 1 -12 -11 8 7 5 0
6995 0 4 8 0 0 11 7 9 6 18 2 18 16 7 0 6 -5 2 -6 1 2 -6 -3 -3 6 4 -6 1 -3 -22 -12 -5 1 -6 8 4 -12 -3 0 -4 -6 -5 -3 3 11 12 6 8 11 13 0
7045 0 14 5 7 8 -2 -7 1 -1 -8 4 2 4 -1 -6 -1 -5 3 -6 -8 1 0 5 4 15 0 1 0 -4 4 5 8 7 -3 10 14 12 11 15 6 3 9 10 9 9 10 14 19 14 4 13 11 16 7
7098 7 -4 6 11 6 13 -6 5 4 -14 -6 -2 4 0 5 -7 8 8 -7 6 11 4 10 -7 10 13 6 11 7 26 5 5 20 2 9 13 2 12 6 1 2 6 -5 3
7141 3 0 -14 1 -5 -2 -2 -14 0 -7 3 -2 -2 2 3 -3 6 5 4 8 -2 9 16 4 13 0 4 12 0 9 -12 50 12 1 9 1 6 0 14 -5 -5 -5 -11 3 -10
7185 -10 -4 -4 -8 -11 3 -8 0 2 -7 -2 12 8 6 4 10 13 12 15 7 5 9 -9 6 18 0 9 2 9 14 5 -4 12 -1 15 8 -15 4 -4 -8 -2 -9 2 -1 -7 3 -1
7231 -1 -6 11 -8 -5 4 -11 11 1 11 21 0 4 15 9 12 7 2 24 7 -1 17 -3 7 1 7 5 1 3 6 -6 6 -2 -7 3 -11 -1 0 0 -12 19
7271 19 1 -4 8 -14 20 9 -13 -17 13 22 -11 26 33 33 -39 25 8 -22 -82 -56 104 28 -71 -34 37 -6 -8 -21 7 2 -1 9 -9 -6
7305 -6 -3 -17 10 4 0 -4 -7 -7 10 -4 -7 -5 -13 14 9 6 14 10 2 15 -2 10 -4 -7 4 -2 -3 13 -2 -2 5 1 10 -3 -4 -1 6 0 -2 -9 -8 -4 -17 0 -7 -10
7351 -10 -3 -7 -2 -1 -5 3 7 -3 11 2 16 17 6 13 17 8 16 12 5 14 -2 6 5 2 13 0 3 3 2 7 0 4 5 -1 2 -4 4 5 6 -12 -1 -5 -10 12 -9 6 3 -7
7399 -7 10 13 1 15 13 -8 19 4 8 16 3 10 12 9 9 -4 -4 0 -9 1 -6 2 -4 -2 3 2 -12 -3 0 -10 -9 2 2 -6 -6 3 4 0 -2 6 -9 11 4 9 4 0 18
7446 18 20 4 12 14 8 9 -1 1 3 4 5 5 -6 4 -5 1 -6 -11 3 0 -9 -2 -3 -1 -5 -5 2 -1 -6 13 -4 -5 6 -7 5 1 -3 12 7 17 -2 6 3 -2 7 31
7492 31 -12 -16 12 -4 14 5 -6 3 2 1 4 -10 -3 5 -15 -10 1 -10 -5 -4 6 -11 -2 -9 4 2 0 1 -4 9 7 1 0 6 10 12 26 4 5 8 3 5 9 1 1
7537 1 5 1 12 -5 -2 -2 0 -7 -7 0 1 -2 -11 -12 -7 -6 -3 -10 -7 -3 -4 1 1 3 7 -9 8 9 1 2 5 20 3 3 4 10 -2 -8 1 -6 -7 -2 -3 -1 -1 -7 -15 11 4 0 2 -3 -6
7590 -6 -8 -3 -5 -10 -5 -4 6 -2 -9 10 7 7 3 4 0 13 2 11 13 12 4 17 13 2 15 1 -2 -2 6 6 -6 -12 0 -6 1 -9 -9 -11 7 3 -3 1 -10 4 2 -12
7636 -12 13 6 -4 6 -5 0 -4 1 7 -1 4 9 2 -4 1 10 3 6 14 14 -3 4 -4 -4 7 1 -6 2 -1 -6 -2 -9 -4 -9 -10 -3 3 -10 10 5 3 -1 -1 5 -2 4 10 -2 7 7 3
7687 3 7 4 -1 11 6 12 3 2 -2 10 9 8 -6 1 1 -3 2 -7 -23 -2 -13 -9 -9 -11 -6 -8 -1 -3 -10 -2 2 -9 2 6 5 3 -1 -1 6 6 5 14 -8 1 13 1 7 -2 0 13
7737 13 -1 4 -6 4 -4 -3 -9 -8 -3 -5 -7 -9 -3 -2 2 -8 -15 -5 -5 -18 1 -1 -1 8 0 7 0 3 8 12 15 11 6 11 15 -2 8 -2 -8 11 -3 -10 6 -9 -1 -1
7783 -1 -10 -9 4 2 -10 -10 -8 0 -12 -2 -2 2 4 -9 -1 7 -3 -4 5 -2 2 -1 0 11 1 9 4 4 2 0 1 12 1 3 7 2 -6 -10 0 3 -7 -8 5 -7 -5 7
7829 7 -1 -5 7 -8 -11 7 -1 11 -8 15 7 2 17 17 12 14 -4 6 11 2 0 5 3 8 10 8 12 -5 14 1 6 10 3 -2 5 -15 -5 8 -3 9 -11 -12 7
7872 7 7 -13 0 -12 -5 -2 -8 6 0 10 14 6 6 11 1 6 11 6 8 -3 -1 -1 -5 5 2 -3 17 9 6 11 7 0 -1 -10 6 -3 7 8 4 4 -3 -9 -9 -5 1 1 -8 9 11
7921 11 -7 12 6 8 16 0 10 19 4 6 10 -1 -2 10 -1 8 1 3 1 -8 4 -8 -8 1 -9 -2 0 -4 1 7 -5 9 4 3 -4 0 7 1 -4 12 2 0 10 -1
7965 -1 13 9 5 12 14 -1 26 15 7 4 13 10 -1 4 5 0 0 -3 -6 -6 -9 -1 0 -9 -6 -2 -8 -2 5 -17 -12 1 -2 8 -2 0 0 1 16 11 -6 18 0 12 17 18 9
8012 9 5 10 7 11 8 8 3 -4 0 -7 -1 1 -1 -10 -6 -6 -4 -10 -13 -12 -22 3 -5 -2 -3 1 -1 -6 6 3 -1 9 10 7 3 16 -2 3 2 9 9 7 13 4 10 10 3 8 10 2 0 11 2 -1
8066 -1 -2 3 3 -12 -4 -5 1 0 -9 -5 -4 -2 0 1 3 7 11 7 1 18 10 4 22 0 1 4 7 -1 3 -1 8 3 -2 -3 9 0 -5 0 1 0 2 1 2 -6 -15 -8 -10 -3 -1 -3 -4 0 -2 -5 1 -4
8122 -4 10 0 -10 8 10 6 19 5 10 2 9 17 6 9 7 6 20 13 7 2 6 2 -11 0 4 -5 -8 1 -7 0 3 -6 4 2 -2 3 -4 4 -3 -2 -5 0 -3 5 0 4 1 -2 16
8171 16 -1 15 13 1 11 0 16 12 3 6 3 -10 5 -1 -1 3 -10 -1 -8 -10
8191a0
$$ Imaginary data points
##PAGE= N=2
##DATA TABLE= (X++(I..I)), XYDATA
0 0 0 0 0 0 0 0 0 0 0 0 0 0 0 0 0 0 0 0 0 0 0 0 0 0 0 0 0 0 0 0 -8 8 -8 8 -8 8 -8 8 -8 15 -16 16 -16 16 -24 24 -24 27
48 27 -32 32 -40 40 -47 48 -56 61 -67 73 -83 93 -105 119 -137 159 -187 227 -286 381 -572 1971 -4646
71 -4646 493 5034 -2410 1559 -595 721 2954 -3776 404 3054 -4638 -196 1484 -1628 42
86 42 -1710 -24 1230 -3474 168 1466 -1931 567 385 43 595 -2242 1315 1970 -2773 651 2224
103 2224 -994 -316 -121 437 -28 -1185 1480 526 -1439 882 503 -428 -498 -57 1690 -690 -750 1990
121 1990 -1002 -955 1000 -713 342 -414 -880 1847 -1020 -1816 1158 -231 -398 -173 -183 1267 -954
138 -954 -701 1425 -988 -378 872 -182 435 -947 -298 1187 -2017 -529 1341 -1589 -238 256 -1110
155 -1110 159 -1323 -493 1312 -1598 -270 1264 -1016 -13 -132 -381 891 -883 295 1168 -1480
171 -1480 302 707 -1142 302 -141 171 691 -1397 530 743 -1733 479 654 -623 367 -350 379
188 379 296 -1437 548 649 -841 330 88 140 44 -986 735 393 -945 875 596 -220 266 -124 806
207 806 296 -590 1389 715 -525 745 320 61 132 -219 933 165 -660 690 -120 -543 106 -424 340
226 340 108 -662 559 -127 -691 304 -245 58 222 -314 598 -94 -662 518 -108 -286 337 49 315 -247
246 -247 -277 549 -539 -276 723 -208 -16 186 -202 113 -515 -159 552 -537 -89 428 -525 -238 -199 -313
266 -313 120 -358 -6 337 -424 -78 17 -203 245 -107 205 664 -231 90 494 -131 156 229 267 517 -176
287 -176 128 475 -432 -85 436 -67 -16 142 93 -104 -308 92 38 -178 174 96 -23 -29 -167 78 -35 -107 288
310 288 69 -1 149 -180 26 123 -189 235 288 -106 46 105 -53 -141 -19 247 -25 -145 159 -83 -328 -183
332 -183 -70 -71 -255 -116 98 -348 -372 14 -233 -251 56 -15 -42 -46 -146 -14 1 -133 115 245 -12 -8 102 -33
356 -33 -64 19 61 174 29 -61 126 -64 -235 16 91 -69 -54 121 -15 -291 -96 5 -147 -43 8 51 -23 -314
380 -314 -32 72 -360 -4 231 -210 -60 -19 -184 -54 -209 -81 159 -188 -100 33 -254 -198 -172 -129 -33 -225
402 -225 -37 -64 -357 -126 -226 -175 40 -261 108 193 -408 68 181 -200 213 193 200 340 -30 266 317 -30 360
425 360 362 203 376 219 251 149 65 425 123 117 468 46 105 204 -180 256 133 -166 325 73 -100 109 -228
448 -228 65 139 -259 219 178 -167 95 -74 25 86 -89 319 66 -71 370 -150 -57 276 -127 227 107 -142
470 -142 387 -168 -241 336 -201 -34 165 -193 172 -141 -316 168 -215 -110 59 -232 165 -122 -354 147 -255
491 -255 -89 161 -344 78 49 -353 60 -242 -138 285 -382 -68 232 -375 -59 -74 -206 164 -258 -45 189
512 189 -367 10 -67 -353 226 -141 -216 163 -233 79 -58 -439 322 -14 -248 257 -264 9 183 -421 126
533 126 65 -191 226 -242 -34 177 -462 139 107 -358 171 -152 -102 149 -467 1 146 -305 209 -156 -240 327
555 327 -241 -92 150 -255 312 80 -298 291 -66 -19 235 -233 308 202 -321 402 32 -230 271 -111 213
576 213 226 -389 317 133 -238 229 -219 69 397 -275 128 54 -177 410 -181 -105 389 -121 267 122 -271
597 -271 443 -4 -52 518 -165 176 411 -198 342 70 -147 488 -1 73 240 -316 297 151 -371 222 -77
618 -77 -32 237 -455 -25 75 -371 170 -270 -307 316 -444 -165 181 -587 28 76 -333 145 -323 -122 284 -448
640 -448 15 88 -326 350 -80 -263 235 -224 175 109 -390 396 40 -178 373 -331 25 407 -365 210 155
661 155 -295 337 -94 -98 243 -294 211 211 -337 255 -17 -166 295 -192 16 135 -182 329 -153 -307 439 -197
683 -197 -125 273 -342 162 99 -374 253 -165 -210 328 -284 -18 101 -350 255 -97 -344 249 -187 -59 87
704 87 -344 172 -103 -279 351 -298 -149 335 -335 66 44 -317 321 -112 -220 307 -237 15 171 -280 202
725 202 6 -173 292 -157 -33 186 -186 210 8 -177 333 -128 -36 277 -283 172 174 -281 285 -20 -181
746 -181 311 -192 19 203 -259 214 48 -241 234 -111 -40 168 -272 136 47 -260 209 -147 -111 204 -285
767 -285 106 92 -351 229 -43 -277 210 -188 -49 139 -279 111 8 -259 182 -103 -116 148 -178 45 30
788 30 -202 161 -72 -93 188 -158 54 119 -197 186 13 -127 246 -70 -11 202 -94 131 90 -69 247 -17
810 -17 -9 249 -55 85 136 -31 182 10 11 222 -103 64 172 -95 117 38 -41 178 -75 19 156 -117 62
833 62 50 -82 96 -76 -45 101 -131 -7 49 -100 27 -64 -45 66 -155 -31 48 -164 -17 -25 -103 2 -113 -51
857 -51 16 -162 -28 -11 -144 -1 -46 -69 -15 -99 -24 -25 -110 14 -32 -79 -2 -38 -18 -14 -57 16 4 -32 10 3 6 -27 -12 32
887 32 -7 -22 23 7 -4 -23 11 8 -28 10 -3 -64 -49 26 -12 -27 -9 45 -5 -26 16 -4 -16 -27 -40 50 -12 -52 37 -38 -12
918 -12 10 -76 34 5 -83 41 -64 -99 10 -87 -41 -4 -69 38 -98 -57 77 -144 -30 38 -71 61 -80 -66 138
943 138 -127 -54 107 -88 78 31 -94 138 -6 -22 116 -52 112 103 -56 137 55 1 135 -36 132 158 -80
966 -80 161 76 -8 182 -57 87 221 -113 123 105 -105 176 -33 -34 201 -99 48 58 -163 148 -73 -142 162
989 162 -130 -35 -6 -233 138 -123 -239 165 -170 -90 45 -303 85 -24 -308 145 -84 -133 122 -253 31 90
1011 90 -233 140 -22 -111 206 -160 -32 157 -150 149 -25 -133 303 -145 -114 221 -167 85 49 -198 292
1032 292 -89 -201 234 -166 15 125 -231 191 -8 -198 210 -169 -13 199 -226 146 61 -166 232 -156
1052 -156 -8 278 -247 134 168 -210 201 -96 -92 293 -253 5 215 -241 116 -71 -211 243 -171 -103 139
1073 139 -258 88 -33 -302 184 -155 -108 188 -288 70 81 -332 200 -40 -166 256 -200 54 215 -325 167
1094 167 86 -164 267 -158 -16 296 -260 83 107 -177 294 -104 -96 264 -242 81 135 -295 261 -8 -158 282
1116 282 -216 -25 195 -247 216 20 -221 314 -92 -79 198 -219 163 141 -217 225 -73 -80 279 -254 16
1137 16 189 -204 208 -66 -210 252 -224 -64 208 -300 91 30 -237 182 -255 -137 273 -279 12 89 -272
1158 -272 203 -104 -196 210 -220 85 181 -340 161 36 -183 233 -192 -14 257 -228 118 47 -242 253 -53
1179 -53 -84 212 -219 104 136 -283 171 -25 -97 283 -173 -6 168 -205 195 8 -195 294 -62 -19 193 -229
1201 -229 136 131 -182 225 -60 -77 254 -200 25 99 -214 227 -27 -197 212 -183 -32 135 -306 101 26 -198
1223 -198 190 -205 -122 172 -239 38 46 -244 194 -94 -162 146 -214 40 120 -218 154 -22 -159 197 -185 -48
1245 -48 187 -189 107 36 -212 178 -89 -72 181 -198 89 139 -198 142 -46 -101 222 -123 53 134 -168 166
1267 166 12 -141 213 -74 28 200 -181 112 91 -163 193 -49 -56 202 -131 41 68 -191 147 -18 -120
1288 -120 164 -129 -1 84 -202 96 -11 -133 174 -118 -46 131 -189 45 40 -174 150 -46 -89 138 -161 6
1310 6 76 -175 101 2 -113 128 -130 -48 66 -153 84 17 -121 126 -94 -65 106 -155 58 75 -123 137 -27
1333 -27 -94 155 -92 26 141 -98 117 33 -77 158 -51 1 146 -60 89 63 -76 121 -50 -34 136 -98
1355 -98 45 69 -133 62 -36 -101 89 -106 -16 78 -143 0 -24 -120 57 -78 -43 76 -110 -3 3 -99 61 -36
1379 -36 -42 80 -100 -4 20 -128 59 -3 -86 73 -60 -36 32 -137 17 20 -95 45 -11 -56 40 -92 -4 42 -50 61
1405 61 25 -24 78 -36 8 83 -25 94 58 -17 121 24 -11 91 2 71 68 -20 85 13 -54 38 -9 -4 21 -9 19 4
1433 4 -84 -9 -28 -13 39 -51 34 6 -91 14 -38 -48 32 -9 -11 59 3 12 -26 -54 -18 -24 -63 -7 -12 33 -59 -121 27 -21 24 -63
1465 -63 -24 -19 -15 -73 18 -20 -66 -10 1 -50 28 -113 -22 -25 -18 12 21 -74 -11 -87 24 106 105 -10 27 25 8 47 2 54 39 10
1497 10 30 8 11 47 -37 20 54 -32 48 -28 -18 55 -69 -79 26 -18 23 9 -103 49 -3 -52 41 -38 -3 23 -56 54
1525 54 -76 -102 13 -44 36 45 -114 2 21 -43 26 -50 32 76 -103 -32 18 -42 4 -48 -57 94 -54 -6 30 -76 73
1552 73 -48 -25 103 11 -41 55 -67 34 34 -95 134 -5 37 85 -77 69 86 -68 138 15 -4 81 -68 -10
1576 -10 107 -115 42 85 -60 75 -59 -4 88 -59 24 73 -98 60 -35 -75 72 -75 -26 75 -138 59 -3
1599 -3 -162 77 -36 -71 73 -102 37 -2 -146 106 -64 -67 74 -134 -17 82 -155 73 -31 -100 122 -69 -48
1622 -48 106 -114 51 14 -130 121 -45 -50 135 -90 21 74 -105 130 -18 -72 164 -65 8 90 -143 119 48
1645 48 -107 155 -52 -16 138 -140 48 67 -105 151 -39 -78 153 -99 8 98 -133 114 12 -86 139 -134
1667 -134 -26 135 -158 60 25 -140 138 -85 -109 108 -162 38 75 -191 77 -46 -112 100 -168 -20 96
1688 96 -162 72 -19 -158 125 -86 -33 108 -163 95 66 -173 121 -52 -55 162 -121 26 93 -152 136 -8
1710 -8 -120 164 -67 5 112 -161 83 53 -131 147 -76 -42 161 -143 33 50 -145 159 -22 -99 152 -104
1732 -104 35 110 -173 99 45 -95 167 -101 -32 137 -134 71 15 -152 161 -46 -92 102 -167 33 46 -178
1754 -178 94 -67 -113 131 -161 -68 78 -145 74 -29 -157 114 -89 -62 110 -170 74 84 -104 128 -69
1775 -69 -38 177 -92 38 102 -116 133 25 -81 140 -41 42 158 -140 96 40 -148 154 -76 -36 146 -140
1797 -140 40 50 -151 120 6 -85 86 -64 -22 63 -142 66 7 -127 171 -88 -55 107 10 9 -60 -115 95 -55
1821 -55 -34 86 -110 43 52 -125 106 -29 -82 99 -134 -19 32 -157 55 -18 -112 88 -82 -39 75 -128 22
1844 22 28 -105 105 -60 -62 106 -89 31 60 -95 108 -2 -59 118 -73 0 73 -102 65 11 -79 94 -57 -34
1868 -34 72 -103 39 31 -102 68 -51 -52 72 -100 13 48 -83 53 -18 -52 87 -70 4 80 -75 49 1 -54
1892 -54 81 -38 -4 80 -65 36 5 -81 69 -32 -41 50 -63 6 4 -90 45 -32 -73 31 -74 -21 6 -122 2
1917 2 -13 -79 24 -58 -24 39 -85 7 5 -69 44 -31 -22 60 -40 26 16 -37 68 3 1 94 -6 22 47 -20 72 21 -13
1946 -13 85 8 3 42 -16 47 25 -34 47 -5 -3 11 -40 27 27 -52 -5 -27 6 54 -55 -3 4 -52 -2 -13 -10 9 -66 -21 19 -29
1978 -29 2 -16 -21 29 -29 -26 3 -25 9 -7 -30 25 -24 -26 8 -19 17 -25 -34 30 -18 -21 -8 -25 22 -16 -32 22 -7 3 -4 -9 36 14
2012 14 -4 30 9 15 11 -20 50 33 -12 30 1 44 29 -31 25 30 6 23 -17 27 41 -41 8 7 -5 22 -44 -7 22 -46 0 -12
2044 -12 -14 30 -40 -33 31 -44 -7 -7 -49 40 -30 -44 27 -40 -7 -1 -50 23 -21 -50 23 -50 -25 7 -70 30 -9 -58 33 -52 -24 25
2076 25 -72 12 10 -55 32 -21 -3 44 -62 23 46 -33 53 -6 -6 92 -26 26 69 -22 78 21 -14 103 -2 7 65 -27 69
2105 69 24 -55 77 -21 -24 63 -52 32 23 -84 48 -28 -69 45 -85 -22 27 -105 19 -24 -77 53 -76 -29 39 -105
2131 -105 24 -6 -77 58 -43 -38 80 -74 26 41 -76 71 -12 -37 80 -72 10 50 -91 68 13 -59 90 -37
2155 -37 -6 64 -82 42 24 -76 79 -34 -25 84 -85 27 48 -82 81 -18 -44 101 -59 11 65 -91 70 15
2179 15 -53 109 -57 -9 94 -81 48 35 -83 105 -27 -55 95 -89 28 48 -104 71 -19 -64 96 -95 -11
2202 -11 60 -109 52 -10 -87 79 -61 -38 79 -123 28 27 -103 71 -54 -57 101 -108 4 56 -99 76 -9 -84
2226 -84 85 -75 -4 67 -121 60 25 -85 117 -63 -58 103 -89 29 37 -95 120 -22 -69 105 -84 53 80
2249 80 -97 69 44 -13 125 -106 -8 147 -89 73 41 -90 126 -7 -26 90 -88 42 52 -122 71 -30
2271 -30 -73 97 -102 -33 45 -129 45 -24 -126 76 -82 -51 56 -144 17 13 -124 70 -61 -72 87 -99 -8
2294 -8 49 -121 89 -18 -80 105 -52 19 105 -100 76 44 -66 120 -60 -15 120 -86 43 38 -102 108 -13
2317 -13 -51 93 -86 22 87 -102 70 6 -60 114 -68 -25 85 -84 60 33 -84 98 -20 -30 90 -95 46
2340 46 71 -97 83 -9 -38 99 -71 1 66 -100 70 6 -101 81 -57 -35 67 -115 13 15 -107 69 -63
2363 -63 -67 67 -95 -5 32 -107 55 -19 -94 76 -70 -13 74 -90 55 24 -82 88 -21 -31 89 -65 40 55
2387 55 -90 89 5 -27 96 -56 6 77 -73 56 10 -53 93 -50 -8 79 -79 41 15 -71 83 -21 -41 88
2411 88 -60 6 27 -78 56 -10 -67 69 -38 -10 45 -81 44 24 -77 52 -36 -19 56 -70 0 33 -68 37
2435 37 -23 -42 57 -68 -2 44 -76 19 -2 -45 60 -39 -21 53 -46 31 21 -55 64 6 -23 56 -14 20 46 -49 69 33
2463 33 -22 56 -10 14 46 -61 32 31 -44 47 -15 0 59 -45 13 41 -29 42 -6 -24 50 -34 -16 28 -28 33 2 -44 49 -15
2493 -15 -22 17 -37 22 12 -52 26 3 -32 27 -32 12 8 -49 19 -2 -22 19 -29 -14 12 -41 -17 6 -45 2 -46 -35 19 -40 -31 -1
2525 -1 -27 4 -24 -42 23 -17 -25 6 -15 16 6 -14 24 21 -5 19 -3 23 28 -10 17 13 5 26 11 -2 34 -4 -2 10 9 18 -6 -9 21
2560 21 -2 -16 10 -20 -1 3 -12 12 -5 -29 5 -12 -8 13 -21 2 2 -14 -5 -6 -1 9 -14 -11 7 -17 -15 -4 -19 5 -16 -15 1 -15 -17
2595 -17 2 -21 12 -7 -27 13 -6 -11 12 -25 1 23 -22 9 3 -14 33 -7 0 35 -10 10 18 0 27 5 -6 44 -12 19 31 -10
2627 -10 37 11 -14 38 -15 -1 21 -27 24 12 -34 27 -12 -20 39 -35 -7 18 -52 19 -9 -37 25 -42 -9 14 -44 8 1 -38 29
2658 29 -31 -27 33 -49 3 9 -54 34 -7 -35 46 -40 -4 17 -56 26 1 -41 34 -32 -23 37 -51 23 21 -41 54 -12 -17 52 -39 24 35
2691 35 -56 54 1 -25 66 -24 17 76 -38 42 24 -26 78 -23 -1 66 -31 38 34 -39 49 -19 -41 57 -52 -14 29 -70
2719 -70 32 -8 -65 45 -41 -24 34 -85 25 14 -68 54 -47 -24 63 -75 9 21 -61 62 -17 -40 74 -37 2
2744 2 40 -59 57 22 -52 66 -43 -16 55 -70 37 18 -72 58 -22 -34 61 -65 14 36 -78 55 -13 -45 71 -55
2770 -55 -5 50 -69 40 10 -55 80 -19 -11 66 -53 46 49 -52 84 -9 -22 94 -56 15 55 -58 68 -9 -66 64
2796 64 -60 -10 44 -68 31 3 -72 59 -60 -31 58 -80 9 10 -90 55 -21 -58 56 -80 12 37 -97 47 -2
2821 -2 -49 64 -46 -9 63 -73 47 19 -66 85 -22 -26 50 -42 33 49 -76 71 -17 -15 57 -58 8 80 -78 67
2847 67 30 -82 45 -23 24 15 -57 -12 56 -73 73 -46 -31 84 -52 45 64 -70 77 3 -47 72 -51 11 53
2872 53 -88 38 5 -40 63 -61 -32 57 -91 15 -1 -87 40 -38 -50 46 -86 3 28 -92 38 -25 -47 67 -60
2897 -60 -9 44 -79 48 -1 -62 57 -36 -3 48 -80 33 37 -63 50 -27 -19 81 -70 7 33 -56 55 -12 -45 73
2923 73 -47 -7 50 -66 48 2 -45 72 -25 -20 62 -46 30 29 -51 62 -1 -32 66 -53 14 40 -71 41 0 -45 60
2950 60 -42 -5 44 -78 21 -1 -49 45 -52 -21 43 -83 -14 17 -65 38 -38 -50 54 -49 -5 21 -63 43 -19 -56 53
2977 53 -43 -1 46 -35 45 20 -45 64 -2 3 61 -37 37 37 -51 46 2 -17 46 -41 8 40 -45 29 15 -34 48 -34 -14 42 -44
3008 -44 19 21 -34 57 -28 -33 37 -35 0 10 -50 38 -8 -40 27 -43 -2 16 -53 15 -10 -57 24 -28 -18 15 -57 -3 -10 -50 -3 -34
3040 -34 -31 18 -53 -7 11 -42 11 -13 -37 23 -27 -12 7 -26 13 4 -17 39 -3 -3 26 -17 24 10 -19 30 3 -3 31 -8 9 14 -19
3073 -19 19 17 -11 22 -18 3 12 -30 6 10 -19 4 -4 -11 3 -25 -5 -2 -13 6 -16 -7 7 -4 -1 6 -2 14 -2 3 7 0 8 -7 -11 7 -2 -20
3111 -20 -7 -16 -16 -13 -21 -14 -17 -13 -3 -20 -19 -19 -26 -14 -26 -16 -15 -11 -4 -16 -5 -3 -7 6 3 -12 1 4 4 12 4 6 14 10 26 13 5 24 10 12 11 -8 15
3154 15 -5 -7 13 -6 0 -4 -25 9 -10 -20 0 -20 -14 1 -32 -2 -13 -33 -1 -24 -8 11 -30 -7 1 -31 12 -12 -20 19 -14 10 2 -41
3188 -41 13 -6 -18 10 -26 -8 11 -44 8 -5 -31 16 -22 -24 7 -33 2 2 -44 14 -18 -26 25 -33 2 17 -46 26 13 -2 36 -6
3220 -6 -4 38 -37 30 17 -31 38 5 -1 43 -11 19 28 -26 40 -3 -18 43 -36 -4 23 -48 10 -5 -57 22 -41 -31 12 -61 -8 -13 -47
3253 -47 28 -27 -34 22 -55 9 24 -49 29 -2 -40 42 -26 -11 45 -36 17 3 -42 40 -28 -30 28 -52 8 15 -54 28 -18 -38 38 -59
3285 -59 -2 23 -63 28 -13 -39 45 -31 -8 29 -39 25 17 -41 46 -14 -16 71 -26 17 44 -40 49 5 -26 52 -38 -2 33 -60 27
3316 27 1 -51 53 -45 -28 40 -42 7 -2 -72 31 -27 -32 37 -64 -1 29 -56 17 -7 -44 44 -29 -21 38 -57 22 17 -42 53 -15
3347 -15 -15 51 -56 12 26 -50 47 -21 -40 55 -39 -14 22 -48 33 -7 -56 56 -31 -15 32 -60 23 21 -48 49 -17 -20 69 -39
3377 -39 15 30 -47 54 20 -29 55 -31 18 58 -36 28 39 -35 51 -38 -23 56 -54 2 9 -56 32 -20 -55 30 -61 -10 21 -67
3407 -67 22 -20 -65 32 -44 -31 22 -64 25 8 -74 38 -22 -18 39 -64 0 41 -46 33 -13 -31 58 -32 -11 35 -48 33 -2 -46
3437 -46 43 -36 -16 44 -41 13 12 -48 42 -18 -36 33 -27 4 25 -53 33 2 -27 47 -25 3 49 -38 29 25 -28 48 -18 -9 67 -36
3469 -36 17 30 -44 42 -11 -25 44 -38 -6 37 -40 22 -17 -51 37 -44 -29 12 -55 3 -6 -60 28 -17 -38 20 -55 1 12 -43 21
3500 21 -2 -22 34 -24 3 41 -31 30 22 -33 37 -13 2 47 -33 5 19 -19 23 -21 -26 27 -37 0 17 -31 19 -2 -38 28 -31
3531 -31 -13 18 -43 18 -3 -40 24 -9 -18 25 -31 15 21 -30 18 -4 -13 33 -27 12 22 -28 16 -4 -32 27 -31 -31 9 -39 0 -12
3563 -12 -38 23 -40 -27 1 -41 -18 -8 -44 -4 -10 -36 14 -23 -3 -6 -43 7 -7 -29 21 -17 -2 31 -20 16 28 -14 29 -5 0 25
3595 25 -11 6 18 -1 22 -2 -4 20 -20 -4 15 -18 -4 -1 -21 9 -9 -12 8 -9 2 15 -12 16 13 0 8 -14 5 13 1 10 -1 -3
3629 -3 8 -8 7 7 -12 -7 -4 -19 -9 -9 -15 0 -18 -7 -6 -10 -10 -20 -13 -2 -19 -15 -12 -19 -8 -15 -22 -3 -2 1 -4 -4 11 10 8 2 13 11 1 6 12 12 20 14
3673 14 21 8 8 14 4 4 3 -3 1 4 -8 7 -18 -4 -3 -4 -7 5 -12 4 -6 -14 4 -5 -11 2 -10 1 6 -11 9 1 -11 10 -10 -9 4 -5 4 -6
3713 -6 -15 11 -17 -5 8 -31 2 -11 -18 9 -21 -11 18 -13 -16 -3 -33 7 -7 -27 18 -19 2 13 -5 8 2 -5 31 3 7 37 -12 19
3747 19 17 -10 33 1 1 33 0 17 19 -7 32 9 -18 28 -12 -13 11 -30 10 9 -27 19 -26 -16 11 -34 6 7 -27 14 -14 -28 13
3780 13 -30 -3 14 -28 11 -1 -29 32 -13 -18 14 -37 14 -3 -35 20 -18 -21 23 -28 -5 12 -30 10 -17 -30 20 -28 -11 13 -33
3811 -33 9 12 -36 23 -21 -9 31 -27 20 26 -22 38 2 -15 39 -23 -2 21 6 0 -26 14 68 -14 -2 47 -35 15 2 -24 34 -20
3843 -20 -27 16 -50 3 8 -59 29 -22 -31 22 -50 -14 12 -51 16 -6 -35 32 -38 -17 33 -34 18 24 -45 45 -11 -12 50 -36 11 34 -40
3876 -40 45 -14 -30 40 -32 -1 26 -43 25 -14 -51 48 -34 -6 36 -52 22 5 -48 46 -5 -28 42 -35 18 33 -40 36 2 -10
3906 -10 49 -24 7 58 -33 34 4 -31 53 -14 -16 32 -45 12 11 -45 27 -27 -37 41 -45 -8 19 -62 34 -14 -56 24 -33 -17 20
3937 20 -63 9 5 -51 30 -32 -15 45 -45 11 14 -46 36 -7 -20 48 -38 10 31 -45 33 -1 -39 56 -20 -19 28 -38 14 3 -50 35
3969 35 -11 -30 34 -40 13 36 -54 33 -4 -28 45 -32 13 40 -38 33 10 -42 45 -9 4 50 -35 26 37 -33 39 -21 -27 51 -43
4000 -43 2 18 -46 41 -14 -46 31 -38 -15 13 -50 10 -1 -41 28 -28 -24 39 -37 11 16 -41 38 8 -9 46 -21 9 35 -30 31
4031 31 8 -21 39 -23 -6 46 -24 24 14 -34 28 -10 -19 37 -34 -9 11 -38 29 -7 -25 17 -26 -6 12 -35 20 6 -34 37 -15
4062 -15 -11 40 -27 22 34 -21 43 -4 -3 43 -24 16 22 -33 17 7 -21 28 -20 -12 18 -33 2 -2 -31 15 -20 -28 11 -40 -1 -9 -40 9
4096 9 -19 -18 24 -34 -1 20 -34 10 11 -18 27 -20 -7 22 -20 12 5 -20 34 -2 -4 32 -12 16 10 -24 8 -3 -19 19 -18 -9 12 -23
4130 -23 8 -8 -27 2 -14 -11 10 -16 5 -3 -29 16 -3 -18 27 -18 -4 10 -11 3 -1 2 24 1 5 11 -15 4 0 -26 6 -11 -12 -1
4164 -1 -28 -13 -11 -17 -3 -13 -23 4 -18 -9 1 -15 -8 0 -6 4 -5 -8 2 -11 2 10 -9 16 -5 1 16 2 18 7 -6 9 8 3 11 10 8 9 -8
4203 -8 8 -1 -13 4 -11 -9 -2 -12 -5 0 -10 -2 -5 1 0 2 0 -2 -6 0 -2 7 4 4 7 2 7 10 6 0 4 3 5 -3 1 0 -11 9 0 -12 -5 -19 -8 -12 -2 -20 -22 -18
4251 -18 -16 -30 -21 -13 -13 -10 -13 -7 1 -6 -3 3 1 11 1 -3 16 2 10 12 0 18 14 1 12 3 2 11 -2 16 7 -5 9 6 4 6 -4 -3 4 -25 1 -8 -15 6
4295 6 -22 -2 -3 -17 4 -7 -15 19 -7 -4 8 -7 9 1 -4 11 6 -12 22 -13 -12 11 -33 14 -10 -15 12 -2 -1 8 -21 7 0 -22 6 -5
4331 -5 -24 -4 -31 -10 4 -38 2 -13 -24 16 -6 -5 29 -11 3 6 -2 30 -2 -20 28 -3 19 2 -14 34 7 -8 22 -10 15 9 -21
4364 -21 12 -4 -17 12 -29 -8 9 -36 -4 -11 -21 5 -24 -13 12 -33 -4 10 -30 10 -6 -4 25 -12 -2 15 -22 21 8 -14 24
4395 24 -10 1 23 -30 14 3 -34 15 -19 -18 12 -31 9 6 -31 18 -20 -12 22 -36 2 5 -29 19 9 -6 25 -13 1 28 -24 19
4427 19 16 -2 41 8 7 36 -6 23 28 -12 40 4 -18 28 -11 5 22 -25 28 3 -28 22 -16 -15 16 -30 -11 -5 -30 11 -11 -27 22
4460 22 -33 -4 8 -40 10 -5 -30 29 -16 6 26 -18 18 8 -30 44 -1 -1 30 -13 21 10 -19 30 -6 -20 22 -16 5 16 -31
4491 -31 7 -5 -33 18 -25 -14 26 -31 12 13 -24 23 0 5 36 -25 6 32 -21 36 8 -7 40 -17 1 36 -11 38 10 -18 38
4522 38 -15 -8 16 -20 2 5 -32 16 -10 -24 9 -28 -2 18 -41 12 -8 -32 23 -28 12 20 -30 9 0 -28 28 -6 -11 32 -17 19 14
4555 14 -35 37 -8 -6 38 -20 3 18 -23 24 11 -22 31 -23 -7 13 -28 10 0 -33 13 -8 -8 19 -24 4 11 -16 25 -8 -20 28
4587 28 -7 26 38 -20 20 1 1 32 -2 19 30 -11 6 10 -17 22 -8 -15 13 -35 1 9 -36 18 -19 -27 20 -31 -11 6 -28 15 -14
4620 -14 -20 23 -10 -11 22 -21 9 8 -22 26 -8 2 21 -10 4 26 -11 24 4 -16 18 -16 4 20 -20 16 5 -20 6 -8 -10 9
4652 9 -26 10 -8 -24 10 -9 -20 11 -23 7 7 2 16 16 -24 38 -5 21 24 6 18 -13 -2 80 6 21 32 -7 19 -15 28 21 -30
4685 -30 -16 62 -66 -24 -13 -29 -19 3 -26 4 -20 -12 0 -26 -15 9 -19 11 -10 -3 1 -15 4 3 -12 10 0 -6 10 2 2 6 3 14
4719 14 11 -6 3 -6 -9 3 -3 12 0 -13 -3 0 -14 10 -9 -12 -5 -19 0 -17 -3 -4 -11 -24 -7 17 -41 2 9 21 17 -17 -58 25 31 31 15
4756 15 16 7 -5 2 -3 5 6 -2 -7 -3 -5 -4 -7 -12 -13 0 -5 -10 -6 -10 -23 -10 -4 -7 -5 -16 -1 -10 -12 3 0 8 3 11 2 3 3 4 0 20 2 10 11 6 10 14 -10 8 13
4805 13 -4 13 -1 1 2 -13 -16 -8 -18 -4 0 -13 5 -10 -4 4 -11 1 -2 -16 -1 4 -4 19 0 -3 9 2 10 4 -3 17 4 19 9 -15 11 9
4843 9 -5 1 -23 -9 8 -22 -12 -7 -27 -3 -17 -16 -2 -26 -13 -12 -14 -7 -8 -15 12 -12 -5 6 -12 18 12 -11 29 5 3 18 -7 15 15 -4 22
4880 22 7 -4 30 -3 10 14 -28 15 0 -10 5 -16 -7 9 -21 1 3 -29 5 -22 -21 15 -20 -2 4 -30 19 3 -10 24 -2 3 14
4913 14 -20 19 5 -21 16 0 -12 17 -13 9 21 -22 11 -15 -10 10 -31 -13 6 -34 10 4 -16 6 -31 -6 8 -24 5 -1 -31 23
4945 23 -10 0 14 -18 8 17 -12 30 -1 -1 33 -5 11 24 -17 29 7 -14 20 1 -14 21 -17 4 -3 -14 15 -11 -17 24 -27 0
4977 0 4 -30 22 -21 -13 9 -25 -2 19 -25 12 -3 -13 25 -16 -7 28 -22 8 12 -30 22 -5 -4 24 -31 -8 15 -20 26 -2 -24 15
5010 15 -25 -10 3 -33 16 3 -26 16 -20 -15 19 -21 2 7 -11 20 -12 4 31 -15 8 21 -11 29 3 -12 26 8 2 33 -10 20
5042 20 6 -10 25 -9 -12 18 -12 2 6 -28 8 -11 -29 3 -33 -9 13 -31 -1 -1 -25 17 -16 -17 13 -23 6 4 -22 30 -3 -5 29
5075 29 -9 0 17 -22 20 -2 -21 23 -19 29 12 -24 14 5 -28 22 -9 -21 17 -27 -6 5 -30 14 -21 -18 12 -20 -10 9 -24 11
5107 11 8 -5 32 -2 -5 35 -12 23 10 -4 40 11 -4 24 -6 5 11 -11 23 -4 -11 12 -30 -12 10 -35 -5 -18 -32 13 -28 -24 -3
5140 -3 -32 -9 -4 -29 4 -13 -22 20 -19 -8 1 -13 18 8 -10 20 -12 0 12 -23 8 3 -11 21 1 -4 18 -13 5 -4 -19 6 -17 -21
5174 -21 8 -24 -7 0 -23 8 7 -16 24 -3 -4 22 -12 17 4 -12 16 6 2 26 6 14 13 -12 -5 5 19 7 4 24 19 -2 10 -2 -19
5209 -19 4 -23 -9 7 -52 2 -39 -29 11 -26 -18 -10 -22 -8 8 -26 -4 -13 -27 11 -15 -4 17 -7 5 2 -8 18 -1 -4 12 -6 9
5242 9 9 -8 15 -4 -11 7 -16 -8 4 -13 3 -9 -17 10 -9 -12 -2 -20 11 -2 -16 5 3 -12 7 -6 -3 8 -8 12 7 4 19 -4 14
5277 14 10 -10 14 3 -6 0 -17 -8 5 -3 -11 1 -7 -3 -18 -19 -10 -13 -15 -11 -16 0 -13 -14 -10 -8 -10 0 -11 -1 2 -18 9 0 -8 1 -7 10 20 3 11 2 4
5320 4 4 -7 5 6 -7 5 -8 -3 4 -11 2 -11 -11 0 -11 -2 -7 -13 -10 -4 -9 3 -6 -11 -5 5 1 -3 -10 -6 -3 -8 1 6 -3 -2 7 4 6 -5 -3 8 9 -3 2 0
5366 0 -5 -3 -1 -10 -14 -14 -8 -5 -13 -8 -13 -16 -14 -9 -11 -7 -12 5 -3 -8 5 -6 -2 6 -2 -2 4 5 9 1 7 6 1 8 -1 -2 7 0 2 10 -2 -2 5 -13 1 -8 -7 -8 -10 -8 -3 -18 -18 -7
5420 -7 -20 -6 -7 -11 1 -14 3 4 -17 9 1 -13 11 -2 7 12 -12 3 9 -8 5 -12 -9 7 -10 -1 4 -11 2 -6 -9 8 -22 -17 3 -22 -2
5457 -2 -5 -25 10 -15 -17 -1 -16 2 5 -20 8 2 -16 10 -11 3 10 -1 17 4 -4 17 1 -1 20 -10 16 9 -3 4 -21 -1 1 -25 -5 -2
5493 -2 -18 -6 -11 -14 -2 -18 -14 -11 -21 7 -4 -29 5 -11 -20 12 -20 1 8 -8 21 7 -10 16 -10 8 19 -13 23 3 -9 14 -10 -1
5527 -1 12 -21 3 -1 -18 8 -24 -24 5 -28 -11 -10 -29 -4 -32 -22 -4 -18 2 6 -24 8 -1 -9 13 -19 4 26 -17 17 6 -5 22 5
5561 5 3 24 -7 20 15 -13 12 -7 -5 11 -19 -7 10 -24 6 -12 -23 5 -9 -21 15 -29 -5 0 -25 4 -4 -12 10 -19 -5 18 -16 15
5595 15 -6 -7 17 -8 7 9 -26 8 -4 -25 4 -17 -15 12 -32 -13 -2 -29 16 -9 -31 -2 -27 -14 -19 -28 4 -7 -25 5 -15 -12 15
5628 15 -30 8 2 -8 24 6 -12 14 -7 19 15 -3 16 5 -1 20 -7 -3 9 -16 10 -2 -8 14 -23 -8 -2 -29 -3 -4 -32 -1 -23 -17
5662 -17 -2 -38 -11 -8 -18 6 -11 -17 17 -12 -3 8 -18 7 1 -23 19 -10 3 17 -4 2 5 -15 11 -17 -23 9 -27 -12 -5 -21 -4 -5 -13
5697 -13 13 -14 -20 2 -26 0 -11 -21 16 -5 -14 -2 -18 11 9 -4 -2 3 -1 19 -6 9 11 -4 21 19 -8 15 -3 -2 15 -12 7 -2 -11 -1
5733 -1 -13 -19 12 -24 -28 3 -19 -2 -19 -27 -11 -20 -17 -3 -17 0 -6 -12 -2 -6 -14 9 -12 2 6 -15 1 5 -7 17 -4 4 -1 -17 4 -6 -10 -3
5771 -3 -7 2 3 -15 -5 -5 -13 -3 -8 -13 0 -11 -1 -11 -15 4 -5 -3 7 -10 0 3 -2 8 6 0 9 -1 7 16 -3 3 5 9 -4 -6 -8 3 -15 -7 -11 -21 6
5814 6 -20 -9 -4 -2 -16 -10 -17 -18 -16 -21 -18 -10 -8 -3 -9 -5 4 -8 -7 -4 4 5 0 8 -2 -3 1 7 7 5 4 2 6 3 3 5 0 -1 -4 -10 -8 -13 -5 -3 -9 -6 -5 -14 -10 -12 5 1 1 -11
5868 -11 -9 7 2 1 29 13 -8 11 0 -22 -25 34 1 6 9 -14 -4 -7 -6 -3 40 57 18 50 13 -25 0 -10 -19 -12 -16 -21 -20 -15 -17 -21 -13 -17 -8 2
5908 2 -7 -2 -13 -7 -4 8 4 6 1 12 10 4 5 6 12 8 0 9 13 -4 7 3 -3 12 -4 3 -4 -16 2 -12 -11 -10 -7 -2 -1 -15 -11 -11 -17 -7 -7 -9 3 -8 3 13
5954 13 -2 10 7 4 7 -7 8 2 -16 4 1 -4 3 -13 4 6 -7 -2 -13 -7 -2 -6 -21 -11 -17 -10 -1 -18 1 -5 -19 -1 -10 -7 7 -15 -4 2 -4 -2 5
5995 5 -4 16 -1 11 18 3 16 -2 7 25 -3 7 13 -4 18 3 -15 7 0 0 3 -23 -1 -4 -4 0 -10 -17 -2 -20 5 2 -19 -5 -16 -9 15
6032 15 -8 0 6 -15 14 8 2 10 -7 3 17 -10 17 12 13 9 -7 -2 8 -3 9 -2 -21 10 -17 -14 4 -13 -13 -4 -9 -10 -2 -16 9 -10 -4 5 -13
6071 -13 6 10 -16 18 11 -2 7 -8 9 7 -18 13 6 -2 14 2 10 20 -14 16 -1 -5 5 -17 -5 -9 -11 -7 -11 -23 -3 -19 -14 1 -18 -12 4
6108 4 -19 -6 -8 -9 7 -11 -5 9 -12 -1 12 -10 14 2 -1 6 -15 12 7 -17 6 -11 -11 4 -27 9 0 -24 -5 -17 -16 -2 -11 -3 -9 -25 -1
6145 -1 -16 -23 -1 -6 -9 11 -6 2 8 -10 13 -2 -4 5 -4 5 24 -7 5 7 -2 15 -8 9 14 -14 7 7 -9 4 -7 -15 -4 -22 -11 -12 -14 3 -21
6184 -21 -20 1 -20 2 -5 -36 2 -4 -18 3 -9 0 13 -19 10 16 -6 21 14 -5 11 -2 4 21 -9 9 4 -12 2 -18 -2 -2 -25 4 -8
6219 -8 -16 1 -22 -22 -4 -26 -5 -5 -17 11 -13 -7 3 -8 0 10 -6 20 3 5 22 3 5 10 -6 8 14 -5 17 8 6 15 -10 0 0 -10 8
6256 8 -12 -13 8 -21 -11 -5 -35 -13 -11 -21 7 -26 -8 -2 -5 8 -2 -10 5 -11 -5 10 -14 7 23 0 3 5 -7 8 2 -1 16 -16 6 -5
6292 -5 -14 11 -9 -9 3 -9 -10 -6 -16 -2 -10 -14 0 -16 -13 -5 -7 3 10 -7 7 -2 15 13 -8 19 11 -5 15 -2 6 34 4 1 7 5 12 14 -8 7
6332 7 0 -6 4 -5 -7 -3 -6 -6 -6 -17 2 -31 -4 -11 -8 0 -6 -15 -2 -12 -4 2 -7 -3 6 4 6 4 10 13 0 5 -3 5 2 -2 0 8 -10 -7 -5 -10 -4 2 -7 13 -3 -5 -5 -18
6382 -18 -9 0 -16 -12 -17 -20 -12 -17 -2 4 -11 -4 8 7 9 0 3 -1 -3 18 6 10 24 6 8 8 5 -1 2 -5 4 -5 -7 7 -2 -6 -2 -16 -5 -18 -14 -3 -27 -13 -13
6427 -13 -21 -16 -1 -13 -11 -1 -10 2 -6 -1 -7 -2 1 3 2 8 15 6 8 6 1 12 13 8 6 5 3 12 -6 -3 -12 7 7 -3 -11 -1 -6 -14 -4 -10 -5 -5 -1 3 -4 -9 2 -4 3
6476 3 12 1 5 11 9 0 8 11 10 8 -1 9 -1 13 -6 -5 0 -2 -10 -5 2 -3 -11 -13 -18 -12 -18 -18 -14 -10 -16 -15 -4 -8 -12 -10 -15 -4 -9 -2 8 7 12 11 1 5 7 7 -3 8
6526 8 10 19 -2 10 1 -23 -2 -6 4 -21 -8 -27 -15 -50 -7 -8 -5 20 -2 -11 -15 -17 -3 6 -11 8 -13 2 -2 -9 -6 -1 -4 6 7 9 6 2 10 7 7 13
6568 13 11 1 6 -3 -9 -5 -19 -5 -2 -6 -4 -3 -14 -14 -17 -21 -7 -29 -13 -12 -9 4 -2 -4 -2 -14 2 1 0 7 6 -10 20 4 13 19 -6 11 11 10 13 0 7 22
6612 22 -9 4 -2 -9 2 -10 -4 -10 -31 -9 0 -12 -3 -12 -18 3 -20 -14 -8 -10 0 -5 -12 12 -2 -3 7 -11 -4 9 3 11 -2 4 7 -6 3 9 -6 14 3
6653 3 -7 8 -7 1 0 -15 -1 -20 -6 1 -28 -14 -2 -18 -5 -6 -6 2 -7 -12 14 -11 7 15 -4 12 0 -1 7 3 2 21 -5 10 15 2 16 9
6691 9 -2 13 -3 6 5 -7 0 -8 -2 -6 -9 -7 -2 -17 -8 -3 -27 7 -13 -12 -7 -15 1 3 -11 12 -2 -6 7 3 2 12 0 19 11 -5 6 3 -4 18 -6
6732 -6 1 -13 -8 1 -10 -4 -4 -20 3 -1 -18 -11 -10 -21 -12 -19 -8 -8 -23 -8 -8 -2 8 -4 -8 10 -2 8 9 16 19 5 0 13 6 9 13 3 13 -1 11
6773 11 7 -6 5 -1 -11 -4 -10 -13 -1 -22 -14 -7 -14 -20 -16 -23 -2 -12 -24 0 -13 -7 1 -14 9 -10 3 3 1 1 0 4 10 7 8 18 -3 7 11 4 5 8 -13
6816 -13 -1 -7 -6 -4 -16 2 -1 -10 1 -2 -14 -5 -16 -9 -7 -18 -19 -11 -11 13 5 2 0 3 -1 -5 6 11 10 1 23 3 11 11 -6 10 13 -11 12 -5 -1 -2 -13
6859 -13 6 -2 -14 -5 -17 -10 4 -14 -14 -11 -17 -3 2 -15 -4 -13 1 -2 -6 -1 -10 0 9 5 4 5 -1 7 3 3 9 5 11 3 -3 8 4 -4 5 1 -16 -6 -11 -9 -3 -15
6905 -15 -19 -4 -15 -4 -13 -22 1 -9 -5 -6 -6 -1 1 2 1 7 -3 -3 18 7 3 0 4 7 11 12 12 3 8 12 -6 -7 2 0 -7 -20 -1 -22 -16 -15 -12 -7 -5 -10 -13 -10 -3 -16
6953 -16 -12 -2 -5 1 -6 2 -5 8 -3 8 -5 -3 -3 -1 3 4 1 4 2 5 4 3 0 5 -2 -2 -10 -4 -10 -6 0 -17 -4 -12 -15 -2 -7 0 -7 -9 -7 5 -3 -5 0 -3 -8 7 12 15
7003 15 8 20 3 16 18 8 10 6 13 15 18 11 14 7 -9 -5 5 -13 -2 -6 -2 -11 -16 -7 -14 -21 -17 -10 -10 -2 -2 -4 -17 1 1 6 13 -2 6 15 13 15 12 6 14 8 7 15 3
7052 3 6 7 -2 -1 10 2 -9 0 -1 2 6 4 2 -18 -13 -11 -13 4 -7 -8 -7 -6 17 9 -2 4 -8 2 17 5 1 19 21 7 5 0 10 12 4 4 -1 15 2 -2 -2
7097 -2 -3 5 12 -10 3 -5 -9 0 0 -10 5 -10 -12 1 -3 -2 -2 -3 -2 7 -2 5 4 1 9 3 14 -1 5 11 5 12 12 20 11 4 5 6 -3 15 17 -6 -6 -1 -11 0 -12 -11
7145 -11 -10 -1 -1 -10 -4 0 -6 -7 -3 -15 1 -2 -9 9 11 2 14 -1 0 19 12 14 14 8 19 5 -13 15 11 3 0 4 11 -5 -1 5 -6 -11 -4 -21 2 -13 -28 -1
7189 -1 -16 2 0 -21 -3 -9 -18 10 -6 -8 1 1 6 11 5 9 15 5 17 -1 11 11 -2 2 9 -2 -3 5 6 7 -12 16 -5 6 2 -12 -13 -9 -12 -3 -12 -10 -1 -8
7233 -8 -8 0 -18 0 0 -13 0 0 -6 9 -5 -3 13 1 8 3 2 10 -6 1 4 -13 -2 -1 -3 -3 3 -5 5 -20 3 0 -11 5 -28 4 -2 1 -17 -11 12
7274 12 21 -3 -1 -3 48 -3 -66 -8 -48 47 -4 -73 -31 46 49 -8 32 32 8 -51 -29 -15 12 -13 -19 -1 -4 -9 -8 -18 3 -18 -9 -9 -25 -8
7310 -8 -14 -19 -6 -16 -14 -11 -28 -13 -9 -12 7 5 -8 12 -5 -8 9 4 16 15 -8 -2 4 13 10 -5 -4 3 -6 3 -13 -12 3 -23 -14 -8 -14 -2 -7 -13 -9 -9 -7 -10 -14
7355 -14 -7 -11 -8 2 -6 0 -6 -9 -1 1 -1 10 8 1 15 4 9 12 4 -7 3 -4 5 2 -12 4 -10 -4 -12 -18 -10 -17 -16 -12 -29 -8 -6 -6 -6 -13 -10 -11 -9 -3 -8 -7 5 -1
7403 -1 1 2 4 -2 12 13 23 3 0 0 2 -1 9 0 4 13 -5 0 -7 -10 -7 -15 -17 -16 -20 -7 -4 -15 -7 -8 -7 -2 -4 -3 -8 0 1 7 -1 3 9 1 4 1 14 10 7 17 6 1 15
7454 15 0 6 4 0 4 -2 -5 1 -12 -2 -1 -12 -3 -14 -11 -5 -4 -17 -9 -24 -12 -14 -10 6 1 -9 -1 -4 3 7 -1 -1 1 3 15 20 32 -20 0 33 -4 10 -4
7497 -4 5 -10 8 -3 -5 -7 -4 -8 -12 -7 -17 -7 -7 -7 -10 -3 -11 -10 -19 -12 -7 -7 -10 6 -4 -2 -3 9 6 2 2 7 10 8 -1 15 16 3 6 4 -9 10 1 -4 -6 0 -9 -12 0
7546 0 -17 -8 -7 -15 -23 -20 -14 -13 -8 -8 -10 -6 -2 8 3 0 11 8 9 9 5 0 12 10 -2 13 -3 -1 7 8 3 -4 -1 -3 -1 19 0 -10 1 -12 1 -16 -1 -6 -6 -11
7592 -11 -9 -14 -1 0 3 10 -2 -1 -3 -2 7 -6 11 11 -4 -5 12 6 7 11 9 17 16 12 7 6 7 10 -7 5 4 -13 2 -9 -9 -8 -10 -10 -4 -15 -15 -14 -14 -8 -13 -10 -4 -11
7640 -11 -10 -8 -2 -9 2 -3 9 0 -10 14 0 10 -1 -3 14 10 10 5 -2 9 5 -4 2 -7 -7 -9 -6 -13 -11 -24 -20 -8 -22 -1 -7 -4 -3 -11 -11 -6 3 0 1 5 3 11 11
7687 11 6 12 9 15 20 21 3 17 3 7 11 6 -5 0 -15 -6 -7 -13 -7 -4 -14 1 -11 -13 -6 -12 -7 -13 -19 3 -9 -11 -6 -2 -6 -2 8 7 6 4 3 -2 -6 9 -4 3 17
7734 17 0 5 -4 0 -1 -7 1 1 -13 -3 -8 -21 -8 -12 -5 -10 -19 -15 -9 -13 -9 -19 -13 -8 -14 -10 -7 -8 11 2 5 11 3 2 2 3 17 4 -2 12 -13 1 14 -6 -2 6
7780 6 -14 -13 -15 -17 -2 -20 -5 -15 -14 -9 -17 -8 -2 -30 -7 -2 -19 -16 -7 -11 11 -1 -12 7 -7 3 10 -2 9 14 4 11 -3 10 11 -5 4 -1 -5 8
7820 8 0 -1 4 -7 -2 5 -11 -8 -23 -20 -5 -3 -9 -9 -14 -7 -6 -15 4 -2 -7 2 -12 -2 -7 2 0 -1 -3 3 -4 5 11 2 8 -4 -8 2 1 5 -1 -7 3 -3 -19 -1 -10 -18 -10
7869 -10 -15 2 -12 -16 -8 -18 -17 -2 -10 -15 -14 -10 -9 -3 -1 9 -8 4 9 -1 16 -4 2 14 7 0 13 5 8 7 -4 11 -7 0 1 -15 -7 -11 -3 -2 -11 -17 -9 -11
7913 -11 -9 1 -13 -12 -4 -13 -4 -11 -1 8 -2 -1 6 11 9 0 0 7 8 8 4 1 10 5 4 6 0 3 14 -15 -2 -7 -6 0 -8 -2 -3 -4 -2 -6 -17 -9 -9 -4 -10 -11 -5 0 -5 -2 -2 -4
7965 -4 14 7 3 5 8 7 -3 7 5 9 7 16 11 11 12 -4 -1 1 -2 5 -13 -4 -7 -7 -8 -6 -11 -10 -5 -11 -3 -19 -12 -17 -6 1 -1 -2 3 -11 0 4 2 11 8 8 0 7 0 3 9 15
8017 15 4 3 6 3 10 7 -2 -3 7 -1 -1 -7 -9 -4 -20 -10 -1 -14 -11 -4 -4 -8 0 4 -4 -4 9 10 5 3 4 3 15 19 17 12 6 16 13 16 10 6 1 9 6 10 0 -17 -6
8066 -6 -5 -10 1 -11 -9 -13 -6 -7 -15 -10 -2 -18 -4 -17 -11 1 -17 -3 -2 3 1 11 -2 4 6 2 6 16 5 14 11 7 4 16 1 3 -4 0 11 6 -7 -8 -4 -7 -12
8111 -12 -9 4 -11 -8 -14 -11 -5 -12 -6 -7 -2 -11 -9 -8 2 -7 10 -8 6 12 3 19 7 13 4 3 9 12 5 6 -1 2 3 -10 -7 -6 -13 -13 -7 -12 -7 -16 -15 -16 -4 -7 -6 -7 -5 0
8161 0 -9 -2 3 2 3 -2 5 6 5 6 6 11 11 20 8 6 13 8 0 8 -1 3 11 -10 -9 -6 -13 -6 -10 -19
8191a9
##END NTUPLES=NMR FID
##END=
