##TITLE=1H_SAV-77-CeCl3-B
 CDCl3, 8 sc, 
 24.11.2020
##JCAMPDX= 6.0         $$ Bruker NMR JCAMP-DX V2.0
##DATA TYPE= NMR FID
##DATA CLASS= NTUPLES
##ORIGIN= UXNMR, Bruker Analytische Messtechnik GmbH
##OWNER= root
$$ XWIN-NMR		Version 3.5
$$ Tue Nov 24 10:32:24 2020 Russian Standard Time (UT+4h)  she@DPX200
##.OBSERVE FREQUENCY= 200.1315066352
##.OBSERVE NUCLEUS= ^1H
##.DELAY= (6, 6)
##.ACQUISITION MODE= SIMULTANEOUS
##.ACQUISITION SCHEME= undefined
##.AVERAGES= 8
##.DIGITISER RES= 18
##SPECTROMETER/DATA SYSTEM= spect
##.PULSE SEQUENCE= zg30
##.SOLVENT NAME= CDCl3
##.SHIFT REFERENCE= (INTERNAL, CDCl3, 0, 15.7039)
##AUDIT TRAIL= $$ (NUMBER, WHEN, WHO, WHERE, WHAT)
$$ ##TITLE= Audit trail, XWIN-NMR		Version 3.5
$$ ##JCAMPDX= 5.01
$$ ##ORIGIN= Bruker BioSpin GmbH
$$ ##OWNER= she
$$ F:/spectra/data/she/nmr/H-F/1/audita.txt
$$ ##AUDIT TRAIL=  $$ (NUMBER, WHEN, WHO, WHERE, WHAT)
(   1,<2020-11-24 10:31:00.54 +0400>,<she>,<DPX200>,
      <created by zg, POWCHK disabled, PULCHK disabled
       configuration hash MD5:
       00 E9 B6 7A A2 85 ED C7 34 08 36 98 17 FE 4E 26
       data hash MD5: 16K
       50 59 A1 DD 22 7C 3B 3A 73 6D 8B 53 2E 72 B4 E0>)
$$ ##END=
$$ 
$$ hash MD5
$$ F8 D1 49 41 55 18 A5 68 41 10 C9 04 E6 4B 15 6C
##$RELAX= 
##$RELAX= 
##$RELAX= 
##$RELAX= 
##$RELAX= 
##$RELAX= 
$$ Bruker specific parameters
$$ --------------------------
##$DU= <F:/spectra>
##$EXPNO= 1
##$NAME= <H-F>
##$PROCNO= 1
##$TYPE= <nmr>
##$USER= <she>
##$AMP= (0..31)
100 100 100 100 100 100 100 100 100 100 100 100 100 100 100 100 100 100 
100 100 100 100 100 100 100 100 100 100 100 100 100 100 
##$AQSEQ= 0
##$AQ_mod= 1
##$AUNM= <au_zg>
##$AUTOPOS= <>
##$BF1= 200.13
##$BF2= 200.13
##$BF3= 200.13
##$BF4= 200.13
##$BF5= 200.13
##$BF6= 200.13
##$BF7= 200.13
##$BF8= 200.13
##$BYTORDA= 1
##$CFDGTYP= 0
##$CFRGTYP= 5
##$CHEMSTR= <none>
##$CNST= (0..31)
1 1 145 1 1 1 1 1 1 1 1 1 1 1 1 1 1 1 1 1 1 1 1 1 1 1 1 1 1 1 1 1 
##$CPDPRG= <>
##$CPDPRG1= <>
##$CPDPRG2= <>
##$CPDPRG3= <>
##$CPDPRG4= <mlev>
##$CPDPRG5= <mlev>
##$CPDPRG6= <mlev>
##$CPDPRG7= <mlev>
##$CPDPRG8= <mlev>
##$CPDPRGB= <>
##$CPDPRGT= <>
##$D= (0..31)
0 1.2 0 0 0 0 0 0 0 0.06 0 0.03 0 0 0 0 0.0002 0 0 0 0 0 0 0 0 0 0 0 0 
0 0 0 
##$DATE= 1606199459
##$DBL= (0..7)
120 120 120 120 120 120 120 120 
##$DBP= (0..7)
150 150 150 150 150 150 150 150 
##$DBP07= 0
##$DBPNAM0= <>
##$DBPNAM1= <>
##$DBPNAM2= <>
##$DBPNAM3= <>
##$DBPNAM4= <>
##$DBPNAM5= <>
##$DBPNAM6= <>
##$DBPNAM7= <>
##$DBPOAL= (0..7)
0.5 0.5 0.5 0.5 0.5 0.5 0.5 0.5 
##$DBPOFFS= (0..7)
0 0 0 0 0 0 0 0 
##$DE= 6
##$DECBNUC= <off>
##$DECIM= 32
##$DECNUC= <off>
##$DECSTAT= 4
##$DIGMOD= 1
##$DIGTYP= 9
##$DL= (0..7)
0 120 120 120 120 120 120 120 
##$DP= (0..7)
150 150 150 150 150 150 150 150 
##$DP07= 0
##$DPNAME0= <>
##$DPNAME1= <>
##$DPNAME2= <>
##$DPNAME3= <>
##$DPNAME4= <>
##$DPNAME5= <>
##$DPNAME6= <>
##$DPNAME7= <>
##$DPOAL= (0..7)
0.5 0.5 0.5 0.5 0.5 0.5 0.5 0.5 
##$DPOFFS= (0..7)
0 0 0 0 0 0 0 0 
##$DQDMODE= 0
##$DR= 18
##$DS= 0
$$ [...]
##$SUBNAM2= <"">
##$SUBNAM3= <"">
##$SUBNAM4= <"">
##$SUBNAM5= <"">
##$SUBNAM6= <"">
##$SUBNAM7= <"">
##$SUBNAM8= <"">
##$SUBNAM9= <"">
##$SW= 16.9725356469052
##$SWIBOX= (0..15)
0 0 2 0 0 0 0 0 0 0 0 0 0 0 0 0 
##$SW_h= 3396.73913043478
##$TD= 16384
##$TD0= 1
##$TE= 0
##$TE2= 300
##$TE3= 300
##$TEG= 300
##$TL= (0..7)
0 120 120 120 120 120 120 120 
##$TP= (0..7)
150 150 150 150 150 150 150 150 
##$TP07= 0
##$TPNAME0= <>
##$TPNAME1= <>
##$TPNAME2= <>
##$TPNAME3= <>
##$TPNAME4= <>
##$TPNAME5= <>
##$TPNAME6= <>
##$TPNAME7= <>
##$TPOAL= (0..7)
0.5 0.5 0.5 0.5 0.5 0.5 0.5 0.5 
##$TPOFFS= (0..7)
0 0 0 0 0 0 0 0 
##$TUNHIN= 0
##$TUNHOUT= 0
##$TUNXOUT= 0
##$USERA1= <user>
##$USERA2= <user>
##$USERA3= <user>
##$USERA4= <user>
##$USERA5= <user>
##$V9= 5
##$VALIST= <valist>
##$VCLIST= <CCCCCCCCCCCCCCC>
##$VD= 0
##$VDLIST= <DDDDDDDDDDDDDDD>
##$VPLIST= <PPPPPPPPPPPPPPP>
##$VTLIST= <TTTTTTTTTTTTTTT>
##$WBST= 1024
##$WBSW= 4
##$XGAIN= (0..3)
0 0 0 0 
##$XL= 0
##$YL= 0
##$YMAX_a= 101187
##$YMIN_a= -105302
##$ZGOPTNS= <>
##$ZL1= 120
##$ZL2= 120
##$ZL3= 120
##$ZL4= 120
##$ABSF1= 10
##$ABSF2= 0
##$ABSG= 5
##$ABSL= 3
##$ALPHA= 0
##$AQORDER= 0
##$ASSFAC= 0
##$ASSFACI= 0
##$ASSFACX= 0
##$ASSWID= 0
##$AUNMP= <proc_1d>
##$AZFE= 0.1
##$AZFW= 0.1
##$BCFW= 1
##$BC_mod= 2
##$BYTORDP= 1
##$COROFFS= 0
##$CY= 11.3945322036743
##$DATMOD= 1
##$DC= 2
##$DFILT= <>
##$DTYPP= 0
##$F1P= 15.9154993809931
##$F2P= -4.1035820241983
##$FCOR= 0.5
##$FTSIZE= 0
##$FT_mod= 4
##$GAMMA= 1
##$GB= 0.15
##$INTBC= 1
##$INTSCL= 1
##$ISEN= 128
##$LB= 0.24
##$LEV0= 0
##$LPBIN= 0
##$MAXI= 10000
##$MC2= 0
##$MEAN= 0
##$ME_mod= 0
##$MI= 1.114404
##$NCOEF= 0
##$NC_proc= 0
##$NLEV= 6
##$NOISF1= 3.799351
##$NOISF2= 2.8
##$NSP= 1
##$NTH_PI= 0
##$NZP= 0
##$OFFSET= 15.70392
##$PC= 1
##$PHC0= -11050.25
##$PHC1= 14.20089
##$PH_mod= 1
##$PKNL= yes
##$PPARMOD= 0
##$PSCAL= 0
##$PSIGN= 0
##$REVERSE= no
##$SF= 200.130013532006
##$SI= 16384
##$SIGF1= 3
##$SIGF2= 2
##$SINO= 400
##$SIOLD= 16384
##$SREGLST= <1H.CDCl3>
##$SSB= 0
##$STSI= 0
##$STSR= 0
##$SW_p= 3612.71676300578
##$SYMM= 0
##$S_DEV= 0
##$TDeff= 0
##$TDoff= 0
##$TI= <>
##$TILT= no
##$TM1= 0
##$TM2= 0
##$TOPLEV= 0
##$USERP1= <user>
##$USERP2= <user>
##$USERP3= <user>
##$USERP4= <user>
##$USERP5= <user>
##$WDW= 1
##$XDIM= 8192
##$YMAX_p= 0
##$YMIN_p= 0
$$ End of Bruker specific parameters
$$ ---------------------------------
##NTUPLES= NMR FID
##VAR_NAME=  TIME,          FID/REAL,        FID/IMAG
##SYMBOL=    X,             R,               I
##VAR_TYPE=  INDEPENDENT,   DEPENDENT,       DEPENDENT
##VAR_FORM=  AFFN,          ASDF,            ASDF
##VAR_DIM=   8192,          8192,            8192
##UNITS=     SECONDS,       ARBITRARY UNITS, ARBITRARY UNITS
##FACTOR=    0.0002944,     1,               1
##FIRST=     0,             0,               0
##LAST=      2.4114304,     0,               0
##MIN=       0,             -105302,         0
##MAX=       2.4114304,     101187,          0
$$ Real data points
##PAGE= N=1
##DATA TABLE= (X++(R..R)), XYDATA
$$ plain form
0 0 0 0 0 0 0 0 0 0 0 0 0 0 0 0 0 -7 8 -8 8 -8 15 -15 16 -23 23 -31 34 -39 47 -54 62 -70 80 -93 103 -116 132
37 132 -148 165 -186 207 -230 256 -284 314 -348 385 -426 466 -513 566 -624 687 -757 835 -923
56 -923 1021 -1132 1262 -1411 1587 -1796 2054 -2375 2793 -3357 4166 -5446 7848 -26555 99383
71 99383 -21886 -105302 49200 3449 -15928 -35088 -13589 58769 -16712 -22430 73212 15091
83 15091 4243 19434 14064 46147 685 2619 69631 11278 -3983 27171 5826 5568 -13712
96 -13712 -4456 32711 -19690 -15059 22521 -22402 -22084 -6166 -17852 2914 -11263 -12160 16826
109 16826 -9567 -20539 -2232 -363 -4103 -15825 10710 22505 -21329 -6019 18073 -13043
121 -13043 -15632 1868 13843 5720 -13629 13082 15803 -17313 -3645 9803 8439 8596 -1191
$$ packed form
0@%%%%%%%%%%%%%%%pJ5j6J6j6K3l0L1l9M6n4O5p3Q6j01J16j32J50j73J96k19K48
37A32k80L13l51L93m37M86n40N98o62P33q11Q92r79J079j190J311j444J592j758
56i23J944k153K394k673K998l383L850m429N168o150P523r612J3294l4403J25938
71I9383j21269q3416J54502m5751j9377j9160K1499P2358p5481n718R5642n8121
83A5091j0848J5191n370L2083m5462J934O7012n8353j5261L1154k1345k58j9280
96a3712R256L7167n2401M631L7580m4923L18J5918j1686K0766j4177q97K8986
109A6826k6393j0972J8307J869l740j1722K6535J1795m3834J5310K4092l1116
121a3043k589J7500J1975q123j9349K6711K721l3116J3668J3448j364J57r787
$$ plain form
134 -1191 17462 22099 -11057 -5487 17562 4228 -9538 7835 17034 -3112 -5799 -1341 -9208
147 -9208 -2731 -7656 -10891 9286 2093 -7617 -1824 -4960 3671 -4279 -10321 22110 14312 -7371
161 -7371 16647 15901 -1728 3360 8913 15595 8482 4962 19992 7832 -3387 5706 -1469 932
175 932 4731 -2714 8664 4125 -8574 253 -5131 -7290 63 -4388 4323 3144 -6417 3460 -4945
190 -4945 -13025 1219 -2962 -6633 1587 838 -2399 -10007 -7724 -1546 -11294 -7210 2418 -205 -1770
205 -1770 -5305 -2895 -748 -10286 -3640 4048 564 2907 -1155 -417 2602 -10538 -7472 3403 -3287
220 -3287 -2952 -704 -2047 -2630 -10940 -10312 -2597 -5806 -4531 -281 1362 1542 -5591 -5259 3014 -951
236 -951 -736 7616 9392 7460 3503 4610 8113 1260 2486 11305 8263 7648 8567 4130 3740 1441
$$ packed form
134a191J8653M637l3156N570K3049j3334j3766J7373R199k0146k687M458p867
147i208O477m925l235K0177p193r710N793l136Q631p950o042L2431p798k1683
161g371K4018p46j7629N088N553O682p113l520J5030j2160j1219R093p175K401
175I32L799p445J1378m539j2699Q827n384k159P353m451Q711j179r561R877q405
190d945q080J4244m181l671Q220p49l237p608K283O178r748M084R628k623j565
205a770l535K410K147r538O646P688l484K343m062P38L019j3140L066J0875o690
220c287L35K248j343n83q310O28P715l209J275M250J643J80p133L32Q273l965
236i51K15Q352J776j932l957J107L503o853J226Q819l042o15R19m437l90k299
$$ plain form
252 1441 -604 3352 4854 5003 3052 2805 3081 -4244 -4814 1471 -1791 -729 3169 551 -1222 -4666
268 -4666 -5083 -4810 -7739 -2992 -480 -3928 -1867 -4100 -7269 -5936 -8596 -4967 395 -4066 -782 3380
284 3380 -3532 -5019 -1834 -2120 -705 -62 3701 5635 -1212 -1034 992 -4295 -1990 961 -1739 3264
300 3264 1840 -5619 -1328 -2380 -8227 -3827 -241 737 -472 -1969 2755 -1169 -7219 1203 3617
315 3617 -221 5080 5990 4864 4255 -706 3024 6465 770 5745 10913 6562 4136 4101 5785 3030
331 3030 -45 7624 8943 2614 5559 6589 391 -53 -398 1870 2763 231 3278 3305 -3125 -3985 -3419
348 -3419 -3614 -3649 -3346 -880 -1081 -4171 -3891 -5101 -6633 -4468 -4558 -1804 388 -2230 -905 -1776 -3973
365 -3973 -774 -1845 13 4215 1712 2176 3430 -1107 248 259 -818 3882 2461 1558 4245 683
$$ packed form
252A441k045L956J502J49j951k47K76p325n70O285l262J062L898k618j773l444
268d666m17K73k929M747K512l448K061k233l169J333k660L629N362m461L284M162
284C380o912j487L185k86J415O43L763J934o847J78K026n287K305K951k700N003
300C264j424p459M291j052n847M400L586R78j209j497M724l924o050Q422K414
315C617l838N301R10j126o09m961L730L441n695M975N168m351k426l5J684k755
331C030l075P669J319o329K945J030o198m44l45K268Q93k532L047K7o430q60N66
348c419j95l5L03K466k01l090K80j210j532K165r0K754K192k618J325q71k197
365c973L199j071J858M202k503M64J254m537J355J1j077M700j421r03K687l562
$$ plain form
381 683 -1318 360 -1330 555 1769 1596 3963 993 -826 1645 -1959 -1833 3177 1114 1271 3506
397 3506 374 -100 -1805 -2059 1100 -1067 -741 3568 462 -2150 -674 -2830 -1885 -2231 -2269 1980 -31
414 -31 -2794 -1014 -3202 -3413 -3953 -5162 253 110 -5052 -2397 -1102 -5983 -6468 -4222 -2409 -2544 -3993
431 -3993 -1703 -675 -5366 -4960 -3258 -2958 -740 -1972 -260 2893 -2049 -2285 1011 -1987 71 1792
447 1792 934 4095 1199 -1246 1873 -827 -515 552 919 4346 215 -1295 3819 -1531 -3744 2065
463 2065 1114 666 2519 2527 2468 -453 -41 2921 127 2313 6208 2442 3361 5503 1844 3349 3238 3379
481 3379 7337 4933 4156 8281 4985 2455 3485 4828 6248 2146 4263 8448 2007 689 2617
496 2617 113 1574 -430 -1582 2704 -241 -4612 -3949 -2726 -3485 -7868 -5487 -379 -5309 -8328 -3501
$$ packed form
381F83k001J678j690J885J214j73K367k970j819K471l604J26N010k063J57K235
397C506l132m74j705k54L159k167L26M309l106k612J476k156R45l46l8M249k011
414c1k763J780k188k11n40j209N415j43n162K655J295m881m85K246J813j35j449
431c993K290J028m691M06J702L00K218j232J712L153m942k36L296k998K058J721
447A792q58L161k896k445L119k700L12J067L67L427m131j510N114n350k213N809
463B065r51m48J853Qn9k921M12K962k794K186L895l766R19K142l659J505j11J41
481C379L958k404p77M125l296k530J030J343J420m102K117M185o441j318J928
496B617k504J461k004j152M286k945m371O63J223p59m383K381N108m930l019M827
$$ plain form
512 -3501 -4404 -7747 -7939 -3740 -2153 -5763 -4308 -334 -2639 -5967 -2928 431 -1146 -2248 2122 3931
528 3931 -316 -492 3192 2109 740 2899 4850 4150 3087 3385 2893 1390 2771 2337 1265 4482
544 4482 2903 1038 2336 173 -254 -245 -773 756 -269 359 -82 -3807 -1176 -301 -5343 -1837 816
561 816 -1397 -1834 -2833 -286 -1027 -5754 -1885 1219 -1367 -1687 -1357 843 -193 -4352 -1390 1598 -1548
578 -1548 -2113 133 937 -1180 -4011 -1449 733 -3609 -2844 1493 -222 -3634 -1782 -1002 -1457 -3585
594 -3585 -1589 1605 -658 -1954 1154 -248 -2036 -1137 69 2261 519 1052 2512 1288 1498 1684
610 1684 1510 4001 3589 2615 3817 4747 3062 2156 2865 3794 3167 2748 4058 4167 1936 2416 2499 329
628 329 1414 2340 771 1334 854 995 -140 -2735 -189 611 -2879 -741 97 -906 -1969 -3628 -378
$$ packed form
512c501r03l343j92M199J587l610J455L974k305l328L039L359j577j102M370J809
528C931m247j76L684j083j369K159J951p00j063K98m92j503J381m34j072L217
544D482j579j865J298k163m27Rn28J529j025O28m41l725K631Q75n042L506K653
561H16k213m37r99K547p41m727L869L104k586l20L30K200j036m159K962K988l146
578a548n65K246Q04k117k831K562K182m342P65M337j715l412J852P80m55k128
594c585J996L194k263j296L108j402j788Q99J206K192j742N33J460j224K10J86
610A684j74K491m12r74J202R30j685r06P09R29o27m19J310J09k231M80Q3k170
628C29J085R26j569N63m80J41j135k595K546Q00l490K138Q38j003j063j659L250
$$ plain form
645 -378 -370 -4662 -1248 831 -1885 -2025 -1772 -505 -1224 -3566 -712 877 -1983 -986 -230 -656 -874 -2451
663 -2451 -1159 1478 -1955 -1987 1709 -27 -2273 -1688 -131 870 -2643 -1056 3258 -905 -2415 958
679 958 316 -809 -1040 975 2364 -643 199 2748 -752 519 1473 444 2498 1438 891 2400 1001
696 1001 1073 2192 784 2597 2323 900 2666 1898 205 1759 907 463 1105 553 1489 296 -1552
713 -1552 1384 635 -3159 287 1348 -1939 -1512 -492 333 -2080 -3875 1236 3 -5237 -975 948
729 948 -2850 -3364 -1182 -87 -2735 -3532 524 -340 -3684 -1438 -232 -1854 -1836 -1792 -162 -112 -2360 -702
747 -702 659 -1405 -1180 -161 -327 -58 -1353 79 1460 -959 -293 1078 259 489 83 1215 2080
764 2080 -420 429 2646 -16 529 1690 1706 1683 275 2014 2717 -150 1366 3350 645 681 2107
$$ packed form
645c78Qm292L414K079k716j40K53J267p19k342K854J589k860R97P56m26k18j577
663b451J292K637l433l2L696j736k246N85J557J001l513J587M314m163j510L373
679I58o42j125k31K015J389l007Q42K549l500J271R54j029K054j060n47J509j399
696A001P2J119j408J813k74j423J766p68j693J554q52m44O42n52R36j193j848
713a552K936p49l794L446J061l287M27J020Q25k413j795N111j233n240M262J923
729I48l798n14K182J095k648p97M056q64l344K246J206j622J8M4J630N0k248J658
747g02J361k064K25J019j66K69j295J432J381k419O66J371q19K30m06J132Q65
764B080k500Q49K217k662N45J161J6k3j408J739P03k867J516J984k705L6J426
$$ plain form
781 2107 1694 782 451 2089 1346 -921 830 1801 -529 37 692 85 -445 -1090 -138 301 -1811 -1043
799 -1043 317 -1566 -1692 -415 -991 -1677 -1355 -791 -1621 -2438 -580 -602 -2543 -936 -199 -1922 -1171 -228
817 -228 -933 -1245 -187 17 -818 -414 382 271 -468 763 953 -588 674 1071 243 1026 1931 788 1325
836 1325 2218 1421 1505 1777 2117 1386 1494 2314 1417 1209 2187 1056 1139 1506 765 738 912 662 717 636 189
857 189 83 -154 -153 -87 -900 -523 -124 -1166 -1094 -887 -1162 -1708 -1694 -884 -1205 -1644 -1242 -1084 -1619 -1935 -1525 -731
879 -731 -1306 -1949 -788 -791 -1751 -1668 -720 -1486 -1831 -483 -515 -1350 -1140 -1098 -712 -1214 -1327 -138 -482 -666 -357
900 -357 -688 -139 -731 -1123 356 172 -788 803 468 -207 743 499 137 1163 1219 1015 1243 1003 1791 1246
920 1246 884 2430 1520 1334 2685 1526 1653 2316 1096 1244 1684 1579 2113 393 1117 2314 -721 318
$$ packed form
781B107m13r12l31J638p43k267J751R71k330N66O55o07n30o45R52M39k112P68
799a043J360j883j26J277n76o86L22N64q30q17J858k2j941J607P37j723P51R43
817b28p05l12J058K04q35M04P96j11p39J231J90j541J262L97q28P83R05j143N37
836A325Q93p97Q4K72L40p31J08Q20q97k08R78j131Q3L67p41k7J74k50N5q1m47
857A89j06k37JO6q13L77L99j042P2K07k75n46J4Q10l21m39M02J58n35l16M10P94
879g31n75o43J161lr60Q3R48p66l45J348l2q35K10M2L86n02j13J189l44j84L09
900c57l31N49n92l92J479j84r60J591l35o75R50k44l62J026N6k04K28k40P88n45
920A246l62J546r10j86J351j159J27O63j220J48M40j05N34j720P24J197l035J039
$$ plain form
938 318 1485 -567 581 572 -47 398 -1204 -846 246 -2002 -793 101 -1625 -593 -1108 -1531 -769 -2324
956 -2324 -1577 -585 -1699 -1345 -743 -1141 -597 -1795 -1802 715 -1105 -1287 729 -202 -635 -672 -706 1079 -884
975 -884 -1049 1954 394 -728 464 577 404 -315 471 2337 -579 -165 2302 -43 -845 1227 1453
992 1453 440 -48 2082 2117 -490 57 2132 763 -141 1500 2008 1320 284 841 1387 375 -186 961
1010 961 1025 208 692 862 243 -773 -746 268 -695 -564 267 190 -1027 -1401 -1426 -861 -1641 -2625 -1105 -492
1030 -492 -1701 -2899 -1639 -1686 -2511 -2123 -419 -712 -2078 -1222 -462 -1775 -1595 -435 -746 -287 357 149
1048 149 59 -431 190 343 -652 1365 1658 462 1179 975 936 1313 176 1291 1574 686 1892 1403 714
1067 714 2160 282 756 1794 1120 1757 988 682 1785 226 -441 1326 830 613 977 1010 850 -218
$$ packed form
938C18J167k052J148ro19M45j602L58J092k248J209Q94j726J032n15m23P62j555
956b324P47R92j114L54O02l98N44j198pK517j820j82K016r31m33l7l4J785j963
975h84j65L003j560j122J192J13j73p19P86J866k916M14K467k345q02K072K26
992A453j013m88K130L5k607N47K075j369r04J641N08o88j036N57N46j012n61J147
1010I61O4q17M84J70o19j016K7J014r63J31Q31p7j217l74k5N65p80r84J520O13
1030d92j209j198J260m7q25L88J704k93j366Q56P60j313J80J160l11M59O44k08
1048A49r0m90O21J53r95K017K93j196P17k04l9L77j137J115K83q88J206m89o89
1067G14J446j878M74J038o74O37p69l06J103j559o67J767m96k17L64L3j60j068
$$ plain form
1085 -218 -124 540 -331 -153 1074 -102 -679 275 -863 -870 -985 -991 58 -691 -1049 -167 -1273 -1460 -1521 -1994
1105 -1994 -256 -1359 -1560 -358 -928 -2116 -1218 -1846 -1587 -1188 -1316 256 -906 -1225 -756 -834 -517 -81
1123 -81 -405 975 565 -94 729 551 -457 471 974 869 946 1636 1497 431 433 1381 593 782 1587 968
1143 968 1677 1327 102 729 1118 311 586 1273 1191 506 238 852 -145 -323 634 175 63 803 547 376
1163 376 -7 -925 423 78 -73 -401 253 -119 -653 -1317 -952 -379 -765 -515 100 -971 -1500 -922 -1458
1182 -1458 -2146 -1061 -1467 -661 -641 -1410 -1142 -856 -1487 -1527 -588 -516 -873 -99 107 -1176 -1068 -109 -304 -661
1202 -661 227 836 399 361 621 -8 329 436 872 1778 1234 959 1512 797 475 800 879 1388 1055 1068 1707
1223 1707 650 576 479 175 703 572 601 986 342 -33 26 -205 -346 120 332 337 -43 -472 163 -650 -1418
$$ packed form
1085b18R4O64q71J78J227j176n77R54j138pj15oJ049p49l58Q82j106j87o1m73
1105a994J738j103k01J202n70j188Q98o28K59L99j28J572j162l19M69p8L17M36
1123h1l24J380m10o59Q23j78j008R28N03j05P7O90j39j066KR48p88J89Q05o19
1143I68P09l50j225O27L89q07K75O87q2o85k68O14r97j78R57m59j12P40k56j71
1163C76l83r18J348l45j51l28O54l72n34o64L65N73l86K50O15j071n29N78n36
1182a458o88J085m06Q06K0p69K68K86o31m0R39P2l57P74K06j283J08R59j95l57
1202f61Q88O09m37l8K60o29L37J07M36R06n44k75N53p15l22L25P9N09l33J3O39
1223A707j057p4r7l04N28j31K9L85o44l75N9k31j41M66K12Nl80m29O35q13p68
$$ plain form
1244 -1418 -84 72 -512 185 323 -343 -1094 -734 -246 -1006 -976 541 -203 -875 -599 -1095 -748 -1345 -991
1263 -991 229 -822 -817 159 -948 -1514 -947 -772 -398 -454 -247 581 -221 -831 -222 -270 124 194 444 696 595
1284 595 92 700 628 108 866 1095 1459 1230 979 1294 1004 6 1023 1264 1088 1461 1078 859 752 233
1304 233 732 278 195 755 630 285 356 -462 -605 -311 -830 -285 -19 -561 -308 -829 -1048 -788 -1093 -905 -598
1325 -598 -446 -639 -455 -949 -1133 -1364 -1035 -678 -655 -771 -210 -452 -1251 -821 -1059 -359 -453 -746 432 -271
1345 -271 -820 -198 -341 -889 -427 -216 290 -69 -110 396 -239 -284 213 204 606 874 923 1299 492 288 926 601
1367 601 791 1123 1557 1652 1094 729 1508 1019 214 1464 1741 940 1089 995 916 -191 160 975 83 125 788
1388 788 92 -60 -209 -794 -264 -636 -584 -133 -342 -985 -786 -1193 -1239 -1450 -907 -660 -726 -771 -733 -1011 -770 -989
$$ packed form
1244a418J334J56n84O97J38o66p51L60M88p60L0J517p44o72K76m96L47n97L54
1263i91J220j051NR76j107n66N67J75L74n6K07Q28q02o10O09m8L94P0K50K52j01
1284E95n03O08p2n20P58K29L64k29k51L15k90r98J017K41j76L73l83k19j07n19
1304B33M99m54q3N60j25l45P1q18j43K94n19N45K66n42K53n21k19K60l05J88L07
1325e98J52j93J84m94j84k31L29L57K3j16N61k42p99M30k38P00r4k93J178p03
1345b71n49O22j43n48M62K11N06l59m1N06o35m5M97rM02K68M9L76q07k04O38l25
1367F01J90L32M34R5n58l65P79m89q05J250K77q01J49r4p9j107L51Q15q92M2O63
1388G88o96j52j49n85N30l72N2M51k09o43J99m07m6k11N43K47o6m5L8k78K41k19
$$ plain form
1410 -989 -1343 -299 -407 -748 -257 -122 -688 -842 -689 188 -258 92 569 -123 -118 97 -278 -247 132 901 890
1431 890 283 730 484 13 -39 172 636 947 620 720 1007 286 234 250 476 724 656 984 756 408 337 204
1453 204 133 960 596 368 679 368 -65 275 -399 -265 36 -247 -69 -194 35 -767 -1234 -562 -496 -1082 -667
1474 -667 -249 -444 -538 -1233 -1020 -748 -1180 -658 -763 -433 -230 -741 -780 -858 -820 25 -567 -102 213 -118 -275
1495 -275 -144 -25 305 -8 -143 782 397 173 180 -98 386 180 -128 581 841 537 258 76 344 449 290
1516 290 517 906 761 725 541 327 783 414 419 990 1056 837 475 394 532 162 517 666 630 1030 577 409
1538 409 -25 -112 -131 -66 -327 793 240 -574 68 -546 -517 -1264 -1142 -97 -439 -822 -580 -1069 -1252 -1356 -1358
1559 -1358 -896 -948 -693 -306 -943 -1214 -410 -1110 -1092 -154 -57 -251 -545 58 -81 -505 -318 209 188 731 744
$$ packed form
1410i89l54J044j08l41M91J35n66j54J53Q77m46L50M77o92NK15l75L1L79P69j1
1431H90o07M47k46m71n2K11M64L11l27J00K87p21n2J6K26K48o8L28k28l48p1j33
1453B04p1Q27l64k28L11l11m33L40o74J34L01k83J78j25K29q02m67O72O6n86M15
1474f67M18j95r4o95K13K72m32N22j05L30K03n11l9p8L8Q45n92M65L15l31j57
1495b75J31J19L30l13j35R25l85k24Pk78M84k06l08P09K60l04k79j82K68J05j59
1516B90K27L89j45l6j84k14M56l69NN71O6k19l62q1J38l70L55J49l6M00m53j68
1538D09m34q7j9O5k61J120n53q14O42o14K9p47J22J045l42l83K42m89j83j04k
1559a358M62n2K55L87o37k71Q04p00J8R38R7j94k94O03j39m24J87N27k1N43J3
$$ plain form
1580 744 372 824 631 -83 706 911 1600 890 882 1095 565 376 1034 599 450 1303 652 813 359 268 258
1601 258 -103 269 667 123 136 592 -1 -58 -352 -362 23 -294 -76 566 -166 -447 -316 -696 -551 15 -271
1622 -271 -325 58 -13 -543 -837 -406 -239 -1049 -362 -485 -640 -584 -1295 -775 -805 -574 -568 -469 -944 -609 -132 -1728
1644 -1728 -920 -368 -164 -568 -367 -574 -139 -733 430 -132 258 359 -136 168 524 498 549 510 375 554
1664 554 570 694 1017 911 611 1132 544 353 611 894 1074 753 771 749 204 400 423 55 265 759 136
1685 136 155 148 -109 10 -354 56 305 -228 -64 -173 -547 -451 -523 -603 -608 -358 -357 -532 -582 -508 -725 -826 -640 -447
1709 -447 -467 -392 -531 -518 -595 -660 -360 -485 -401 -51 -69 -210 -286 108 -182 -226 87 2 321 384 328 412 112 523
1733 523 356 469 767 990 808 692 672 479 694 548 672 974 752 662 749 266 522 363 507 366 533
$$ packed form
1580G44l72M52j93p14P89K05O89p10qK13n30j89O58m35j49Q53o51J61m54r1j0
1601B58l61L72L98n44J3M56n93n7k94j0L85l17K18O42p32k81J31l80J45N66k86
1622b71n4L83p1n30k94M31J67q10O87j23j55N6p11N20l0K31OR9m75L35M77j596
1644a728Q08N52K04m04K01k07M35n94J163n62L90J01m95L04L56k6N1l9j35J79
1664E54J6J24L23j06l00N21n88j91K58K83J80l21J8k2n45J96K3l68K10M94o23
1685A36J9pk57J19l64M10K49n33J64j09l74R6p2q0nK50Jj75n0P4k17j01J86J93
1709d47k0P5j39J3p7o5L00j25Q4L50j8j41p6L94k90m4L13q5L19O3n6Q4l00M11
1733E23j67J13K98K23j82j16k0j93K15j46J24L02k22r0Q7m83K56j59J44j41J67
$$ plain form
1754 533 298 260 59 137 -137 -340 289 -128 -306 -136 -249 -534 -600 -518 -260 -470 -375 -179 -335 -696 -717 -655
1776 -655 -763 -743 -222 -477 -433 -584 -313 -478 -722 -370 -683 -663 -393 -556 -413 -502 -596 -418 -235 -170 -131 -321
1798 -321 -95 -359 -767 -435 -67 -162 -262 51 328 -107 6 126 -41 436 -66 451 789 359 754 818 398
1819 398 191 739 472 968 632 546 939 384 720 506 611 985 530 643 993 400 482 541 340 260 231 98
1841 98 72 12 102 -246 -421 -350 -357 -623 -367 -557 -835 -513 -768 -931 -798 -767 -734 -820 -879 -616 -874 -948 -593 -752
1865 -752 -641 -415 -236 -115 -352 -317 -30 -319 -537 -57 406 472 582 513 809 -72 437 777 424 676 1085
1886 1085 677 362 508 758 562 446 820 916 517 614 412 344 520 196 348 224 168 389 -85 232 9
1907 9 -620 -93 -21 -305 -186 -176 -225 -345 -848 -478 -244 -660 -301 -320 -739 -395 -585 -500 -453 -782 -142 -302 -494
$$ packed form
1754E33k35l8k01P8k74k03O29m17j78J70j13k85o6Q2K58k10R5J96j56l61k1O2
1776f55j08K0N21k55M4j51K71j65k44L52l13K0K70j63J43q9r4J78J83O5L9j90
1798c21K26k64m08L32L68r5j00L13K77m35J13J20j67M77n02N17L38m30L95O4m20
1819C98k07N48k67M96l36q6L93n55L36k14J05L74m55J13L50n93Q2N9k01q0k9j33
1841I8k6o0R0l48j75P1pk66K56j90k78L22k55j63J33L1L3q6n9K63k58p4L55j59
1865g52J11K26J79J21k37L5K87k89k18M80M63O6J10o9K96q81N09L40l53K52M09
1886A085m08l15J46K50j96j16L74R6l99R7k02o8J76l24J52j24n6K21m74L17k23
1907Io29N27P2k84J19J0m9j20n03L70K34m16L59j9m19L44j90Q5M7l29O40j60j92
$$ plain form
1930 -494 -165 -192 -108 -668 -357 203 -496 -626 -273 -62 -231 -413 -468 -6 -179 -318 51 -136 135 -172 -343
1951 -343 50 -31 -244 -88 76 -102 192 -276 -2 42 -41 124 172 175 784 386 248 498 512 678 461 779
1973 779 695 796 611 820 734 629 631 705 1040 375 509 287 142 160 719 178 89 283 -2 -128 -361 -253
1995 -253 88 -389 -602 -306 -503 -613 -665 -446 -266 -647 -769 -529 -653 -173 -677 -754 -656 -594 -615 -275 -372 -311
2017 -311 -354 -401 -175 -21 -429 169 130 294 331 183 235 246 63 115 252 215 567 361 320 659 289 306 425
2040 425 268 344 225 430 572 289 327 188 52 449 305 209 112 333 350 68 3 191 -33 -58 136 85 9
2063 9 27 -192 -20 9 15 -36 -299 -57 -300 -648 -592 -369 -384 -573 -347 -246 -157 -536 -113 -498 -491 -209 -768 -409
2087 -409 -216 -231 -502 -253 -405 -320 -359 -326 28 -282 -357 -273 -297 -157 -221 -88 146 -45 33 72 367 13 302
$$ packed form
1930d94L29k7Q4n60L11N60o99j30L53K11j69j82n5M62j73j39L69j87K71l07j71
1951c43L93q1k13J56J64j78K94m68K74M4q3J65M8LO09l98j38K50J4J66k17L18
1973G79q4J01j85K09q6j05KP4L35o65J34k22j45J8N59n41q9J94k85j26k33J08
1995b53L41m77k13K96j97j10n2K19J80l81j22K40j24M80n04p7R8O2k1L40r7O1
2017c11m3m7K26J54m08N98l9J64L7j48N2J1j83N2J37l7L52k06m1L39l70J7J19
2040D25j57P6j19K05J42k83L8j39j36L97j44r6r7K21J7k82o5J88k24k5J94n1p6
2063IJ8k19J72K9On1k63K42k43l48N6K23j5j89K26J01Q9l79M23l85PK82n59L59
2087d09J93j5k71K49j52Q5l9L3L54l10p5Q4k4J40o4J33K34j91P8L9K95l54K89
$$ plain form
2110 302 120 6 534 151 660 240 432 670 474 526 652 414 762 751 535 561 475 638 583 480 845 249
2132 249 378 884 294 460 96 132 26 104 240 -354 -274 -290 -182 -245 -477 -470 -567 -569 -763 -697 -1048 -701 -984 -501
2156 -501 -661 -824 -812 -818 -582 -705 -556 -748 -592 -583 -403 -454 -281 -298 -488 -274 107 13 23 241 371 410 201
2179 201 261 340 499 355 422 711 447 357 772 853 456 941 364 761 685 510 868 512 399 515 272 357
2201 357 203 339 129 -201 220 132 -184 30 -223 -69 -123 -93 -76 -287 -358 -333 -179 -353 -83 -263 -379 -246
2223 -246 -294 -139 -309 -449 53 -629 -405 -424 -289 -543 -284 -450 -606 -202 -262 -26 -290 -281 -97 -256 -319 -31
2245 -31 -199 -20 -176 -274 -112 -51 -116 136 -386 -216 4 90 -151 -118 174 303 179 58 255 136 316 426
2267 426 539 645 394 496 541 419 451 518 500 500 474 396 554 420 247 395 276 -58 259 169 146 -158 115
$$ packed form
2110C02j82j14N28l83N09m20J92K38j96N2J26k38L48j1k16K6q6J63n5j03L65n96
2132B49J29N06n90J66l64L6j06P8J36n94Q0j6J08o3k32Pr7kj94O6l51L47k83M83
2156e01j60j63J2oK36j23J49j92J56RJ80n1J73j7j90K14L81r4J0K18J30L9k09
2179B01O0P9J59j44O7K89k64r0M15Q1l97M85n77L97p6j75L58l56j13J16k43Q5
2201C57j54J36k10l30M21q8l16K14k53J54n4L0J7k11p1K5J54j74K70j80j16J33
2223b46m8J55j70j40N02o82K24j9J35k54K59j66j56M04o0K36k64RJ84j59o3K88
2245c1j68J79j56r8J62O1o5K52n22J70K20Q6k41L3K92J29j24j21J97j19J80J10
2267D26J13J06k51J02M5j22L2O7j8%k6p8J58j34j73J48j19l34L17r0k3l04K73
$$ plain form
2290 115 7 93 -176 -192 -501 -286 -358 -388 -399 -488 -472 -619 -991 -873 -490 -710 -736 -827 -672 -774 -849 -420 -474 -479
2314 -479 -429 -497 -212 -393 -257 -221 -320 -366 -43 125 123 232 32 540 229 346 644 334 422 523 894 793 736
2337 736 519 665 459 577 683 482 561 373 531 484 477 309 536 373 237 253 -3 0 -98 -25 -28 -59 -97 27
2361 27 76 -215 43 -193 -265 -87 -493 -240 -243 -3 -288 -138 -413 -120 -122 -91 -197 -284 -24 -720 81 120 -196
2384 -196 -97 -225 -142 -443 -656 -301 -990 -822 -537 -331 -304 -81 -391 -311 -298 -412 -288 -221 -192 -130 -3 81 178
2407 178 161 48 254 133 491 267 310 638 591 458 269 447 447 355 465 624 347 236 567 266 479 399
2429 399 360 626 147 241 243 -58 -43 -104 -240 -21 -145 -231 -30 -208 -407 -537 -546 -333 -405 -572 -244 -416 -545
2452 -545 -439 -475 -40 -30 -403 -178 -247 -273 -240 -434 -219 -1 -121 -120 180 346 -14 -43 349 20 -23 30 203
$$ packed form
2290A15j08Q6k69j6l09K15p2l0j1q9J6j47l72J18L83k20k6r1J55j02p5M29n4n
2314d79N0o8K85j81J36L6r9m6L23J68kJ09k00N08l11J17K98l10Q8J01L71j01n7
2337G36k17J46k06J18J06k01P9j88J58m7pj68K27j63j36J6k56Lr8P3ll1l8J24
2361B7M9k91K58k36p2J78m06K53lK40k85J50k75K93kL1j06q7K60o96Q01L9l16
2384a96R9j28Q3l01k13L55o89J68K85K06K7K23l10Q0J3j14J24O7K9O2J27Q4R7
2407A78j7j13K06j21L58k24M3L28m7j33j89J78%r2J10J59k77j11L31l01K13q0
2429C99l9K66m79R4Kl01J5o1j36K19j24q6K01j78j99j30rK13p2j67L28j72j29
2452e45J06l6M35J0l73K25o9k6L3j94K15K18j20JL00J66l60k9L92l29m3N3J73
$$ plain form
2475 203 283 474 9 -39 397 136 477 320 129 324 439 83 501 410 475 378 188 453 242 158 392 145
2497 145 225 -2 173 317 298 140 -42 -30 181 209 186 505 274 -74 98 128 201 207 36 -139 -49 -224 -234 -34
2521 -34 -288 -135 -353 -252 -467 -435 -453 -487 -460 -174 -368 -592 -285 -363 -191 -468 -311 -406 -107 -317 -421 -478 -371
2544 -371 -38 -635 -117 -129 -196 20 63 -88 60 -238 173 258 331 60 -17 141 261 192 168 458 238 465 91
2567 91 434 509 442 162 688 398 654 540 560 462 614 343 553 732 365 403 171 424 291 311 344 60 24
2590 24 24 28 40 -57 16 -164 -263 -547 -278 -363 -265 -709 -325 -345 -742 -429 -519 -540 -697 -607 -696 -555 -643 -723 -345 -89
2616 -89 -304 -396 -405 42 -357 -139 -39 -129 -54 145 -84 231 332 -1 277 339 659 482 306 338 511 456 493
2639 493 594 201 324 328 437 306 249 117 80 272 458 360 40 245 -13 147 167 76 -111 271 -169 76
$$ packed form
2475B03Q0J91m65m8M36k61L41j57j91J95J15l56M18r1O5r7j90K65k11q4K34k47
2497A45Q0k27J75J44j9j58j82J2K11K8k3L19k31l48J72L0P3Oj71j75R0j75j0K00
2521c4k54J53k18J01k15L2j8l4K7K86j94k24L07p8J72k77J57r5K99k10j04n7J07
2544c71L33n97N18j2o7K16M3j51J48k98M11Q5P3k71p7J58J20o9k4K90k20K27l74
2567I1L43P5o7k80N26k90K56j14K0r8J52k71K10J79l67L8k32K53j33K0L3k84l6
2590B4%MJ2r7P3j80r9k84K69q5R8m44L84k0l97L13r0k1j57R0q9J41q8q0L78K56
2616h9k15r2rM47l99K18J00r0P5J99k29L15J01l33K78O2L20j77j76L2J73n5L7
2639D93J01l93J23MJ09j31n7j32l7J92J86r8l20K05k58J60K0r1j87L82m40K45
$$ plain form
2661 76 -169 -463 -35 -101 -30 -90 -113 -168 -145 -267 -153 -222 -322 -66 -340 -497 -216 -380 -311 -283 -281 -425 -350 -228
2685 -228 -248 -368 -40 -34 -363 -248 -22 -61 -126 -32 -173 -18 48 66 -49 182 125 535 131 9 327 383 365 416
2709 416 145 458 562 308 234 302 480 333 301 196 607 270 466 373 377 237 475 319 -56 313 265 402
2731 402 547 97 276 106 84 279 121 -83 -78 -196 -358 -168 -179 -321 -599 -55 -466 -426 -349 -476 -206 -318
2753 -318 -570 -483 -624 -361 -531 -437 -170 -374 -336 -266 -298 -300 -376 -497 -388 -34 -256 137 -203 126 68 -56 155
2776 155 172 -162 253 9 568 444 352 210 315 478 76 316 211 464 440 445 442 201 270 342 603 443 495
2799 495 323 124 202 359 101 502 291 247 141 195 192 44 296 -93 61 -102 -29 -98 195 42 -332 -169
2821 -169 -299 -101 -216 -357 -151 -390 -175 -422 -260 -254 -501 -267 -144 -208 -492 -302 -52 -358 -290 -306 -178 -209
$$ packed form
2661G6k45k94M28o6P1o0k3n5K3j22J14o9j00K56k74j57K81j64O9K8Kj44P5J22
2685b28k0j20L28Ol29J15K26l9o5R4j41J55O6J8j15K31n7M10m04j22L18N6j8N1
2709D16k71L13J04k54p4O8J78j47l2j05M11l37J96r3Mj40K38j56l75L69m8J37
2731D02J45m50J79j70k2J95j58k04Nj18j62J90j1j42k78N44m11M0P7j27K70j12
2753c18k52Q7j41K63j70R4K67k04L8P0l2kp6j21J09L54k22L93l40L29n8j24K11
2776A55J7l34M15k44N59j24r2j42J05J63m02K40j05K53k4Nlk41O9P2K61j60N2
2799D95j72j99P8J57k58M01k11m4j06N4lj48K52l89J54j63P3o9K93j53l74J63
2821a69j30J98j15j41K06k39K15k47J62Ok47K34J23o4k84J90K50l06O8j6J28l1
$$ plain form
2843 -209 -456 -70 -89 -188 -215 -20 41 -289 79 -262 97 228 371 249 463 466 349 446 296 716 498 294
2865 294 606 304 259 361 502 277 513 255 396 237 102 110 102 -22 109 -304 -39 6 -300 109 -112 -182
2887 -182 -277 -245 -65 -36 -302 -186 -321 -304 -148 -339 -241 -227 -347 -215 -397 -462 -215 -540 -93 -195 -211 -432 -188
2910 -188 -250 -379 16 -236 23 -227 16 62 -221 15 -36 -130 -150 -61 210 133 176 219 245 -112 61 549 141
2933 141 160 394 270 242 557 470 373 334 430 382 293 664 387 364 370 115 463 265 216 310 75 179 328 87
2957 87 182 282 63 70 -51 183 -126 -92 119 -106 -66 115 -501 13 -206 -427 -155 -210 -491 -312 -351 -327 -432
2980 -432 -448 -660 -188 -291 -302 -285 -341 -268 -624 -40 15 -288 81 31 -195 104 -298 51 367 84 -49 -85 14
3003 14 11 130 60 -321 -27 -100 462 276 50 137 -556 -50 -147 440 369 369 75 227 -61 288 -144 -33 508
$$ packed form
2843b09k47L86j9r9k7J95O1l30L68l41L59J31J43j22K14Lj17R7j50M20k18k04
2865B94L12l02m5J02J41k25K36k58J41j59j35Qqj24J31m13K65M5l06M09k21p0
2887a82r5L2J80K9k66J16j35J7J56j91R8J4j20J32j82o5K47l25M47j02j6k21K44
2910a88o2j29L95k52K59k50K43M6k83K36n1r4k0Q9K71p7M3M3K6l57J73M88m08
2933A41J9K34j24k8L15q7r7l9R6m8q9L71k77k3Ok55L48j98m9R4k35J04J49k41
2957H7R5J00k19Pj21K34l09L4K11k25M0J81o16N14k19k21K72n5k81J79l9K4j05
2980d32j6k12M72j03j1J7n6P3l56N84N5l03L69n0k26K99m02L49L16k83j33l6R9
3003A4lJ19p0l81K94p3N62j86k26Q7o93N06r7N87p1%k94J52k88L49m32J11N41
$$ plain form
3026 508 -132 174 253 -153 -36 276 426 192 110 -202 224 -76 -27 42 -286 -5 -1018 -335 -90 -356 -697
3047 -697 -272 -181 -70 166 -556 -311 -942 56 -543 -250 -100 -518 -108 -58 -363 -421 -82 -100 -321 77 -372
3068 -372 -239 -252 -634 -547 157 543 175 -2 -104 218 358 147 4 179 -32 308 169 58 211 346 429
3089 429 303 398 272 327 369 218 107 191 212 364 -146 -61 61 200 166 229 362 397 270 152 268 50 -88
3112 -88 99 30 -80 -169 -108 -132 -365 -218 -505 -191 -623 -472 -441 -125 -44 -364 -270 -155 -501 -323 -466 -497 -346
3135 -346 -412 -292 -21 -454 -226 -286 -282 -247 -141 -155 -211 -367 -292 80 43 -49 18 -60 34 298 254 80 216 330 460
3160 460 277 460 371 367 329 467 333 124 520 448 282 355 294 92 592 372 111 154 250 108 58 -14 151 229
3184 229 -334 -211 62 130 29 221 -6 -86 -273 -562 165 -243 -664 -577 -143 -448 122 -429 -515 -386 -436 -543
$$ packed form
3026E08o40L06P9m06J17L12J50k34q2l12M26l00M9O9l28K81j013O83K45k66l41
3047f97M25R1J11K36p22K45o31R98n99K93J50m18M10N0l05n8L39j8k21L98m49
3068c72J33j3l82Q7P04L86l68j77j02L22J40k11j43J75k11L40j39j11J53J35Q3
3089D29j26R5j26N5M2j51j11Q4K1J52n10Q5J22J39l4O3J33L5j27j18J16k18j38
3112h8J87o9j10q9O1k4k33J47k87L14m32J51L1L16Q1l20R4J15l46J78j43l1J51
3135c46o6J20K71m33K28o0ML5J06j4n6j56P5L72l7r2O7p8R4K64m4j74J36J14J30
3160D60j83J83q9ml8J38j34k09L96p2j66P3o1k02N00k20k61M3R6j42n0p2J65P8
3184B29n63J23K73O8j01J92k27q0j87k89P27m08m21Q7M34l05N70n51q6J29n0j07
$$ plain form
3206 -543 89 -160 19 -64 -8 -82 -289 -235 173 51 120 -23 -139 1 -84 -48 -220 -116 -18 227 -169 186 -167
3229 -167 383 -169 120 159 146 241 158 294 233 286 181 451 340 238 260 229 343 207 415 298 -40 146 38
3252 38 463 235 90 153 89 256 151 142 135 141 111 -147 -87 -200 -187 -163 -162 -261 -419 -464 -266 -243 -430 -198 -105 -131 -120
3279 -120 -342 -352 -272 -115 -578 -391 -121 -231 -246 -314 -408 63 -301 -262 33 -10 -303 -248 8 -119 -283 -63 280
3302 280 -29 114 60 229 113 360 263 68 239 368 236 252 240 326 282 250 206 334 323 254 60 23 120 221
3326 221 4 112 96 181 65 -1 -178 70 -42 -23 173 -168 -85 -236 -174 -391 -131 -254 -131 -161 -212 -301 -246
3349 -246 -297 -154 -266 -512 -229 -261 -423 -174 -13 -423 -341 -136 -187 30 12 -292 -51 -230 6 -193 -186 -332
3371 -332 -138 -119 -56 111 24 -4 64 245 242 324 180 116 199 329 40 210 119 599 245 68 365 234 207 523
$$ packed form
3206e43O32k49J79q3N6p4k07N4M08j22O9j43j16J40q5L6j72J04R8K45l96L55l53
3229a67N50n52K89L9j3R5q3J36o1N3j05K70j11j02K2l1J14j36K08j17l38J86j08
3252C8M25k28j45O3o4J67j05rpOl0k58O0j13J3K4Jr9j58m5J98K3j87K32R3k6J1
3279a20k22j0Q0J57m63J87K70j10j5o8r4M71l64L9K95m3k93N5K56j27j64K20L43
3302B80l09J43n4J69j16K47r7j95J71J29j32J6j2Q6m4l2m4J28j1o9j94l7R7J01
3326B21k17J08j6Q5j16o6j77K48j12J9J96l41Q3j51O2k17K60j23J23l0n1q9N5
3349b46n1J43j12k46K83l2j62K49J61m10Q2K05n1K17j8l04K41j79K36j99Pj46
3371c32J94J9O3J67q7k8O8J81lQ2j44o4Q3J30k89J70r1M80l54j77K97j31k7L16
$$ plain form
3395 523 414 378 156 342 92 107 212 165 66 135 11 326 362 37 49 -77 13 -33 -214 -171 -108 -139 -178 -129 -393
3420 -393 -365 -275 193 -272 -44 -334 -369 -452 -417 -281 -279 -171 -342 87 -338 -277 -140 -26 -243 -283 -233 -170 -70 -18
3444 -18 191 -290 -78 -255 -178 -104 -203 -208 -180 316 19 -2 -141 -150 418 89 287 194 104 280 317 -14 -88 138 395
3469 395 357 354 318 67 235 204 195 64 303 174 320 115 264 157 -112 99 1 -245 17 98 -45 -257 -174
3492 -174 -141 -51 -303 -423 -75 -339 -89 -355 -517 -143 -468 -193 -341 -345 -274 -359 -323 -225 -283 -201 -90 67 115 -26
3516 -26 -102 -157 -196 84 -37 -90 -31 357 23 192 101 183 33 68 108 163 197 365 401 67 193 253 272 468 170
3541 170 489 216 58 497 301 29 189 337 427 80 303 242 104 -4 95 77 231 257 43 25 -30 -6 -151
3564 -151 -157 -3 237 -123 38 -277 -348 -456 79 -33 -268 -336 -280 -240 -162 -114 -175 -415 -268 -211 -319 -118 -277
$$ packed form
3395E23j09l6k22J86k50J5J05m7r9O9j24L15L6l25J2j26R0m6j81M3O3l1l9M9k64
3420c93K8R0M68m65K28k90l5q3L5J36KJ08j71M29m25O1J37J14k17m0N0O3J00N2
3444a8K09m81K12j77P7P4r9nK8M96k97k1j39rN68l29J98r3r0J76L7l31p4K26K57
3469C95l8ll6k51J68l1rj31K39j29J46k05J49j07k69K11r8k46K62Q1j43k12Q3
3492a74L3R0k52j20L48k64K50k66j62L74l25K75j48mP1q5L6R8n8Q2J11J57M8j41
3516b6p6n5l9K80j21n3N9L88l34J69r1Q2j50L5M0N5L4J68L6l34J26O0J9J96k98
3541A70L19k73j58M39j96k72J60J48R0l47K23o1j38j08R9j8J54K6k14j8n5K4j45
3564a51oJ54K40l60J61l15p1j08N35j12k35o8N6M0P8M8o1k40J47N7j08K01j59
$$ plain form
3587 -277 -36 -273 -227 -65 -118 -5 -32 -278 7 -51 62 -181 -87 -17 12 -6 86 161 135 378 262 -96 358 309
3611 309 245 220 104 -68 88 139 287 265 230 94 -19 153 427 348 348 38 122 292 54 -49 100 15 60 225
3635 225 -29 -2 -37 -379 -330 -179 -194 -284 -446 -364 -126 -22 -263 -403 -365 -390 -248 -319 -105 -252 -262 -425 -314
3658 -314 -543 -464 -53 65 -312 -557 50 17 309 336 113 294 -146 -278 112 201 -209 -33 5 61 -14 129
3680 129 356 415 44 253 39 -67 787 38 355 432 407 -265 416 982 473 -188 518 5 119 212 246 341
3702 341 240 -62 -34 225 95 -98 509 11 -29 -152 125 -18 -179 148 -92 -87 -379 -231 87 -17 -404
3723 -404 -187 -245 -115 -232 -180 -152 25 -215 37 -172 -302 -309 175 -395 57 -25 -215 -15 -424 -13 -74 2 79
3746 79 83 -160 -57 -26 -27 18 69 -61 -69 324 23 175 -16 150 328 248 185 214 -120 122 265 156 87 -90 216
$$ packed form
3587b77K41k37M6J62n3J13k7k46K85n8J13k43R4P0K9j8R2P5k6K43j16l58M54m9
3611C09o4k5j16j72J56N1J48k2l5j36j13J72K74p9%l10Q4J70k38j03J49q5M5J65
3635B25k54K7l5l42M9J51j5r0j62Q2K38J04k41j40L8k5J42p1K14j47j0j63J11
3658c14k29P9M11J18l77k45O07l3K92K7k23J81m40j32L90Q9m10J76L8N6p5J43
3680A29K27N9l71K09k14j06Q54p49L17P7k5o72O81N66n09o61P06n13J14R3L4R5
3702C41j01l02K8K59j30j93O07m98m0j23K77j43j61L27k40Nk92J48L18j04l87
3723d04K17n8J30j17N2K8J77k40K52k09j30pM84n70M52q2j90K00m09M11o1P6P7
3746G9Mk43J03L1jM5N1j30qL93l01J52j91J66J78q0o3K9l34K42J43j09o9j77L06
$$ plain form
3771 216 315 -96 68 365 -24 67 51 99 112 165 89 360 -58 49 -77 8 -167 -71 -203 -124 15 -65 -62 -122 -129
3796 -129 -4 5 -298 -20 -168 -306 -316 -270 -137 -12 -205 -60 -227 -75 -25 -212 -426 -262 -97 -74 -128 -107 61
3819 61 -111 91 5 -47 -176 261 155 -96 -68 -142 258 307 135 328 344 348 127 -31 320 -16 270 327 123
3842 123 3 347 521 35 139 386 -197 168 240 69 -26 194 244 -118 362 232 71 104 -309 -9 555
3863 555 44 27 -247 82 -206 -119 -24 -187 -21 16 -15 -172 -133 -94 5 -178 -114 -293 -304 -339 152 -489 -605 -117
3887 -117 -315 80 505 -546 -21 -363 -82 -307 -74 -9 -97 568 352 461 -71 -24 303 -363 391 112 542
3908 542 -243 255 743 155 16 297 361 290 31 -14 490 297 387 556 270 -47 319 -97 462 239 265 113
3930 113 150 225 -77 -92 19 183 -213 -107 -136 138 -212 -9 -132 -254 -227 -180 -290 16 -432 -196 -154 -568
$$ packed form
3771B16R9m11J64K97l89R1j6M8J3N3p6K71m18J07j26Q5j75R6j32P9J39q0Lo0p
3796a29J25Rl03K78j48j38j0M6J33J25j93J45j67J52N0j87k14J64J65K3n4K1J68
3819F1j72K02q6n2j29M37j06k51K8p4M00M9j72J93J6Mk21j58L51l36K86N7k04
3842A23j20L44J74m86J04K47n83L65P2j71r5K20N0l62M80j30j61L3m13L00N64
3863E55n11j7k74L29k88Q7R5j63J66L7l1j57L9L9R9j83O4j79j1l5M91o41j16M88
3887a17j98L95M25j051N25l42K81k25K33O5q8O65k16J09n32M7L27o66P54k79M30
3908E42p85M98M88n88j39K81O4p1k59m5N04j93R0J69k86l17L66m16N59k23K6j52
3930A13L7P5l02j5J11J64l96J06k9K74l50K03j23j22K7M7j10L06m48K36M2m14
$$ plain form
3952 -568 103 -346 -326 -197 -185 -384 -350 101 -164 -368 -355 -70 -207 -14 172 -165 -43 43 -58 56 -21 -109
3974 -109 -21 -26 -171 -43 238 76 365 156 219 22 166 -6 57 -71 152 129 144 114 43 178 180 127 134 137 215 -68
4000 -68 138 195 -5 -50 -122 6 -192 -69 -15 -83 22 -185 30 -169 -282 -223 -12 -18 -157 -119 -81 -282 -65 -157
4024 -157 -367 -195 -253 -56 -86 -258 -129 -81 -92 -61 -45 -44 168 -20 -45 21 -23 -8 -143 -109 67 -292 -16 -55 -34
4049 -34 87 25 -56 323 140 101 158 93 146 166 -106 -81 87 36 453 348 244 231 258 150 215 102 257 170 150
4074 150 271 151 179 -42 280 -73 279 52 83 -76 -24 -161 -33 -24 -200 200 -56 -89 -226 -313 -154 -434
4096 -434 -36 19 -282 -373 -306 -322 -250 -283 -441 -194 -81 -156 -260 -89 -543 -14 -95 -275 -260 -187 -199 153 -20 -265
4120 -265 115 -60 -11 -353 114 85 108 -74 118 68 287 -81 -18 89 -13 223 240 87 120 236 255 294 -139
$$ packed form
3952e68O71m49K0J29J2j99L4M51k65k04J3K85j37J93J86l37J22Q6j01J14p7q8
3974a09Q8nj45J28K81j62K89k09O3j97J44j72O3j28K23k3J5l0p1J35Kn3PLP8k83
4000f8K06N7k00m5p2J28j98J23N4o8J05k07K15j99j13N9K11oj39L8L8k01K17r2
4024a57k10J72n8J97l0j72J29M8j1L1J6JK12j88k5O6m4J5j35L4J76l59K76l9K1
4049c4J21o2q1L79j83l9N7o5N3K0k72K5J68n1M17j05j04j3K7j08O5j13J55q7k0
4074A50J21j20K8k21L22l53L52k27L1j59N2j37J28Rj76M00k56l3j37q7J59k80
4096d34L98N5l01r1O7j6P2l3j58K47J13p5j04J71m54N29q1j80J5P3j2L52j73k45
4120b65L80j75M9l42M67k9K3j82J92n0K19l68O3J07j02K36J7j53L3J16J9L9m33
$$ plain form
4143 -139 246 205 350 382 262 -34 195 -71 318 72 194 39 -54 -3 46 88 -254 181 172 -72 -110 -77 -22 -406
4167 -406 59 17 -382 -94 -260 122 145 -82 -206 66 -328 -50 -91 -420 -162 56 -196 126 101 -235 -43
4188 -43 -9 48 23 -43 53 10 5 45 -68 -32 -165 79 -83 65 301 -41 64 224 315 181 219 278 261 256 234 301
4214 301 173 132 -72 224 271 189 260 216 56 337 -28 222 334 -32 -81 -4 16 -97 -50 -203 130 -16 -284
4237 -284 92 -59 57 -154 -147 -184 -34 -46 -319 -248 -118 -115 -65 -329 -94 -147 98 -237 -138 -186 -214 74 335 169
4261 169 -462 392 94 -54 141 209 -11 225 -246 48 -198 259 348 374 167 -39 81 18 -60 166 45 145
4283 145 201 98 254 21 199 367 184 205 122 128 228 246 52 -44 212 -7 251 1 -74 -149 -131 -29 100
4306 100 149 59 8 -59 130 -83 -41 293 174 -116 -69 102 -4 -236 -336 146 77 -199 -162 -316 -38 -313 -26
$$ packed form
4143a39L85m1J45L2j20k96K29k66L89k46J22j55r3N1M9M2l42M35rk44l8L3N5l84
4167d06M65m2l99K88j66L82K3k27j24K72l94K78m1l29K58K18k52L22k5l36J92
4188d3L4N7k5o6R6m3nM0j13L6j33K44j62J48K36l42J05J60R1j34L8N9j7nk2O7
4214C01j28m1k04K96M7q2P1m4j60K81l65K50J12l66m9P7K0j13M7j53L33j46k68
4237b84L76j51J16k11Pl7J50j2k73P1J30LN0k64K35n3K45l35R9m8k8K88K61j66
4261A69o31Q54k98j48J95O8k20K36m71K94k46M57Q9K6k07k06J20o3p8K26j21J00
4283A45N6j03J56k33J78J68j83K1q3OJ00J8j94r6K56k19K58k50p5p5J8J02J29
4306A00M9r0n1o7J89k13M2L34j19k90M7J71j06k32j00M82o9k76L7j54K78k75K87
$$ plain form
4329 -26 -127 -76 160 -102 39 -66 -348 -421 -22 -70 -22 67 -249 -128 -108 -82 56 -64 -312 -39 85 132 32
4352 32 255 300 -187 476 115 -197 297 508 213 -287 508 -370 -126 -11 191 -152 194 -380 31 785 -272
4373 -272 -231 -633 538 125 -388 -135 427 36 220 143 242 -271 -266 204 77 -12 2 -127 -128 -3 -177 -254 -25
4396 -25 -122 -151 -262 -103 -280 -103 120 -87 -29 -444 -196 -231 -262 -126 -4 -68 -46 -256 55 -79 84 -43 269
4419 269 -3 83 -8 -35 161 -266 87 245 -99 121 295 -112 56 290 -4 349 88 2 108 23 192 13
4441 13 47 431 221 203 84 138 214 159 396 138 55 57 202 218 25 -48 -97 117 -18 -171 -1 -60 142 -76
4465 -76 -310 8 -249 -121 -266 -282 -162 -235 -289 -248 -343 -66 -137 -123 -298 -185 -259 -55 -282 -128 -311 -87 -6
4488 -6 -210 -273 -210 -277 -275 -20 -262 -236 -107 62 -175 44 -70 -92 108 2 248 64 84 -22 225 61 448
$$ packed form
4329b6j01N1K36k62J41j05k82p3L99m8M8Q9l16J21K0K6J38j20k48K73J24M7j00
4352C2K23M5m87O63l61l12M94K11k95n00P95q78K44J15K02l43L46n74M11P54j057
4373b72M1m02J171m13n13K53N62l91J84p7R9n13NM70j27q9J4j29jJ25j74p7K29
4396b5r7k9j11J59j77J77K23k07N8m15K48l5l1J36J22o4K2k10L11j34J63j27L12
4419B69k72Q6r1k7J96m27L53J58l44K20J74m07J68K34k94L53k61q6J06q5J69j79
4441A3L4L84k10j8j19N4P6n5K37k58q3KJ45J6j93p3m9K14j35j53J70n9K02k18
4465g6k34L18k57J28j45j6J20p3n4M1r5K77p1J4j75J13p4K04k27J54j83K24Q1
4488fk04o3O3o7KK55k42K6J29J69k37K19j14k2K00j06K46j84K0j06K47j64L87
$$ plain form
4511 448 -37 141 126 143 94 295 237 353 285 13 163 103 355 126 93 56 300 85 83 63 37 -163 -118 -268
4535 -268 -75 4 23 -218 24 65 -113 -118 -410 2 -351 -36 113 -154 -108 23 -127 -344 -290 -223 -9 -129 -35
4558 -35 -327 -174 -221 -109 -85 -67 49 131 -167 -77 70 -99 -172 109 -137 -82 117 132 -177 253 -35 151 123
4581 123 165 185 83 163 -36 5 -7 47 210 185 244 211 206 227 143 295 112 163 20 186 -81 221 231 240 -61 -129
4607 -129 -26 -128 98 106 72 -109 -142 -112 142 -119 105 -213 -185 -119 26 -293 -205 -107 -332 -280 -187 -92 -43 -91 -135
4632 -135 99 -164 -24 -34 -212 -377 -242 -83 -68 -99 258 -22 137 3 119 -162 20 53 -52 125 71 20
4654 20 182 114 443 75 -240 126 269 2 36 244 234 161 -16 72 119 62 49 13 233 150 62 240 57 -114
4678 -114 47 257 51 141 -119 -85 57 -133 -51 -77 -33 -335 -12 28 74 76 -121 -314 -80 -202 -221 -330 -259 16
$$ packed form
4511D48m85J78j5J7m9K01n8J16o8k72J50o0K52k29l3l7K44k15kk0k6k00M5j50
4535b68J93P9J9k41K42M1j78nk92M12l53L15J49k67M6J31j50k17N4O7K14j20R4
4558c5k92J53m7J12K4J8J16Q2k98R0J47j69p3K81k46N5J99J5l09M30k88J86k8
4581A23M2K0j02Q0j99M1j2N4J63k5N9l3nK1q4J52j83N1j43J66k67L02J0Rl01o8
4607a29J03j02K26Ql4j81l3L0K54k61K24l18K8O6J45l19Q8R8k25N2R3R5M9m8m4
4632a35K34k63J40j0j78j65J35J59J5l1L57k80J59j34J16k81J82L3j05J77n4n1
4654B0J62o8L29l68l15L66J43k67L4K08j0p3j77Q8M7n7j3l6K20q3q8J78j83j71
4678a14J61K10k06R0k60L4J42j90Q2k6M4l02L23M0M6Kj97j93K34j22j9j09P1K75
$$ plain form
4702 16 -13 -197 40 -160 -334 -155 -119 -10 58 131 -116 -141 53 107 -25 4 75 -109 176 -99 -188 -85 -156 96
4726 96 -69 -16 168 252 -43 -46 40 43 -68 -74 132 -21 396 69 118 11 87 41 157 250 268 53 68 107 -56 122
4752 122 119 285 -116 -64 -74 84 -32 -67 118 89 31 -3 153 31 -17 -102 -248 111 -207 -131 -50 -245 -110 165
4776 165 -119 -389 -48 -227 -55 -58 29 -205 -180 -86 -85 -216 37 -697 -170 -92 -297 -257 -102 87 31 15 -171 111
4800 111 135 242 -78 98 -63 200 68 250 86 224 -3 88 156 96 12 410 22 62 277 96 -16 -44
4822 -44 324 312 203 -197 387 -6 328 114 95 -94 -88 173 163 -199 -51 230 -280 25 -66 -273 131 -37
4844 -37 -194 -148 -77 162 107 -169 -162 -104 -164 -88 36 -154 -70 -97 -170 -288 13 5 92 51 -53 -227 -23 -231 -31
4869 -31 54 -49 -11 -171 97 242 132 4 243 -142 -55 333 160 -218 70 21 169 -7 297 -5 259 98
$$ packed form
4702A6k9j84K37k00j74J79L6J09O8P3k47k5J94N4j32K9P1j84K85k75q9J03p1K52
4726I6j65N3J84Q4k95lQ6Lj11oK06j53M17l27M9j07P6m6J16R3J8k15J5L9j63J78
4752A22lJ66m01N2j0J58j16l5J85k9n8l4J56j22m8q5j46L59l18P6Q1j95J35K75
4776A65k84k70L41j79J72lQ7k34K5R4Jj31K53p34N27P8k05M0J55J89n6j6j86K82
4800A11K4J07l20J76j61K63j32J82j64J38k27R1O8o0q4L98l88M0K15j81j12k8
4822d4L68j2j09m00N84l93L34k14j9j89OK61j0l62J48K81n10L05r1k07M04j68
4844c7j57M6P1K39n5k76PN8o0P6J24j90Q4k7p3j18L01qQ7m1j04j74K04k08K00
4869c1Q5j03L8j60K68J45j10j28K39l85Q7L88j73l78K88m9J48j76L04l02K64j61
$$ plain form
4891 98 236 140 156 65 -111 136 300 284 52 87 79 177 30 200 -25 106 73 38 106 -143 -151 -71 -7 -258 -83
4916 -83 101 -219 24 -344 75 -231 42 -212 -270 -398 18 -355 -22 -132 -126 -85 11 -60 -246 15 -232 -106
4938 -106 -47 -219 24 -69 -320 -9 24 -101 -197 -20 -205 16 54 26 -76 -6 247 -55 -63 220 131 169 -464 155
4962 155 139 208 223 140 96 308 83 -23 -88 96 208 -84 43 361 160 77 82 271 68 44 108 -211 -43 124
4986 124 -107 148 78 -157 -114 250 -264 -60 90 -142 -149 -431 -149 -293 -154 -77 -177 -23 -109 -137 -126 42 -116
5009 -116 138 -231 -115 -129 107 -11 -36 -90 42 -142 -71 149 14 -178 94 316 -10 3 109 5 159 -86
5031 -86 -116 17 -18 303 274 65 334 104 243 -320 -79 133 65 213 77 190 189 5 206 39 43 -49 42 141
5055 141 -138 226 -59 121 266 -156 -90 -224 -193 112 178 -139 -72 6 -102 23 -250 -245 -124 -229 -154 -106 42
$$ packed form
4891I8J38r6J6r1j76K47J64j6k32L5qR8j47J70k25J31l3l5O8k49qQ0O4k51J75
4916h3J84l20K43l68M19l06K73k54n8j28M16l73L33j10OM1R6p1j86K61k47J26
4938a06N9j72K43r3k51L11L3j25r6J77j85K21L8k8j02P0K53l02qK83q9L8o33O19
4962A55j6O9J5q3m4K12k25j06o5J84J12k92J27L18k01q3NJ89k03k4O4l19J68J67
4986A24k31K55p0k35M3L64n14K04J50k32pk82K82j44J39P7j00J54q6k8J1J68j58
5009a16K54l69J16j4K36j18k5n4J32j84P1K20j35j92K72K22l26J3J06j04J54k45
5031h6l0J33l5L21k9k09K69k30J39n63K41K12o8J48j36J13jj84K01j67Mr2R1R9
5055A41k79L64k85J80J45m22O6j34L1L05O6l17O7P8j08J25k73NJ21j05P5M8J48
$$ plain form
5078 42 -308 200 -321 43 -237 -430 -125 -281 249 -153 -221 -82 28 8 10 -79 -191 272 -206 -109 -30 -6 150
5101 150 92 -152 103 -60 -362 37 12 163 199 -81 71 29 -93 95 -34 21 52 -164 -114 339 232 163 65
5124 65 198 233 142 114 182 -158 49 -159 -49 -72 -9 23 172 -36 -215 66 -262 120 55 -61 -68 -130 -94 -10 -128
5149 -128 -237 -132 -330 -31 -50 -428 -107 -404 -30 -200 58 69 -95 147 -74 -296 -221 17 -50 52 -198
5170 -198 259 -242 32 -132 68 -80 -208 -110 -206 -37 177 13 230 142 24 78 -149 111 143 97 88 211 -56
5193 -56 233 -233 229 -120 -160 102 45 186 241 133 125 191 28 -32 118 16 -228 190 412 125 -13 166 -63
5216 -63 42 29 156 -13 -15 67 -100 54 -66 -120 -90 -17 -266 -190 -83 -158 -61 170 -146 -208 -116 -251 -79 -291
5240 -291 83 10 -88 303 198 35 -71 55 -26 -158 -155 96 152 -12 -235 286 -40 129 -43 -97 -15 -115 -119
$$ packed form
5078D2l50N08n21L64k80j93L05j56N30m02o8J39J10k0Kq9j12M63m78R7P9K4J56
5101A50n8k44K55j63l02L99k5J51L6k80J52m2j22J88j29N5L1k16N0M53j07o9r8
5124F5J33L5r1k8O8l40K07k08J10k3O3L2J49k08j79K81l28L82o5j16po2L6Q4j18
5149a28j09J05j98K99j9l78L21k97L74j70K58J1j64K42k21k22P5K38o7J02k50
5170a98M57n01K74j64K00j48j28R8r6J69K14j64K17q8j18N4k27K60L2m6rJ23k67
5193e6K89m66M62l49m0K62n7J41N5j08qO6j63o0J50j02k44M18K22k87j38J79k29
5216f3J05j3J27j69kQ2j67J54j20n4L0P3k49P6J07p5R7K31l16o2R2j35J72k12
5240b91L74p3r8L91j05j63j06J26q1j32LK51N6j64k23N21l26J69j72n4Q2j00m
$$ plain form
5263 -119 49 259 -70 40 17 201 369 191 191 34 184 73 -17 148 -70 -28 107 -131 -125 183 16 25 -5
5286 -5 -228 38 48 -44 -86 -110 40 -2 -84 -148 42 -117 84 -82 -149 11 -157 -149 -153 -86 -166 -64 -59 -323 -24 -202
5312 -202 -59 -67 -218 -206 -160 274 10 -28 112 11 -257 -181 75 -65 -76 65 10 134 -134 87 131 -77 76
5335 76 -146 238 -1 166 -83 60 117 142 -131 226 151 -13 233 357 157 -38 27 164 286 -99 107 6
5357 6 57 6 -243 -165 -118 -97 -129 -56 -24 -289 -79 103 -185 -249 -126 -4 79 -35 -49 -105 -174 -107 -46 89 -93 -133
5383 -133 -38 -48 171 292 -69 70 -95 -60 73 -97 130 314 -128 -76 -94 86 -134 58 165 53 -22 -63
5405 -63 89 -243 -98 211 310 102 333 211 -150 207 20 237 -53 130 291 -2 230 80 207 57 -13
5426 -13 8 131 90 -8 -230 241 -71 -167 172 -203 87 27 -172 78 30 -156 -51 -104 -92 -152 -72 -191 -176 -37
$$ packed form
5263a19J68K10l29J10k3J84J68j78%j57J50j11r0J65k18M2J35k38OL08j67Rl0
5286ek23K66J0r2m2k4J50m2q2o4J90j59K01j66o7J60j68QmO7q0J02Nk64K99j78
5312b02J43qj51J2M6M34k64l8J40j01k68P6K56j40j1J41n5J24k68K21M4k08J53
5335G6k22L84k39J67k49J43N7K5k73L57p5j64K46J24k00j95O5J37J22l85K06j01
5357FN1n1k49P8M7K1l2P3L2k65K10J82k88o4J23J22Q3j14j4n6o9O7O1J35j82m0
5383a33R5j0K19J21l61J39j65L5J33j70K27J84m42N2j8J80k20J92J07j12p5m1
5405f3J52l32J45L09R9k08K31j22l61L57j87K17k90J83J61k93K32j50J27j50p0
5426a3K1J23m1r8k22M71l12r6L39l75K90o0j99K50m8j86J05n3J2o0Q0j19J5J39
$$ plain form
5450 -37 74 -190 -115 72 65 208 -102 -94 -162 -53 -91 136 122 78 226 13 -146 -89 197 -159 56 -39 -94 45
5474 45 405 -108 -158 61 49 -140 97 -74 107 182 -22 -76 -36 276 110 12 123 134 88 87 189 183 109 317 25
5499 25 143 297 144 -23 266 305 90 121 -30 -12 112 -92 -158 -105 52 -21 -74 -60 -23 37 -126 16 -162 235
5523 235 180 -301 -25 90 -110 -150 67 -54 -68 -201 -201 0 -190 1 31 35 47 228 -72 -103 -89 131 29 -139
5547 -139 184 -289 -71 316 91 -8 100 -32 -18 392 187 106 -122 110 89 262 31 -39 142 10 261 143
5569 143 35 188 -10 217 340 124 -92 -80 -9 -2 72 -92 198 30 98 28 188 155 136 -184 226 -20 -228
5592 -228 -152 159 -64 -81 -27 -7 -3 -54 -124 -45 -30 -258 23 -223 -21 32 -26 -93 67 -61 -290 -381 174 163 111
5617 111 -9 -17 29 67 -201 235 -206 23 -258 -135 457 -316 -183 247 -24 -302 -88 549 592 -305 37 233
$$ packed form
5450c7J11k64P5J87pJ43l10Qo8J09l8K27j4m4J48k13j59N7K86l56K15r5n5J39
5474D5L60n13n0K19j2j89K37j71J81P5k04n4M0L12j66r8J11J1m6jJ02op4K08k92
5499B5J18J54j53j67K89L9k15L1j51J8J24k04o6N3J57p3n3J4L7O0j63J42j78L97
5523B35n5m81K76J15k00m0K17j21j4j33%K01j90J91L0MJ2J81l00l1J4K20j02j68
5547a39L23m73K18L87k25r9J08j32J4M10k05q1k28K32k1J73k31p0J81j32K51j18
5569A43j08J53j98K27J23k16k16J2P1PP4j64K90j68O8p0J60l3j9l20M10k46k08
5592b28P6L11k23j7N4K0Mn1p0P9J5k28K81k46K02N3n8o7J60j28k29r1N55j1n2
5617A11j20qM6L8k68M36m41K29k81J23N92p73J33M30k71k78K14O37M3q97L42J96
$$ plain form
5639 233 -434 -1033 747 -233 141 -179 86 -300 243 87 154 178 -1 -22 65 69 -241 90 -175 -241 -153 -33
5661 -33 -33 -51 -45 228 -38 -261 159 -47 -36 154 -220 58 -60 -173 -88 -100 -119 -116 -68 6 -305 28 -93 -278 -397
5686 -397 -75 21 -95 5 51 35 39 -329 -113 38 -68 -4 -219 63 -206 -2 -23 175 83 53 105 -48 115
5709 115 344 41 238 105 61 20 226 191 188 169 91 55 -11 173 242 -39 118 100 -48 241 76 -125 -398 -115
5733 -115 157 879 327 345 -260 338 -180 -191 241 -55 151 -23 -54 -262 -328 -367 -156 -195 -101 -105 -100 -225 -141 -162
5757 -162 -150 -8 -80 49 -52 -140 -43 67 -61 60 4 -63 35 -146 -5 19 208 100 94 -19 15 -29 62 -64
5781 -64 -21 150 89 249 15 -13 -65 -46 -111 120 181 71 -46 -43 -66 1 245 -102 -71 -155 125 191 166 423 96
5806 96 -523 -476 211 -589 -70 -383 12 -297 -6 40 -33 9 -181 106 12 59 -175 -174 -123 -174 -91 -8 11 -195 244
$$ packed form
5639B33o67n99J780r80L74l20K65l86N43j56O7K4j79k1Q7Ml10L31k65o6Q8J20
5661c3%j8OK73k66k23M20k06J1J90l74K78j18j13Q5j2j9LM8P4l11L33j21j85j19
5686c97L22R6j16J00M6j6Ml68K16J51j06O4k15K82k69K04k1J98r2l0N2j53J63
5709A15K29l03J97j33m4m1K06l5lj9p8l6o6J84O9k81J57j8j48K89j65k01k73K83
5733a15K72P22n52J8o05N98n18j1M32k96K06j74l1k08o6l9K11l9R4mNj25Q4k1
5757a62J2J42p2J29j01q8R7J10j28J21n6o7R8j81J41K4J89j08oj13L4m4R1j26
5781f4M3J71o1J60k34k8n2J9o5K31O1j10j17Lk3O7K44l47L1q4K80O6k5K57l27
5806I6o19M7O87q00N19l13L95l09K91M6p3M2j90K87r4M7k34JN1n1Q3Q3J9k06M39
$$ plain form
5831 244 -321 118 208 -386 -201 -226 -84 -324 -189 -208 -114 -31 -212 6 291 -165 -116 168 -116 170 -46 58
5853 58 -25 4 143 -17 12 -111 97 -31 133 184 -56 26 85 218 294 -52 289 -7 -73 -10 -200 -2 -191
5876 -191 -17 -135 94 -111 -125 -51 4 -127 -59 -84 -202 -25 -70 71 -125 -92 41 -437 -1 -320 359 376 -30
5899 -30 425 -104 -329 -230 -76 8 -121 48 -24 -235 125 -148 51 73 -171 158 -59 134 86 -173 -139 -220 -214
5922 -214 -124 90 108 -18 73 238 -101 -87 -200 55 12 -60 111 6 174 204 -228 15 -53 -42 6 -185 -47
5945 -47 120 256 -67 193 128 131 96 132 26 77 13 -186 -87 -125 59 -176 -31 -43 -317 -54 -167 120 77 -56
5969 -56 -32 -227 -308 -76 -305 -38 80 -62 132 -74 -252 -39 -164 -5 156 -80 74 8 -359 -241 -128
5990 -128 -195 -100 -177 -62 114 4 -338 46 121 -10 70 58 56 175 163 -54 38 -14 -78 150 31 -104 78 141
$$ packed form
5831B44n65M39R0n94J85k5J42k40J35j9R4Q3j81K18K85m56M9K84k84K86k16J04
5853E8q3K9J39j60K9j23K08j28J64N1k40Q2N9J33P6l46L41k96o6O3j90J98j89
5876a91J74j18K29k05j4P4N5j31O8k5j18J77m5J41j96L3J33m78M36l19O79J7m06
5899c0M55n29k25R9J54Q4j29J69p2k11L60k73J99K2k44L29k17J93m8k59L4q1O
5922b14R0K14J8j26R1J65l39J4j13K55m3p2J71j05J68L0m32K43o8J1M8j91J38
5945d7J67J36l23K60o5Ll5L6j06N1o4j99R9l8J84k35J45j2k74K63j13K87m3j33
5969e6K4j95q1K32k29K67J18j42J94k06j78K13j25J59J61k36J54o6l67J18J13
5990a28o7R5p7J15J76j10l42L84P5j31Q0j2kJ19j2k17R2n2o4K28j19j35J82O3
$$ plain form
6014 141 14 27 79 54 75 -58 -38 136 241 -198 91 -112 -188 147 -98 -92 85 -81 -93 -241 91 141 -260
6037 -260 -226 -31 166 -149 -78 -40 56 -128 -113 -145 111 -308 -40 -26 -70 -232 -40 -94 194 -292 -110 -281 -133
6060 -133 -166 -351 -86 404 311 -277 60 -330 321 193 -212 272 -76 280 270 -172 -493 149 62 62 175 -244
6082 -244 -77 1 197 75 67 255 -95 79 -117 19 373 260 156 113 -186 143 -4 -166 -38 117 90 51
6104 51 157 12 71 -178 -88 -84 -90 196 -121 -11 115 119 144 -185 61 -230 -168 55 -120 98 128 208 -184 -71
6128 -71 -94 -400 -102 -330 0 49 9 -45 -161 229 -82 10 203 -160 -264 188 98 24 205 -1 107 -15 -310
6151 -310 -34 -111 -120 -175 58 -146 -98 -60 -15 213 168 79 346 -150 -191 -59 7 125 167 136 69 77 -14 90 241 83
6177 83 190 215 237 -131 -59 134 67 35 -46 -17 -125 212 2 -31 -293 -135 -104 9 75 236 -65 -156 14 -176
$$ packed form
6014A41j27J3N2k5K1j33K0J74J05m39K89k03p6L35k45OJ77j66j2j48L32N0m01
6037b60L4J95J97l15P1L8R6j84J5l2K56m19K68J4m4j62J92n4K88m86J82j71J48
6060a33l3j85K65M90r3n88L37l90O51j28m05M84l48L56j0m42l21O42q7%J13m19
6082b44J67P8J96j22qJ88l50J74j96J36L54j13j04m3k99L29j47j62J28J55k7l9
6104E1J06j45N9k49R0MoK86l17J10J26MK5l29K46k91O2K23j75K18L0Q0l92J13
6128g1k3l06K98k28L30M9m0n4j16L90l11R2J93l63j04M52r0p4J81k06J08j22k95
6151c10K76p7rn5K33k04M8L8M5K28m5q9K67m96m1J32O6J18M2l1o7Qr1J04J51j58
6177H3J07K5K2l68P2J93o7l2q1K9j08L37k10l3k62J58L1J13O6J61l01r1J70j90
$$ plain form
6201 -176 -118 -429 -192 -62 -150 -41 -156 -233 -286 -221 284 -164 103 234 -233 -526 62 162 94 -499 -655 207
6223 207 -145 899 -204 200 -651 116 -134 -145 724 -19 201 138 91 46 81 195 7 49 -63 -46 -158 184
6245 184 6 49 -20 10 31 257 238 85 144 110 34 63 129 22 -18 -124 122 199 26 -108 -112 65 -60 16 -84
6270 -84 -27 160 -24 -92 -257 -217 -3 -143 135 -39 -43 -160 -256 42 120 -263 -157 24 -69 -60 -118 -169 -121 107 96
6295 96 83 -308 -2 -22 -34 169 -141 -132 117 11 -38 -11 27 132 199 9 133 -146 215 -131 -106 307 -10 51
6319 51 -29 29 -183 154 52 -38 159 -7 23 -66 51 -147 -45 -82 101 72 -67 83 -14 14 -156 -179 222 161
6343 161 99 -205 176 -158 -182 93 51 -89 -47 107 3 -167 -85 -68 38 -127 -194 -225 69 -246 13 237 -115
6366 -115 100 -109 -33 214 -533 -87 -69 1 -340 -232 -435 262 635 -140 83 -134 55 -216 26 0 308
$$ packed form
6201a76N8l11K37J30q8J09j15p7n3O5N05m48K67J31m67k93N88J00o8n93j56Q62
6223B07l52J044j103M04q51P67k50j1Q69p43K20o3m7m5L5J14j88M2j12J7j12L42
6245A84j78M3o9L0K1K26j9j53N9l4p6K9O6j07m0j06K46P7j73j34mJ77j25P6j00
6270h4N7J87j84o8j65M0K14j40K78j74mj17r6K98P8l83J06J81r3Rn8n1M8K28j1
6295I6j3l91L06k0j2K03l10RK49j06m9K7L8J05O7j90J24k79L61l46K5M13l17O1
6319E1q0N8k12L37j02r0J97j66L0q9J17j98J02l7J83k9j39J50r7K8j70k3M01o1
6343A61o2l04L81l34k4K75m2j40M2J54j04j70Q2J7J06j65o7l1K94l15K59K24l52
6366a15K15k09P6K47p47M46J8P0l41J08k03O97L73p75K23k17J89k71K42k6L08
$$ plain form
6387 308 -60 -107 -70 -4 -142 174 91 163 357 -67 245 339 221 -443 -180 512 137 642 -160 52 -303 -23
6409 -23 19 453 144 -208 -117 20 165 -149 85 -176 -30 -122 187 130 108 -272 -24 -167 -135 33 139 -106
6431 -106 34 -83 8 -215 -176 125 -81 -188 48 63 110 -164 90 58 -142 140 48 12 -43 264 -17 -165 20
6454 20 204 -58 305 19 112 155 11 123 -11 79 44 66 103 -194 -26 66 -76 86 188 404 17 109 -112
6477 -112 -99 2 162 -89 24 62 -2 -38 86 -139 16 67 -30 24 59 -38 102 0 -26 195 -195 -4 -127
6500 -127 111 -65 40 123 73 -35 -28 -41 -91 0 -407 -2 -217 -142 -79 83 -148 -174 -124 -132 93 -7 64 43 107
6525 107 -129 58 -135 -76 -192 3 29 3 -139 171 84 68 80 5 226 272 166 148 103 -168 116 150 250 206
6549 206 -341 170 -227 -129 231 177 -44 -99 95 89 -140 109 128 -53 71 -278 -289 7 11 -82 -221 -43 -97 -57
$$ packed form
6387C08l68m7L7O6j38L16q3P2J94m24L12R4j18o64K63O92l75N05q02K12l55K80
6409b3M2M34l09l52R1J37J45l14K34k61J46r2L09n7k2l80K48j43L2J68J06k45
6431a06J40j17R1k23L9L01k06j07K36J5M7k74K54l2k00K82r2l6n5L07k81j48J85
6454B0J84k62L63k86R3M3j44J12j34R0l5K2L7k97J68R2j42J62J02K16l87R2k21
6477a12J3J01J60k51J13L8o4l6J24k25J55N1r7N4L5r7J40j02k6K21l90J91j23
6500a27K38j76J05Q3n0j08Pj3n0R1m07M05k15P5O3J62k31k6N0qK25j00P1k1O4
6525A07k36J87j93N9j16J95K6k6j42L10q7j6J2p5K21M6j06j8m5k71K84L4J00m4
6549B06n47N11l97R8L60n4k21n5J94ok29K49J9j81J24l49j1K96Mr3j39J78n4M0
$$ plain form
6573 -57 -111 -30 155 -106 -144 220 -49 -13 -89 -156 -158 7 -204 1 -23 -149 -137 76 -32 21 7 -28 94 95 102 -316
6599 -316 13 85 -64 200 36 166 119 -19 103 -24 -350 -23 -49 102 164 148 28 15 68 2 -32 -52 -57 251
6623 251 -42 72 28 -153 76 40 241 379 258 97 145 -92 152 -101 -86 167 -58 37 221 178 67 -199
6645 -199 -84 89 293 76 17 -55 -152 83 -327 213 -114 -312 158 -110 22 175 -128 -171 -148 39 -76 -11
6667 -11 -69 -10 25 -141 186 -143 -33 -128 -10 -335 -152 -230 -53 -239 11 -53 94 120 -218 213 -62 227 47
6690 47 49 48 178 63 92 157 69 157 109 119 39 20 -55 -173 -93 168 73 28 -6 -203 102 -13 -89 217 -164 -183 32
6717 32 -78 116 -68 -62 -34 -130 66 -107 223 97 -36 -217 -193 -104 -5 -11 188 263 0 -148 -99 -44 -117 -43 19
6742 19 88 47 -126 56 -38 119 100 -184 -30 -33 122 171 251 -26 186 -147 107 95 100 33 10 285 65 -116 29
$$ packed form
6573e7n4Q1J85k61l8L64k69L6p6o7kJ65k11K05k4j26J2K13j08N3j4l5J22JPm18
6599c16L29P2j49K64j64J30m7j38J22j27l26L27k6J51O2j6j20j3N3o6l4k0nL08
6623B51k93J14m4j81K29l6K01J38j21j61M8k37K44k53J5K53k25R5J84m3j11k66
6645a99J15J73K04k17n9p2r7K35m10N40l27j98M70k68J32J53l03m3K3J87j15O5
6667a1n8N9L5j66L27l29J10r5J18l25J83p8J77j86K50o4J47K6l38M31k75K89j80
6690D7KjJ30j15K9O5q8Q8m8J0q0j9p5j18Q0K61r5m5l4j97L05j15p6L06l81j9K15
6717C2j10J94j84OK8r6J96j73L30j26j33j81K4Q9R9oJ99P5k63j48M9N5p3P4O2
6742A9O9m1j73J82r4J57j9k84J54lJ55M9Q0k77K12l33K54j2No7k3K75k20j81J45
$$ plain form
6767 29 14 200 -347 -32 -15 53 115 126 -73 -73 -12 -24 77 165 67 88 75 -305 -134 -166 167 187 116 192 126 -196
6793 -196 -90 148 12 197 -48 259 -92 -25 -98 59 51 -132 58 24 113 32 41 -336 12 -122 -155 -97 -154 -60
6817 -60 -49 70 246 378 -209 7 -36 205 -89 -43 -117 277 5 46 225 79 164 196 99 -27 212 -88 75
6840 75 229 -62 71 219 -65 -145 321 -67 -30 -272 -239 127 24 159 126 -153 23 146 21 46 170 -114
6862 -114 -117 -27 -45 -143 29 -10 -136 -200 60 30 -107 -18 -99 43 -106 -304 -65 -95 -71 -118 227 42 86 -287 -98
6887 -98 -41 -183 113 -14 49 -270 -69 -134 -161 99 105 -7 -46 -179 23 -138 -53 -98 117 101 284 -16 151 -61
6911 -61 92 -51 111 -116 -72 55 188 231 77 -28 -425 68 66 181 -82 11 -94 75 283 277 -136 74 -44
6934 -44 -102 -4 182 15 95 166 -153 -145 -65 -5 -18 -228 -127 -270 -102 11 -104 -131 -35 -74 -116 84 -255 -73 -20
$$ packed form
6767B9j5J86n47L15J7O8O2J1j99%O1j2J01Q8r8K1j3l80J71l2L33K0p1P6o6l22
6793a96J06K38j36J85k45L07l51O7p3J57qj83J90l4Q9q1Rl77L48j34l3N8n7R4
6817f0J1J19J76J32n87K16m3K41k94M6p4L94k72M1J79j46Q5L2r7j26K39l00J63
6840G5J54k91J33J48k84q0M66l88L7k42L3L66j03J35l3k79J76J23j25K5J24k84
6862a14lR0j8r8J72l9j26o4K60l0j37Q9q1J42j49j98K39l0K4m7L45j85M4l73J89
6887i8N7j42K96j27O3l19K01o5k7K60Oj12l9j33K02j61Q5m5K15j6J83l00J67k12
6911f1J53j43J62k27M4J27J33M3j54j05l97M93kJ15k63R3j05J69K08om13K10j18
6934d4n8R8J86j67Q0P1l19QQ0O0j3k10J01j43J68J13j15k7R6l9m2K00l39J82N3
$$ plain form
6959 -20 15 -127 25 34 -294 -306 -64 -68 -295 49 105 78 -95 -131 250 -77 -18 201 118 -58 -122 110 93 76 190
6984 190 185 41 -38 188 -350 3 86 101 24 -122 -38 154 61 2 -22 74 145 69 3 76 -54 29 88 -141 271 43
7010 43 -52 48 -80 -101 116 -26 135 67 50 -218 -347 112 -117 149 143 -12 -147 8 33 -363 184 -32 119
7033 119 -77 -55 -21 -46 51 72 -53 -259 -266 165 46 27 -102 43 -106 -66 -248 237 15 26 -202 -159 97 -165
7057 -165 147 -129 89 -136 29 179 150 -116 26 -56 -32 -123 219 -35 -147 199 204 173 -129 -255 -184 -306 62
7080 62 -111 -8 50 32 97 60 190 105 -95 -23 -5 150 148 -180 -132 22 258 -140 138 -288 -54 -149 94 -202
7104 -202 -348 56 -36 -67 -17 -64 30 90 -156 -100 26 -174 -169 49 -69 109 -45 217 -35 -240 -77 -23 67 19
7128 19 46 56 28 -58 97 -248 -180 -6 -241 -118 -124 -16 -90 20 -95 59 -197 264 -61 -1 31 165 -180 -11
$$ packed form
6959b0L5j42J52Rl28j2K42mk27L44N6k7j73l6L81l27N9K19q3j76o4K32j7j7J14
6984A90nj44p9K26n38L53Q3J5p7j46Q4J92r3n9k4R6P1p6o6P3j30Q3N9k29M12k28
7010D3r5J00j28k1K17j42J61o8j7k68j29M59k29K66oj55j35J55K5l96N47k16J51
7033A19j96K2L4k5R7K1j25k06pM31j19j9j29J45j49M0j82M85k22J1k28M3K56k62
7057a65L12k76K18k25J65J50k9k66J42q2K4r1L42k54j12L46Nl1l02j26P1j22L68
7080F2j73J03N8j8O5l7J30q5k00P2J8J55kl28M8J54K36l98K78m26K34r5K43k96
7104b02j46M04r2l1N0m7R4O0k46N6J26k00NK18j18J78j54K62k52k05J63N4R0m8
7128A9K7J0k8q6J55l45O8J74k35J23oJ08p4J10j15J54k56M61l25O0L2J34l45J69
$$ plain form
7152 -11 76 -1 220 -51 148 143 98 -72 28 375 -65 -239 35 85 61 -12 75 62 -101 -96 -44 32 -15 -220 103
7177 103 -117 226 -202 -144 -101 45 -195 -104 -213 -203 -48 -114 -154 42 2 -53 -131 230 42 30 6 -134 43 -74
7201 -74 18 71 -61 210 -86 -78 14 -49 222 10 -278 247 54 -19 -4 389 493 -201 66 47 136 169 -150 -69
7225 -69 -122 49 0 91 104 220 -121 22 280 31 81 7 -34 7 111 3 -132 -174 -167 84 -5 -444 -107 -327
7249 -327 -3 -78 135 117 70 -191 -25 7 346 31 -51 -74 121 109 154 -21 97 201 -179 -210 -132 -70 45 -173
7273 -173 52 13 167 3 -113 176 29 -146 283 23 101 196 -280 173 -16 -172 -252 81 50 253 229 -24
7295 -24 -170 -3 121 152 87 24 -50 97 321 -81 90 234 -18 222 -100 -42 214 -146 126 -15 -153 186
7317 186 16 -345 97 -18 -121 -239 173 -66 -18 -78 71 -155 -380 -60 -12 -69 62 -168 -149 -167 -84 134
$$ packed form
7152a1Q7p7K21k71J99nm5j70J00L47m40j74K74N0k4p3Q7j3j63NN2P6m7k05L23
7177A03k20L43m28N8M3J46k40R1j09J0J55o6m0J96m0n5p8L61j88j2k4j40J77j17
7201g4R2N3j32K71k96QR2o3K71k12k88N25j93p3J5L93J04o94K67j9Q9L3l19Q1
7225f9n3J71m9R1J3J16l41J43K58k49N0p4m1M1J04j08j35m2PK51q9m39L37k20
7249c27L24p5K13j8m7k61J66L2L39l15q2k3J95j2M5j75J18J04l80l1P8O2J15k18
7273a73K25l9J54j64j16K89j47j75M29k60P8R5m76M53j89j56q0L33l1K03k4k53
7295b4j46J67J24L1o5o3p4J47K24m02J71J44k52K40l22N8K56l60K72j41j38L39
7317A86j70l61M42j15j03j18M12k39M8o0J49k26k25L20M8n7J31k30J9j8Q3K18
$$ plain form
7339 134 111 96 -45 -52 -207 120 -3 98 158 -13 -252 -23 12 -99 53 18 -232 -25 -82 -49 90 -160 114
7362 114 -6 193 188 130 53 113 80 -90 180 52 26 195 -89 77 -2 94 -128 -8 -84 135 23 -30 65 11
7386 11 71 100 -67 -72 -29 138 -94 -81 -172 -27 96 75 -184 -216 12 25 148 -223 248 204 -74 78 -21 63 -180
7411 -180 122 66 99 -90 124 -140 343 -518 -194 -218 -55 202 -99 -217 -162 81 4 22 -189 -142 53 40 180
7434 180 -225 -122 201 154 42 -22 -70 -200 203 -22 120 -82 -119 178 83 -4 16 356 71 -100 -47 -147 105
7457 105 -28 -126 110 -69 35 6 142 -240 25 56 92 92 -9 -69 -149 61 -244 346 218 26 -40 6 -261
7480 -261 -23 -275 73 153 40 -195 -192 -226 -245 303 149 8 230 117 212 331 284 -382 -147 -249 24 65 221
7503 221 -288 177 177 396 89 16 184 376 -153 481 318 373 185 230 -91 302 217 -46 48 -257 420 300
$$ packed form
7339A34k3j5j41pj55L27j23J01O0j71k39K29L5j11J52l5k50K07n7L3J39k50K74
7362A14j20J99nn8p7O0l3j70K70j28k6J69k84J66p9R6k22J20p6K19j12n3R5n4
7386A1O0K9j67nM3J67k32J3r1J45J23k1k59l2K28J3J23l71M71m4k78J52r9Q4k43
7411a80L02n6L3j89K14k64M83q61L24k4J63K57l01j18N5K43p7J8k11M7J95j3J40
7434A80m05J03L23m7j12o4m8j30M03k25J42k02l7K97r5q7K0L40k85j71N3j00K52
7457A05j33r8K36j79J04k9J36l82K65L1L6%j01o0q0K10l05N90j28j92o6M6k67
7480b61K38k52L48Q0j13k35Ll4j9N48j54j41K22j13R5J19m7o66K35j02K73M1J56
7503B21n09M65%K19l07p3J68J92n29O34j63N5j88M5l21L93q5k63R4l05O77j20
$$ plain form
7525 300 152 -468 134 -584 8 253 25 158 678 -102 -240 -208 130 292 97 -190 63 -451 5 557
7545 557 -147 -369 -323 409 -183 -322 295 102 298 317 -85 182 -97 -4 -279 261 199 265 -302 382 -201 41
7567 41 287 -323 -242 -442 224 298 -108 -190 147 -437 15 -111 -11 -420 555 101 -449 -99 112 -111 -358
7588 -358 -459 238 -517 491 0 48 398 517 939 197 -8 -830 62 -421 104 97 167 592 -403 455 -515
7609 -515 -112 135 -336 87 -59 1 -203 69 -506 -40 107 276 522 187 -361 78 -212 -504 189 31
7629 31 55 50 234 -792 -331 117 332 322 -139 -101 -197 -832 -39 511 -197 21 -400 213 -1467 494 678
7650 678 967 200 883 399 455 710 -19 83 -163 120 1493 76 -120 -303 -779 435 -15 -907 -382
7669 -382 869 -838 425 350 620 336 946 538 29 159 -135 -122 -87 -70 -214 79 86 131 142 -367 162 136
$$ packed form
7525C00j48o20O02p18N92K45k28J33N20p80j38L2L38J62j95k87K53n14M56N52
7545E57p04k22M6P32n92j39O17j93J96J9m02K67k79R3k75N40o2O6n67O84n83K42
7567D1K46o10Q1k00O66P4m06q2L37n84M52j26J00m09R75m54n50L50K11k23k47
7588c58j01O97p55J008m91M8L50J19M22p42k05q22Q92m83N25pP0M25r95Q58r70
7609e15M03K47m71M23j46O0k04K72n75M66J47J69K46l35n48M39k90k92O93j58
7629C1K4nJ84j026M61M48K15j0m61L8r6o35P93N50p08K18m21O13j680J961J84
7650F78K89p67O83m84N6K55p29J02k46K83J373j417j96j83m76J214m50q92N25
7669c82J251j707J263p5K70k84O10m08n09J30k94J3L5J7j44K93PM5J1n09N29k6
$$ plain form
7691 136 -123 -179 -44 28 10 -199 -96 7 76 58 -167 -134 127 -128 28 -50 21 46 41 -113 -123 -172 -168 -402 -270
7716 -270 -79 -149 28 58 -20 129 88 -148 146 -120 -106 -22 -123 -20 -44 -371 293 -121 -176 73 123 202 30
7739 30 -267 221 88 136 -128 213 70 -118 8 62 -154 94 -36 -218 -122 -18 -37 85 -309 182 -198 -61
7761 -61 -135 -28 -13 -27 196 -246 -202 -343 73 215 92 96 179 0 56 55 48 -295 28 88 37 2 235 -170 147
7786 147 -198 -67 79 56 -57 -34 -423 -19 245 -12 -229 77 138 68 206 -9 13 125 95 -205 77 102
7808 102 -95 -122 15 -228 108 -73 43 260 96 -158 167 -122 16 -13 -123 27 -245 21 -38 -77 125
7829 125 249 12 15 -71 17 83 -146 -184 55 14 -149 178 24 -83 -177 -1 -62 135 237 -18 -6 -64 -171 -109
7853 -109 96 96 -17 100 -127 73 -127 -15 34 78 15 -144 96 -124 -59 -145 1 -24 -51 31 134 -36 -298
$$ packed form
7691A36k59n6J35P2j8k09J03J03O9j8k25L3K61k55J56p8P1K5nj54j0m9Mk34J32
7716b70J91p0J77L0p8J49m1k36K94k66J4Q4j01J03k4l27O64m14n5K49N0P9j72
7739C0k97M88j33M8k64L41j43j88J26N4k16K48j30j82R6J04j9J22l94M91l80J37
7761f1p4J07J5j4K23m42M4j41M16J42j23MQ3j79N6jpl43L23O0n1l5K33m05L17
7786A47l45J31J46k3j13K3l89M04K64k57k17L06O1p0J38k15K2J12l0l00K82K5
7808A02j97k7J37k43L36j81J16K17j64k54L25k89J38k9j10J50k72K66n9l9K02
7829A25J24k37Lq6Q8O6k29l8K39m1j63L27j54j07r4J76o1J97J02k55J2n8j07O2
7853a09K05%j13J17k27K00k00J12M9M4o3j59K40k20O5q6J46k5k7Q2J03j70k62
$$ plain form
7876 -298 316 -141 178 223 123 98 -224 5 -31 -25 155 -211 -57 36 6 -83 -101 49 0 -179 -75 -150 49 239
7900 239 -22 48 -33 -1 -38 -141 99 1 -7 128 27 52 19 20 -179 -166 -47 -33 -55 -108 163 -24 -42 -304 44
7925 44 -114 -157 234 1 -253 -79 53 -65 -45 -64 -45 58 193 -182 -80 -59 -84 13 -16 26 -70 -35 128 379
7949 379 -82 191 -82 59 135 4 -142 4 -90 -100 -19 -278 -7 -70 -82 -215 -40 71 -70 202 -65 120
7971 120 141 -187 47 -9 -40 47 92 -78 138 63 65 115 83 -208 -103 195 -214 73 24 58 -130 64 28 -281
7995 -281 -148 -88 -8 -129 0 -14 -76 101 0 -83 143 107 67 14 118 23 92 -247 -75 -121 -22 38 98 37 -139
8020 -139 -27 -100 84 200 -135 -205 69 51 212 65 -124 184 -170 155 409 55 3 -23 147 -95 31 203
8042 203 148 295 62 -201 -211 96 -25 -95 -54 -208 152 178 181 -23 -117 4 -203 -11 16 -80 62 -74 152
$$ packed form
7876b98O14m57L19M5j00k5l22K29l6OJ80l66J54R3l0q9j8J50m9j79J04p5J99J90
7900B39k61P0q1L2l7j03K40r8qJ35j01K5l3Jj99J3J19J4k2n3K71j87j8k62L48
7925D4j58m3L91k33k54J74J32j18K0j9J9J03J35l75J02K1k5R7k9M2r6L5J63K51
7949C79m61K73k73J41P6j31j46J46r4j0Q1k59K71o3j2j33J75J11j41K72k67J85
7971A20K1l28K34n6l1Q7M5j70K16p5KN0l2k91J05K98m09K87m9L4j88J94l6l09
7995b81J33O0Q0j21J29j4o2J77j01q3K26l6m0n3J04r5O9l39J72m6R9O0O0o1j76
8020a39J12p3J84J16l35p0K74j8J61j47j89L08l54L25K54l54n2k6J70k42J26J72
8042B03n5J47k33k63j0L07j21p0M1j54L60K6Lk04r4J21k07J92K7r6J42j36K26
$$ plain form
8065 152 -31 -138 -177 0 -162 -306 117 -126 -266 -305 73 -123 57 -229 -42 63 0 -95 -198 -121 121 -148
8087 -148 260 37 -236 164 -234 -195 -78 -235 93 185 154 26 29 -21 -211 11 140 34 -208 -207 -64 5 31
8110 31 -82 -55 -50 -75 -168 98 -58 -125 121 131 13 22 -14 4 129 -6 121 90 -204 5 -13 -165 52 65 -331
8135 -331 -5 19 55 -196 -298 161 -166 -245 -8 -205 -119 84 -28 54 232 -153 -81 2 -64 27 -41 -66 -353 192
8159 192 -96 -247 47 -70 -49 213 73 -45 -260 -159 -49 -73 -52 -157 -179 -148 205 177 115 -97 -53 -18 -112
8182 -112 300 -20 110 67 26 -163 -82 145 23
$$ packed form
8065A52j83j07l9J77j62j44M23k43j40l9L78j96J80k86J87J05o3r5j03P7K42k69
8087a48M08k23k73M00l98L9J17j57L28R2l1j28Ln0j90K22J29j06k42JJ43O9K6
8110C1j13K7Nk5r3K66j56o7K46J0j18Rl6J8J25j35J27l1k94K09j8j52K17J3l96
8135c31L26K4L6k51j02M59l27p9K37j97Q6K03j12Q2J78l85P2Q3o6R1o8k5k87N45
8159A92k88j51K94j17K1K62j40j18k15J01J10k4K1j05k2L1L53k8o2k12M4L5r4
8182a12M12l20J30m3m1j89Q1K27j22
8191B3
$$ Imaginary data points
##PAGE= N=2
##DATA TABLE= (X++(I..I)), XYDATA
$$ plain form
0 0 0 0 0 0 0 0 0 0 0 0 0 0 -7 8 -8 8 -8 15 -16 23 -24 31 -32 39 -47 55 -63 74 -86 97 -111 127 -144 162
34 162 -184 207 -232 260 -289 322 -359 400 -441 489 -542 597 -659 727 -800 882 -971 1070
52 1070 -1181 1302 -1439 1595 -1772 1974 -2211 2493 -2831 3247 -3775 4466 -5416 6805 -9029
67 -9029 13164 -23366 101187 98622 -91499 95321 73329 -1926 13995 21909 71901 28176
79 28176 -30199 72290 28264 -24900 17270 9181 22728 7975 -19954 48388 9104 -36871
91 -36871 13499 925 -13559 -8148 -13556 21515 -14669 -38432 11458 -21366 -41539 -4460 -17202
104 -17202 -9471 -8457 -24917 2330 -11361 -32441 -3124 2085 -3186 -6799 6830 23340 -15008
117 -15008 -14225 24278 -3383 -14105 11274 14358 3268 -17238 -2961 8039 -27175 -20552 3540
$$ packed form
0@%%%%%%%%%%%%pJ5j6J6j6K3l1L9m7N5o3P1q6J02j18J37j60J83k08K38k71L06
34A62l46L91m39M92n49O11o81P59q41R30j031J139j256J386j527J682j853K041
52A070k251K483k741L034l367L746m185M704n324O078p022Q241r882J2221j5834
67i029K2193l6530J24553k565j90121J86820k1992p5255J5921P914M9992m3725
79B8176n8375J02489m4026n3164M2170q089J3547j4753k7929O8342l9284m5975
91c6871N0370j2574j4484N411n408L5071l6184k3763M9890l2824k0173L7079j2742
104a7202P731J014j6460K7247j3691k1080K9317N209n271l613J3629J6510l8348
117a5008P83L8503k7661j0722K5379L084j1090k0506J4277J1000l5214O623K4092
$$ plain form
130 3540 -7284 -10680 -16714 -10255 -782 -29046 -27027 4280 -4303 -19814 -3258 9427 -9763
143 -9763 -16234 -1873 -5432 -2821 1650 -5336 9213 6411 -12206 -3707 -2715 -1723 -89 -9868 12545
158 12545 13501 -17299 869 11284 -11011 -4014 7547 9128 5283 -2431 9113 3680 -12564
171 -12564 605 1016 -3013 4794 -3471 -394 845 -15137 -6908 -3462 -10503 -322 -2092 -1333 2552
186 2552 -9255 -1625 795 -8876 6941 9786 1228 9896 9638 3996 932 2202 10741 4420 3390
201 3390 14205 8150 1785 207 -178 3765 -2804 -666 9815 3519 1477 540 -1849 3620 -3094
216 -3094 -2869 12019 7015 2114 7246 4498 3436 -103 209 9783 7868 4265 8422 6720 4238
231 4238 -555 -1398 7377 5182 1870 9027 8681 2774 -389 17 4621 723 -223 8555 5416 -788
$$ packed form
130C540j0824l396o034O459R473k8264K019L1307q583j5511J6556J2685j9190
143i763o471J4361l559K611M471o986J4549k802j8617Q499R92R92J634r779K2413
158A2545R56l0800J8168J0415k2295O997J1561J581l845p714J1544n433j6244
171a2564J3169M11m029P807q265L077J239j5982Q229L446p041J0181j770P59L885
186B552j1807P630K420r671J5817K845q558Q668k58n642l064J270Q539o321j030
201C390J0815o055o365j578l85L943o569K138J0481o296k042r37k389N469o714
216c094K25J4888n004m901N132k748j062l539L12R574j915l603M157j702k482
231D238m793q43Q775k195l312P157l46n907l163M06M604l898r46Q778l139o204
$$ plain form
247 -788 681 -3638 -4961 -4064 -6039 -2563 -1220 -4365 -7099 -8834 -8106 -12070 -13025 -4460 -5883 -7876
263 -7876 -3003 -5684 -8197 -7759 -7287 -3189 -3288 -476 4000 -808 -804 59 -3648 -604 47 997 6480 1790
281 1790 -122 4229 -2042 -5174 827 1455 1396 2234 2952 3976 -1730 -3773 1709 -1072 -250 5726 2434
298 2434 3224 4135 -3740 -507 2871 -2709 1129 6387 3937 2018 -296 2154 1572 -4091 3186 8260
314 8260 1971 4572 6385 2111 2037 -621 1549 6828 1308 2384 7529 1124 -3310 -1740 -1273 -2498
330 -2498 -5347 -967 2306 -7062 -6130 -3199 -10216 -10334 -6690 -5179 -3955 -5892 -6128 -3930 -8353 -8663
346 -8663 -5303 -4566 -3107 -1994 -633 -403 -4237 -3245 -2020 -2785 286 1142 1754 3521 229 -209 857
363 857 -1005 1743 3012 2848 6074 3769 1128 3595 146 137 3453 1986 5024 4857 940 3136 809
$$ packed form
247g88J469m319j323Q97j975L476J343l145k734j735P28l964r55Q565j423j993
263g876M873k681k513M38M72M098r9K812M476m808MQ63l707L044O51R50N483m690
281A790j912M351o271l132O001O28n9Q38P18J024n706k043N482k781Q22N976l292
298B434P90R11p875L233L378n580L838N258k450j919k314K450n82n663P277N074
314H260o289K601J813m274p4k658K170N279n520J076N145o405m434J570M67j225
330b498k849M380L273r368R32K931p017j18L644J511J224j937k36K198m423l10
346h663L360P37J459J113J361K30l834R92J225p65L071Q56O12J767l292m38J066
363H57j862K748J269j64L226k305k641K467l449rL316j467L038j67l917K196k327
$$ plain form
380 809 -2139 1374 1002 1418 3530 1543 2303 525 -2506 598 -270 -987 4369 3117 533 2973 971
397 971 -904 322 309 3811 2846 796 4364 1965 -2658 468 -277 -359 1279 494 2898 1422 -3121
414 -3121 -891 -966 -2066 117 -438 2817 3877 -2169 -403 3031 -1360 -1368 2847 4022 3651 1659 2289
431 2289 3647 -186 -567 2990 2742 4029 3167 2250 4270 317 -1608 2937 1195 925 3872 1300
447 1300 2553 761 -3090 148 -319 -1515 828 139 1625 -827 -4451 599 -1616 -5578 945 1358
463 1358 -2217 68 -788 -1282 -2857 -2912 753 -723 -849 3185 -322 -2274 629 -2225 -2328 37 -1345
480 -1345 1147 -678 -4154 -566 -2743 -7051 -4488 -3550 -2622 -5955 -6822 -2001 -7160 -10680 -5988 -7016
496 -7016 -6576 -5554 -7853 -3838 -4710 -9460 -6755 -4228 -3984 -5938 -4036 1977 -1565 -5797 167 1563
$$ packed form
380H09k948L513l72M16K112j987P60j778l031L104q68p17N356j252k584K440k002
397I71j875J226j3L502r65k050L568k399m623L126p45q2J638p85K404j476m543
414c121K230p5j100K183n55L255J060o046J766L434m391qM215J175l71j992O30
431B289J358l833l81L557k48J287q62r17K020l953j925M545j742k70K947k572
447A300J253j792l851L238m67j196K343o89J486k452l624N050k215l962O523M13
463A358l575K285q56m94j575n5L665j476j26M034l507j952K903k854j03K365j382
480a345K492j825l476L588k177m308K563R38R28l333q67M821n159l520M692j028
496g016M40J022k299M015q72m750K705K527K44j954J902O013l542m232N964J396
$$ plain form
512 1563 -1867 -311 4249 5827 2609 2389 7152 5292 1598 5329 8596 7294 5143 7831 9145
527 9145 4627 3334 7336 6415 3933 5702 6540 4913 2906 2502 2716 1148 1769 2479 713 2440 1345
544 1345 -1742 91 -657 -1621 30 -732 481 168 -797 282 -2897 -1070 2065 -2691 -422 3688
560 3688 98 -950 -641 486 1563 -2557 -416 4445 545 -809 274 955 387 -2699 -945 3375
576 3375 49 -1873 610 1261 -1262 -3542 -924 1750 -1606 -2229 2470 914 -3332 -1274 580 -224
592 -224 -1028 -285 2881 1724 -1087 1360 589 -264 403 2093 2585 2022 721 2735 1368 755 1629 646
610 646 2096 1656 -743 124 858 -1487 -2596 -1681 -494 -1405 -2356 -1916 -1660 -3582 -3729 -3093 -3911 -3831 -2047
629 -2047 -3381 -3595 -3172 -3634 -3429 -4896 -2846 -866 -3817 -2709 -33 -1959 -2651 -2813 -874 854 -2871
$$ packed form
512A563l430J556M560J578l218k20M763j860l694L731L267j302k151K688J314
527I145m518j293M002r21k482J769Q38j627k007m04K14j568O21P10j766J727j095
544A345l087J833p48r64J651p62J213l13r65J079l179J827L135m756K269M110
560C688l590j048L09J127J077m120K141M861l900j354J083O81n68l086J754M320
576C375l326j922K483O51k523k280K618K674l356o23M699j556m246K058J854q04
592b24q04P43L166j157k811K447p71q53O67J690M92n63j301K014j367o13Q74r83
610F46J450m40k399Q67P34k345j109R15J187r11r51M40K56j922j47O36q18Q0J784
629b047j334k14M23m62K05j467K050J980k951J108K676j926o92j62J939J728l725
$$ plain form
646 -2871 -916 2904 -641 -1496 245 758 908 -1265 1345 3461 146 204 2011 952 717 188 1230
663 1230 3516 928 -541 3188 2171 -1081 637 2385 2825 395 442 4569 1708 -1403 3088 3046
679 3046 671 1352 2324 3687 971 298 3715 1126 304 2739 1081 1668 2129 -203 1821 763 -592
696 -592 1237 21 348 1059 -1302 -91 -178 -2481 -830 -690 -1830 -1117 -1296 -1441 -1551 -3100 -1260 -243
714 -243 -4064 -1651 935 -2500 -2943 -1302 -362 -1837 -3794 450 1212 -4214 -1014 2292 -1730 -2241
730 -2241 517 1011 -693 -1656 1607 2276 -1878 146 2594 -151 212 1171 1539 1943 111 739 2567
747 2567 573 259 2207 1733 1548 1270 1237 2799 731 146 2578 1628 987 1405 1465 2368 521 142 2747
766 2747 563 -121 1479 880 523 -164 44 1490 -1300 -1050 1545 -859 -1858 38 -404 -1517 -1746
$$ packed form
646b871J955L820l545q55J741N13J50k173K610K116l315N8J807j059k35n29J042
663A230K286k588j469L729j017l252J718J748M40k430M7M127k861l111M491m2
679C046k375O81R72J363k716o73L417k589q22K435j658N87M61k332K024j058j355
696e92J829j216L27P11k361J211q7k303J651J40j140P13j79j45j10j549J840J017
714b43l821K413K586l435m43J641R40j475j957M244P62n426L200L306m022n11
730b241K758M94j704r63L263O69m154K024K448k745L63R59L68M04j832O28J828
747B567j994l14J948m74j85k78l3J562k068n85K432r50o41M18O0R03j847l79K605
766B747k184o84J600n99l57o87K08J446k790K50K595k404r99J896m42j113k29
$$ plain form
783 -1746 -490 -648 -2779 -1033 0 -2165 -2280 -1153 -1644 -1953 -1951 -1529 -860 -2282 -2206 -435 -1669 -2216
801 -2216 -329 -882 -1768 -932 -445 -554 -1085 -145 527 -949 -294 1376 -259 -131 1446 789 172 1229
819 1229 1692 416 537 1584 1437 614 1245 1882 617 951 2045 404 1066 1712 556 362 1613 562
837 562 186 625 381 -162 -593 657 -135 -1056 -121 -159 -1442 -842 -1029 -1258 -744 -1216 -1113 -977 -1347 -1349 -1669
858 -1669 -1289 -1145 -1464 -1169 -374 -1365 -1370 -694 -676 -809 -542 -101 -15 -612 15 177 -46 -99 446 761 597 163
880 163 927 958 113 533 1795 1241 447 1748 1628 608 664 1246 1466 1209 1014 2037 1802 1240 1245 1299 1018
901 1018 1253 738 1881 2279 893 1694 1937 634 1227 1556 944 1195 1546 1225 1198 370 938 690 -168
920 -168 833 758 -404 788 -247 -1329 25 -810 -1110 -662 -1072 -641 -1958 -2022 -313 -2851 -2931 -397
$$ packed form
783a746J256j58k131J746J033k165j15J127m91l09KM22O69j422P6J771j234n47
801b216J887n53q86Q36M87j09n31R40O72j476O55J670j635J28J577o57o17J057
819A229M63j276J21J047j47q23O31O37j265L34J094j641O62O46j156j94J251j051
837E62l76M39k44n43m31J250p92r21R35l8j283O00j87k29N14m72J03J36l70kl20
858a669L80J44l19K95P95r91nO76J8j33K67M41Q6n97O27J62k23n3N45L15j64m34
880A63P64L1q45M20J262n54p94J301j20j020N6N82K20k57j95J023k35n62NN4k81
901A018K35n15J143L98j386Q01K43j303N93L29o12K51L51l21k7q28N68k48q58
920a68J001p5j162J192j035j082J354q35l00M48m10M31j317o4J709k538q0K534
$$ plain form
938 -397 -2357 -2626 -1346 -2516 -1974 -2481 -2352 -1035 -2379 -2080 -204 -2047 -1802 -896 -1652 -549 -1005 -1282
956 -1282 787 -373 -702 270 -66 223 283 -355 1843 857 -588 1475 1317 -293 265 455 1798 940
974 940 -493 2402 1620 -604 808 978 865 475 705 2468 639 -688 2313 653 -1183 1495 1643
991 1643 291 -170 1205 1621 -795 -626 1685 622 -1171 846 675 11 -1093 -694 92 -825 -1280
1008 -1280 77 -99 -1200 -1102 -1384 -987 -1496 -1514 -901 -506 -1914 -1140 -667 -2130 -2037 -657 -970 19 -1363
1027 -1363 465 -304 -1282 -1115 395 627 -237 -53 1893 1585 12 744 1809 489 469 2078 1627 1770
1045 1770 2165 1552 1651 1065 1268 1898 1028 1548 2468 552 1008 1161 90 817 409 741 1283 -21 276
1064 276 -23 -529 261 -372 -1098 792 -168 -372 -535 -1301 -539 -1001 -1998 -98 -279 -1223 -800 -752 -1048 -1732
$$ packed form
938c97j960k69J280j170N42n07J29J317j344K99J876j843K45R06p56J103m56k77
956a282K069j160l29R72l36K89O0o38K198r86j445K063j58j610N58J90J343q58
974I40j433K895p82k224J412J70j13l90K30J763j829j327L001j660j836K678J48
991A643j352m61J375M16k416J69K311j063j793K017j71o64j104L99P86r17m55
1008a280J357j76j101R8k82L97n09j8O13L95j408P74M73j463R3J380l13R89j382
1027a363J828p69r78J67J510K32q64J84J946l08j573P32J065j320k0J609m51J43
1045A770L95o13R9n86K03O30q70N20R20j916M56J53j071P27m08L32N42j304K97
1064B76k99n06P90o33p26J890r60k04j63p66P62m62r97J900j81r44M23M8k96o84
$$ plain form
1084 -1732 -1681 -464 -1075 -1572 -84 -929 -2099 -907 -1162 -1628 -810 -1112 -504 -309 -1562 -670 -1165 -1097 -605
1103 -605 -984 450 327 -1043 580 439 -869 194 489 736 829 708 1351 1321 244 1184 907 858 1658
1122 1658 973 1807 1571 516 1259 1256 401 980 1674 1296 924 1125 915 45 -65 722 418 118 773 241
1142 241 -293 214 -1047 -782 347 -478 -394 202 -239 -1042 -1250 -263 -1020 -1244 -223 -445 -1034 -266 -955
1161 -955 -1261 -921 -1026 -647 -380 -854 -333 -841 -773 -1339 -1723 -531 -63 -774 133 -247 -1072 -1151 -516 -508 -174
1182 -174 324 553 952 96 -165 6 368 -330 98 886 1632 504 1011 1596 362 438 1317 1229 1126 1828
1202 1828 1946 1214 642 1168 827 622 1018 1348 1910 1337 284 643 180 -540 4 335 339 73 -165 -56
1222 -56 -880 -1081 -344 -715 -348 -192 -661 -605 -717 -1278 -1180 -642 -1241 -660 -291 -474 -1107 -963 -674 -976 -1129
$$ packed form
1084a732N1J217o11m97J488q45j170J192k55m66Q18l02O08J95j253Q92m95O8M92
1103f05l79J434j23j370J623j41j308J063K95K47R3j21O43l0j077R40k77m9Q00
1122A658o85Q34k36j055P43lq55N79O94l78l72K01k10q70j10P87l04l00O55n32
1142B41n34N07j261K65J129q25Q4N96m41q03k08R87p57k24J021k22n89P68o89
1161i55l06L40j05L79K67m74N21n08O8n66l84J192M68p11R07l80q25p9O35QL34
1182a74M98K29L99q56k61J71L62o98M28P88P46j128N07N85j234P6Q79q8j03P02
1202A828J18p32n72N26l41k05L96L30N62n73j053L59m63p20N44L31Mk66k38J09
1222e6q24k01P37l71L67J56m69N6j12n61R8N38n99N81L69j83o33J44K89l02j53
$$ plain form
1243 -1129 -33 294 -720 -664 -255 -1169 -1188 -881 10 -161 -765 495 424 -807 -269 -218 -266 -349 191 898
1263 898 462 -313 541 171 -432 473 857 874 1071 686 1093 689 216 804 1134 1033 1121 1273 1291 974 219
1284 219 814 1053 473 958 1370 769 653 115 247 -51 -569 -92 481 -391 -83 -265 -696 -955 -1287 -877
1304 -877 -504 -993 -553 -532 -1396 -999 -1287 -1609 -676 -1001 -646 -388 -1002 -774 -1064 -1052 -881 -521 -544 294 -132
1325 -132 -308 -54 -607 -444 -142 -78 770 554 105 640 349 -212 330 257 730 1100 504 974 676 -343
1345 -343 566 748 267 952 887 1500 877 246 1145 632 108 1121 1261 1134 1026 700 947 342 -24 912
1365 912 726 162 438 628 499 -223 -768 195 -139 -912 206 279 -1021 -873 -758 -1437 -1373 -1610 -808 -980
1385 -980 -1215 -840 -1252 -1699 -1456 -1497 -1107 -797 -1123 -364 -488 -1379 -1162 -481 -769 -557 8 117 107 -471 -102
$$ packed form
1243a129J096L27j014N6M09r14j9L07Q91j71o04J260p1j231N38N1m8q3N40P07
1263H98m36p75Q54l70o03R05L84J7J97l85M07m04m73N88L30j01Q8J52J8l17p55
1284B19N95K39n80M85M12o01j16n38J32k98n18M77N73q72L08j82m31k59l32M10
1304h77L73m89M40K1q64L97k88l22R33l25L55K58o14K28k90J2J71L60k3Q38m26
1325a32j76K54n53J63L02O4Q48k16m49N35k91n61N42p3M73L70n96M70k98j019
1345c43R09J82m81O85o5O13o23o31Q99n13n24J013J40j27j08l26K47o05l66R36
1365I12j86n64K76J90j29p22n45R63l34p73J118P3j300J48J15o79O4k37Q02j72
1385i80k35L75m12m47K43m1L90L10l26P59j24q91K17O81k88K12N65J09j0n78L69
$$ plain form
1406 -102 -208 -368 292 352 806 1153 365 673 760 210 283 852 1363 901 951 1301 569 94 728 652 531 857
1428 857 1049 1009 256 386 482 106 252 781 884 996 504 -78 375 -72 8 496 451 242 384 61 -249
1449 -249 -229 -444 -420 -809 146 45 -412 -290 -820 -1022 -643 -1003 -758 -126 -365 -512 -582 -511 -969 -1486 -639
1470 -639 -135 -439 -201 74 -321 -338 -785 -363 196 -120 162 565 58 509 132 -71 414 622 1154 558
1490 558 703 1042 303 210 549 315 679 497 628 1058 712 123 358 292 397 442 601 694 491 467 215 -148
1512 -148 93 381 267 187 503 208 31 -7 -276 -241 -257 -405 73 336 -283 -673 -503 -356 -579 -463 -199
1533 -199 -424 -407 -729 -1072 -1128 -1164 -871 -719 -1132 -363 -722 -1438 -1099 -1037 -1109 -1020 -912 8 7 -982 -661 -762 -832
1556 -832 -473 -106 307 329 321 703 96 90 821 637 374 1344 1356 1015 914 935 850 1056 1141 1398 1135 1316 1317 598
$$ packed form
1406a02j06j60O60O0M54L47p88L08Q7n50P3N69N11m62N0L50p32m75O34p6j21L26
1428H57J92m0p53J30R6l76J46N29J03J12m92n82M53m47Q0M88m5k09J42l23l10
1449b49K0k15K4l89R55j01m57J22n30k02L79l60K45O32k39j47p0P1m58n17Q47
1470f39N04l04K38K75l95j7m47M22N59l16K82M03n07M51l77k03M85K08N32n96
1490E58J45L39p39r3L39k34L64j82J31M30l46n89K35o6J05M5J59R3k03k4k52l63
1512a48K41K88j14q0L16k95j77l8k69L5j6j48M78K63o19l90J70J47k23J16K64
1533a99k25J7l22l43n6l6K93J52m13P69l59p16L39O2p2Q9J08R20jr89L21j01p0
1556h32L59L67M13K2qL82o07oP31j84k63R70J2l41j01K1q5K06Q5K57k63J81Jp19
$$ plain form
1580 598 674 723 173 404 1011 440 918 606 223 -80 -639 289 186 -215 163 -233 -415 -287 -550 -529 -530 -583
1602 -583 -147 -784 -823 -254 -665 -744 -908 -469 -163 -403 -481 196 -527 -749 -502 -1096 -540 -9 -203 -343 -104
1623 -104 -490 -507 -597 -201 30 -556 332 668 -561 -207 -289 -677 179 142 161 256 512 177 148 -48 430 1202
1645 1202 1510 886 347 763 1453 -264 648 572 469 1314 1170 1011 562 142 587 350 644 743 601 293
1665 293 773 319 -90 -63 -66 -257 -89 48 81 -265 -311 -622 -561 -661 -354 -736 -673 -286 -456 -818 -1054 -749
1687 -749 -711 -969 -243 -365 -779 -671 -267 -710 -989 -259 -577 -330 -302 -257 -318 -442 -161 -210 -283 -48 194 281
1709 281 91 227 -173 -42 174 374 453 531 650 640 506 629 689 332 601 1009 674 903 677 779 395
1730 395 564 568 701 482 612 700 250 293 78 15 190 278 219 59 -230 62 -279 -438 -634 -325 -444 -509 -59
$$ packed form
1580E98P6M9n50K31O07n71M78l12l83l03n59R28j03m01L78l96j82J28k63K1jn3
1602e83M36o37l9N69m11p9j64M39L06k40p8O77p23k22K47n94N56N31j94j40K39
1623a04l86j7r0L96K31n86Q88L36j229L54q2l88Q56l7J9R5K56l35k9j96M78P72
1645A202L08o24n39M16O90j717R12p6j03Q45j44j59m49m20M45k37K94R9j42l08
1665B93M80m54m09K7lj91J68J37L3l46m6l11O1j00L07l82O3L87j70l62k36L05
1687g49L8k58P26j22m14J08M04m43k79P30l18K47K8M5o1j24K81m9p3K35K42Q7
1709B81j90J36m00J31K16K00P9P8J19j0j34J23O0l57K69M08l35K29k26J02l84
1730C95J69MJ33k19J30Q8m50M3k15o3J75Q8n9j60k89K92l41j59j96L09j19o5M50
$$ plain form
1753 -59 -694 -1005 -807 -642 -1023 -964 -266 -354 -712 -520 -647 -883 -860 -601 -434 -324 -28 -244 -47 -623 -431
1774 -431 -295 -134 97 291 317 194 176 172 -122 24 179 185 387 557 270 140 126 338 393 494 549 505 603 747
1798 747 462 345 13 524 653 792 855 773 581 433 650 500 521 264 941 929 760 96 214 328 -315
1819 -315 385 926 1006 -238 474 173 -326 93 -201 -543 -212 -204 -618 -442 -532 -931 -829 -658 -853 -679 -822
1840 -822 -548 -1041 -949 -653 -1069 -583 -485 -667 -586 -594 -835 -790 -811 -673 -491 -228 75 -9 100 214 -95 -4 879
1863 879 430 153 693 713 654 310 472 920 895 605 978 1174 741 443 599 590 194 583 933 575 20 543
1885 543 69 105 -135 -77 92 -310 -63 28 -351 -319 -521 -526 -498 -708 -291 -483 -715 -529 -825 -622 -583 -905 -574
1908 -574 -368 -325 -331 -504 -549 -316 -379 -235 -190 6 -13 -223 -198 -238 48 -14 395 22 517 388 -182 101 263
$$ packed form
1753e9o35l11J98J65l81N9O98q8l58J92j27k36K3K59J67J10K96k16J97n76J92
1774d31J36J61K31J94K6j23j8mk94J46J55OK02J70k87j30j4K12N5J01N5m4R8J44
1798G47k85j17l32N11J29J39O3q2j92j48K17j50K1k57O77j2j69o64J18J14o43
1819c15P00N41Q0j244P12l01m99M19k94l42L31Qm14J76r0l99J02J71j95J74j43
1840h22K74m93R2K96m16M86R8j82Q1qk41M5k1J38J82K63L03q4J09J14l09R1Q83
1863H79m49k77N40K0n9l44J62M48k5k90L73J96m33k98J56rl96L89L50l58n55N23
1885E43m74L6k40N8J69m02K47R1l79L2k02nK8k10M17j92k32J86k96K03L9l22L31
1908e74K06M3oj73m5K33o3J44M5J96j9k10K5m0K86o2M09l73M95j29n70K83J62
$$ plain form
1931 263 161 186 220 495 335 -22 232 242 184 219 414 460 287 45 374 662 80 506 274 120 689 521
1953 521 459 628 175 303 58 311 797 382 617 602 298 816 256 -35 501 458 416 508 247 463 -66 -409
1975 -409 -7 -63 -226 -243 -232 -147 -229 -894 -727 -871 -631 -548 -800 -570 -585 -928 -825 -838 -956 -406 -657 -451 -393
1998 -393 -754 -493 -304 -628 -49 -183 -427 1 151 61 -59 -151 57 423 65 383 450 210 565 361 387
2019 387 812 335 545 664 516 684 -36 355 698 361 265 501 193 301 155 174 389 -133 -6 -119 103
2040 103 325 -72 -201 -230 39 -30 -40 -181 213 -189 -320 -402 -391 -208 -520 -305 -356 -178 -331 -350 -536 -385
2062 -385 -268 -532 -271 -211 -601 -433 -268 -339 -10 -495 -352 -116 -196 -26 55 -227 -45 -111 -4 223 -225 48
2084 48 -68 -103 125 270 45 367 322 407 521 456 427 470 302 419 692 494 733 645 705 556 603 477 540 321
$$ packed form
1931B63j02K5L4K75j60l57K54J0n8L5J95M6j73k42L29K88n82M26k32j54N69j68
1953E21o2J69m53J28k45K53M86m15K35j5l04N18n60k91N36m3m2R2k61K16n29l43
1975d09M02n6j63j7J1Q5q2o65J67j44K40Q3k52K30j5l43J03j3j18N50k51K06N8
1998c93l61K61J89l24N79j34k44M28J50r0j20r2K08L66l58L18O7k40L55k04K6
2019C87M25m77K10J19j48J68p20L91L43l37r6K36l08J08j46J9K15n22J27j13K22
2040A03K22l97j29k9K69o9j0j41L94m02j31q2J1J83l12K15n1J78j53j9j86J51
2062c85J17k64K61O0l90J68J65p1L29m85J43K36q0J70Q1k82J82o6J07K27m48K73
2084D8j16l5K28J45k25L22m5Q5J14o5k9M3j68J17K73j98K39q8O0j49M7j26O3k19
$$ plain form
2108 321 689 375 574 493 576 365 412 314 374 120 135 397 -19 -19 97 -96 -137 180 -465 -236 -345 -389 -176
2131 -176 -627 -479 -644 -762 -330 -772 -689 -626 -721 -581 -734 -636 -304 -749 -654 -690 -648 -516 -336 -298 -335 -142 -178
2154 -178 36 -441 173 12 33 -14 336 749 447 426 522 630 538 700 441 634 679 683 697 577 625 551 643 687
2178 687 320 378 552 439 511 315 265 244 295 65 280 -32 -287 25 87 -157 -206 -446 -534 -196 -81 -325 -281
2201 -281 -499 -346 -573 -498 -104 -661 -524 -327 -434 -400 -627 -281 -528 -418 -412 -89 -273 -306 -194 -256 -188 -52
2223 -52 13 -291 2 -180 46 -417 99 -344 -182 342 206 213 136 25 139 8 -52 340 117 -2 392 214
2245 214 300 214 270 511 172 13 477 286 313 519 390 619 267 264 490 490 113 273 315 179 348 281 398
2268 398 209 133 172 -87 -38 -27 97 -54 -107 -395 -105 -419 -347 -45 -413 -577 -458 -459 -488 -615 -603 -289 -701
$$ packed form
2108C21L68l14J99q1Q3k11M7r8O0k54J5K62m16%J16j93m1L17o45K29j09m4K13
2131a76m51J48j65j18M32m42Q3O3r5J40j53R8L32m45R5l6M2J32J80L8l7J93l6
2154a78K14m77O14j61K1m7L50M13l02k1R6J08r2J62k59J93M5MJ4j20M8p4R2M4
2178F87l67N8J74j13P2j96n0k1N1k30K15l12k55L12O2k44m9k40q8L38J15k44M4
2201b81k18J53k27P5L94n57J37J97j07L4k27L46k47J10OL23j84l3J12o2O8J36
2223e2O5l04K93j82K26m63N16m43J62N24j36Pp7j11J14j31o0L92k23j19L94j78
2245B14Q6q6N6K41l39j59M64j91K7K06j29K29l52lK26%l77J60M2j36J69o7J17
2268C98j89p6L9k59M9J1J24j51n3k88K90l14P2L02l68j64J19jk9j27J2L14m12
$$ plain form
2291 -701 -742 -561 -369 -682 -350 -502 -354 -378 -607 3 -375 -183 -166 52 -144 90 153 110 386 159 263 312
2313 312 487 487 484 728 617 713 818 644 593 864 524 777 699 640 713 389 674 538 662 264 426 331 201
2336 201 -169 49 177 -128 129 -47 -288 -153 -226 -345 -481 -536 -415 -551 -521 -206 -448 -694 -396 -374 -459 -453
2358 -453 -421 -171 -532 -630 -357 -354 -395 -204 -444 -347 -251 -205 -407 -393 -26 -24 -406 3 170 -145 -253 -142 -515 239
2382 239 -411 -48 302 -48 -23 -104 507 -211 -573 -341 316 271 426 388 232 584 572 320 553 337 539 306
2404 306 202 408 455 553 404 302 467 608 155 438 339 199 468 81 127 266 -127 277 -72 -454 -57
2425 -57 -288 -193 -423 -286 -512 -299 -310 -288 -582 -611 -278 -376 -391 -82 -438 -364 -263 -125 -126 -123 -313 -198 -559 -155
2449 -155 -82 -314 203 35 -42 69 133 526 178 -35 265 212 102 311 341 213 125 347 553 171 146 738
$$ packed form
2291g01m1J81J92l13L32j52J48k4k29O10l78J92J7K18j96K34O3m3K76k27J04M9
2313C12J75%lK44j11R6J05j74n1K71l40K53p8n9P3l24K85j36J24l98J62r5j30
2336B01l70K18J28l05K57j76k41J35p3j19j36n5J21j36L0L15k42k46K98K2q5O
2358d53L2K50l61r8K73Lm1J91k40R7R6M6k02J4L67Kl82M09J67l15j08J11l73P54
2382B39o50L63L50l50K5q1O11p18l62K32O57m5J55l8j56L52j2k52K33k16K02k33
2404C06j04K06M7R8j49j02J65J41m53K83r9j40K69l87M6J39l93M04l49l82L97
2425e7k31R5k30J37k26K13j1K2k94k9L33r8j5L09l56P4J01J38jLj90J15l61M04
2449a55P3k32N17j68p7J11O4L93l48k13L00n3j10K09L0j28q8K22K06l82k5N92
$$ plain form
2471 738 315 -68 219 372 328 161 346 259 -169 191 104 5 171 240 -50 253 152 55 56 -55 89 -165 -254
2494 -254 -9 -385 -99 286 -196 -396 -145 -309 -340 -332 -336 -85 -326 -479 77 -436 -381 -508 -426 -200 -439 -348 -262
2517 -262 -602 -271 -464 -54 -87 -589 -228 -196 -90 -117 -111 -374 -66 -101 -102 100 -210 -102 80 -5 32 96 140 300
2541 300 422 172 435 199 362 436 303 390 590 640 514 160 270 427 474 388 187 342 242 321 404 505
2563 505 291 358 290 231 591 364 43 222 -19 -4 -139 -197 -146 -311 -137 -289 -308 -339 -286 -378 -388 -314 -490 -511
2587 -511 -478 -366 -530 -675 -574 -370 -570 -421 -447 -615 -374 -403 -471 -513 -380 -307 -164 -413 37 -37 -209 -322
2609 -322 278 221 308 176 378 258 374 713 160 562 384 526 225 381 110 458 360 324 571 437 257
2630 257 465 306 414 243 59 368 205 178 -10 -131 -118 -439 -153 45 -171 -136 -173 -287 -134 -261 -419
$$ packed form
2471G38m23l83K87J53m4j67J85q7m28L60q7r9J66O9k90L03j01r7Jj11J44k54q9
2494b54K45l76K86L85m82k00K51j64l1QmK51k41j53N56n13N5j27Q2K26k39R1Q6
2517b62l40L31j93M10l3n02L61L2J06k7Ok63L08l5jK02l10J08J82q5L7O4M4J60
2541C00J22k50K63k36J63P4j33Q7K00N0j26l54J10J57M7q6k01J55j00P9Q3J01
2563E05k14O7o8n9L60k27l21J79k41J5j35n8N1j65J74j52j9l1N3r2j0P4j76k1
2587e11L3J12j64j45J01K04k00J49k6j68K41k9o8m2J33P3J43k49M50p4j72j13
2609c22O00n7Q7j32K02j20J16L39n53M02j78J42l01J56k71L48r8l6K47j34j80
2630B57K08j59J08j71j84L09j63k7j88j21J3l21K86J98k16L5l7j14J53j27j58
$$ plain form
2651 -419 -285 -238 -249 -140 -281 -537 -466 -351 -361 -393 -189 -270 -191 -52 32 -155 -268 -137 -173 -319 -171 -231 -296 16
2675 16 -81 -188 -316 -81 -198 -100 71 271 -70 157 314 -1 215 -97 166 105 483 304 401 225 264 469
2697 469 512 388 181 489 402 231 582 360 261 437 132 175 795 407 139 266 315 59 47 129 214 -189 96
2720 96 -57 -35 -159 -264 -79 -130 -203 -279 -313 -609 -314 -484 -304 -565 -402 -459 -586 -609 -538 -126 -265 -370 -191
2743 -191 -412 -112 -367 -115 -256 -280 -79 -167 -101 -106 20 -120 -47 17 -84 -225 -120 401 225 107 308 167
2765 167 314 260 615 419 333 322 342 202 326 472 437 612 306 318 198 323 228 323 462 145 278 290 204
2788 204 -78 108 73 132 106 66 -9 -246 -267 -187 -120 -345 -156 -128 -108 -212 -242 84 -344 -271 -44 -156 -534 -226
2812 -226 -256 -170 -323 -460 -304 -670 -296 -210 -208 -348 -68 -474 -221 -148 -147 -140 -150 -37 35 -99 -111 112 -124 -52 241
$$ packed form
2651d19J34M7j1J09j41k56P1J15j0l2K04q1P9J39Q4j87j13J31l6j46J48o0o5L12
2675A6r7j07j28K35j17R8J71K00l41K27J57l15K16l12K63o1L78j79R7j76L9K05
2697D69M3j24k07L08q7j71L51k22r9J76l05M3O20l88k68J27M9k56j2Q2Q5m03K85
2720I6j53K2j24j05J85n1p3p6l4k96K95j70J80k61J63n7j27k3P1M12j39j05J79
2743a91k21L00k55K52j41k4K01q8O6nJ26j40P3O4j01j41J05N21j76j18K01j41
2765A67J47n4L55j96q6j1K0j40J24J46l5J75l06J2j20J25r5R5J39l17J33J2q6
2788B04k82J86l5N9k6m0p5k37k1Q0O7k25J89K8K0j04l0L26m28P3K27j12l78L08
2812b26l0Q6j53j37J56l66L74Q6Kj40K80m06K53P3JPj0J13P2j34j2K23k36P2K93
$$ plain form
2837 241 71 286 288 28 186 130 203 116 335 130 445 442 639 374 145 119 365 205 53 341 408 312 107
2860 107 237 163 130 36 3 -52 -60 -36 -201 -259 -207 -744 -275 -353 -49 -483 -392 -400 -363 -553 -232 -517 -316 -153 -332
2885 -332 -134 -330 -99 -195 -346 -300 -81 -86 -265 -216 67 -168 -203 -12 -121 -73 -105 195 149 34 104 62 -23 173
2909 173 268 419 398 657 370 29 40 94 259 420 267 335 453 142 187 109 204 530 17 288 391 463 405
2932 405 271 262 145 375 -225 205 -147 57 -167 -156 144 227 -76 -72 -142 60 -165 -100 -281 -189 -221 -470 -462 -497
2956 -497 -311 -403 -233 -201 -465 -369 -303 -450 -377 -379 -312 -250 -203 -156 -581 -431 -331 -277 -135 91 -364 -173 65 235
2980 235 43 126 85 78 368 84 422 77 -90 174 133 243 8 259 322 396 426 536 65 191 19 100 538
3003 538 234 -37 357 181 -208 385 122 697 470 874 146 380 252 369 -207 173 126 -152 524 208
$$ packed form
2837B41j70K15Kk60J58n6P3q7K19k05L15lJ97k65k29k6K46j60j52K88O7r6k05
2860A07J30p4l3r4l3n5qK4j65n8N2n37M69p8L04m34R1qL7j90L21k85K01J63j79
2885c32J98j96K31r6j51M6K19nj79M9K83k35l5J91j09M8l2L00m6j15P0m2q5J96
2909A73R5J51k1K59k87l41J1N4J65J61j53O8J18l11M5p8R5L26n13K71J03P2n8
2932D05j34rj17K30o00M30l52K04k24J1L00Q3l03Mp0K02k25O5j81R2l2k49Ql5
2956d97J86r2J70L2k64R6O6j47P3kO7O2M7M7m25J50J00N4J42K26m55J91K38J70
2980B35j92Q3m1pK90k84L38l45j67K64m1J10k35K51O3P4L0J10m71J26j72Q1M38
3003E38l04k71L94j76l89N93k63N75k27M04p28K34j28J17n76L80m7k78O76l16
$$ plain form
3023 208 -406 -229 48 104 111 465 -148 384 -109 -68 -66 -482 100 -570 -510 -387 10 24 -654 -202 -420 -369 -369 202
3047 202 -468 -53 -405 -267 4 206 290 -356 217 -278 -77 -440 -155 143 618 378 481 302 372 377 -185
3068 -185 42 243 127 580 -93 -266 289 25 288 200 33 -302 549 234 -187 408 47 -108 -20 19 -60
3089 -60 124 71 -143 -123 -106 -40 58 -229 -454 -201 13 102 -82 -330 -222 -233 -312 -291 -652 -176 -240 -259 -273 -48
3113 -48 -202 -314 -259 -256 -273 -297 -270 -598 17 -333 -35 -295 -252 34 -6 73 -228 -2 -324 32 12 31 4 222
3137 222 186 63 121 115 193 379 218 294 567 499 131 126 528 521 511 285 335 134 68 301 321 64 64 392 365 142
3163 142 380 96 111 -6 2 -121 93 -68 44 -254 -410 1 -289 -267 -364 -536 -166 -253 -292 -303 -489 -433 -181
3186 -181 -156 -166 47 -179 -288 112 -1053 -422 -414 -643 -505 -774 -147 -53 255 -245 254 -219 -510 -92 -12 252
$$ packed form
3023B08o14J77K77N6PL54o13N32m93M1Km16N82o70O0J23L97J4o78M52k18N1%N71
3047B02o70M15l52J38K71K02Q4o46N73m95K01l63K85K98M75k40J03j79P0Nn62
3068a85K27K01j16M53o73j73N55k64K63q8j67l35Q51l15m21N95l61j55Q8L9p9
3089f0J84n3k14K0J7O6R8k87k25K53K14Q9j84k48J08j1p9K1l61M76o4j9j4K25
3113d8j54j12N5Lj7k4K7l28O15l50K98k60M3K86m0P9l01K26l22L56k0J9k7K18
3137B22l6j23N8oP8J86j61P6K73o8l68nM02pj0k26N0k01o6K33K0k57%L28k7k23
3163A42K38k84J5j17Qj23K14j61J12k98j56M11k90K2r7j72L70q7l9j1j86N6K52
3186a81K5j0K13k26j09M00j165O31Qk29J38k69O27R4L08n00M99m73k91M18Q0K64
$$ plain form
3208 252 -30 118 164 133 283 196 110 374 366 184 99 275 278 126 123 298 363 331 222 94 74 39 257 194 105 280
3234 280 41 44 359 212 4 -48 163 -161 118 157 -91 187 -75 18 -84 93 221 -120 -185 -370 -140 -291
3256 -291 -357 -219 -201 -70 -195 -150 -639 -346 -160 -285 -345 -270 -455 -298 -254 -403 34 -208 -266 113 -203 17
3278 17 -187 130 128 172 253 240 157 118 22 -132 231 191 53 323 355 268 150 202 395 292 315 290 596 487 266
3303 266 260 218 80 387 88 413 175 174 -58 174 216 71 -83 146 -37 -267 -332 -217 -444 -357 -389 -102 -142
3326 -142 -65 -375 -275 -396 -271 -136 -373 -463 -106 -282 -292 -243 -238 -245 -122 -288 -204 -157 17 -325 -54 -36 -254 -242
3350 -242 240 -45 101 -74 60 172 90 52 -112 138 93 -8 291 206 -78 137 293 -6 163 242 288 153
3372 153 401 181 172 279 373 307 396 452 270 203 292 47 337 240 354 240 73 -60 135 138 -97 -62 -80 -107 -113
$$ packed form
3208B52k82J48M6l1J50q7q6K64qj82q5J76Lj52lJ75O5l2j09j28k0l5K18o3q9J75
3234B80k39LL15j47k08n2K11l24K79L9k48K78k62R3j02J77J28l41o5j85K30j51
3256b91o6J38J8J31j25M5m89K93J86j25o0P5j85J57M4j49M37k42n8L79l16K20
3278A7k04L17kM4Q1j3q3l9r6j54L63m0j38K70L2q7j18N2J93j03K3k5L06j09k21
3303B66om2j38L07k99L25k38jk32K32M2j45j54K29j83k30o5J15k27Q7l2K87m0
3326a42P7l10J00j21J25J35k37r0L57j76j0M9NpJ23j66Q4M7J74l42K71J8k18J2
3350b42M82k85J46j75J34J12q2l8j64K50m5j01K99q5k84K15J56k99J69P9M6j35
3372A53K48k20rJ07R4o6Q9N6j82o7Q9k45K90r7J14j14j67j33J95Lk35L5j8k7o
$$ plain form
3397 -113 -139 -186 -474 -176 -429 -463 -201 -301 -301 -313 -305 -113 -213 -478 -133 -74 -267 -417 -154 -329 -318 -188 -238 -346
3421 -346 -130 54 -166 -2 126 -12 -156 -226 10 91 197 337 -18 79 152 119 210 15 -142 -43 424 196
3443 196 78 166 89 84 179 246 274 179 225 196 129 79 101 91 51 220 153 240 67 22 169 94 -78 73 93 -171 -13
3470 -13 -136 -272 -87 -125 -56 -397 9 -172 -358 8 -335 -351 -250 -76 -364 -348 -293 -501 -113 -124 -286 36
3492 36 -287 -108 -246 121 -218 -340 -141 -286 -186 -16 -260 18 -1 260 -4 184 233 186 209 386 126 115
3514 115 440 114 235 338 331 519 16 109 -6 105 267 382 150 321 310 111 -1 -38 120 167 4 218
3536 218 164 -25 147 -109 166 -35 87 -37 -38 -85 65 -74 -162 96 -106 -119 -105 -58 -84 -183 -410 -442 -225 -154
3560 -154 -55 -137 -80 -232 -128 -207 -117 -263 -10 -371 -154 -80 -337 -275 98 68 142 -445 -74 148 76 191 105 -162
$$ packed form
3397a13k6m7k88K98k53l4K62j00%j2QJ92j00k65L45N9j93j50K63j75J1J30n0j08
3421c46K16J84k20J64J28j38j44p0K36Q1J06J40l55R7P3l3R1j95j57R9M67k28
3443A96j18Q8p7nR5O7K8r5M6k9o7n0K2j0m0J69o7Q7j73m5J47p5j72J51K0k64J58
3470a3j23j36J85l8O9l41M06j81j86L66l43j6J01J74k88J6N5k08L88j1j62L22
3492C6l23J79j38L67l39j22J99j45J00J70k44K78j9K61k64J88M9m7K3J77k60j1
3514A15L25l26J21J03pJ88n03R3j15J11J62J15k32J71j1j99j12l7J58M7j63K14
3536B18n4j89J72k56K75k01J22j24jm7J50j39q8K58k02j3J4M7k6r9k27l2K17P1
3560a54R9q2N7j52J04p9R0j46K53l61K17P4k57O2L73l0P4n87L71K22p2J15q6k67
$$ plain form
3584 -162 50 56 -3 115 146 353 167 140 237 164 93 414 274 358 262 382 383 260 199 198 -131 243 229 122 91 226
$$ packed form
3584a62K12On9J18L1K07j86k7R7p3p1L21j40Q4r6J20Jj23o1jl29L74j4j07l1J35
$$ [...]
8191E1
##END NTUPLES=NMR FID
##END=
