##TITLE=1H_SAV-77-CeCl3-A
 CDCl3, 32 sc, 
 20.11.2020
##JCAMPDX= 6.0         $$ Bruker NMR JCAMP-DX V2.0
##DATA TYPE= NMR FID
##DATA CLASS= NTUPLES
##ORIGIN= UXNMR, Bruker Analytische Messtechnik GmbH
##OWNER= root
$$ XWIN-NMR		Version 3.5
$$ Fri Nov 20 10:37:13 2020 Russian Standard Time (UT+4h)  she@DPX200
##.OBSERVE FREQUENCY= 200.1315066352
##.OBSERVE NUCLEUS= ^1H
##.DELAY= (6, 6)
##.ACQUISITION MODE= SIMULTANEOUS
##.ACQUISITION SCHEME= undefined
##.AVERAGES= 8
##.DIGITISER RES= 18
##SPECTROMETER/DATA SYSTEM= spect
##.PULSE SEQUENCE= zg30
##.SOLVENT NAME= CDCl3
##.SHIFT REFERENCE= (INTERNAL, CDCl3, 0, 15.7039)
##AUDIT TRAIL= $$ (NUMBER, WHEN, WHO, WHERE, WHAT)
$$ ##TITLE= Audit trail, XWIN-NMR		Version 3.5
$$ ##JCAMPDX= 5.01
$$ ##ORIGIN= Bruker BioSpin GmbH
$$ ##OWNER= she
$$ F:/spectra/data/she/nmr/H-F/1/audita.txt
$$ ##AUDIT TRAIL=  $$ (NUMBER, WHEN, WHO, WHERE, WHAT)
(   1,<2020-11-20 10:36:01.04 +0400>,<she>,<DPX200>,
      <created by zg, POWCHK disabled, PULCHK disabled
       configuration hash MD5:
       00 E9 B6 7A A2 85 ED C7 34 08 36 98 17 FE 4E 26
       data hash MD5: 16K
       0E 4F DC EC CC B4 B5 47 B7 15 99 F4 11 5E C8 D9>)
$$ ##END=
$$ 
$$ hash MD5
$$ 1E B7 F1 B3 9E 15 32 7E 7C A9 88 57 43 88 F8 BA
##$RELAX= 
##$RELAX= 
##$RELAX= 
##$RELAX= 
##$RELAX= 
##$RELAX= 
$$ Bruker specific parameters
$$ --------------------------
##$DU= <F:/spectra>
##$EXPNO= 1
##$NAME= <H-F>
##$PROCNO= 1
##$TYPE= <nmr>
##$USER= <she>
##$AMP= (0..31)
100 100 100 100 100 100 100 100 100 100 100 100 100 100 100 100 100 100 
100 100 100 100 100 100 100 100 100 100 100 100 100 100 
##$AQSEQ= 0
##$AQ_mod= 1
##$AUNM= <au_zg>
##$AUTOPOS= <>
##$BF1= 200.13
##$BF2= 200.13
##$BF3= 200.13
##$BF4= 200.13
##$BF5= 200.13
##$BF6= 200.13
##$BF7= 200.13
##$BF8= 200.13
##$BYTORDA= 1
##$CFDGTYP= 0
##$CFRGTYP= 5
##$CHEMSTR= <none>
##$CNST= (0..31)
1 1 145 1 1 1 1 1 1 1 1 1 1 1 1 1 1 1 1 1 1 1 1 1 1 1 1 1 1 1 1 1 
##$CPDPRG= <>
##$CPDPRG1= <>
##$CPDPRG2= <>
##$CPDPRG3= <>
##$CPDPRG4= <mlev>
##$CPDPRG5= <mlev>
##$CPDPRG6= <mlev>
##$CPDPRG7= <mlev>
##$CPDPRG8= <mlev>
##$CPDPRGB= <>
##$CPDPRGT= <>
##$D= (0..31)
0 1.2 0 0 0 0 0 0 0 0.06 0 0.03 0 0 0 0 0.0002 0 0 0 0 0 0 0 0 0 0 0 0 
0 0 0 
##$DATE= 1605854160
##$DBL= (0..7)
120 120 120 120 120 120 120 120 
##$DBP= (0..7)
150 150 150 150 150 150 150 150 
##$DBP07= 0
##$DBPNAM0= <>
##$DBPNAM1= <>
##$DBPNAM2= <>
##$DBPNAM3= <>
##$DBPNAM4= <>
##$DBPNAM5= <>
##$DBPNAM6= <>
##$DBPNAM7= <>
##$DBPOAL= (0..7)
0.5 0.5 0.5 0.5 0.5 0.5 0.5 0.5 
##$DBPOFFS= (0..7)
0 0 0 0 0 0 0 0 
##$DE= 6
##$DECBNUC= <off>
##$DECIM= 32
##$DECNUC= <off>
##$DECSTAT= 4
##$DIGMOD= 1
##$DIGTYP= 9
##$DL= (0..7)
0 120 120 120 120 120 120 120 
##$DP= (0..7)
150 150 150 150 150 150 150 150 
##$DP07= 0
##$DPNAME0= <>
##$DPNAME1= <>
##$DPNAME2= <>
##$DPNAME3= <>
##$DPNAME4= <>
##$DPNAME5= <>
##$DPNAME6= <>
##$DPNAME7= <>
##$DPOAL= (0..7)
0.5 0.5 0.5 0.5 0.5 0.5 0.5 0.5 
##$DPOFFS= (0..7)
0 0 0 0 0 0 0 0 
##$DQDMODE= 0
##$DR= 18
##$DS= 0
$$ [...]
##$SUBNAM2= <"">
##$SUBNAM3= <"">
##$SUBNAM4= <"">
##$SUBNAM5= <"">
##$SUBNAM6= <"">
##$SUBNAM7= <"">
##$SUBNAM8= <"">
##$SUBNAM9= <"">
##$SW= 16.9725356469052
##$SWIBOX= (0..15)
0 0 2 0 0 0 0 0 0 0 0 0 0 0 0 0 
##$SW_h= 3396.73913043478
##$TD= 16384
##$TD0= 1
##$TE= 0
##$TE2= 300
##$TE3= 300
##$TEG= 300
##$TL= (0..7)
0 120 120 120 120 120 120 120 
##$TP= (0..7)
150 150 150 150 150 150 150 150 
##$TP07= 0
##$TPNAME0= <>
##$TPNAME1= <>
##$TPNAME2= <>
##$TPNAME3= <>
##$TPNAME4= <>
##$TPNAME5= <>
##$TPNAME6= <>
##$TPNAME7= <>
##$TPOAL= (0..7)
0.5 0.5 0.5 0.5 0.5 0.5 0.5 0.5 
##$TPOFFS= (0..7)
0 0 0 0 0 0 0 0 
##$TUNHIN= 0
##$TUNHOUT= 0
##$TUNXOUT= 0
##$USERA1= <user>
##$USERA2= <user>
##$USERA3= <user>
##$USERA4= <user>
##$USERA5= <user>
##$V9= 5
##$VALIST= <valist>
##$VCLIST= <CCCCCCCCCCCCCCC>
##$VD= 0
##$VDLIST= <DDDDDDDDDDDDDDD>
##$VPLIST= <PPPPPPPPPPPPPPP>
##$VTLIST= <TTTTTTTTTTTTTTT>
##$WBST= 1024
##$WBSW= 4
##$XGAIN= (0..3)
0 0 0 0 
##$XL= 0
##$YL= 0
##$YMAX_a= 119108
##$YMIN_a= -111891
##$ZGOPTNS= <>
##$ZL1= 120
##$ZL2= 120
##$ZL3= 120
##$ZL4= 120
##$ABSF1= 10
##$ABSF2= 0
##$ABSG= 5
##$ABSL= 3
##$ALPHA= 0
##$AQORDER= 0
##$ASSFAC= 0
##$ASSFACI= 0
##$ASSFACX= 0
##$ASSWID= 0
##$AUNMP= <proc_1d>
##$AZFE= 0.1
##$AZFW= 0.1
##$BCFW= 1
##$BC_mod= 2
##$BYTORDP= 1
##$COROFFS= 0
##$CY= 11.3945322036743
##$DATMOD= 1
##$DC= 2
##$DFILT= <>
##$DTYPP= 0
##$F1P= 15.9154993809931
##$F2P= -4.1035820241983
##$FCOR= 0.5
##$FTSIZE= 0
##$FT_mod= 4
##$GAMMA= 1
##$GB= 0.15
##$INTBC= 1
##$INTSCL= 1
##$ISEN= 128
##$LB= 0.24
##$LEV0= 0
##$LPBIN= 0
##$MAXI= 10000
##$MC2= 0
##$MEAN= 0
##$ME_mod= 0
##$MI= 1.114404
##$NCOEF= 0
##$NC_proc= 0
##$NLEV= 6
##$NOISF1= 3.799351
##$NOISF2= 2.8
##$NSP= 1
##$NTH_PI= 0
##$NZP= 0
##$OFFSET= 15.70392
##$PC= 1
##$PHC0= -11049.85
##$PHC1= 13.60091
##$PH_mod= 1
##$PKNL= yes
##$PPARMOD= 0
##$PSCAL= 0
##$PSIGN= 0
##$REVERSE= no
##$SF= 200.130013532006
##$SI= 16384
##$SIGF1= 3
##$SIGF2= 2
##$SINO= 400
##$SIOLD= 16384
##$SREGLST= <1H.CDCl3>
##$SSB= 0
##$STSI= 0
##$STSR= 0
##$SW_p= 3612.71676300578
##$SYMM= 0
##$S_DEV= 0
##$TDeff= 0
##$TDoff= 0
##$TI= <>
##$TILT= no
##$TM1= 0
##$TM2= 0
##$TOPLEV= 0
##$USERP1= <user>
##$USERP2= <user>
##$USERP3= <user>
##$USERP4= <user>
##$USERP5= <user>
##$WDW= 1
##$XDIM= 8192
##$YMAX_p= 0
##$YMIN_p= 0
$$ End of Bruker specific parameters
$$ ---------------------------------
##NTUPLES= NMR FID
##VAR_NAME=  TIME,          FID/REAL,        FID/IMAG
##SYMBOL=    X,             R,               I
##VAR_TYPE=  INDEPENDENT,   DEPENDENT,       DEPENDENT
##VAR_FORM=  AFFN,          ASDF,            ASDF
##VAR_DIM=   8192,          8192,            8192
##UNITS=     SECONDS,       ARBITRARY UNITS, ARBITRARY UNITS
##FACTOR=    0.0002944,     1,               1
##FIRST=     0,             0,               0
##LAST=      2.4114304,     0,               0
##MIN=       0,             -111891,         0
##MAX=       2.4114304,     119108,          0
$$ Real data points
##PAGE= N=1
##DATA TABLE= (X++(R..R)), XYDATA
0@%%%%%%%%%%%%%%%qJ6j6J6j6K4l2L2m0M8n6O4p2Q8j03J17j33J51j68J90k15K41
$$ 0 0 0 0 0 0 0 0 0 0 0 0 0 0 0 0 -8 8 -8 8 -8 16 -16 16 -24 24 -32 32 -40 48 -55 62 -71 80 -88 102 -113 128
37A28k72L05l43L83m25M73n26N84o45P12p87Q67r54J052j160J277j407J552j714
$$ 128 -144 161 -182 201 -224 249 -277 307 -338 374 -413 454 -500 552 -608 669 -738 814 -900
56i00J895k101K340k613K933l317L781m362N113o121P562r825J4096m0978J07764
$$ -900 995 -1106 1234 -1379 1554 -1763 2018 -2344 2769 -3352 4210 -5615 8481 -32497 75267
71G5267r1463r5695J35511j5896k9616j9361K0458P4362n5311m4130J11387k3641
$$ 75267 -16196 -111891 23620 7724 -21892 -41253 -20795 53567 -1744 -45874 65513 41872
83D1872o8107M1087K3563j1289j6814j499M8753k7666m3711L9848N152l0935M737
$$ 41872 -26235 14852 38415 27126 10312 8813 57566 29900 -13811 26037 31189 254 4991
96D991R627K2250k5312k9657N3610r816n7179N2367K3635m6799J3164K3794j1957
$$ 4991 14618 36868 11556 -18101 35509 25693 -31486 20881 44516 -2283 10881 34675 22718
109B2718j4584n049K6697N468l4739J7005L3132l6009k1827L4780L824k7408O074
$$ 22718 8134 3085 29782 35250 511 17516 50648 14639 -7188 27592 31416 4008 10082
122A0082K4223l752k0732M81J6250l422j6943O060K5616r116k7130J9895J2333
$$ 10082 34305 30553 9821 10302 26552 23130 6187 12247 37863 28747 1617 21512 33845
135C3845l2625K793K0959r823k636j08j896M744j6091l119J9299q799o475J3867
$$ 33845 1220 4013 24972 15149 12513 12405 10509 15253 -838 -3957 15342 6543 68 13935
149A3935l876o039l67k561O439l13m347R309j71j1161p51M041k357r630M320J3887
$$ 13935 10059 4020 3653 1092 7531 7218 2871 12180 12009 848 97 4138 1781 -7849 -3529 10358
165A0358j4324j2849J5838m899j7127O674Q555n18p880l065J3065p138j7790J4764
$$ 10358 -3966 -16815 -977 -5876 -23003 -16329 -7774 -8292 -16172 -19237 -6172 -13310 -31100 -16336
179a6336R868j2401J171Q413n74o995p260O645P137q819j655J1658kj3357j424
$$ -16336 -6468 -18869 -17698 -9285 -9859 -16854 -24114 -17469 -10332 -19151 -20806 -9148 -9150 -22507 -23931
194b3931R438j458p662O124Q390l243o934m90P132k125q732R335R601q733l791
$$ -23931 -14493 -15951 -23613 -17489 -9099 -12342 -19276 -19766 -12634 -14759 -23491 -14156 -4555 -13288 -17079
209a7079O252j141n242p67O704N148n983L56P062n073m801O854M364j478K900
$$ -17079 -10827 -11968 -17210 -17977 -11273 -6125 -12108 -11752 -4690 -9763 -14564 -7710 -3346 -4824 -1924
224a924O009j127l416K996K828j780L952N350k76p42m50j045N9j042J147M668
$$ -1924 4085 2958 -458 2538 5366 3586 7538 12888 12612 11870 11420 10375 10434 9392 10539 15207
240A5207J67k224J98r83j668j429o20O798K061o783L455M987r424l126P954J870
$$ 15207 15374 13150 13348 12365 10697 9268 8648 15446 17507 10724 14179 19166 9742 6616 14570 16440
256A6440l762J73O493j452r984J543P680n885l037Q936Q92o985j085K695j967
$$ 16440 12678 12851 19344 17892 7908 9451 17131 11246 8209 17145 18037 11052 9967 12662 10695
271A0695l664K592M677j712l819J355o84m732r60K804J96j902K26j054l198k968
$$ 10695 7031 9623 14300 12588 8769 10124 9440 4708 3748 6552 6748 4846 5072 4018 820 -2148
287b148o07l79J017L94j160R99r51n376P25L815l221L67N730j245l295n35P0R52
$$ -2148 -2755 -3134 -2117 -1723 -2883 -1884 -2835 -8211 -7486 -3671 -6892 -6525 -795 -2040 -5335 -5870 -5800 -4848
305d848k529j07P772l262o693N487l88r176L523M858l796k42K327j570l652n27
$$ -4848 -7377 -7484 288 -2974 -9667 -4180 -4568 -13744 -10221 -5363 -9159 -9401 -7074 -8644 -12296 -12823
321a2823K56K32P90L88J293L2l103m08Q75k053K631K748k439J868J459n292P99
$$ -12823 -12567 -12335 -11545 -11157 -9864 -9832 -12935 -13343 -12468 -14521 -11890 -9142 -11581 -9713 -8254 -13546 -12747
338a2747M283l362J428O018k338j632K741j498j372K585R08J825J773k075P10
$$ -12747 -8464 -11826 -10398 -4380 -6718 -8350 -5609 -7107 -8479 -5894 -4986 -3161 -1388 -3463 -2753
353b753R17l516M81M154q28r46L690j569l417J821L04j556L839J387j268L144
$$ -2753 -1836 -5352 -4871 -717 -1545 -2491 1199 -370 -3787 -1966 -1662 -3218 621 2008 740 3884
369C884j252k799L670K81j057M863R96j152K960k012j274L557o71l00N341j083
$$ 3884 2632 -167 3503 3784 2727 7590 8586 7434 10394 8382 7108 10665 9994 9694 15035 13952
385A3952k268K142n1k502J277K409K05l72R01r81j131k83j723J748J586k766J946
$$ 13952 11684 13826 13775 11273 12550 14959 15164 14792 15693 14712 13581 13298 11575 13323 14909 12143 14089
402A4089Q89n101l87J702k443K69J294p45m98j463k362K72j62k155K061J095l003
$$ 14089 14978 9877 9490 11192 8749 9018 10312 9567 9069 7606 5244 5516 5354 3199 5260 6355 3352
419C352o50P86l909l30J599j399N82N22k291j037n85k523k72J461k3j015OJ21
$$ 3352 2702 3488 -421 -751 848 -551 31 553 -1738 -2775 -3360 -5883 -6155 -4694 -4717 -5732 -5726 -5605
437e605k258j722O05J492p04o24K796p75l893J614K041k920M56M350q83k145J459
$$ -5605 -7863 -9585 -8980 -7488 -8192 -8816 -6020 -6795 -10688 -9074 -7033 -9953 -9497 -5147 -6030 -8175 -6716
454f716N55k570k19K430L83j293J422J31j892q25k10N67K12L93J053j893n43P65
$$ -6716 -6161 -8731 -8950 -6520 -6137 -7430 -6008 -5877 -7769 -8594 -8804 -8237 -8025 -7632 -6579 -8472 -9015 -8250
472h250k997O36K920k513N09K889k028j662P04Q31n2j06K811J465k176N96J435
$$ -8250 -11247 -10611 -7691 -10204 -9695 -6806 -8834 -10496 -9792 -8961 -9013 -9119 -6308 -4843 -7019 -6423 -4988
489d988p84RJ683K886m87k56K714p61j846K418R63r2J560M79j1K29j132L7J747
$$ -4988 -5772 -5763 -4080 -1194 -1681 -1937 777 16 -1830 588 1551 1459 3019 3498 3487 3716 2584 2621 4368
508D368n94N16J245m35l98J19o23K01J044J04J056J167p03r66J178P87j604J518
$$ 4368 3774 4290 5535 5100 4702 4821 4198 4399 5443 5547 6603 7770 7067 6101 7279 8066 6462 7980
526G980J955m97K58P16n74K99j163J902Q93J6K11J027j328j992J414L39j285K41
$$ 7980 9935 9438 9696 10412 9838 10137 8974 10876 11769 11785 11996 13023 11695 9703 11117 11456 10171 10412
544A0412J341j478j532L54m74j511J75J12O7p60j518m15m46j153q11R49N58j870
$$ 10412 11753 10275 8743 9097 8623 7112 7287 7399 7466 6706 5188 4773 4327 3174 2363 3312 3870 2000
562B000j064J264j217k631J194J216j087n64o6M58j050k144J078P75j597L01P67
$$ 2000 936 2200 983 -1648 -454 762 -325 -889 -955 -497 -1547 -3691 -2613 -1838 -3435 -3134 -2367
579b367o10j205j673J083K12j960Q84O26p15j104j283J433q09j967L074o8l278
$$ -2367 -2977 -4182 -5855 -4772 -4560 -6520 -5636 -5010 -5725 -6829 -8112 -6679 -7488 -9455 -6381 -6449 -9727
596i727K320p6k788O39R60M30q35l4J540j588r12J400j65M90L44M4J966j761o50
$$ -9727 -7407 -7483 -10271 -9632 -8672 -8242 -9077 -9111 -7571 -9159 -10071 -8671 -8836 -8346 -8002 -7958 -5992 -7753 -8403
615h403K223j365N01J431q65K376k01k645K874O87k792J974K365j086n70J175
$$ -8403 -6180 -7545 -7044 -5613 -6478 -4102 -4303 -6948 -4074 -3387 -6179 -4205 -1840 -2926 -3496 -2321
631b321J406k232J89K594o32K56P84r8N88n10o38K946j360o55L165j255q70J013
$$ -2321 -915 -3147 -2958 -364 -996 -740 44 -54 534 24 -614 2332 972 317 3482 2227 1357 2370
649B370l25N50J55R5M43M63n21o2Q38j60j656K608J118l084J922J735k338N24
$$ 2370 2045 2595 2750 2845 3288 3751 3230 3168 4006 3846 2190 4798 5916 2832 4754 6489 4151 4675
667D675R60l02R91l03O21N50j391L00J094j76J63j6Q85N56j422L2P81j63j16m67
$$ 4675 5635 5333 6324 6021 6642 7192 5801 6101 7195 7019 7182 7166 8051 8607 7185 7217 7998 7835 7719 7252
687G252J256L26k942J352J612l343LK566j807r82N63l6j085j114J191m62j489
$$ 7252 8508 8834 5892 7244 8856 5513 5516 8082 6275 5293 5856 5820 4735 3621 4812 4350 2861
704B861Q38m46j343R7p52n47k51l02L31j136m95P22k083J19R63k397Q90M58j542
$$ 2861 3699 3253 1910 2007 1255 708 457 155 486 -650 -1145 -423 -2506 -2387 -1424 -3821 -2931 -2473 -4015
723d015l39J44rj490r6J339o97j669J259J9j794J31O79n7r08j73J516j168o52
$$ -4015 -4354 -4210 -4219 -5709 -5805 -4466 -5163 -6832 -5573 -5554 -7348 -7217 -6538 -6595 -7503 -7676 -6160 -7328 -7980
742g980R45j51l17O04p94P92P41j728P73J277q22J35P61M14J04o34J083J89o76
$$ -7980 -7035 -7186 -7503 -6899 -7693 -6901 -6160 -7888 -7115 -5838 -6660 -6525 -5764 -5350 -5246 -5880 -4797 -4608 -5284
761e284N53J054J32m11N31J121q01l04J503n5m77J189k98K15O80p53J009O47p11
$$ -5284 -4731 -3677 -3545 -3956 -3425 -2304 -3105 -3409 -1906 -1961 -2438 -1249 -1547 -1332 -652 -1405 -396 251 -460
780d60M84J206q65n44J617L51q64O56J024m49n66J001M6M6j62K62J213j039l68
$$ -460 24 1230 365 -179 1438 1789 925 1581 2605 2156 1590 2591 2637 2683 2521 2783 3996 2957 2589
799B589J916n48p75R54O33o60J56N19j59J60j59l2N63N84q69J48J205r68J83R53
$$ 2589 4505 3957 3182 4136 4769 4109 4265 4784 4625 4785 4626 4594 5157 5741 4872 5020 6225 5257 5440 6393
819F393r28m4M04k69L12k30k89P06k74m25M73r1o10m2L53k71p67M10j35j077P08
$$ 6393 5465 5421 5825 5556 5868 5638 5349 6055 5781 5356 5829 5738 5128 5086 5439 5168 4401 4811 4676 3599 4307
840D307k04p75R3k63l41J83q89p6N19j422l68M88l28r46J19o3m86n13n1m06p26
$$ 4307 4103 3328 3421 3158 2817 3000 2111 2035 2554 1132 764 1252 924 -22 97 34 -452 -965 -1016 -1422 -2148
861b148L22o31o26J78o36j70k45o00j00l17k82q6m40l51m9j80k03j14O8l77j92
$$ -2148 -1826 -2457 -3083 -2905 -3541 -3711 -3956 -4556 -4656 -4973 -5255 -5341 -5781 -6132 -6181 -6361 -6564 -6678 -6610 -6987 -7179
882g179K44L0k18M06r2l46N03Q0l38N95J81l6Q6O97j75j18N17K75k07N57M00J56
$$ -7179 -6935 -6905 -7123 -6717 -6809 -7155 -6652 -6572 -6910 -6315 -6134 -6170 -6084 -5387 -5562 -5680 -5163 -4888 -5095 -4538 -4138 -3982
904c982M70l77O48O00m17M13Q85k39L1O65j56M9N48R31q64R10O06n06L05L0n6
$$ -3982 -3512 -3889 -3241 -2641 -3058 -2645 -1760 -1999 -1968 -1303 -1459 -1410 -862 69 -795 115 721 215 520 550 494
925D94J219l96P2J252r26J75Q55l06L44M74J19J20J13L25Q4j31P96m35J72Q60
$$ 494 1713 1317 1389 2641 1715 1890 2745 2439 2783 3257 3376 3496 3609 3934 4018 3887 4683 4248 4420 5280
945E280q37K49N97q56M73N61q87N83q0n5J06j36k12l2L28k55l7M28k83o89L45
$$ 5280 4443 4692 5289 4433 4906 5467 4580 5163 5083 5028 5134 4998 4786 4754 5082 4827 4790 5218 4935 4246 4591
966D591l03l21N55k31q3J56p51o2K78p88L45J52n20K45o68l6k71j64M11q43L14
$$ 4591 4288 3967 4522 4291 4208 4364 3613 3551 3829 3041 3386 3538 3018 3263 2595 2559 2288 2124 2535 1692 2006
987B006N1q98L9J18j296P53m28K61m3o85J59k33p66L36k66n31M91n11m67mq56
$$ 2006 2057 1159 1198 1316 20 773 345 606 563 -122 37 -196 -962 -626 -892 -1423 -932 -1443 -1910 -1914 -2770
1008b770M26o94L0L72o88k51o3j018n4P6p04L41k06l11o0q01M23j88n44N78J26
$$ -2770 -2344 -3038 -3008 -2636 -3324 -3575 -3638 -4656 -4710 -4634 -5338 -4997 -5203 -5514 -5574 -6375 -5952 -6140 -6684 -6106 -5980
1029e980n75K29K40n64J83o1M86K64J04M94jK70J10L1Q18J20l27J197l42J50P85
$$ -5980 -6555 -6326 -6086 -6650 -6467 -6528 -6042 -5778 -5674 -5180 -5181 -4911 -4801 -4770 -3952 -3832 -4159 -2962 -3304 -3154 -2369
1050b369n74R21L65P1N36M30o64O97J10J12l5Q19N97o08M94M59m69M58N35k90
$$ -2369 -2943 -2022 -1657 -1586 -1050 -620 -1284 -587 -477 -365 -400 419 1016 408 902 1361 892 1350 1885 1595
1070A595J132j66J37K86J17l28N43M09J59M1oK60j01K22o7L01q2n5N27k54m06
$$ 1595 2727 2561 2698 2984 3101 2773 3316 3725 3884 3925 3919 4179 4078 4300 4233 4534 4452 4397 4924 4670 4264
1091D264K36K97q65N35M07o72MN87q20m54M06m05K33nm40K46k73L0o71R7J34j28
$$ 4264 4500 4797 3932 4467 4874 4202 4206 4793 3973 3519 3925 3520 3753 3748 3308 3554 3281 3311 2640 2737 2871 2743
1113B743j32K36m33k16Q2k96K01o7m47Q59p56n23P41o84j29K40J03j10m77j32
$$ 2743 2611 2847 2414 2198 2280 1984 2185 2118 1671 2530 1774 1251 1992 1308 1179 1419 1522 1412 935 803
1133H03m13n9j30J6k39J61o15m42K63r63j27M70o02m6R8m37k97k51n73O33l60
$$ 803 390 331 201 217 -22 139 -476 -918 -655 -1618 -1745 -1275 -1877 -1923 -1825 -2262 -2559 -2810 -3383 -2750 -3110
1154c110k06L09k85k3m96j01K39l30J28M65q57R3Lo52O03n67k68P80o55L65K29
$$ -3110 -3316 -3007 -3292 -3315 -3811 -3912 -3673 -4003 -3875 -3410 -4267 -4174 -4171 -4823 -4220 -4787 -5055 -4275 -4930 -4565 -4336
1175d336m75l9j20K02N13o78R96n0p38O33m39M49N61J2L04J033o59K10N95k26
$$ -4336 -4811 -4850 -4970 -4768 -4255 -4933 -3937 -3987 -4725 -4092 -4531 -4082 -3521 -3509 -3205 -2172 -2831 -2621 -2026 -2252
1195b252Q28r5O78J80J49N66q9j94J15P70L93N37j37K3L85n48J188Q9mN58o92
$$ -2252 -1424 -1519 -841 -661 -512 54 -35 -229 -114 656 1049 1586 1449 1472 1857 1309 2497 2586 2582 3140 2448
1216B448M54M2l08O76K44K28M8M77n57L09q21O28Q61j470P99P01k78l47n59N18
$$ 2448 2902 2944 2636 3312 3556 3784 3832 4309 3752 4061 3240 3868 4729 3259 4058 4759 4481 4134 3575 4093
1236D093L27p36L36R91j461R80m04o95k01m07O6J88p56q0O7j62L25o89L94j31
$$ 4093 4420 3684 4020 5011 3550 4530 4126 3431 3230 2823 2889 3077 2321 2241 2308 2146 2471 1782 2176 2045
1256B045l28K59k03o79j50J84k51J89l30M12m35m52O27r38J76K1L3j11O4p11L36
$$ 2045 1717 1976 1773 1094 944 1128 877 1066 736 1148 713 261 888 -50 126 147 180 69 133 -578 -242
1277b42k45n00N83o58J63r2k71K21n40m25L81n77K58k02j92J07q07m38Q05l34
$$ -242 -487 -987 -404 -1062 -899 -991 -1262 -1041 -1581 -2006 -1625 -2202 -1944 -2146 -2338 -2231 -3038 -3476 -2671 -3005
1297c005L10M71n69k54k80K59L33k29n21K47M86l35n71l20O01l47R0L68m09M92
$$ -3005 -2695 -2224 -2793 -3047 -3327 -3068 -2735 -2964 -3485 -3238 -2752 -3087 -3658 -3978 -3377 -3724 -3634 -3266 -3675 -3183
1317c183M11n78L17J70j175O57L42j48N49m23j68O79n2n73J136j25J09k89M70
$$ -3183 -2772 -3350 -3033 -2863 -4038 -3381 -3039 -3187 -2638 -3061 -3229 -2550 -2602 -3175 -2039 -2164 -2055 -2344 -1874
1336a874l40P22K9L85J57O72j45k1J22K74l4P57L31K38M74m04J52L59N0K18L06
$$ -1874 -2214 -1492 -1463 -1078 -921 -249 -394 -415 -293 -19 -53 704 1035 1273 1747 1343 1495 1854 1904 2122 2428
1357B428M33n3L37p1J5mK83l4L72J26k28k25L18k62J08K50r9L29J2k50Km0k46
$$ 2428 2861 2808 3145 3074 3089 3085 3368 3334 3706 3832 3604 3379 3697 3435 3543 3793 3694 4023 4035 3785 3787 3747 3501
1380C501J27J78J83l88K11k87k33J3j02J32K9k93q5K12o80m01K26l10Q3m18q5
$$ 3501 3628 3806 3989 3601 3812 3525 3292 3305 3203 3335 3364 3071 2986 3198 2518 2117 2343 2033 2116 1698 1613
1401A613k95j69l92j80k51J33k21m26O23r41rM2o28J41L11m52j8k08q9j71k55
$$ 1613 1318 1149 757 577 326 459 238 -188 435 -506 -515 -473 -1101 -960 -649 -1101 -1119 -1327 -1416 -1587 -1842
1422a842J06M7J14k7K0l93n0k28K06p6j52J29R5l57j73m3M7K8l7l1J53j1l15j36
$$ -1842 -1736 -1689 -1575 -1602 -1582 -1975 -2025 -2253 -2047 -2123 -2275 -2146 -2051 -2408 -2581 -2624 -2577 -2549 -2586 -2617 -2464 -2475 -2790 -2926
1446b926j42j38ON29M5k90O2j45j10M17l93L68J84j04k4J80j77qL1M79K23j82
$$ -2926 -3068 -3206 -3200 -2671 -2626 -2916 -2854 -2999 -3109 -2692 -3085 -2717 -2533 -2637 -2661 -2481 -2658 -2666 -2635 -2156 -1933 -2115
1468b115O0j7P9J50l66N74K54j44M73j48M0J92k48K18L67M3K25J67mK62k13M49
$$ -2115 -2055 -2072 -1993 -1843 -2209 -1635 -1381 -1525 -1052 -1200 -1160 -968 -1216 -998 -631 -588 -363 -196 -200 62 -151 298
1490B98L50K88K40l50N26K66l59L82N68k23P92k45J22L76n9nJ18O15l68J73L44
$$ 298 648 936 1176 826 1352 1618 1259 1641 2209 1986 2778 2533 2655 3031 2972 2967 3085 3700 3332 3505 3849
1511C849l49l10O16O5l01K60l16M7J94l22J25j26k53J20J64J60l76l63J67l39
$$ 3849 3500 3190 3806 3871 3570 3830 3514 3561 3755 3433 3558 3432 3179 3299 3463 3623 3247 2884 3051 2712
1531B712l57L57n8N5k53l77j4q1l85L59n37j33M22n60j76o01k3J94n99J32K48
$$ 2712 2355 2712 2654 2709 2456 2079 2065 1984 1599 1958 1421 1288 1710 1150 974 373 350 544 -55 77 325
1552C25p67j78Lp01J69l44kN37q54k10M89p61K7j0j83L92k44l11L04k59j90k7
$$ 325 -442 -620 -617 -1318 -1149 -1493 -1495 -958 -1812 -2022 -1533 -2294 -2267 -2277 -2460 -2068 -2312 -2623 -2319 -2578 -2768 -2795
1574b795J06M34l28L5P4m87L57K97p27O25J90l07M39m25o7o1j05L74k73J83J06
$$ -2795 -2689 -2255 -2583 -2548 -2474 -2961 -2604 -2307 -3034 -2409 -2219 -2526 -2087 -2512 -2579 -2640 -2745 -2371 -2644 -2461 -2355
1595b355O1k1J32n87K92K22J37K27j12j51M91l37K11J64O3J5P0K56Pl39L60K32
$$ -2355 -2294 -2315 -2183 -2770 -2478 -2256 -2119 -1892 -2004 -2155 -1664 -2001 -1790 -1626 -1563 -1548 -1478 -1222 -1215 -1554 -1194 -962
1617i62L6M83r7J45j79K3L9M15k08L77N63m74P3K54p7M55p4N3M57k63J94L82l37
$$ -962 -926 -443 -540 -395 -574 -551 -512 -97 -305 72 635 161 234 488 411 866 792 845 1302 1039 1233 1615 1278
1640A278R0K68K28L01p0L03K8k56L95J11m79P83J10L0K12j15m3j31K4N41l25Q2
$$ 1278 1368 1636 1864 2165 2095 2398 2426 2170 2565 2676 2197 2980 3090 3120 3332 3217 3174 3043 3067 3608 3283 3365
1662C365N6l06J11L7q7R5k49R1O2l40j21K09p57M56k1n09K55j74l10m65j10j60
$$ 3365 3421 3115 3226 3263 3176 3271 3022 3113 3175 2835 2714 2923 2166 2622 2601 2092 2347 2173 1863 1398 1288 1128
1684A128m11K15M23o03l23J1m23N6K9n15J52m47q9J11l39l61k40o8K22n54J30
$$ 1128 717 932 1355 752 429 440 17 73 102 -413 -261 -708 -797 -686 -1025 -1386 -1626 -1694 -1472 -2026 -1896
1705a896J50n58J25j34r7J08k38q3j77Ol06M26m10L22J00j00J22l78K16K45j85
$$ -1896 -1746 -2304 -2179 -2313 -2410 -2302 -2540 -2623 -2800 -2794 -3100 -2674 -3084 -2762 -2662 -2762 -2640 -3018 -2802 -2557 -2742
1726b742mJ97Q6J52j71j86L56k19L4N40n9k2M88n64K62K15o5PQ0J43P7m6K30j72
$$ -2742 -2746 -2549 -2463 -2311 -2482 -2668 -2312 -2531 -2497 -1957 -2016 -2038 -1550 -2114 -1852 -1637 -1702 -1695 -1615 -1472 -1395 -1441 -1211 -1383
1750a383K11K24n8M41N4l65N24j42j05L71l11K96L35l3j59L72m68M85o0K67M41
$$ -1383 -1172 -948 -1006 -565 -511 -876 -352 -494 -599 -228 -539 -243 92 59 -100 272 -196 289 229 496 937
1771I37l09L69k77M8L72K29l7N7j97M68R5m47M35n3q1M18L3J34O3l5R6r3o5K95
$$ 937 628 997 720 768 1140 1369 1332 1389 1192 1660 1755 1308 1743 1690 1609 2027 2060 2194 2257 2222 2318 2225 2160 2455
1795B455n6K61j19k81K16r3p1P47n45P4j1J48j99L5m9Mj8k02N37m98j46Q0n40
$$ 2455 2399 2660 2541 2260 2476 2383 2312 3059 2514 2588 2577 2725 2526 2561 2512 2516 2498 2296 2833 2335 2189 2269 1729
1818A729L17Pp17N36j51k12l33l01M8j29j23J55j51o54K43q8j3k00k62k9k50l25
$$ 1729 2046 2053 1336 1872 1721 1509 1176 875 923 794 671 826 675 21 264 176 163 -37 -299 -328 -578 -903
1840i03J30k70j22r3l85J85K43o67L25m73j18Q0l63K31k48J37j62m54J58j55r5
$$ -903 -773 -1043 -1165 -1258 -1643 -1458 -1215 -1882 -1557 -2030 -2148 -2068 -2431 -2200 -2448 -2311 -2473 -2927 -2769 -2924 -3019
1861c019J03pO9j6j47p9J21j14N5L59j87K02J66n4J03P4J14M03k19q9L04K15j65
$$ -3019 -2916 -2923 -2854 -2870 -3017 -3096 -2975 -3089 -3034 -2675 -2862 -2660 -2494 -2548 -2445 -2371 -2257 -1854 -2073 -2162 -1858 -1643 -1808
1884a808N18J57J11lL3K13J8J88NJ75J14K12N4K19j52K59k47P9L02R9K19j9j84
$$ -1808 -1290 -1133 -1022 -1025 -992 -779 -761 -573 -568 -393 -279 -67 -13 206 54 313 66 145 447 546 765 746 562
1907E62L00l73L95J3N0Q4k96J5M62m6O7l42L74l7r4M95l77K57p7K70j11L48k04
$$ 562 862 489 884 897 947 1031 735 750 1212 1166 1233 891 1265 1228 1134 1629 1252 1509 1432 1702 1591 1939 1735
1930A735K00j53nJ10p3L54k68k8M26k90r0K23k9K01R3j39N1N5k51L36l51J74k69
$$ 1735 1935 1782 1777 1887 1814 2168 1900 1872 2298 2008 1918 2141 2112 2313 2406 2267 2318 2373 2122 2458 2107 2281 2012
1953B012k34P5j51P0Q9l58J42J6k87J15j46l90L64l44k83L70n52k0L8m82L37k46
$$ 2012 1778 1853 1702 1772 1861 1503 1645 1661 1374 1489 1343 953 1317 973 690 1060 508 488 526 44 381 135
1975A35k86J17k66lk60j39j1k09or3j95k61oq3j47J83l56J18j97k20Q1j90j40
$$ 135 -151 -34 -300 -303 -563 -702 -713 -922 -928 -1021 -1216 -1477 -1483 -1566 -1713 -1530 -1886 -1768 -1965 -2185 -2104 -2294 -2434
1998b434P3p7K34m44O4o1m1K00l31j18K51lp5J19np1qK66j64K48M6K59k23K97
$$ -2434 -2361 -2438 -2204 -2648 -2584 -2645 -2686 -2486 -2817 -2935 -2684 -2687 -2762 -2643 -2648 -2719 -2727 -2461 -2625 -2377 -2331 -2072 -2295 -1998
2022a998N5J84j2J82N4Q6J18J07L76j68O8L35O1OL94j47K06L14j05K55K83m0j1
$$ -1998 -1943 -1759 -1771 -1589 -1535 -1449 -1331 -1224 -848 -1016 -948 -613 -552 -546 -152 -299 -93 221 116 371 654 614 603
2045F03J73K21o0k2K92KM5pN0L67m11K61K97r5j38M3K49k64J54K69k69om6k38
$$ 603 776 997 937 915 1207 1209 1254 1247 1297 1664 1253 1514 1811 1716 1578 1621 1870 1606 1760 2029 1760 1754 1708 1470
2069A470K50J20Pn80N32o9n2O50n10k88L53Q1q53Q51L31p86O12l37j24J22j35
$$ 1470 1720 1840 1847 1267 1799 1730 1678 2328 1818 1530 1883 1964 1111 1962 2293 1507 2119 1782 1658 1780 1645
2090A645L8n5J43k81n5o4K73j21j25k25l43N70l35O4j4q1l9j08k62J71j58l88
$$ 1645 1683 1628 1771 1490 1435 1371 1644 1523 1398 1173 830 1400 1065 1129 1115 1034 995 887 625 796 638 250
2112B50J83j82k46r3K81l47n0k29J75m26n0o5l08J15K29m71j61k9l23J92k3m93
$$ 250 433 251 5 -88 193 -154 -204 -433 -258 -684 -734 -799 -1107 -992 -763 -1234 -1395 -1424 -1747 -1555 -1578 -2071
2134b071K06k20pK69k85Ml0l8J1j95N3J93l14N41l51j07K15k96N9M20l36K1K35
$$ -2071 -1865 -2085 -2092 -1823 -2108 -2104 -2134 -2172 -2161 -2356 -2303 -2110 -2424 -1883 -2234 -2341 -2126 -2422 -2363 -1943 -2279 -2258 -2023
2157b023k46L33j08J44j83L58j31J35j29J86O2J62P0J01J21j0J02R7K07j76M15
$$ -2023 -2269 -1936 -2044 -1900 -2083 -1725 -1856 -1721 -1850 -1664 -1602 -1440 -1370 -1269 -1148 -1158 -1056 -959 -752 -928 -513
2178e13k2L06O3j40K97K89j31L79J8j33K57N8P13j40p77R79J08j72O7L5K03J46
$$ -513 -535 -229 -166 -306 -9 280 149 528 546 413 670 728 1441 1301 524 1503 1611 1439 1506 1541 1744 1890
2200A890n1j9K54k13N4OL36m00J15L15r0o5K3j88J84J15k59j48L46j72j69J20
$$ 1890 1839 1820 2074 1861 1915 1921 2257 1857 1972 2287 2197 2132 2155 1967 2151 2266 2007 1859 2205 2033 1864 1984
2222A984k70J93j62j18J3k52J9mn9l32K27j56r5j42K46k58J6J36j52l46K51p0
$$ 1984 1714 1907 1745 1627 1640 1388 1407 1403 1344 1012 1239 1083 988 846 1092 834 850 986 834 488 739 669
2244F69j50q8j92L49k57k41J68p3j61J23j69J75j72p8J14j35l20M58n42J04Jl94
$$ 669 519 431 239 588 331 90 258 185 24 147 -22 153 -19 -97 17 -118 -438 20 -522 -418 -417 -811
2266h11J38j27k34J79m6l81q0k69L42j62k93L48j86l68L79k05j54o2k33M90n06
$$ -811 -673 -800 -1034 -855 -901 -1282 -1362 -1631 -1289 -1451 -1744 -1396 -1582 -1950 -1571 -1776 -1930 -1992 -2225 -1735 -2241
2287b241N8J18J75K68k55n63M35k27o9L11R9j26J40j75M1K59l98M29J26p3K65
$$ -2241 -2183 -2065 -1890 -1622 -1877 -2440 -2005 -2232 -2301 -1990 -1891 -2017 -1877 -2052 -2011 -1752 -2150 -1721 -1595 -1668 -1403
2308a403k4l4L70j29Q5J95l4L5J92L72j1k14M14R5K47K39j95p0J15J40J74K17
$$ -1403 -1427 -1461 -1091 -1220 -1135 -940 -974 -939 -747 -375 -386 -600 -186 -91 156 395 200 130 245 385 559 776
2330G76nr4P0J80N51j60k32K98q8J80J9k6L58j53K65O0l09J87J87j73J68J7N1
$$ 776 771 677 747 927 1478 1318 1086 1384 1296 1476 1495 1469 1827 1674 1939 1999 1690 1877 2064 1891 2059 2076 2127
2353B127K18l17J83p9j77K03k27N7J10m66J86Kj25j17K14l26K00k68j78K57m57
$$ 2127 2345 2028 2211 2132 1955 2158 1931 1988 2098 1632 1818 1820 1695 1578 1792 1466 1666 1398 1220 1477 1020
2374A020m6J36n42L77j00k47K32k07j57p6k48M6j4k12M12k96k26j35mJ73Jl80
$$ 1020 974 1110 568 945 845 598 830 623 466 390 142 188 174 -38 374 78 -148 -283 -287 -114 -113 -493
2396d93L15k37n2L41n42J64j74r1M22l99l15N40o00J93o7rj35q6Jj59j09K14k00
$$ -493 -178 -415 -467 -126 -668 -504 -678 -769 -347 -746 -1061 -521 -1121 -928 -995 -1004 -1139 -1225 -1224 -1383 -1492 -1278 -1478
2419a478l30M66l45L8j04K64j27N9k06J16m5j24K05j15j11K63m32M50K90m07O0
$$ -1478 -1808 -1342 -1687 -1649 -1753 -1489 -1616 -1557 -1763 -1647 -1692 -1816 -1611 -1726 -1837 -1574 -2006 -1556 -1266 -1673 -1613
2440a613p2KL21j01KJ18k54N54k31K2K90k67L05q2J96M3n5K53J63j66K35L34m24
$$ -1613 -1685 -1683 -1362 -1463 -1461 -1343 -1597 -1043 -1274 -1252 -962 -1229 -924 -1006 -810 -767 -822 -569 -406 -572 -337 -3 -427
2463d27J48L77M7J58J96k26J28QL13K06k37L28l5j92M23j23rM97k12M25k96K08
$$ -427 -279 98 145 303 499 273 401 409 722 928 691 1019 984 792 1215 1092 1083 1580 1368 1793 1497 1705
2485A705qQ8j15L66l50J11J33L9k50K14K2k9j5R3J4RL3l11P8N8j55L6k4j50l48
$$ 1705 1697 1785 1670 2036 1686 1797 1930 1969 1719 1933 1955 1926 1911 2004 2018 2027 2060 1749 1827 1885 1730 1766 1742 1592 1244
2510A244N43o1l27K08k77k49p1J08q8j36J17k43k77j93R2J03j01j07Jr6j52k04
$$ 1244 1787 1726 1399 1607 1330 1081 1010 1118 1030 894 1011 768 491 298 390 493 392 285 286 190 38 -166
2532a66p4k42L61n24p8J34l75K64l89J14O9r0j09P4j07pj17Q6N6p2k13J35j26
$$ -166 -240 -482 -121 -645 -723 -589 -964 -700 -1089 -975 -906 -996 -1105 -1031 -1138 -1145 -1262 -1176 -1120 -1192 -1405 -1270 -1396
2555a396j59J36j00J89M4m07K05L49j87j34K37k30J88p6j71J08K20J48r7L7j16
$$ -1396 -1555 -1419 -1519 -1330 -1286 -1693 -1488 -1139 -1326 -1460 -1223 -1453 -1265 -1341 -1512 -1404 -1184 -1036 -1133 -1096 -1212
2576a212j54N8J99k95L00k28K79N6m4l0o6k8j5r0K84Mj70L63j24n1K90J26J43
$$ -1212 -1366 -1308 -1109 -1404 -1104 -1332 -1053 -997 -1041 -1071 -1137 -1165 -1180 -1270 -986 -982 -1152 -789 -913 -964 -674 -548 -405
2599d05m9J14j89N79qk60K5K65J9K23Mj94M37J23j65J43Q5j24J68j6j6L64J08
$$ -405 -454 -340 -529 50 42 -218 -193 72 91 314 318 124 561 684 519 662 747 623 791 775 759 1123 1231
2622A231o0J71k2Q4K1J05j88K02R9l3k8J60J41q7o8r0K98j69J25l8Pj1M5l80N29
$$ 1231 1171 1342 1320 1404 1425 1530 1342 1544 1643 1610 1582 1742 1883 1796 1728 1638 1936 1767 1892 1854 1861 1850 1895 1515 2044
2647B044l43j5J14l44J93k36J21j12j23j22mj91J80j68k82Q8l8k47J26l50k26
$$ 2044 1701 1686 1800 1456 1649 1413 1534 1422 1299 1177 1173 982 1162 994 712 800 762 515 641 291 65
2668F5N8k34Q0j31l61J73O2k44J61j45j63k94K33k65k1j77O4o7j19L82k64K3k01
$$ 65 123 -111 -31 -162 -523 -350 -288 -532 -371 -516 -679 -973 -740 -1005 -1026 -1203 -1139 -1206 -1325 -943 -1207 -1184 -1385
2691a385R2l2l2j60J6J68k39J53qk2L2j53M45j95J19J91l36J01j97K35P4r7jj60
$$ -1385 -1293 -1325 -1357 -1517 -1501 -1333 -1572 -1419 -1427 -1449 -1417 -1570 -1125 -1320 -1201 -1010 -1346 -1245 -1442 -1207 -1133 -1230 -1231 -1391
2715a391J78lQ3k41L52J2k21N32j19k27J02K91q4l0kL00j39k72J42J15l3J52q6
$$ -1391 -1213 -1216 -1133 -1374 -1022 -1010 -1231 -699 -818 -1045 -943 -652 -736 -766 -768 -468 -607 -879 -737 -622 -655 -503 -589
2738e89M23pl28J23J4L25M11m09L3Q4M0K40q4K5J85n1N1K98l26L16P9J15L8L0
$$ -589 -166 -173 -501 -378 -364 -39 372 -37 -4 80 120 360 276 301 486 435 486 784 458 774 853 968 1006 1036
2762A036r7K10Nj46K80j12J68j48K50M2m3o4J53LJ95l76N7K52k31K29n2k33P3
$$ 1036 939 1149 1154 1008 1288 1176 1344 1196 1446 1488 1445 1381 1534 1537 1732 1356 1413 1665 1434 1663 1611 1378 1451
2785A451K68j23J82j82L9l03m6J51J35o6k73j15j20J2j86J49J11m30J93M4k78
$$ 1451 1719 1596 1778 1596 1635 1332 1286 1437 1572 1506 1233 1118 998 1010 824 973 1084 654 847 891 613
2806F13O6k47R7j87j25k04J10k7k3k66j18R3L7m23L4j19k95L89n89J24o5j79J56
$$ 613 679 432 529 342 217 13 123 96 73 -193 -311 -218 -181 -604 -570 -689 -984 -595 -1184 -1060 -1125 -1304 -1148
2829a148k86J17pk74J31Jl5j28Kk08L51j77L1l7o7j6k6K05P0j93J86J7o0K38k28
$$ -1148 -1434 -1317 -1324 -1598 -1467 -1466 -1501 -1629 -1627 -1835 -1484 -1661 -1630 -1667 -1734 -1750 -1776 -1571 -1501 -1694 -1508 -1491 -1551 -1313 -1541
2854a541K79R4j78L73j13LK01P1j26K42k71K32j29J24K60Ro8N9N1N9J44o3J97
$$ -1541 -1262 -1168 -1346 -973 -1086 -1083 -882 -811 -937 -695 -966 -734 -863 -739 -479 -470 -538 -479 -428 -369 -225 -288 -91
2877i1j66j34L29k1R3J67J52l48K51q8J70L26j18j35j43K79n2j81N94j16m75N54
$$ -91 -257 -391 -62 -83 10 177 329 -19 232 144 314 640 522 387 244 523 471 290 884 768 293 847
2899H47j93K02l9N9q6K54j1m9J49l19L77l37K81J39k52L45k27L3K5p1k4K88l55
$$ 847 654 856 817 876 790 1044 1033 984 1133 814 1191 854 1135 1274 1022 1367 1140 1173 1198 1127 1103 1391 1036
2922A036J84L38l59Q8R5K3j65j20J78m0K5j4j97j92K52j37LJ60o1n2l11Q1J92
$$ 1036 1220 1558 1199 1287 1382 1405 1240 1120 1298 1258 1283 1269 1072 880 1132 995 998 1158 1097 1045 734 815 1007
2945A007n41m1K47Rk64j3k31J60j37k55MJ2R6l49PN8J3k68l01l2j62R9m68M32
$$ 1007 466 425 672 681 417 404 173 333 196 -59 -55 -43 53 -296 -289 -231 -218 -486 -787 -819 -981 -882 -1350 -918
2969i18m9j81J84m03l1J04j85K87k54j51M31n55J97K1o4j30J33j41K78k27P8K28
$$ -918 -967 -1148 -964 -1367 -1398 -1294 -1479 -1192 -1446 -1597 -1166 -1721 -1524 -1503 -1567 -1697 -1564 -1705 -1427 -1654 -1576 -1348
2991a348p1R2j27o5q1M44k12K51N6m1K01j93K17J76k9J61j34L67j35j53J12J86
$$ -1348 -1419 -1327 -1454 -1519 -1600 -1156 -1368 -1117 -1061 -1102 -901 -1094 -877 -701 -730 -569 -703 -336 -471 -624 -512 -326
3013c26m26P38j49OJ78j77K31K25k51L7M61k02J24L6r7K11J8j48K66o9J32j50
$$ -326 -752 -14 -163 -157 21 -156 75 300 49 86 547 345 469 505 408 619 637 489 755 686 818 668
3035F68o0L87k51M3j47L08k61J09k7J99L07m42J22NLn3o3K1K60m00M50k02k00
$$ 668 608 995 744 787 640 948 687 796 769 968 1275 833 955 960 963 910 847 868 1128 728 1178 976 776
3058G76K79k54M75j21o8j2Pj56J54p6j22JJ81K3k96J4K68k4jL0j54j28P2M9m5
$$ 776 1055 801 1276 1155 1087 1075 1082 926 1080 1004 882 883 1064 1087 791 805 1073 1049 1048 1078 924 796 868 917 872
3083H72m4l42Q3j74l5P2j57K1J3k84J02J63l90J11k58Q8l51m8K37k01j95J80j58
$$ 872 828 486 569 395 360 432 275 296 309 25 127 290 -100 11 -247 -159 -510 -558 -321 -522 -717 -537 -695
3106f95k83N44k74k84J84J0j78k80L54m4l59K6J43j22R2j11j86M15l91K07k25
$$ -695 -978 -434 -708 -992 -808 -798 -976 -1256 -902 -946 -1305 -1279 -1136 -1258 -1166 -1277 -1463 -1048 -1439 -1232 -1457
3127a457j2J65k54K01J70N1k61k34K28Q5qJ71k53J66J41j06L76k66O3O5J62M3
$$ -1457 -1469 -1304 -1558 -1357 -1187 -1136 -1397 -1631 -1403 -1318 -1326 -1155 -1408 -1242 -1101 -1207 -831 -1097 -1034 -969 -807 -764
3149g64o5M20k12j7J12K72j51M49l20J67K11l32K92M7K82l9j83L09J35p4L45k90
$$ -764 -829 -409 -621 -638 -526 -254 -405 44 -276 -109 102 -230 62 109 391 352 169 478 613 539 884 594
3171E94J58P2m4J97k7k0k31L09j66K97j45J21o2j91J51j74q3J47L7L4N3J59l71
$$ 594 752 824 780 977 950 930 699 1008 842 1139 994 1115 1053 862 1013 839 756 903 940 974 1027 1186 815
3194H15L01n0Q9n2o3n5R1P0j62j70K00j08O0k1j38P8j28KM8k46L09N2k00rj07
$$ 815 1116 1066 1155 1103 1040 985 1076 1146 984 814 1014 906 966 945 807 885 757 759 807 561 870 922 722 713 606
3219F06lJ52j57jj72K1j11j47L76r5l82K70m5J7m07J28K2k51m7R3K6j93J2j79
$$ 606 603 755 598 597 425 446 335 188 564 469 87 357 312 329 -78 50 72 -179 -226 -133 -107 -300 -288 -467
3243d67J3k8L2L7j0k26j34M9K4r7k9J03j59n5Q5Q0j96q1l8J23k76L58j73o5j86
$$ -467 -454 -482 -450 -413 -423 -649 -783 -734 -710 -807 -836 -733 -892 -947 -862 -782 -978 -1059 -1097 -974 -1250 -892 -1065 -1130 -1316
3268a316J39k43L43p4j4J03l77J63n3P1j09M1K03J31k82K67J50J3m6or6j7L4K29
$$ -1316 -1177 -1420 -1077 -1151 -1165 -1062 -1439 -1276 -1329 -1258 -1367 -1326 -1123 -992 -1274 -1007 -857 -844 -890 -896 -992 -1009 -975 -746
3292g46J18k11L03J2K59r1K53j4j89L82J42o5j23K44J66O2l7J21k18L25j21o8
$$ -746 -628 -839 -536 -524 -265 -356 -103 -117 -306 76 218 153 30 274 440 502 465 586 368 693 572 504
3314E04K59l07N00k9P4L1k04M05Q6j40J40k71J20j5J24j66J49k42L26k15R2nk42
$$ 504 763 456 956 927 1001 1032 828 1233 1319 1179 1319 1048 1168 1153 1277 1111 1260 1018 1344 1129 1221 1216 974
3337I74J69J61k97j21K72j59k11J24L9n0k10K47j60k2Q6j64j4J6j81K26l88j34
$$ 974 1143 1304 1007 886 1158 999 788 912 951 901 691 938 778 756 842 678 664 680 499 725 337 203
3359B03K64k47k0J17K79j25q4O1m39J47j76J9j45mO9j1P9m2J79o14J52k0l0j62
$$ 203 467 220 200 317 596 471 387 448 9 156 -20 -1 -146 -150 -81 -92 -13 -55 124 -490 -338 -358 -388 -550
3383e50R4L08l61l6J94l14K31k96o3K23k29p4K76o3j78j55K3oJ82o1K1l33L87
$$ -550 -456 -148 -509 -545 -351 -665 -434 -730 -793 -570 -799 -873 -597 -660 -838 -993 -970 -976 -794 -855 -834 -1167 -780
3406g80j30j3J06l76NK24O7j05p9j26L03l29J95r8p4K07j24j05K73K2Q3p3J92
$$ -780 -910 -923 -817 -1193 -1188 -964 -897 -1002 -1081 -1207 -904 -1233 -1038 -1136 -1210 -1003 -1127 -1232 -959 -937 -854 -927 -735
3429g35j8P1J04j54J38K2O3j57M55l1k9K00j90Q5M44r5Mo2j2J05J57J23J69q1
$$ -735 -753 -682 -578 -732 -594 -572 -509 -666 -211 -242 -271 -71 -261 -176 268 173 177 115 103 208 365 488 657 576
3453E76N6k0j05O2K55m7o4L19j7lj38J46J4L1R9j12p7M51k74R2j2n2l81M16rp6
$$ 576 632 612 507 569 824 777 713 1032 1015 1012 874 1020 1034 1065 1164 1052 975 1426 1152 1244 1232 1180 799 1215 1206 1130
3479A130J3k54K55M5K7j90J75l17j28O2J81k12Qk27J9J6J5j11QJ4o5Q4l39R2K9
$$ 1130 1143 889 1144 1189 1216 1026 1201 884 756 818 999 787 795 568 587 603 618 507 515 529 464 548 209 301 330
3504C30m8Jl23m9J93k71J20j15j53j3P6p7J05k17K02j19r0p8M2M9L9k09m1K23
$$ 330 282 283 -40 -89 104 -167 -47 -162 -315 -328 -252 -329 -224 -441 -239 -358 -448 -526 -484 -435 -396 -605 -646 -423
3528d23j51k11J18K02m11K33k44j50L35j41J19O2Q2j17n42M01J68k01q4R3J91
$$ -423 -574 -785 -667 -465 -876 -643 -887 -1037 -702 -843 -724 -662 -580 -697 -1239 -838 -670 -871 -955 -862 -671
3549f71j3k05j64j85N14j59J08j76l5m2J89n4J05j00K03K6L21m02L03L8j65k89
$$ -671 -684 -889 -1053 -1238 -724 -883 -775 -951 -986 -1028 -839 -893 -788 -888 -685 -659 -338 -740 -437 -399 -564 -853
3571h53K77K1P6p0K15l2o2J49Q8l2J46M2QJ76l06J56pk31N12M8k0J4M06o77L96
$$ -853 -576 -555 -479 -549 -334 -366 -428 -279 -191 -223 -77 -35 -27 149 -157 -1 -8 -239 273 321 301 315 721 44 440
3596D40K45j24K92m01L58Mj27j3N31k82OoK56j4j40O6K12j91L33m39O9J60l4m2
$$ 440 685 561 853 452 810 814 687 674 1205 923 929 923 1179 1165 1025 1091 1303 1112 1445 1006 1075 1235 1201 1159
3620A159J26l5j69q6O1oQ1p0q9j37K92m11R7k35k2K54j61O9l46K44k60J71o8r7
$$ 1159 1285 1250 1081 995 1056 1050 1131 1061 972 835 1127 716 813 578 556 810 649 718 372 616 356 527 459 362
3644C62k96J88l6m3l17J51j20r8O2M%j54k48N4p0O6j08J26L7p6m4k14K68k06j17
$$ 362 66 254 218 175 -142 9 -111 -209 -147 -143 -143 -297 -545 -491 -561 -495 -603 -477 -440 -516 -560 -774 -506 -712 -829
3669h29J58l00K08j25J64J71k04J17k27rr5K03J18l60Q2J77l7j41l7J62j08J82
$$ -829 -671 -971 -763 -888 -724 -553 -757 -640 -867 -876 -971 -768 -650 -1010 -928 -751 -788 -929 -966 -804 -912 -730
3691g30P9r5J88j97R5N2m4p9J05J54o1k17K56j32L75j70j64j2K57j68K16r5K16
$$ -730 -651 -746 -558 -755 -660 -608 -652 -731 -626 -472 -533 -750 -494 -626 -251 -421 -585 -597 -340 -508 -292 -387 -171
3714a71q8l38L94j76L12l25K00J38k3J16j99L82j4j48K3j62L87pO7N4j54jN2J34
$$ -171 -259 -597 -203 -379 -67 -392 -192 -54 -77 39 -160 222 208 60 83 -79 308 301 368 422 268 267 319 453
3738D53q8j08M41k39Q2K55j6m8Q9j46O8K76M8q0Jk0j1j15L61j32L19l03k27j9
$$ 453 365 257 698 459 541 796 780 732 821 675 743 1019 1067 987 988 968 957 842 1203 1071 1390 1087 860 841
3762H41M42l43l3J41j20R1J48k66p0J42J31o93M23L25l82J14j81m2M19m74k44
$$ 841 1283 940 907 1048 928 1019 1167 901 831 973 1104 411 834 1159 777 891 710 668 1087 613 369
3783C69K81l59qk14Q3l45M51k12j93L4k19J2M0k12K11j24J33l31J81r4K03o5m79
$$ 369 650 291 283 69 152 -193 258 46 -147 -113 -332 -320 -280 -492 -281 -405 -272 -603 -422 -516 -313 -378 -857
3806h57M30j80l2K75k99j49q7L22l41j81J06N0J79k45Q4kQ2L8j49J42N7j23K41
$$ -857 -427 -607 -639 -364 -663 -812 -899 -577 -918 -1099 -993 -943 -764 -1009 -925 -927 -845 -807 -956 -814 -757 -880 -639
3829f39k2j54oP1p7J36k00J63r4J72P1j77K71J8k99K05q6P4J89K08j81kK29k80
$$ -639 -661 -815 -821 -750 -827 -691 -891 -728 -822 -650 -579 -756 -485 -467 -766 -561 -647 -573 -384 -176 -357 -359 -130 -410
3853d10l6K86L8O9j45K85k98L72J79m84K50k39L11K1J2k3j9k2N9L28j92LJ67N7
$$ -410 -446 -160 -122 -53 -198 87 -211 161 340 -144 106 -133 178 199 211 188 169 147 206 534 342 345 512 569
3877E69m2k07K29N7k22J90j43J78k23M1K73K9K18m22m2N4N90m51O6M8J8kj92K41
$$ 569 527 320 549 606 384 574 431 609 386 427 700 729 947 525 483 537 1127 676 742 790 808 806 614 855
3901H55L1J15j59j50j2J89n5j12j35M14k41O2L3l36L25k70j7L2q5L6J09j63J23
$$ 855 886 1001 842 692 680 869 814 702 567 981 740 802 835 499 824 554 537 569 484 520 629 466 589
3924E89j52R7l06J32k35m4L2O0j51l8k01P6Qk90L36j01q6J8q3L7j28P6l19J05
$$ 589 437 534 228 360 125 81 113 173 22 -16 -217 -141 -133 -423 -87 -188 -274 -256 -339 -302 -430 -354 -673 -568
3948e68j2j10j1o9j70K44j32n1J87o1j36o9M39n43O9j51L10q0lj6K60K66o60J13
$$ -568 -580 -690 -701 -770 -940 -696 -828 -879 -692 -753 -889 -958 -519 -1062 -993 -1144 -834 -914 -917 -933 -673 -407 -1067 -954
3972i54J11J30J50k12J16O4j08mP7P9j52J74J17k16K22j78J27j4K35j00K85P2
$$ -954 -843 -713 -563 -775 -659 -595 -703 -707 -630 -551 -703 -529 -412 -628 -406 -584 -457 -471 -236 -336 -51 21
3994B1p7o3J12j3J07O4j15N1JL1K5q9j64L60J60j75J79j36O9M5O2Q1j34j6k57
$$ 21 -56 -119 -7 -20 87 151 36 87 88 119 144 55 -109 251 411 236 415 279 348 393 455 536 402 386 129
4019A29J91pL51k41J20M2k4J2K09j30j62K24n1j69K37J62l09J47J12j01N1k33
$$ 129 320 313 664 423 543 585 561 573 782 652 490 714 663 494 731 893 584 731 843 742 793 560
4041E60k13L44L6j17m01L25Q7j62j51L28K01n03K39k38j3K1L11l55K31j50l8L70
$$ 560 347 691 727 610 209 534 621 459 308 636 837 334 573 335 322 343 654 299 530 380 342 712
4063G12l84Kj8J27j18M4K5k18n7J71j78J52k87p0J8rJ19j05k08n83L63R2l4J6
$$ 712 328 330 312 439 321 365 390 172 115 286 108 260 -27 -97 -79 -88 31 -74 -282 -865 -502 -410 -444 -428
4087d28j33l02K43M7q3l48M59l0j05j54k07M01J9l19M26J6o41N32m06J05K29k19
$$ -428 -561 -863 -620 -573 -656 -1004 -545 -575 -680 -834 -1041 -640 -621 -940 -514 -498 -1139 -607 -1013 -908 -679 -898
4109h98p3k8N3L49j35j88O5o3J80J68l09K75K12m1j44m0J35k20K69J53l14K38
$$ -898 -971 -999 -946 -597 -732 -920 -855 -918 -738 -570 -879 -604 -392 -433 -577 -617 -482 -702 -433 -280 -594 -356
4131c56L7o5j0L09n5R5k52M30RP4l53J84J25J39K2n9J35k06J12N6j06l6P39n11
$$ -356 -319 -384 -394 -85 -140 -45 -297 133 142 216 -137 47 172 311 333 274 409 203 315 371 265 229 968 457
4155D57J66K2j64L0P3j14l7K97k79J37J55j92p7K08k65j2N7M97k72j22K67p4K5
$$ 457 623 645 481 511 584 470 433 730 451 588 743 551 474 682 417 405 462 959 687 565 832 758 783
4178G83j10K09k98l5OK8j8nj04j18J39J76m30L04j78m3J56K92m95m4k1L29lj69
$$ 783 673 882 584 549 555 583 565 560 456 338 477 653 223 527 349 306 462 754 259 215 194 523 520 351
4202C51K65k14l15K86P3n62O65o60M58p4l86l5M35m09Q7J57m54QO24o34R20n62
$$ 351 616 402 87 373 446 -116 549 -111 347 273 -113 -148 287 -122 -35 122 -332 -324 300 -334 586 24
4224B4o24P7O49j174L23J98o8J31m42J20P6M11m20K48l95M71m20K96J09o9l69
$$ 24 -600 -523 126 -1048 -725 -527 -595 -464 -906 -786 -710 -299 -719 -471 -866 -395 -815 -519 -410 -479 -848
4245h48K19l98J22j51N61r0k22q7J98j5l85J81N05m54J31J66M5j08j6M3K06j23
$$ -848 -629 -1027 -905 -1056 -495 -585 -807 -894 -696 -711 -1096 -915 -410 -864 -733 -567 -522 -630 -646 -603 -397 -520
4267e20k88N51p2J34m41L60k97J9P1N3M58o1N71J78l63p14L31K09m13R60o12O64
$$ -520 -808 -257 -329 -195 -636 -276 -573 -554 -483 -430 28 -33 538 716 353 -361 -30 179 -234 726 114 778
4289G78j30K49np96R98q23M51pk62M59m84j10O00J87n22K18Qn1m58M61J16p6j
$$ 778 648 897 892 96 1094 271 722 715 453 912 428 318 918 1105 583 801 809 758 300 761 877 801 800
4312H00j67p9K93m57M46j46n6q1L8O9j06j44L32j9l71N08l27k94K45J5ML8j62
$$ 800 633 554 847 390 836 690 634 553 591 660 554 410 742 723 352 860 533 239 484 499 503 541 379
4335C79n5J51k12K88m32m7L54M9l47j2j47N8M4m2O3J78k07L4k77J24p0k2L30k
$$ 379 324 475 263 551 119 72 426 475 128 116 -31 27 71 29 92 270 63 97 -180 -56 -126 -148 182 180
4359A80k33k45K08j53J32j40R8n5k5J1K8l30P5l5L3j47j38J34LJ60L1m60K47j56
$$ 180 -53 -298 -90 -243 -111 -251 -153 -208 -233 -222 -194 -524 -449 -484 -451 -598 -736 -602 -599 -439 -408 -868 -621 -777
4383g77L90k68j60J29O8j02L40j78j45K48k41J99K5l30J8j02J80K13M2l26K29
$$ -777 -387 -655 -815 -686 -618 -720 -380 -558 -703 -455 -696 -497 -472 -802 -784 -886 -706 -493 -451 -777 -548
4404e48j40n0L45K9j69J23j87R5J47LJ2J42j1mP8M6l2M4J79J45j11K7R1O2j37
$$ -548 -688 -738 -393 -364 -533 -410 -597 -502 -355 -352 -340 -198 -209 -213 -135 -89 -121 -77 102 247 136 163 254 316 179
4429A79j40K31l23N90O2k83L67l8j31p1M2J50R4k90L20q2j04l2M4J21m6rk5q3
$$ 179 39 270 -53 537 599 316 683 645 514 443 485 635 729 439 759 677 573 541 585 706 660 651 626 543
4453E43K3J88j77K73m5j26j66j7J15j51K48p0N2l21O2qK33k58m3J2J00k16p6K26
$$ 543 566 754 577 850 805 679 513 496 611 460 708 638 690 369 431 423 656 398 355 367 467 251 175 401
4477D01j64j35L93p9k11J52j22j45q4j8J0P4l9Q3j57J83j35r6m4j15l0j4K8K30
$$ 401 237 102 495 416 205 357 235 90 6 -12 -2 72 33 116 -41 142 7 -89 -133 -248 -278 -292 -264 -34
4501c4j73j40M50k91j84N3j98M3K63k17k08L96j15J19m6r4N3P0k93Q7k8K5J04
$$ -34 -207 -347 103 -188 -372 -319 -517 -474 -211 -428 -636 -240 -355 -236 -282 -376 -323 -253 -546 -459 -487 -462 -358
4524c58k11J51k85q5K18j30J67J03n58M20q1J26m9k10K10Rl5J40j10k3j43M02
$$ -358 -569 -418 -703 -788 -570 -700 -533 -430 -988 -568 -649 -523 -572 -782 -572 -563 -598 -458 -568 -591 -734 -332
4546c32J7j26k06L36j67J85o6p5R9J2n5J9L21k12J52j84J92K15j75K41O1j63K14
$$ -332 -315 -441 -647 -311 -478 -293 -359 -434 -335 -323 -378 -359 -38 -250 -98 -282 -90 125 -50 191 252 89 303
4569C03j71P0Q6q0j66L18l09L69j64K47k39k8L51R3j56k16J08Q7q8L34l18L8R8
$$ 303 132 202 288 208 42 360 51 420 256 503 264 236 587 680 524 308 416 503 415 749 431 469 567
4592E67N8J11l33J87K02k29l7N36m62L48l84l13J52J067q75O5j70L35l88O4j06
$$ 567 625 736 403 590 792 563 526 1062 600 948 564 251 403 1470 595 660 490 825 437 501 395
4613C95M3J53p6j03N2l09K45j72j01j1K72j26J31j10k76j83L48kk7j72Q8l71k59
$$ 395 438 591 515 412 464 155 400 228 127 116 388 262 393 283 7 -176 172 170 143 -29 59 -312 -571
4636e71N27N74r13K66J89J30l55k93O54n38M3qK06n12K91O3k53J84l27M26m22
$$ -571 -44 530 -383 -117 72 202 -153 -446 208 -330 -287 -295 -89 -601 -310 -247 -500 -316 -643 -217 -639
4657f39L23j18pk58K65K4j5q9L12l28j74K56J20Mk19j85j09M97j22J86k83M66
$$ -639 -316 -434 -441 -699 -434 -410 -425 -514 -202 -530 -704 -448 -328 -324 -543 -728 -837 -340 -462 -276 -559 -93
4679i3l77R7O4j40J50P9j46q3J03j61J19O6q9j02K44M2L0j16J91j30K28j06r2
$$ -93 -470 -373 -309 -449 -299 -220 -366 -449 -346 -507 -388 -322 -411 -513 -269 -227 -197 -313 -122 -252 -24 -130 -222
4702b22J41qlj68K43n1J60N6j20j23K71l0JJ04J97l17K60r7j18K67j45K51k12
$$ -222 -81 -89 -92 -260 -17 -68 92 148 28 -95 176 146 147 251 448 131 391 294 176 443 298 549 337
4725C37J42J59q8J11m4q2J14K7J08j03j50J11P3r4k37Q2L25o2k6j06j20L00j05
$$ 337 479 638 550 661 617 535 649 676 784 681 531 642 715 621 384 466 791 729 703 597 477 777 672
4748F72J05k09j19nJ18J41j30k04K46k03J64l54L29j34jj49L4p0k54K91l10N2
$$ 672 777 568 449 444 562 703 573 369 615 412 576 222 551 417 416 267 301 231 -23 268 -42 10
4770A0q3N5K6P1k58K08j14L1l1k18q3J58j17L7J07j55k11K33k8k02r5J4J72J54
$$ 10 -73 -18 8 79 -179 29 -85 -54 -85 -303 -386 -228 -345 -308 -201 -356 -567 -334 -362 -564 -659 -645 -473 -319
4794c19o5L7j7j33J9p8J27q8O5Rn6j01J70K3k45Q2J77J01m25K03j81K98k42J51
$$ -319 -384 -347 -364 -497 -478 -556 -429 -517 -452 -443 -499 -600 -430 -407 -652 -570 -393 -292 -717 -514 -695 -397 -639 -488
4818d88j42J31P2l2J60l96O50k48j04m9L55l02j99N24j05J01k70R9L8J20K9J7
$$ -488 -630 -499 -427 -459 -299 -695 -45 -293 -397 -446 -91 -393 -592 -68 -173 -72 -342 -243 -205 -85 -56 -39
4840c9q4J26k07K24k02N8J79o4r1L16j36J66l52J91P2k61K91j43J02J62L7m8J67
$$ -39 -123 3 -204 20 -182 -124 55 -9 -100 216 80 246 -106 85 157 -104 187 44 146 308 345 297 464
4863D64l92J87k6K3L09j17K40j76j99K50L1L7n8k76K64j6j22J32O5p7R2lr5L05
$$ 464 72 259 233 256 565 448 688 512 313 563 594 631 573 297 561 545 423 555 620 543 635 632 537 842
4887H42j24k67J3J69k90P3J9K26j17m2J81j97k31JK09n2j29n2J57j3k71J19j72
$$ 842 718 451 464 633 343 416 435 661 544 502 683 486 255 256 465 413 284 232 389 376 105 224 52
4910E2o0M6Q3k48Qj81M02n7j19p7m2k03K53r9j43R4qM7j15l65N24m46Ro6J78k9
$$ 52 -8 38 121 -127 -119 -300 102 45 -74 -151 -193 -396 -143 -242 -385 -291 -299 -252 -367 -732 -208 -654 -645 -711 -533 -562
4936e62l2K57j23p9n9p2P6K1k03J64P1P4p6k9j10p1L33m5J70l33Q8k6R7k07J05
$$ -562 -594 -337 -460 -539 -598 -670 -594 -573 -776 -612 -541 -467 -543 -572 -682 -753 -420 -465 -295 -628 -540 -566 -469 -676 -571
4961e71K15o2m5J74o1J1K22m03M8K74oj52k42M72J72k82oJ34Q7j11P3j23K64P9
$$ -571 -356 -418 -463 -289 -350 -339 -117 -520 -472 -198 -204 -356 -598 -126 46 -236 -242 -108 -21 -132 -59 -182 82 161
4985A61k4q7m6L0k5J48j10K26o5j7J98n30J81J66l07M30J35j70J55m95K11L94
$$ 161 137 50 4 34 9 157 47 273 208 191 389 -141 40 206 -101 329 464 294 449 -46 165 559
5007E59J4O7k04q5J28k42M11j76m35K08L30j91j21j00N2M60p93N52NM86n40L08
$$ 559 573 640 436 351 479 237 648 472 37 245 575 384 263 163 215 675 -118 434 439 925 385 693
5029F93L07n43n39M41K37P7j65%j66N32o39QL8Rj0N7j08O2j1Or3r4O8j65k05K00
$$ 693 1000 457 -82 359 596 673 508 508 342 874 235 243 281 290 280 337 229 291 280 286 193 99 167 2 -203 -3
5055ck14J33K33j31k11J00jk06j37L59j54j79K72k03m8L9J18k52J67r0L9P7l1
$$ -3 -217 -84 149 18 -193 -93 -94 -300 -437 -78 -232 -411 -139 -342 -390 -351 -233 -485 -318 -408 -369 -292 -323
5078c23k06k2J8J75k35J63j41K3P0q8J92r2j59J17j9k46L75k63OK53pj91M83k18
$$ -323 -529 -551 -533 -358 -593 -430 -571 -548 -478 -566 -374 -466 -625 -508 -527 -773 -398 -661 -655 -402 -409 -600 -117 -335
5102c35j00O5j1N8J56k59L11p6n8K04j21j05k57J39q1N18n4J22l50J1J12o6M08
$$ -335 -435 -370 -381 -323 -167 -426 -115 -191 -249 -45 -166 -271 -528 -389 -470 48 -6 116 -234 -223 -111 -177 231
5125B31j74j67L1L73l58M20k58o8P3M6K42j30L6k51R4J99J75j08l4j5J01j23J02
$$ 231 57 -110 -79 294 -64 356 98 30 103 149 391 261 297 46 140 339 514 406 372 357 458 335 437
5148D37k51K52j96K28J56l68K51J18k64K16k81Q4K40j83k19P4N6J04k19J44J40
$$ 437 186 438 242 470 626 258 509 627 363 579 298 382 622 439 220 294 350 454 235 379 519
5169E19q4k78L06j41j8L2R0L7k9O4j81j04L02j56j91P6k00K58j98L0K48M0k00
$$ 519 435 157 463 322 304 336 426 463 434 498 317 213 515 359 168 244 44 302 104 134 382 422 222
5192B22J15j65J8j29o3j8Q7K46l00p1R8q9k14P6K30j57j57j49J61r1Q8j18j28
$$ 222 337 172 190 61 -2 -20 67 313 13 -58 40 -49 -263 -187 43 -114 -271 -420 -259 -350 -262 -380 -508
5215e08k8k4K43j90r2jJ37J17j54%j25J61j74J51J46m29k9K70J05J03l42J84k49
$$ -508 -536 -560 -317 -507 -599 -600 -463 -346 -500 -500 -625 -464 -638 -487 -341 -770 -799 -529 -424 -321 -663 -479 -728
5238g28K87r3K32l1k44K60k29%J19J81j18K40l51K62j71m0K00l61N24J24k56J66
$$ -728 -441 -534 -302 -333 -577 -317 -546 -546 -427 -246 -364 -124 -475 -213 -384 -424 -224 -585 -61 63 -193 -27
5260b7J24j89K96l05K46l2j27J87J38j30j96K64j34L22k5k68J02J85j03r2J52
$$ -27 97 -92 204 -101 145 113 -14 173 311 181 -15 249 115 437 412 144 246 431 328 236 388
5281C88R4j53p9R4R3p4o8j21K86k26J83l3j28N2j79K64J73l6j69m2J05R1k68J77
$$ 388 482 329 250 344 437 363 295 174 460 234 417 384 256 308 129 393 566 530 361 319 424 515 247 424
5305D24K45k51kJ40j57J66l08J92k60J4J42L8J87j52j41mO0K98l52Q0j91J12m6
$$ 424 669 418 416 556 399 565 257 449 189 203 345 383 570 418 277 273 333 631 279 359 168 280 234
5328B34P8p8k40J95j77rJ91Q9j96p0J82k7Rm07K08j48j5j4O6j05r8J34r2n5J50
$$ 234 312 234 -6 189 12 3 194 283 87 17 199 172 181 -226 -18 -166 -181 -195 -129 -234 -332 -198 -290 -345 -195
5353a95J51k38j41J50j78j90K31j1L9j1J84l12R4J5J90k85j11J05J61k31k1K77
$$ -195 -44 -282 -423 -273 -451 -641 -410 -421 -382 -393 -209 -521 -427 -412 -222 -507 -618 -513 -352 -583 -604 -327
5375c27l59L3J63j69k1K15p3Q8j08p2L75k76K11j92K63J1j82j86K86J82j12J48
$$ -327 -686 -653 -490 -659 -680 -465 -538 -450 -558 -630 -255 -531 -320 -512 -249 -238 -420 -606 -320 -138 -250 -102
5397a02l40L51J6RL4RL8O9j35J29j88J57J9K62p5j60N4m4J05q9L85k41k32O8J94
$$ -102 -442 -91 -75 -66 -32 -23 15 84 -51 78 -110 47 66 328 253 93 147 103 208 119 504 263 31 99 293
5422B93j61J93K01j51J78j59J04j03j51N8K82l2J24k79K26m9j08N2j22K47O9m84
$$ 293 132 325 526 375 553 394 498 395 244 302 584 552 676 397 623 574 466 518 396 643 712 228
5444B28M65l71K52j91K83k03k64K96l46J45J64k39L4M0J11l71J40K4Q3k16J73
$$ 228 693 322 574 383 666 463 199 495 149 294 458 219 253 293 404 33 173 197 280 64 237
5465B37j34M4J07m6o1j20J0J09l9p6L31m43K50k46j20J24O0L5rl16K09Q6j15R6
$$ 237 103 147 254 208 147 27 37 146 107 31 362 -81 169 -77 -197 -73 -13 22 13 -303 -94 -8 -123 -27
5489b7o6q5J15R0m45K76j28J98J17l66m10L28J12J88R0l51P%j19L9l57K36J72
$$ -27 -93 -178 -63 27 -418 -142 -270 -72 45 -321 -731 -403 -291 -103 -13 -364 -357 -357 -476 -437 -794 -558 -386
5512c86l1j54K93j00j51J45O4o8k48J32J46p0O1k22J19Om2J10k6p5K82j72L08
$$ -386 -417 -571 -278 -378 -529 -384 -320 -388 -636 -504 -358 -428 -367 -589 -470 -464 -506 -396 -422 -497 -215 -387 -79
5535g9k33K0M9J33j91L6J30K0j7N6j67J48J90k10J62j7O7j7K34l9j10J05j61j09
$$ -79 -312 -292 -243 -110 -301 -265 -135 -115 -132 -76 -243 -95 95 -115 47 30 97 80 314 275 165 270 109 0
5559@L48l36L14Q2Q3mj28qJ52k22J68m1J57J58m59J35O1q0k3K8J0K63q5j18m7
$$ 0 348 12 326 408 491 487 359 351 503 281 449 408 565 723 264 399 460 380 357 385 395 658 573 455 408
5584D08j11j10L61m6o8k8N2j25K33k27j95K40k19K77o5J1J40k83N2k13K17k6L3
$$ 408 297 187 548 502 434 406 458 333 566 339 144 384 165 442 377 388 528 245 297 84 301 275 308
5607C08j51p3O1J8P4k69j53Q4J09j97k0P1J24o7Q8k26K31j82M6K3N8l93K52J8
$$ 308 157 84 145 163 237 -32 -185 -101 8 -189 -209 -138 -14 -81 7 -219 12 -170 -124 -101 -43 -436 -184 -166
5631a66J44k51N6M3M6j08J7l4J94Q2l02k06K61k49J19Q5j7J4j04M5J0P7q7j46
$$ -166 -22 -273 -217 -174 -128 -236 -219 -253 -59 23 -279 -485 -224 -473 -354 -269 -286 -272 -376 -331 -321 -244 -331 -477
5655d77k13K54K31j16o7k02K67J15r3k86J40K90m46K73q8lL1J57j04Q2J10j63
$$ -477 -690 -436 -205 -321 -388 -590 -323 -208 -301 -587 -447 -157 -603 -330 -418 -421 -390 -233 -337 -255 -145 -308
5677c08K30j88K11K7o5j75J20j12K67j32P4m9N0j1K16j80k99N64j72L3n0J14M1
$$ -308 -78 -266 -55 -28 -93 -268 -148 -260 7 -125 -51 -100 -50 -61 155 -25 -324 240 68 101 51 165 206
5700B06l30K88pJ42K4m06K46L26k76J1J81M34m32J5j08P6j12M6J81k7L63n24L4
$$ 206 -124 164 157 299 323 -83 163 489 213 224 405 839 407 422 314 390 278 324 505 478 841 317 351
5723C51J48J35j83J68j78N0l00J95L8p8p8j34K35k12K64m5m9j49J82l94L50k16
$$ 351 499 634 451 619 441 491 191 386 424 346 268 134 369 157 421 376 327 178 360 -34 316 100
5745A00J02M7j99n2P3O6j54N0R6j75n3J58J5j57K01k88J50K6k63K75m23K92k30
$$ 100 202 249 50 -2 71 137 -17 33 129 -46 -99 59 74 -83 118 -170 -20 6 -257 18 -405 -113 -343
5768c43M01k07k12J65j77J08K1J68k50OP3J14k62K93k68K26j82K44m85K89j57
$$ -343 58 -149 -361 -196 -373 -265 -244 -76 -326 -320 -247 -133 -395 -102 -370 -144 -326 -82 -567 -278 -435
5789d35M8L1M6m3j9j39O2K86Pl50K55J02l14J39O0k61J78J00K3j33M8L6j76N8
$$ -435 -387 -356 -310 -353 -372 -511 -449 -163 -156 -506 -251 -149 -463 -324 -264 -525 -347 -247 -224 -357 -309 -273 -449 -391
5813c91L78k80J12qJ68k53J64j35M0q2K10l9J77k50k49P8L14qj86P3J29J12j45
$$ -391 -13 -293 -181 -189 -21 -274 -110 -245 -205 -287 -77 -116 61 -189 -438 -360 -46 -54 -240 -167 -38 74 -71
5836g1oK89n6N4r2j75K4N36l43N44p47K58N94o57L28j59q3K15n6J09o3j07m9K02
$$ -71 -77 212 156 210 118 -57 -33 503 160 704 -43 215 809 152 480 321 238 453 397 506 443 336 287 489
5860D89J26k48pR7N7k17L69r4o7j01o3Q1m6j6j02l7J14j09k8J53O5l53O4j40K50
$$ 489 615 367 360 457 514 297 666 572 505 404 341 422 376 360 258 221 335 226 198 351 416 63 127 -13 237
5885B37r0J48j20j10J47j73P8j97K97j39k4j41K05j7k25J37O7j39p1J13k40r0
$$ 237 147 295 175 65 212 39 117 -80 217 78 54 -87 118 101 -124 13 80 -59 -130 -17 -257 -347
5907c47L44k37%j01K09l68N3K50j75K18k6Rm08J54L18j63l80K36P7R1k6j6R8J
$$ -347 -3 -240 -240 -341 -132 -500 -447 -197 -372 -154 -180 -171 -579 -425 -107 -270 -650 -414 -337 -246 -272 -288 -190 -189
5931a89k46LP0j44j38J64K9J17K0M4J5N7j02J07k07m7K20P1J45k19j6Q6p7l7m6
$$ -189 -435 -432 -362 -506 -644 -480 -451 -334 -314 -270 -255 -198 -300 -193 -400 -447 -227 -156 -11 -230 -246 -160 -237 -274 -320
5956c20M56k91J92l00m5K52pk03J86q9K8J75j6m0j74K15j69L06k64P1J16N3J15
$$ -320 136 -155 37 -263 -308 -56 -63 -266 -80 -169 -141 34 18 -22 -196 19 -150 156 -108 -37 79 132 247
5979B47j04k7J67j88K65k56O1j15K31q0r8M9J85j08j58J51j08L38l01J71k3J99
$$ 247 143 116 283 95 360 104 165 50 281 201 103 152 337 229 71 222 114 452 151 322 299 498
6001D98k09L5L93j59j85l7k04L89J92m31J56k79K45O7J01l09J22O0j61N6R1j71
$$ 498 289 324 717 558 373 336 132 521 713 282 438 159 404 471 572 263 385 445 284 340 431 260
6023B60l1j32K47n7k1j09N1n0j5P2j68K76k31R7j60R6r5l63L76K9j23M14m54L2
$$ 260 229 97 344 287 266 157 208 158 143 215 47 323 92 189 29 125 30 -333 43 72 -51 363 -91 -59
6047e9o3r5J8K76j60L0k43K27k52Q0l09K25P7l2p9j33L54l21k2M9J55O8j67k8
$$ -59 -122 -217 -199 77 -83 -53 -296 -69 -321 -241 -550 -325 -248 -280 -359 -492 -138 -459 -481 -432 -277 -209 -376 -404
6071d04K32j98k4j24m3L50j61q2J20J25j19j42K00J28k92Q6m9n2J35p8k92M32
$$ -404 -172 -370 -394 -518 -561 -211 -372 -454 -334 -209 -328 -470 -270 -142 -434 -348 -397 -449 -314 -392 -684 -252
6093b52K10K8p3N1J21k89N7kL6Q2k3n3P7J23M4r3R6k21J28k43K20J3J54j99j17
$$ -252 -42 -14 -87 -36 85 -204 -147 -149 -113 -31 -54 -107 -30 93 137 44 140 -81 47 -196 24 37 191 -8 -125
6118a25J27j59L14j30J24k8%J50n0O3k09J49N4J73k36n0J64j88L38j84J98k6p9
$$ -125 2 -157 157 27 151 123 123 273 223 286 77 226 280 453 217 167 331 143 481 297 495 469 390
6141C90o8j1J3qL8J34P0p3j34k0j3r9J31M6J34n29L59k75K64J0J3j51K57l60J62
$$ 390 322 311 324 316 354 488 558 485 351 331 318 219 350 396 530 1 360 85 349 359 372 221 478 118 280
6166B80r9K31r8k28K83j03lpk51M2j80K74O5q4M3k93J58l6j02K22k51J37Q3j75
$$ 280 181 412 314 86 369 266 263 256 5 47 -133 141 206 122 165 -128 30 -6 -108 114 -137 0 83 -92
6190i2Nj94j02J50K75o02J13Q8L04n33K60M3j5l03K64L8j54Kj7N3R8k7j3M3q5
$$ -92 -87 -281 -383 -233 42 -560 -447 -359 -55 -588 -328 -285 -300 -603 -339 -301 -455 -453 -470 -417 -319 -346 -359 -316 -401
6215d01J01j01o3K40j09M4R2L5o3m19Q5L03K14k96J13k80K68M7L8k71L22L6L3
$$ -401 -300 -401 -464 -224 -333 -289 -197 -162 -225 -644 -559 -256 -42 -338 -225 -505 -237 -190 -152 -423 -101 -65 -32
6238c2J7k03N1J04J44j19n8Q7P6K5m6K7j06q1J08j69J40J45k97J97K90j41R3m0
$$ -32 -15 -218 -167 -63 81 -38 -96 -9 67 92 46 73 -33 -114 -6 -175 -35 110 -187 10 300 159 252 212
6262B12N9l4k4l8j6J95k80N2mJ29JNm5q8K79l30J51J8N7pR7o6j08J20m3J8oJ53
$$ 212 271 237 213 175 159 354 74 126 122 251 252 257 212 124 403 73 224 242 299 292 389 323 215 335 292 310 304 457
6290D57Q9l73K6J84k47K64Q0j91N9Q2K12l58L6Q3O9j65j49J10l5OPJ13j51%N9
$$ 457 546 173 199 383 136 400 480 289 348 430 642 284 320 403 472 307 158 268 233 239 246 359 208 208 267
6315B67r3mk39L3K01m3k23k2m0K99k12L09k35l7K5j57J47j20J25J07r4Qj42k84
$$ 267 174 170 -69 -36 165 122 -101 -123 -163 136 -76 233 -2 -39 -14 -171 -24 -144 -19 88 -6 2 -140 -424
6339d24J82k3j91N1K5k0J24o3l68L36jK4r6QQL0J59j56Oj01j06J76K6j37o7J40
$$ -424 -242 -265 -456 -405 -380 -400 -276 -339 -707 -371 -372 -348 -444 -436 -428 -398 -239 -395 -389 -490 -596 -420 -394 -531 -598 -458
6365d58J62j45N3j54L79k26j85K42j70K33K16r4j38J53k16K79j49K7L7p7k82L64
$$ -458 -296 -441 -388 -542 -163 -389 -574 -332 -502 -269 -53 -147 -285 -132 -348 -69 -218 -191 -154 -231 -513 -149
6387a49J38J40k70Mm4J86r3K46k06K80k60r9L95m61L47pj7K07l46L30k00j52K19
$$ -149 -11 129 -141 -137 -181 5 -88 158 -48 232 -28 -127 268 -193 154 147 130 337 -9 321 121 -31 188
6410A88K3J04l5K50j96j31M4K10k12J35J3j67K29k58K40k10j38K0K40J19l23J90
$$ 188 211 315 280 530 334 203 247 457 245 380 393 226 455 197 437 227 89 109 349 468 145 335
6432C35n3lk94K16K69k83J09k6J31k5p5k5l77M80M3j48j68J11lQ6k79K57k63J94
$$ 335 282 279 -15 201 470 187 296 270 401 376 301 276 -101 379 422 274 106 217 214 300 21 278 15 209
6456B09J15j58nk07N17n13K37L8l26N1Lj40K00j71Q3K61l82j45J43k12M56l47
$$ 209 324 166 161 -46 471 -42 195 233 -93 -42 -39 -179 21 -150 -67 194 -188 -333 -190 -402 54 -293
6478b93L91k17J90k93RJ89q7J08k20k13K91j51L39l31p8J39j21J9l6j29j92L76
$$ -293 98 -119 71 -222 -213 -24 -111 -3 -223 -436 -145 -296 43 -288 -366 -227 -348 -329 -365 -494 -686 -310
6500c10J13r1l2o2nj19m0L20j06j09J74j21J13N6J20q8j85J31J62j15m9N1k74
$$ -310 -197 -288 -320 -382 -387 -506 -546 -226 -332 -441 -267 -388 -275 -219 -99 -187 -372 -241 -79 -194 -243 -192 -466
6523d66K42N2J27J38k73J43q1J15J18k5k45J65O5J6j42J63L7p5K39m77J75K29
$$ -466 -224 -172 -45 93 -180 -37 -118 -3 115 90 -155 10 75 91 -51 112 149 74 313 -164 11 240
6545B40j03J87J28o1q3j91L78m15J73q6j99P08l52k03M5O1j65L48k04L18l88J73
$$ 240 137 324 452 391 308 117 495 80 253 167 -32 676 324 121 166 227 62 410 206 524 136 309
6567C09k67L04J47q9l98l51O77J39m91N98M3k89q0l6N1j73K02r4J5Q2o9k18L18
$$ 309 42 346 493 404 6 -345 332 471 -20 578 621 332 252 216 267 94 296 202 217 299 230 12 330
6590C30k02O0J72q9j96J45k07O6k16L8J66J02K7l22n8K50n1K0L6M3q8l01N14l10
$$ 330 128 188 360 271 75 220 13 79 -137 -99 67 169 196 -126 -184 66 15 35 71 114 26 -275 239 -71
6614g1q6RQ3lK15k63l3n1q5j17K24J10j03j22n8L05k06j4Q1j83l3j15L35k6M5
$$ -71 -157 -148 -65 -68 147 -116 -149 -200 -285 -402 -178 -68 -171 -293 -351 -46 -252 -266 -185 -368 -401 -516 -181 -207 -162
6639a62k54J52p4N1j74o4K11K6K31l19j25L85q6j61K21j47j0j47J14l48O05j74
$$ -162 -416 -264 -338 -287 -461 -525 -314 -288 -57 -376 -501 -116 -202 -363 -142 -289 -299 -446 -332 -680 -75 -249
6661b49q5P0m1P6J92j51j53J87K31j39k38k6M88j39L4p0q3K73l42O7K15J4j71
$$ -249 -334 -264 -305 -229 -37 -188 -341 -154 77 -62 -300 -326 162 23 57 -13 -96 177 -165 -98 117 131 -40
6684d0K57j39J61Nj64K76J83l80J31L8j00K92p1j29P0k20K57L9k3k80OL82l12
$$ -40 217 78 239 244 80 356 539 159 290 328 228 520 449 320 390 170 427 466 443 163 169 551 239
6707B39n0j08K73r6O5p9o3J36jl4J06K3n34L25R7q9J56m4q8n3O1N4q8J58k18k89
$$ 239 189 81 354 258 323 244 181 317 316 282 388 411 -123 202 299 210 366 322 234 181 242 296 208 366 148 -141
6733a41L99j55m2J27k69R7p1J03L5k22L72j45P2l37J23j02Q0k28L70j0j25j54
$$ -141 258 103 61 188 -81 16 -55 48 83 -139 233 88 160 -177 -54 -156 -76 -304 66 56 -69 -223
6755b23J35J78j89N5j75J22Q9Rl15j72K37r3J52p6j93L32j4j92P8O0J19j47j50
$$ -223 -88 90 -99 -44 -219 -97 -8 1 -314 -486 -249 -342 -190 -266 -459 -127 -141 -333 -255 -195 -76 -223 -373
6778c73K6O5Lp3j78M45k34J15J76l27oK4J07l0J2j38K95k63r0J71l7N1j23M56
$$ -373 -347 -282 -279 -352 -530 -85 -319 -204 -28 -355 -361 -337 -230 -260 -248 -386 -91 -354 -444 -273 -310 -259 -382 74
6802G4k02l3j89J47K17K1j13O6j7J49j94J8j41J42r5K18K62k87r4J79q8K66q9
$$ 74 -128 -161 -350 -203 14 35 -78 -12 -29 120 -74 -56 -197 -55 -150 68 330 43 -51 128 40 306 217
6825B17k49M19l64M6Q1J00k26N04n10K60J52m35K06J83k79l2M79m84K11J61l00
$$ 217 -32 387 23 69 150 250 24 528 18 278 430 -5 201 384 105 73 552 68 279 440 140
6846A40L42j96M9j9k22R6K50J11l33JP6k20K84j7k79K69l50K17J047j605Q05l5
$$ 140 482 286 335 316 94 190 440 551 218 219 295 75 359 342 63 332 -18 199 1246 -359 446 411
6868D11k78J38j79R4R0N1k12j8Q3N9l00J78Ln2n6m2L43l67O3j4j00Kj16M1J10
$$ 411 133 271 92 186 276 327 115 97 180 239 -61 117 120 68 12 -30 313 -54 9 -5 -105 -103 -219 -178 -68
6893f8r7N6rJ19k83O6j11J95P2l33P5J21N0j77j78L80j21P4k59L15r1Q2J4j17
$$ -68 -165 -109 -118 1 -282 -216 -327 -132 -60 -393 -318 -197 -147 -324 -502 -122 -243 -169 -428 -113 -204 -122 -108 -225
6917b25k64J43K09j03P3M5j78l0q5K46j32p8K65m0K17l68J11k52K00k85K05J12
$$ -225 -489 -346 -137 -240 -167 -122 -300 -330 -415 -169 -301 -379 -114 -154 63 -305 -194 -446 -246 -531 -326 -214
6939b14K63l50L72k74m7j45O9J65J14M9j81O8k08K06j44J06L66l10K3J20k16Q
$$ -214 49 -301 71 -203 -250 -395 -326 -161 -47 2 -179 -111 -319 -113 -257 -151 215 -95 -72 48 -168 -160
6961a60J05P5K17L0k04J16j75J74k76K20J91p3q1r7k0j06K10M04k31p7Nl1o5J1
$$ -160 -55 20 237 267 63 179 4 178 -98 122 313 240 159 62 42 -64 146 550 319 242 247 216 151 162
6985A62J16Q1p1j01J9M2J45K40l55J16k32Q1kj34M08j53Q2k14L41m94J89J3j35
$$ 162 278 359 288 187 206 248 393 633 278 394 162 243 241 107 515 362 444 230 571 77 266 279 144
7008A44J08J20j76l7O2Q1k32j2k3k2j9J49J27j42j93J15O9n8o9j46Lq4K70l07
$$ 144 252 372 196 159 221 302 70 58 35 13 -6 143 270 128 -65 50 119 61 -8 -154 -151 -235 35 -272
7032b72j88K50k3J82k57K09m6m7J83l70l7J84L9j63P3rj84J80q4J78pJ94m69M71
$$ -272 -460 -210 -233 -51 -308 -99 -145 -192 -9 -379 -416 -232 -193 -356 -283 -292 -476 -296 -380 -202 -209 -15 -484 -13
7056a3j28j08l3n0j3J19k4J32L5l18m0J80P3j21P6L00j16k64J03m2p3J99J25j15
$$ -13 -141 -249 -282 -332 -345 -226 -250 -118 -83 -401 -441 -261 -188 -309 -233 67 -49 -313 -210 -252 -325 -126 -1 -116
7080a16M0k66j43M68n0k29J86J29j46p0q1K72j41m8J58k3Nj27L59j13j03L5Qk3
$$ -116 -76 -342 -485 -17 -67 -296 -110 19 -127 -197 -278 -6 -147 -195 -37 -60 -55 -182 177 64 -39 -4 4 -19
7104a9K89j05j30j74K54N0q7j22K51oj14J31j00O6o3J35J3l11J87K73J50k96q1
$$ -19 270 165 35 -139 115 165 78 -44 207 201 87 218 118 184 121 256 269 -42 145 418 568 272 191
7127A91l8k6K15o0J5J1j30oL3J90N0j98n6J79m3J28k16j43O7o4R0%J7k09J73R4
$$ 191 153 127 342 282 297 308 178 172 205 395 445 247 191 370 327 455 239 96 163 99 189 189 206 -3 170 264
7153B64J34p2m8r0%l89K99J5m2J18r8J61k32l2P4J43m52K68j11J37k21p3J74o6
$$ 264 398 326 278 188 188 -201 98 113 71 189 91 252 20 -12 62 205 -247 21 -90 47 -174 -247 -73 -139
7177a39j33j04K02K14k19r4l4l0l0N7M1m3K8Lj11j5n7K57l10J48k0O8j08J0n0
$$ -139 -272 -376 -174 40 -179 -273 -307 -337 -367 -310 -269 -312 -284 -281 -392 -407 -464 -207 -517 -369 -389 -321 -429 -419 -469
7202d69K45m9K77j98j81J16k10K45J01k59N7J93r0L5k22O6L70q2m4J12J1k75O6
$$ -469 -224 -273 4 -194 -375 -259 -469 -224 -123 -382 -325 -132 -222 -187 -409 -343 27 -55 -99 13 24 -251 -185
7225a85j3m3j23K43j85Q7Q4J53J08k05O9k05L84l42O1L9j0j5j21R3K85K2k4l0
$$ -185 -198 -241 -364 -121 -306 -219 -135 18 126 -79 -10 -215 169 -173 -112 -73 -83 -98 -219 -126 159 181 157 127
7249A27O0P4k71R0qJ88k20J08l95L1L68l37L39L66l51K13j37j36K81k77j3Q9J86
$$ 127 187 261 -10 80 72 260 40 148 -247 -216 152 -185 154 520 169 382 245 109 390 113 100 189 375
7272C75n0M4r0p8J99p0q2k16K45n9k44M61j27N2n9P7j24P9J48k74j21K24j70J17
$$ 375 325 369 279 201 400 330 248 32 277 218 -26 435 308 360 301 378 254 333 481 207 86 310 140 257
7296B57r6K73j48k76L19j64km2J87l00k2R2Oj30P8n5K9K8n8p8q7L15j82j23mL78
$$ 257 161 434 286 10 329 165 163 121 308 8 -14 78 84 -46 32 -23 6 34 -24 -102 -189 126 -56 -179 -183 195
7322A95j87k57p0rL35k37l32K06J02M8j32M9N6j90K75j65J26j61q4J41j42J81
$$ 195 8 -249 -319 -328 7 -230 -562 -356 -254 -206 -338 -289 -233 -423 -148 -313 -187 -348 -432 -291 -433 -252
7344b52P5k97J2K35l8jr8O6J17K8Mj88K01j27j6M20l28l17L51O5j2K28k83m7K24
$$ -252 -177 -474 -462 -227 -265 -266 -364 -298 -181 -153 -149 -337 -136 -263 -279 141 -187 -504 -153 -88 -100 128 -155 -202 22
7369B2k88K96L7n9O0J9r6Mj52K55M8k07J69k2l7J10R4j20K8jn3K07k50R0rR1K2
$$ 22 -266 30 67 8 68 87 -9 -5 -157 98 146 -61 108 86 49 159 253 133 161 160 107 314 64 154 145 236 258
7396B58j80K11K45j89j20k58o4K56K18j06J59r1j12N5k3l3J18j86n4K67k56J14
$$ 258 78 289 534 345 225 -33 -97 159 377 271 430 339 227 282 259 226 344 158 104 371 115 229
7418B29l7J37j27K45m85K13N1j40J15l1M9o8J64J15j68j87J31M7P6n41N3N5K03
$$ 229 192 329 202 447 -38 175 226 86 201 170 219 151 315 430 262 75 206 253 329 -212 -159 -104 99
7441I9j47K59m28K26l6J4L01m35L46m25L38k2L7l51L73k15j4k63J08n8K02l0o2
$$ 99 -48 211 -217 9 -27 -13 288 -147 199 -226 112 90 127 -224 149 -66 -80 -343 -235 -293 -91 -121 -183
7464a83K13k17l8J40k28O5l8J40n2j86p8J49N2k43J41J36l6r0N9j85K12o3J3k83
$$ -183 30 -187 -225 -85 -313 -248 -286 -146 -198 -384 -462 -313 -261 -504 -363 -227 -263 -353 -294 -479 -267 -330 -317 -600
7488f00J21K50L6m2j38L64k41j88J45K83l16J46n9j40Q5k6N5l8M52k58J9j09k3
$$ -600 -479 -229 -193 -235 -373 -9 -250 -438 -293 -10 -326 -180 -239 -379 -294 -320 -265 -303 149 -109 -90 -199 -222
7511b22K18q4j12R0k28L03M5J1j44M64k99Q2l5j06O5J1N9J2q7j6J31j07J29L25
$$ -222 -4 -88 -200 -110 -338 -35 10 21 -123 341 42 124 89 -17 48 59 118 130 43 27 158 51 180 505
7535E05k88k95J94ml5P2J25k14J43J0J09m70M75Pp1k0J77j62j19j22j2J82J53
$$ 505 217 -78 116 112 77 149 274 60 203 213 322 -148 327 334 263 243 420 258 139 17 5 187 340
7558C40k34L69k89k93M29K9r0R4p2j13K2r0K03rl4p8J03k66J35M2Q4k95n6j86
$$ 340 106 475 186 -107 322 351 261 355 283 170 192 102 305 296 262 184 287 21 156 198 282 -13 -69 -255
7582b55N81k98J34m0P4q0q6j03P7nJ61k38%P9K93l56m6K25k34O9k26O0j92K00
$$ -255 326 28 162 122 196 116 30 -73 4 -1 160 -78 -78 1 294 -62 -108 117 -117 -48 -274 -214 -406 -206
7606b06KK08j34J11k53J06j25m5K0Nj23K42j64J12K34n85L65J2p0Q3J76j62k91
$$ -206 -204 4 -130 -19 -272 -166 -291 -336 -316 -311 -434 -192 -356 -244 -10 -595 -230 -218 -288 -205 -29 -191 -482
7629d82R8K51J20l48O8J2l4K83k66J6L6O3p9p0J27j79J65M8Q0k26KK64m0J98j03
$$ -482 -384 -133 -13 -361 -293 -281 -315 -32 -298 -282 -246 -183 -262 -332 -205 -384 -219 -171 -91 -317 -315 -51 -91 107 4
7654Dl9J29p0k95K78n9j50L07j13N7L55n6j26K8k99J72L7J3K00j58op2n9l8N5
$$ 4 -35 94 24 -271 7 -52 -202 105 -8 49 404 348 222 250 -49 123 160 173 373 215 209 137 78 40 95
7679I5J99lK59l16rM2R0j33J37l87L24L9j71J07r1J47Jk0j97J6r0N4K48Q3j77
$$ 95 294 291 550 234 225 267 357 224 361 -26 298 337 166 273 182 329 330 310 113 129 39 93 341 424 247
7704B47n7J49j86L88n76J19K20j17m1J16j00n7O9J39j94K47l61j56L09k27Q0j37
$$ 247 190 339 153 541 -35 84 304 187 146 262 162 105 174 313 119 366 5 -151 158 -69 11 -126
7726a26J44l7K29j05O8K7l62J72P4j64k15K19j34M98m83O0j2j5K7J96q3j52J86
$$ -126 18 -19 210 105 173 200 -162 10 84 -80 -295 -76 -210 288 -195 -135 -147 -162 -135 61 -22 -174 12
7749A2k8j29k2J17l45L00J5k91J87j70J25j42L4K36r0j06j3j35L08N7k66L22l19
$$ 12 -16 -145 -167 -50 -395 -95 -80 -371 -184 -354 -229 -371 -337 -101 -191 -297 -310 -445 -137 -80 -346 -24 -343
7772c43J72n54M24j64L59r4J26m09J50m6J93k20j38M01m4j19J34J31j53R9k07
$$ -343 -171 -725 -301 -465 -106 -200 -74 -483 -333 -379 -186 -406 -544 -143 -187 -306 -172 -41 -194 -95 -302
7793c02L19k78K47l14L03L7j30J30j4O4j09R5k4j0K43j95j07n7M35l06l6p1M19
$$ -302 17 -261 -14 -328 -25 12 -118 12 -2 62 -47 48 24 14 257 62 -45 -102 333 27 -9 -80 339
7816C39j31m6ko6o0R3m5K48j22J60j88P5n2J96j73J28p3k1R9j32o1J83K6j44l7
$$ 339 208 162 160 94 34 127 82 330 208 368 180 255 203 399 226 354 281 260 359 227 166 349 375 231 194
7841A94K17k11m5n9k3j16O1J16k01L28j54J17k77K85m9n8j78J9K91j79j48J33
$$ 194 411 200 155 96 73 -43 18 134 -67 261 107 224 -53 232 183 125 -53 -34 257 78 -70 63
7863F3J56k01J6K6o2j3J15j40o0NJ13p1P8j32J77j67j47K85k30J86k95O9m5K12
$$ 63 219 18 34 60 -2 -15 100 -40 -100 -95 18 -53 25 -107 70 -97 -244 41 -189 -3 -298 -229 -274 -62
7887f2p5j19L2J75j53j02M1J45l9J03p4q6J31k12J07J33j40j02j19K21J33k11
$$ -62 -137 -256 -224 -49 -202 -304 -263 -118 -157 -54 -128 -214 -83 -295 -188 -55 -195 -297 -416 -195 -62 -273
7909b73P5j48N8J40j14j16L18L2k45l2j47M26k72o6K40k70K8J75j0j09L03n3K39
$$ -273 -198 -346 -288 -148 -262 -378 -60 -28 -273 -305 -452 -26 -298 -364 -124 -394 -366 -191 -201 -310 -7 -60 179
7932A79m26Q7J39r8L9j13OJ56q6L23j75R4K1j01k19K72m0J66N6k24J79o7Q9j13
$$ 179 -247 -160 -21 -119 -80 -193 -187 -31 -117 206 31 125 146 45 -174 98 58 224 280 56 235 168 257 144
7956A44N0j0j70L40o6O5n4j22L5n8j24L15j40J13O5J83m00N1J13l06J90L23Ll07
$$ 144 194 184 14 354 288 353 299 177 212 154 30 345 205 318 383 566 166 217 330 24 214 537 540 233
7980B33J74k5L0j80J24n7j05M02l40j64q1O1Q1j20J20K93k46P5j97J12l27J76
$$ 233 407 382 412 232 356 299 194 596 256 92 11 72 153 33 153 446 200 275 78 190 -137 39
8002C9M8q4j73P0j1M5J00n7J05k50K64p2j68k19L42k04K9J49J24k46k11J4L8L12
$$ 39 87 3 -170 -100 -111 -66 34 -23 82 -168 96 24 -144 -363 -21 -225 -196 -47 77 -169 -380 -366 -328 -16
8026a6k08k6J18k36L89k92o3J25K00j30Lm6k70J87j13M3J46j49O3K14k35J92j45
$$ -16 -224 -250 -132 -368 21 -271 -334 -209 -9 -139 -136 -182 -452 -265 -378 -335 -189 -338 -275 -61 -296 -104 -249
8049b49r9J14nJ16j95R9M6k26J86K2k12J86k6p3J56j48J67o5Q9K0j35o2Q5K13
$$ -249 -348 -234 -239 -123 -318 -219 -173 -399 -213 -191 -403 -217 -243 -316 -160 -308 -141 -206 -117 -97 -232 -294 -209 4
8073Dl41K61J65l20Q5k6K28k46O4J45j36K37l21J30k24M06j22K31q6N6j17k08
$$ 4 -337 -76 89 -231 -146 -172 56 -190 -126 19 -117 120 -201 -71 -295 111 -11 220 134 190 73 -135
8095a35R5J81J07k4j00L2J32M4l20J5K20q7O1K35l02K28J25l22J62k77O16n34
$$ -135 -40 141 248 224 124 156 288 332 12 27 247 160 221 456 154 382 507 185 347 70 686 152
8117A52J85M4j94J03J22j88K25k90k32K19K75k31K18j84j91J85J57P6k02PmK4
$$ 152 337 381 187 290 412 224 449 159 -73 146 421 190 408 224 33 218 375 451 249 256 252 276
8139B76l23K10l00L13j00J8o4q7j12K8J03O2K29k67j76q8L02j92N0J11j13j69
$$ 276 -47 163 -137 176 76 94 30 -57 -169 -141 -38 24 253 -14 -190 -278 24 -168 -118 -7 -120 -289
8161b89l5K34k31J08L1k71K02p7L36l59J59P0p8q5j98j3M89k58J0M1q8L7j87N9
$$ -289 -324 -90 -321 -213 -182 -453 -251 -328 8 -351 -192 -122 -200 -285 -483 -496 -7 -265 -255 -214 -302 -265 -452 -393
8185c93K86k35N23m48j40P5
$$ -393 -107 -342 181 -267 -407 -332
8191c32
$$ Imaginary data points
##PAGE= N=2
##DATA TABLE= (X++(I..I)), XYDATA
0@%%%%%%%%%%%%qJ6j6J6j6K4l2L2m0M8n6P2q8J01j17J36j52J74j98K24k56K90
$$ 0 0 0 0 0 0 0 0 0 0 0 0 0 -8 8 -8 8 -8 16 -16 16 -24 24 -32 40 -48 53 -64 72 -80 94 -104 120 -136 154
34A54l30L73m18M69n24N84o49P22q02Q89r84J087j202J327j462J608j769J950
$$ 154 -176 197 -221 248 -276 308 -341 381 -421 468 -516 571 -631 696 -766 842 -927 1023
52A023k151K371k619K900l218L581m002M497n086N805o705P869r437J1672j5135
$$ 1023 -1128 1243 -1376 1524 -1694 1887 -2115 2382 -2704 3101 -3604 4265 -5172 6500 -8635
67h635K1256l5188J22773J8902j81544J54677P006p3620j079J8561M4917k7928
$$ -8635 12621 -22567 100206 119108 -62436 92241 99247 25627 24548 43109 88026 60098
79F0098p7867R4142K812r5308L7003M4479l1257j1248l674L4381j3846n3418L4461
$$ 60098 -17769 76373 79185 -16123 20880 65359 34102 22854 19180 53561 39715 -13703 20758
92B0758K4389m2334M899J4324N150j6516l4113L7698J3128o3021L4374M2843n5108
$$ 20758 45147 2813 7712 22036 27186 10670 -23443 14255 27383 -35638 -1264 41579 -13529
105a3529k640L5679j6883j4757L615K0587R443l1327M223L4954k9383k9479L5966
$$ -13529 -16169 19510 2627 -12130 -8515 12072 21515 -9812 -5589 29365 -18 -29497 6469
118F469J1088l2341R91K2908p828k5080p02J6776k684j6543M656K0512p242k8205
$$ 6469 17557 -14784 -13793 9115 1287 -23793 -24495 -7719 -10403 -26946 -22290 -1778 -9020 -37225
132c7225J3433K1841k6799l757L0148p619j0867N771k793L007o771o079K0195
$$ -37225 -23792 -1951 -28750 -32507 -2359 -9978 -20845 -15074 -17867 -14860 -21631 -27710 -7515
145g515l385j5057J2428j249j1912K543N14M166K838n847N556K104j1465P76Q056
$$ -7515 -10900 -25957 -13529 -14778 -26690 -24147 -23633 -19467 -16629 -22476 -16920 -14816 -26281 -25505 -17449
160a7449L47m815L335J3079r260j5193J6091L844j7527Q488J3066m406o428k452
$$ -17449 -17102 -21917 -18582 -5503 -14763 -29956 -13865 -10021 -27548 -19060 -5994 -10400 -16828 -19280
174a9280J0033n81j5782J3036J6540j2405k684J1685j272n643j735P619R670o046
$$ -19280 -9247 -9828 -25610 -12574 3966 -8439 -11123 562 -710 -6353 -8088 -469 9201 3155
188C155l762J0644L46j2465n50J1297N33q109M390Q057n673p661J069P260Q65
$$ 3155 -607 10037 10383 -2082 -2632 8665 9198 1089 5479 13536 7863 202 1271 8531 9396
203I396o838O840J0522q449o065Q419J596m082K163O984M278o029k792O658k671
$$ 9396 2558 9398 19920 11471 5406 13825 15421 11339 13502 20486 24764 18735 15943 22601 19930
218A9930o013O361N268m214o34L143l243n469J915L203k299Q26L167k504l734
$$ 19930 13917 20278 25546 21332 20698 23841 20598 15129 17044 20247 17948 18774 21941 19437 15703
233A5703j121j431j13j19K12K036j684m978j262r86j949r77j34L529J536q256
$$ 15703 14582 13151 13038 12919 13131 15167 13483 8505 7243 6257 4308 3331 3197 6726 8262 6
249Fm98N549p381m277R308K199n259q09M087j392q791Q38R156m199n813P457M86
$$ 6 -492 5057 -2324 -6601 2707 4906 -353 -1162 2925 1533 -7258 -6420 2736 -1463 -7276 181 667
266F67r411k524L967j134l863J738M026l081n246J116N47l361K24M308R84k416
$$ 667 -8744 -11268 -7301 -8435 -12298 -10560 -6534 -9615 -14861 -13745 -13198 -16559 -16335 -12027 -11043 -13459
282a3459M4l6j881n88J756K086J379Q17j399K6J97l883J292N336j061j782N463
$$ -13459 -13415 -13451 -15332 -15920 -14164 -12078 -10699 -9882 -11281 -11255 -11058 -14941 -13649 -8313 -9374 -11156 -5693
299e693j423m996Q08J905J199k05K00N489j028q229M373L418p973K779Q048m008
$$ -5693 -7116 -12112 -11304 -9399 -8200 -8405 -8205 -2716 -3744 -11973 -7600 -4182 -12155 -9376 -1328 -5336
315e336k539K918j175l077R53J961J485J266M57J99M61j874J73L552K02J922L961
$$ -5336 -7875 -4957 -6132 -9209 -8256 -6295 -4810 -3544 -3087 -2888 -2427 -4301 -4128 -576 -374 1548 5509
332E509k116m53L109m278M50N880j625r32N399k268m361K702J75j911K738J433
$$ 5509 3393 2940 6049 1771 2221 8101 6476 5544 10943 8675 4314 7016 7191 5280 8018 9451
348I451k75M79j823p83J593j680j09M856k93k651K931o54l702J647K434j427K522
$$ 9451 9176 9655 7832 7049 8642 6962 6853 11709 11416 8765 11696 11042 7340 8987 11421 9994 12516
365A2516J879k915O19K14l721K913K440k326K686J525m108P52k94k763L257R3
$$ 12516 14395 11480 12099 12313 8592 11505 13945 11619 14305 15830 11722 12474 12180 9417 12674 12767
381A2767k586L270j144m733N89k25k740j1K153j600j987k82k124k011J64j037
$$ 12767 10181 13451 12307 7574 8163 7938 5198 5187 7340 5740 3753 3471 1347 -664 -500 -1537
397a537M34J551k973p71J058m360p80L177j731o16J889j800j363m82k180Q21Q38
$$ -1537 -1103 448 -2525 -3296 -2238 -6598 -7378 -4201 -5932 -6548 -4659 -6459 -7822 -8304 -10484 -9663 -8825
414h825j337J272J167l423j577J948k019o81K916l46j40R70k134q36J224p92M82
$$ -8825 -10162 -8890 -7723 -11146 -12723 -10775 -12794 -13475 -10559 -10905 -11045 -10075 -12209 -13045 -11821 -12613 -12131
431a2131K628N01j027J5O76q16o14J918J991l5l12J713J3l178J277L761k014m24
$$ -12131 -9503 -9002 -10029 -10014 -9338 -10154 -10768 -8850 -6859 -6894 -7206 -5493 -5480 -8658 -7381 -3620 -5634 -6058
449f058M372o24l286J390R66k057L30K551O10j730K87L68j606k29R51P24M54J9
$$ -6058 -1686 -2310 -5596 -4206 -3240 -5297 -4967 -2416 -1806 -3536 -3249 -2881 -4487 -4716 -3765 -3041 -2587 -2568
467b568P86p70j116J930j029L14M359j002j070L464j109j705K217J782N29J93
$$ -2568 -1782 -2552 -3668 -1738 -2767 -2453 1906 904 -166 3298 2189 484 2701 4483 5012 5205
483E205J898J310k473J06K120j90n13K131K084j049k013J863k36k778K500J414
$$ 5205 7103 8413 5940 6046 8166 7976 7463 9594 11678 10629 8616 10479 10243 7465 9965 11379
499A1379j492P20j48p50m42j024Q3J445o10k33J157j107j295l14L15L86P72n68
$$ 11379 9887 10607 10459 9709 9267 8243 8326 9771 9161 8928 10085 8978 7683 7369 7684 8070 8842 8274
517H274L04Q74r41j756M63J408j347r6K250j277j660n47M83k525N19P58n8j241
$$ 8274 8578 9452 8511 6755 7218 8626 7279 7183 9433 8156 6496 5949 6432 3907 4426 5184 5126 3885
535C885q10j62k274j973L47J581j488n90L82j623k296L73m27n73J5M12j66j357
$$ 3885 3075 2913 639 -1334 -987 594 -894 -1484 -1102 -2725 -5021 -4648 -5075 -5648 -5633 -5221 -5387 -6744
553f744j198l61O21n46m85J252N09j262j243Q88K7j788J201K072j106m07L28K9
$$ -6744 -7942 -8303 -7682 -8228 -8713 -7461 -6952 -8214 -9457 -8569 -8542 -10330 -9129 -7057 -8163 -8570 -8242 -8213
571h213m45j294R15J989j793N05O78n86o39p72J447J133j646P21J683j504k36
$$ -8213 -8658 -9952 -9037 -7048 -8841 -8336 -7658 -8244 -8883 -9655 -8208 -7075 -8721 -8000 -6317 -7821 -8057
588h057m81J571R10j734K411J899l466J585K063k592J183K203L30k78P7J819p13
$$ -8057 -8538 -6967 -6057 -7791 -5380 -3481 -6947 -5362 -3299 -5891 -4708 -2505 -2175 -2453 -2376 -557 -1270
605a270j097K075O76L87M36O2J370l55j429K558R8o83J936m76N35P85k597J926
$$ -1270 -2367 -292 384 771 1207 1269 2639 2284 855 3413 3511 2828 4764 4288 4823 5608 3011 4937
623D937K137l079J352K981j867j453J232J261j478j022L166o08j270J040l79n35
$$ 4937 7074 3995 5347 8328 6461 5008 6240 7501 6023 5001 8167 7559 6289 7329 6950 6415
639F415M76j729K761o87k057K367q56j253P44J29N68N1j048O91m80o00l20M26
$$ 6415 6891 5162 7923 7236 5179 7546 6690 5437 6181 6310 6878 6929 5881 6572 6092 5492 5172 5598
657E598Q9j140R17J866l606M72K433k752n81K243j068k57j94k37L19j347k97Q40
$$ 5598 5687 4547 5464 7330 3724 4196 6629 3877 3296 5539 4471 4214 4020 3783 4102 2755 2458 3298
675C298k44q20k60j2M4j953n73J049q94m25m14JK52k567m33K315l027r80K836
$$ 3298 3054 2234 1974 1962 2006 53 -520 529 -365 -790 -1204 -1203 -951 -3518 -3951 -1636 -4663 -5643 -2807
694b807j426k090O81J45q96r24Q84J52j230M90L49j620K68K09l50O41l33M38n88
$$ -2807 -4233 -6323 -5642 -5497 -6393 -7317 -6433 -6281 -7511 -7021 -6672 -8292 -8024 -7815 -8165 -7524 -7857 -7419 -8007
713h007m25R58o97k69J970j230j00J770j406k65J288K28n78L34J661l93j249J621
$$ -8007 -8432 -7474 -8171 -8440 -6470 -7700 -7800 -6030 -7436 -7701 -6413 -6185 -6763 -6429 -4768 -5161 -6410 -4789
731d789J116j505M90J842J34n26K68J799k36j146J738Q62q53J452j81Q9J418j348
$$ -4789 -3673 -5178 -4688 -2846 -2712 -3238 -2970 -1171 -1407 -2553 -815 47 -806 646 465 554 1972 624
749F24P97J700q50j84J502P1J04l23P72L45n16K43P77k0l21q4R08N4p82J189j7
$$ 624 1421 3121 2271 2087 3589 3660 3764 3441 4213 4558 4042 4285 5062 5042 4721 4637 5545 5599 4817 6006 5989
770E989j010J096k85o35O67n46N7O42o23k15J100j248o04Q38np24M19R24r91q05
$$ 5989 4979 6075 5790 5155 5822 5276 5333 5975 5352 5137 6237 4989 4385 5223 5218 4494 4913 5837 4846 4041
790D041N02K27o02l36K55N44o30j207J220Mj645P62N92j183l14N88l16l20j91
$$ 4041 4543 4770 4168 3832 4087 4631 4001 2794 4014 4018 2373 3135 3727 2544 2230 2818 2502 2182 1991
809A991m81J97L34r42l3O08j261l57P44o02p57M67k54p38l76n35P38m43q06J21
$$ 1991 1510 1707 2041 1099 1066 1674 413 56 800 198 -559 -92 -346 -1084 -1460 -1995 -1257 -1700 -2506 -2385
829b385K20p22j14K52m03j063N00J61q63k61K30o12j17j60Kj55m00l92P72q46
$$ -2385 -2165 -2887 -3001 -2749 -3152 -4215 -3715 -3554 -4417 -4678 -4448 -5060 -5177 -5337 -5335 -5490 -5890 -6282 -5510 -6356
849f356l68J023n86k1K4R1l12j31O27j42k46O16j89l48M43L11j55N10J5K74K25
$$ -6356 -6724 -5701 -6287 -6308 -6284 -6193 -6505 -6636 -6009 -6151 -6397 -5781 -5970 -6318 -5875 -5564 -5719 -5209 -5194 -4920 -4695
870d695J85R8L54J78O64L53J00N6O88M71j87P85M18K89L64L72L93K5N80J2P00
$$ -4695 -4510 -4412 -4058 -3880 -3216 -2863 -2763 -2707 -2019 -1548 -1735 -950 -532 -243 121 493 886 911 1491 1503 2203
891B203O78j97kQ56j40k48P93K68R2K41J20O6K65j23N3N37n11N11M13o97k06M64
$$ 2203 2881 2684 2682 3538 3398 3150 3943 4211 4303 4544 4664 4730 4995 4872 4925 5462 4951 5462 5875 5178 4972 5436
913E436Pk24J25O23q97L7P70n63l42M01l00K22P7o52O40m67q53P76k45l58K39
$$ 5436 5443 5219 5344 5967 5070 5107 5877 5314 4972 5373 5073 5295 5372 4720 5360 4893 4040 4816 4571 4213 4452
934D452j15l22m58k20J57r61O26l96o71O28o91o90P25p67k70N00n27m04K60p02
$$ 4452 4337 4015 3557 3337 3494 2533 3159 2763 2092 2720 2029 1339 2064 1297 1027 1527 1000 596 856 154
954A54j63j46n45Q2p3j69m50K62l07p18J57Q3p06L17Q0p28K00m83j7K73m52j44
$$ 154 -9 -155 -700 -618 -691 -860 -1310 -1048 -1355 -2073 -1916 -1833 -2539 -2222 -2142 -2870 -2670 -3153 -3170 -2897 -3349 -3493
976c493M09k65l32j9k12j06m50N83j29m8J76n49n97J151q24r1O79n06K72n4l60
$$ -3493 -3084 -3349 -3681 -3700 -3912 -4018 -4468 -3885 -4014 -4062 -3886 -4435 -5032 -3881 -4705 -4796 -4117 -4623 -4351 -4405 -4765
997d765M35q36L85N36r08N64L5l30N2r7K31L46n88Q78j82q8L75k90L34N30k07
$$ -4765 -4330 -5166 -4781 -4245 -5153 -4589 -4554 -4884 -4832 -4929 -4698 -4352 -4940 -4062 -4244 -4332 -3957 -4247 -3913 -3383 -3590
1018c590O00K51lK81J66K43O70m05J098Q04o26P31K07l9P09K78Q82K24K03k1M77
$$ -3590 -2990 -2739 -2742 -2461 -2295 -2052 -1382 -1787 -689 115 -511 220 427 388 1097 1375 2257 2481 2684 2663 3140
1039C140J23K84K11M58L18q7M98L6l48M79k45M6P17l94L40j97m89J10K41l98O5
$$ 3140 3263 3547 3758 4216 4534 4447 4945 4981 4633 5112 4867 4913 5630 5236 5576 5379 4890 5000 5241 4843 4908
1060D908L65J31o07J67L5n38J39N96p25LK47r55M50lm70K02p6l41K92p42j81n05
$$ 4908 5273 5404 4797 4964 4999 4461 4600 5196 4471 4474 4721 3766 4216 4213 3743 3945 3869 3528 3820 3078 2897 2392
1082B392rK08j06m51l85L0l61n42k82P3m92l85O22m66r02M73n34l87K16j48k29
$$ 2392 2383 2591 2485 2034 1649 1679 1318 776 494 567 75 -310 312 -154 -1056 -583 -1117 -1504 -1288 -1436 -1665
1103a665L93m00l04J15m18n5r3K19K1k20K61p91K81J47l20O6K84m26J96j39j034
$$ -1665 -1272 -1672 -1976 -1861 -2279 -2334 -2427 -2208 -2187 -2407 -2146 -2937 -2656 -2509 -2829 -2763 -2479 -2905 -2709 -2848 -3882
1124c882P53n7o16N12p1k46l03j08O2n8j51O1L81n37O1l39N50l13j14J052k04
$$ -3882 -3129 -3186 -3802 -3290 -3361 -3607 -3910 -4018 -3956 -4014 -4165 -4104 -3723 -4260 -4199 -4538 -3988 -4301 -4415 -3363 -3567
1145c567m42N32o84J71N11l64Q20n4N9M32m9k49L91j34L03J02N09N62k38k08P23
$$ -3567 -4009 -3477 -4161 -3990 -3479 -3843 -3023 -3077 -3018 -2586 -2635 -2884 -2493 -2627 -2324 -2222 -1713 -1151 -1389 -1597 -874
1166h74o01L95N99k02Q11k59J39M93j6L41j58M73O27J61K37K16m55M94Q49l04
$$ -874 -1475 -1080 -481 -683 128 -131 8 501 485 826 668 1141 1768 1929 2166 2382 1927 2421 3270 2966
1186B966L96L88O1L66j41l12O92j81L90L89n7l83L95n4Rp1R7L18m96Q10q09m65
$$ 2966 3362 3750 3811 4177 4036 3724 4416 4235 4625 5014 4957 4574 4969 4915 4924 4853 4950 5268 4772 5582 4773 4308
1208D308R71j849N49M90n76m0K23n58j34m76m78P95O2k40m14p36K86k3r07L54
$$ 4308 5279 3430 3979 4469 3893 3853 4076 3518 3384 2908 2430 3225 3287 3047 2633 1897 2183 2160 1253 1607
1228A607p04N96k6j122L9K8n08M32k96j87K92j370L85o19l08N09r04O9K40q80
$$ 1607 903 1499 1473 351 390 418 -90 342 46 -141 151 -1219 -834 -1453 -1761 -1252 -2156 -2087 -1847 -2727
1248b727l83R62r05L59j80l9M27n15M4m8o86L73K89p4J83q5J78m7n80L65K36k01
$$ -2727 -3110 -2148 -3053 -2694 -2874 -2913 -2486 -3001 -2957 -3005 -3691 -3318 -3029 -3103 -2920 -3005 -2827 -2874 -3454 -3089 -2853 -3054
1270c054J53M95n52j8j57J43n6l75Q00k94l6K61l76j06l3m33M94N84M0J41k59
$$ -3054 -2901 -2406 -2958 -2976 -3133 -2990 -3046 -3421 -2621 -2915 -2951 -2690 -3066 -3172 -3205 -3638 -3144 -2560 -2520 -2379 -2638
1291b638P4k0m29J027KL17L46K15j009Q01j22N50l71N14N91o73K03L06N03J34
$$ -2638 -2564 -2584 -3013 -1986 -1984 -1667 -1321 -1106 -2115 -1314 -1436 -886 -1257 -743 -152 -825 -622 -316 187 321
1311C21J31l22N09k06R5N10L55Qk29L47Q37J66j031O11J28o13O54L87K98l7N02
$$ 321 452 130 639 433 528 1038 1393 1401 1172 1519 2356 2522 1491 2102 2230 1617 2271 2658 2956 2919 3421
1332C421m8j12q5L98L1N61K15l99P31m87l34J69L22n06N58m6k24O8m77k99J71
$$ 3421 3373 3261 3176 3574 3605 4166 4381 3982 4713 4226 3892 4061 4383 3877 4435 4389 4165 4233 3756 3457 3628
1353C628j06K15Q7m35j76k73l50m79L10R8l32r5M01q00n16J74l86m1k32J86j12
$$ 3628 3522 3737 3824 3389 3213 2940 2590 2111 2421 2519 2187 2092 2493 1693 1177 1351 965 924 692 878 766
1374G66m02m71Lj86k89jlj15l55j66k03l49k82K07j37j40r3n20J96n72l14K66
$$ 766 364 -107 -104 -290 -579 -580 -583 -698 -1053 -1219 -1422 -1771 -2053 -1846 -1983 -2123 -2216 -2736 -2540 -3112 -3426 -3160
1396c160K59j18j03q1j49j82k76J41j6R3L96l42J85k16k61K99l9J01Q91l54K57
$$ -3160 -2901 -3019 -3122 -3203 -3352 -3534 -3810 -3669 -3685 -3592 -3196 -3538 -3353 -3569 -3830 -3531 -3570 -3469 -2578 -2932 -2675
1417b675q4o9L71r5J14K94J64k15J60k46K48k03N22j5Q7J67J04k92L10J8l4O02
$$ -2675 -2759 -2828 -2457 -2552 -2438 -2144 -1980 -2195 -2035 -2281 -2033 -2236 -1714 -1729 -1642 -1475 -1371 -1663 -1353 -1335 -1369 -767
1439g67l7k44L45J00m10N5M33M15k46N50JJ43q7j33K63L63k92P52J07j04P9L79
$$ -767 -804 -1048 -703 -603 -1013 -958 -525 -110 -356 194 195 338 251 118 381 744 452 1204 1311 1207 1286 1665
1461A665n05K51K07L14j37j42L22J58J15r9m6L51L78l31L17j14k16L18j03L56
$$ 1665 1160 1411 1618 1932 1795 1653 1975 2133 2248 2149 2103 2454 2832 2501 2818 2704 2488 2806 2703 3059
1481C059LK3J09L59k63J39j79M7M3M73J09o21r3j6k13J97K77j32k89k27j02j79
$$ 3059 3062 3085 3194 3553 3290 3429 3250 3297 3340 3813 3922 3301 3208 3192 2979 3176 3453 3321 3032 2805 2703 2524
1503B524k69m53K92J00j82l66j16m00j11l76J63m06K24k49n65N4m36J03k28o7
$$ 2524 2255 1802 2094 2194 2012 1646 1530 1130 1019 643 806 400 624 375 -190 -136 -572 -469 -697 -764
1523g64n4J8p09K04m85k07m6k6R2l50j53ll56K5n3k64K66Lm11K17j20k27J37l48
$$ -764 -818 -800 -1509 -1305 -1790 -1997 -2043 -2069 -1977 -2327 -2480 -2483 -2839 -2814 -2867 -3131 -2865 -2862 -3273 -3056 -3176 -3403 -3266 -3614
1547c614R8Q6J67J92l83j00J57j14L42J35q6M65k4l86O30k60m4M91q9M21M3k69
$$ -3614 -3516 -3430 -3263 -3071 -3454 -3554 -3397 -3511 -3169 -3034 -3120 -2655 -2679 -3065 -2435 -2695 -2739 -2248 -2337 -1916 -1873 -2142
1569b142M09J20M8L52Q3K88j6j1L10n12J99N29J04J08K86k27K09j28O6J10l9N14
$$ -2142 -1733 -1613 -1565 -1213 -1130 -842 -858 -869 -559 -1071 -872 -343 -239 -131 155 -72 137 9 75 185 146 660
1591F60J08j98M8K07k8K20j7R9M54k91J50L84m48L58k79J09N45O7k00O81n50j44
$$ 660 768 570 618 825 797 1017 1000 1099 1553 1262 1412 1796 1348 1706 1427 1536 2081 2148 1948 2629 2079 1935
1613A935L86j79K08j81L66N7j28J29l9j17K78O7k28K16j53j59J50m70N83q3R9
$$ 1935 2321 2142 2350 2169 2535 2592 2464 2593 2554 2437 2715 2782 2554 2770 2617 2458 2608 2138 2721 2638 2737
1634B737m4j78J33j44m48M03j47L6J33l40j6j79l24K77P7n60K15m8k33m54r1j10
$$ 2737 2693 2515 2648 2504 2056 2459 2312 2348 2481 2141 2125 1946 1622 1899 1976 1416 1631 1583 1350 896 805 695
1656F95N5m41L61o10K13k57n23k20k0j59J00r8p88N01n99k76K79m66kJ65m20J15
$$ 695 750 309 670 60 273 16 -507 -727 -747 -906 -806 -904 -1692 -1191 -1790 -2066 -1787 -2253 -2255 -2090 -2510 -2395
1678b395p0j68k82Q4J54m3l82L10k18l14K9qj53L27m92N52N7n48P17l51k53K83
$$ -2395 -2465 -2633 -2915 -2831 -2677 -2720 -3102 -2792 -3010 -3324 -3295 -3303 -3456 -3129 -3621 -3069 -3012 -3560 -2843 -3194 -3447 -3164
1700c164L36K09l2LL95p61M37O21k48K99K37j30K56k70J13O26j59J78O21J8L8
$$ -3164 -2828 -2619 -2651 -2648 -2253 -3014 -2577 -1956 -2204 -1905 -1668 -1798 -1542 -1812 -1699 -1073 -1232 -1054 -433 -415 -377
1721c77J36l17N38j4K53J93J66J24J67p6R3o7Q5O71l44J1K81l62N00j40PK24J44
$$ -377 -241 -558 -20 -34 219 412 578 702 869 793 886 819 904 1575 1231 1242 1523 1161 1661 1521 1528 1752 1896
1744A896m04L85p1j50L23k54M58k28K72J78m84M95j29l20M57q7j32L94l65J67
$$ 1896 1492 1877 1806 1656 1979 1725 2183 1955 2227 2405 1921 2416 2287 1967 2424 2337 2205 2599 2234 2401
1764B401J29p68M26K05R0j48J6j57J99p39P15n28l23N96j26j05n6m97K06L84k95
$$ 2401 2530 1762 2188 2393 2483 2335 2351 2194 2393 1654 2369 1841 1518 2114 1988 1883 1827 1330 1536 1920 1625
1785A625J13l68j37J24J43l67M2m06K04q9l62n5P8k23J13l90R6o8n24O47n26l51
$$ 1625 1738 1370 1233 1357 1500 1133 1175 769 973 884 522 467 545 322 435 45 141 73 -451 196 -330 -681
1807f81P2k40k15K03o79K58j28j77q0k23l1j04k59J57p8n61L55j45k21J35n0O4
$$ -681 -609 -849 -1064 -861 -1540 -1282 -1410 -1587 -1667 -1890 -1921 -2025 -2284 -2127 -2205 -2766 -2411 -2556 -2777 -2642 -2692 -2628
1829b628o2l30J65N7q7N0j94j1M68k10P9j50j14K86q6k32O61l08K84O3j84K46
$$ -2628 -2690 -3020 -2855 -2798 -2885 -2835 -3029 -3040 -2572 -2782 -2703 -2853 -2967 -2681 -2767 -2999 -2338 -2646 -2362 -2299 -2483 -2237
1851b237O37m68K76K29j46L65j19L10J25K69K21m1J13K41j54O08j24L56J97J17
$$ -2237 -1600 -2068 -1792 -1563 -1709 -1344 -1463 -1153 -1028 -759 -538 -579 -466 -225 -379 229 105 461 658 775
1871G75q4M55M8J1L01j28L00J26q5L66J09L7m8R9Q1k72L53j61K08Q4l07l36L66
$$ 775 691 1146 1194 1205 1506 1378 1678 1804 1719 2085 2194 2231 2183 2282 2363 2091 2444 2283 2491 2575 2268 1932 2298
1894B298O8m7k70j30K52jq5l30O03m71p1j72N10n20J27K13k46M2j78K33l66o0
$$ 2298 2366 2319 2049 1919 2171 2170 2085 1755 2358 1887 1816 1644 2154 1634 1761 1974 1728 1770 1592 1825 1459 1399
1916A399J81k10R0O1j18k19J81Oj39j01J79j32m3l21Q7m48L73j02j60J2K3j99
$$ 1399 1580 1370 1460 1521 1403 1184 1365 1371 1232 1131 1310 1178 1135 814 901 453 826 724 564 576 599 400
1938D00j68P8K1l71j80O2j73j82J47k14j66J49n56K09m04J9J81l16pj98pr2j73
$$ 400 232 310 331 -40 -220 -158 -331 -513 -366 -580 -746 -597 -1153 -944 -1348 -1329 -1148 -1464 -1471 -1669 -1676 -1768 -1941
1961a941p3L6n10K33R2l63K8K34j36mk69q8J12l7J04n3K97qp5P6j57J58J41j2
$$ -1941 -2014 -1978 -2488 -2255 -2163 -2526 -2498 -2264 -2400 -2404 -2673 -2761 -2649 -2686 -2582 -2635 -2338 -2346 -2421 -2345 -2502 -2344 -2203 -2215
1985b215k8K34j80J50K19l73K43J73K6N1K4K12R1J51O2l9L47L8K72k3M40K0J5
$$ -2215 -2243 -2009 -2189 -2039 -1820 -2193 -1950 -1777 -1751 -1700 -1676 -1464 -1373 -1222 -1160 -1199 -852 -814 -542 -565 -125 -105 -90
2008i0O6R0J98L08J33N0j60K18M99O0n3J93J95j29K42K55j1J02j7K14K39j44m18
$$ -90 -24 66 264 572 705 755 595 813 1312 1372 1319 1512 1707 1578 1820 2075 2064 2166 2149 2363 2602 2458 2040
2031B040L47J20j18J53J78l51k9m1M5L2p8M1k83L68k82k66M31k68j06j11J89m96
$$ 2040 2387 2507 2389 2542 2720 2369 2340 2299 2344 2376 2298 2339 2056 2424 2142 1876 2307 2039 1933 1822 2011 1515
2053A515J08j44P3q2j42R4k35K5j31J55j04q4n35L81r9n9l57Q2L2M3k53K13o5
$$ 1515 1623 1479 1552 1470 1328 1422 1187 1212 1081 1236 1132 1048 513 894 795 736 379 461 493 536 283 496 431
2076D31k05m80R0pq1M79m34L94q03K65k93n1J53j90j42N7l98M7j72J90k20Q5J56
$$ 431 226 -254 -164 -171 -252 227 -207 187 -616 -351 -644 -695 -542 -732 -874 -817 -1215 -1168 -1340 -1150 -1370 -1285 -1129
2099a129p22L93L9m52K30M2l54J96k91Nm0P9k49J83j33o5L58l38K0k35M91k71
$$ -1129 -1851 -1458 -1419 -1871 -1641 -1599 -1953 -1757 -2048 -2043 -2083 -2004 -2253 -2070 -2203 -2268 -1910 -2248 -2228 -2463 -1972 -2243
2121b243L2m7J40k77K94J1J40J75j99K08l9k8L15J61j35J48K41j85M74j14L77
$$ -2243 -2211 -2258 -2118 -2395 -2101 -2090 -1950 -1775 -1974 -1766 -1805 -1833 -1518 -1357 -1492 -1344 -1103 -1288 -814 -928 -551
2142e51j44l9K26K2K52J42m0K94L2q7M64J6N5R9o2L22n7q0L66k3M6n6O08n20K92
$$ -551 -695 -734 -508 -486 -234 -92 -132 162 194 107 571 587 642 741 679 1001 944 864 1230 1207 1253 1197 1805 1285 1577
2167A577K76m6L51p0k5R4j05J26j30J86J7q4L40j5k54L92k10k27L46k16j56L09
$$ 1577 1853 1807 2158 2088 2063 2157 2052 2178 2048 2234 2251 2167 2507 2492 2238 2630 2420 2193 2539 2323 2167 2476
2189B476p20K99m01N17k35j53J28l37J76J16l78k34K21k00k18J17n26K22m49R0
$$ 2476 1756 2055 1654 2171 1936 1783 1911 1574 1750 1866 1488 1254 1475 1275 1057 1174 648 870 421 511
2209E11Q3m45J38J5m11R6k45p6K23m38j66J9R0j9j13l56J23M3l56M65l20P2j74
$$ 511 594 149 287 302 -109 -13 -258 -334 -111 -549 -715 -696 -606 -625 -738 -1094 -971 -928 -1284 -819 -1139 -1067 -1241
2232a241k05L27j41k21L6o1QJ35j69m7L77n19L01J3k12J53r4L0n0N9m9J08P0j43
$$ -1241 -1446 -1119 -1260 -1481 -1445 -1506 -1498 -1363 -1532 -1579 -1202 -1721 -1420 -1407 -1619 -1466 -1560 -1530 -1580 -1521 -1570 -1462 -1392 -1535
2256a535k40J83l70K60J80M7j05K72l05l3q0K33q8j85J42L85L4m19K52j58N19
$$ -1535 -1775 -1592 -1962 -1702 -1522 -1475 -1580 -1308 -1613 -1646 -1726 -1493 -1581 -1766 -1624 -1239 -1205 -1624 -1372 -1530 -1011
2277a011m34R3K76J72J8J15m16M23Q9L56N38o6q19J098j67l18K43j73M47K77j28
$$ -1011 -1445 -1352 -1076 -904 -886 -771 -1187 -764 -675 -319 219 153 -666 432 265 -53 190 17 464 741 613
2298F13L3J03J92L0L57J81J37k84K74J42k57M83k51j64M60j00O3J11j37K98m33
$$ 613 646 749 941 971 1328 1509 1646 1362 1636 1778 1521 2004 1753 1589 2049 1949 2012 2123 1986 2284 1851
2319A851J74J47k97M02k91k16M65j93r7M65o25L12k70r3J11L4j3K5k32k00K15
$$ 1851 2025 2172 1875 2277 1986 1770 2235 2042 1945 2410 1785 2097 1827 1734 1845 1879 1866 1891 1659 1459 1674
2340A674n65P73n34L2N6l62k31K88n38M56n62k30R6p4r0j5l87r0K5k54J15j13
$$ 1674 1109 1882 1348 1380 1436 1074 843 1131 593 1049 487 257 353 279 189 174 -213 -303 -278 -532 -417 -530
2362e30l62K82l37J26l01r0K20k11j39l8k08R6K37l66N4K5ln5R4k75L07j20j42
$$ -530 -892 -610 -947 -821 -1122 -1212 -992 -1203 -1342 -1380 -1588 -1492 -1255 -1621 -1567 -1542 -1545 -1600 -1506 -1781 -1474 -1594 -1736
2385a736K45k11M08j61k54K44j7j26L04j71RkN8q6k77N03P6k48k8O8K98j92J85
$$ -1736 -1491 -1702 -1294 -1455 -1709 -1465 -1482 -1608 -1304 -1475 -1466 -1468 -1410 -1496 -1773 -1270 -1194 -1442 -1470 -1402 -1104 -1296 -1111
2408a111k99PJ94M8J60j88K67j36kM10j94J92M1r6P6J04J32L24j80R7J76o9j5
$$ -1111 -1410 -1403 -1209 -1161 -1001 -1189 -922 -1058 -1060 -650 -844 -652 -611 -707 -631 -527 -395 -71 -251 -154 22 -47 -62
2431f2m6j10L25M65l43K25J50l9Q9QL70j49J94K42j31lK55j65J04On0J17j49K14
$$ -62 -108 -218 107 572 229 454 604 565 654 662 1032 883 1077 1319 1188 1185 1440 1275 1379 1385 1335 1452 1303 1517
2455A517J65n9J09J35j29pJ56O2J21l20K86K0j11j00Q1k01J15K34m29K04j47n9
$$ 1517 1682 1623 1732 1867 1738 1731 1887 1949 2070 1750 2036 2056 1945 1845 1926 1725 1840 2074 1645 1849 1702 1643
2477A643l7o7n3o3q9l6j09n7%j03j04J02l37n3L4k19l6l6j68j26l86O5k6j17m03
$$ 1643 1606 1539 1486 1423 1334 1298 1189 1132 1132 1029 925 1027 690 637 671 452 416 380 212 86 -300 -235 -261 -378 -781
2502g81L31j67j01j23mq2K09o50L17k32l5J63m65K68l81Q0n2J38n43N42j06j30
$$ -781 -450 -617 -718 -841 -845 -927 -718 -1368 -1051 -1283 -1318 -1155 -1620 -1352 -1733 -1653 -1705 -1567 -2110 -1568 -1674 -1804
2524a804Np7L2r9R4M2j70K50k22M1K09J28%k69L93o5K08m31M89j45L20k82R9K36
$$ -1804 -1799 -1876 -1844 -1943 -1849 -1807 -1977 -1727 -1949 -1908 -1699 -1571 -1571 -1840 -1447 -1512 -1304 -1735 -1246 -1391 -1071 -1353 -1254 -1018
2548a018j29J27m0L58k14M05k59K59j54L50j19J5K2q8L90J7l1j41K65p0M0J02
$$ -1018 -1147 -1020 -1060 -702 -916 -511 -770 -511 -665 -315 -434 -419 -397 -485 -95 -78 -109 -250 15 -55 -15 87
2570H7K23mK46l71k1N35k86j8K75J4n5P1Pj8L03k13j48M18j9O7J65k05K83l96
$$ 87 310 306 552 181 160 695 409 391 666 680 625 696 703 685 988 775 627 1045 1026 1093 1258 1053 1336 940
2594I40M98Ln8J37j51K14J58j14l4j77J20K31k15k1k3P5j21J55Q4n0q8J61j04
$$ 940 1438 1441 1383 1520 1369 1583 1741 1627 1593 1416 1536 1767 1552 1531 1508 1583 1462 1617 1701 1651 1563 1724 1620
2617A620o6k75J18m1J01j88j43J48j50j95L1j73P2J4l28J63k05J3j17n9l7r2m51
$$ 1620 1554 1279 1397 1356 1457 1269 1126 1274 1124 929 960 787 859 873 545 708 503 516 399 340 303 211 -240
2640b40R5K43m05j78j00K75k81k30J82j27n2k72J11k02m8q4p0l1k60J00j17m6
$$ -240 -145 98 -307 -485 -585 -310 -591 -821 -639 -766 -818 -1090 -979 -1181 -1229 -1313 -1383 -1414 -1674 -1574 -1691 -1737
2662a737J6L8jn4j09j82L60k62K19j14n0J27k73M93r9m62L59J81j11K7L00j32
$$ -1737 -1721 -1683 -1684 -1738 -1847 -2029 -1669 -1931 -1712 -1826 -1876 -1749 -2022 -1529 -1628 -2090 -1731 -1550 -1661 -1634 -1334 -1466
2684a466P6K2K77l9K50L0L7Q3k5ML46j74NN12m08m2M49J0rj50J68J34m6R5K03
$$ -1466 -1390 -1368 -1091 -1130 -880 -850 -813 -730 -755 -751 -405 -579 -574 -62 -470 -512 -63 -53 -62 -212 -44 90 44 139 342
2709C42o8N9N1l0J75N2k23J43K47k38O7K89R1j14K06k30q8j19M36J03J69m23M7
$$ 342 274 333 384 354 529 581 358 501 748 510 577 866 957 843 1049 819 731 612 1048 1151 1320 897 944
2732I44K06k41K39J65L6k00L00R1k38J78j29O9j33J26p9r4J9J0j6M8J24o2J19
$$ 944 1150 909 1148 1313 1349 1149 1449 1540 1302 1480 1351 1420 1287 1413 1334 1240 1259 1269 1253 1301 1425 1363 1482
2755A482o7j55l72L20j54M7k62M20k82K43k11r2p1j58O0l7k29j31J96j52j58J91
$$ 1482 1415 1260 888 1208 1054 1101 839 1259 977 1220 1009 917 846 688 748 711 482 351 547 395 237 428
2777D28l51k15K10j0k19j13j2J5n54M69k91jJ04j15l75M7N9J91m80K56k83j20
$$ 428 77 -138 72 62 -157 -270 -282 -267 -821 -352 -643 -644 -540 -655 -1030 -983 -924 -733 -1213 -957 -1240 -1360
2799a360n9J37p0j15J25j26P7m38K1M7K5J23L6m09PL51j29l6r6j59N36j50j61
$$ -1360 -1419 -1282 -1352 -1467 -1342 -1468 -1391 -1829 -1808 -1761 -1736 -1613 -1577 -1986 -1979 -1628 -1757 -1793 -1889 -2048 -1512 -1662 -1823
2822a823J11J32K35k13K59K4k31K50L23L8q1k15K24L62K10j26J06J88M8R5j88
$$ -1823 -1712 -1580 -1345 -1558 -1299 -1275 -1506 -1256 -933 -895 -976 -1191 -967 -605 -395 -521 -415 -227 -179 -84 -272
2843b72K31j6Q6K73oK64J05l25M62l04P3M2j55M98J25k63J42j66J02K33m3J82
$$ -272 -41 -57 29 302 296 560 665 340 802 498 571 613 458 956 1081 818 960 794 896 1129 1086 1268
2865A268k8r3p4L81k4k69O2o2J50j65J00J00k67K30l12M4L30k00J0K8Rp5R5j90
$$ 1268 1240 1147 1073 1454 1430 1161 1223 1161 1311 1146 1246 1346 1079 1309 997 1041 1371 1171 1181 1209 1218 1143 1238 1048
2889A048J16j17J00j6j78Q4L1l27L69J16n16L93k96j60L27j75r2j2l62K21J13
$$ 1048 1164 1047 1147 1131 953 1037 1068 741 1110 1226 710 1103 807 647 974 799 707 695 333 554 667
2910F67l54K86k01L5o1j64K98l06j76L23k97O2j45k33L03l20j18j22L03m18L10
$$ 667 313 599 398 433 372 208 506 200 24 347 50 112 -33 -266 37 -283 -401 -523 -220 -638 -328
$$ [...]
8191A17
##END NTUPLES=NMR FID
##END=
