##TITLE=1H_SAV-70(f8)
 CDCl3, 8 sc, 
 10.7.2020
##JCAMPDX= 6.0         $$ Bruker NMR JCAMP-DX V2.0
##DATA TYPE= NMR FID
##DATA CLASS= NTUPLES
##ORIGIN= UXNMR, Bruker Analytische Messtechnik GmbH
##OWNER= root
$$ XWIN-NMR		Version 3.5
$$ Fri Jul 10 10:37:13 2020 Russian Standard Time (UT+4h)  she@DPX200
##.OBSERVE FREQUENCY= 200.1315
##.OBSERVE NUCLEUS= ^1H
##.DELAY= (6, 6)
##.ACQUISITION MODE= SIMULTANEOUS
##.ACQUISITION SCHEME= undefined
##.AVERAGES= 8
##.DIGITISER RES= 18
##SPECTROMETER/DATA SYSTEM= spect
##.PULSE SEQUENCE= zg30
##.SOLVENT NAME= CDCl3
##.SHIFT REFERENCE= (INTERNAL, CDCl3, 0, 15.7039)
##AUDIT TRAIL= $$ (NUMBER, WHEN, WHO, WHERE, WHAT)
$$ ##TITLE= Audit trail, XWIN-NMR		Version 3.5
$$ ##JCAMPDX= 5.01
$$ ##ORIGIN= Bruker BioSpin GmbH
$$ ##OWNER= she
$$ F:/spectra/data/she/nmr/H-F/1/audita.txt
$$ ##AUDIT TRAIL=  $$ (NUMBER, WHEN, WHO, WHERE, WHAT)
(   1,<2020-07-10 10:36:13.54 +0400>,<she>,<DPX200>,
      <created by zg, POWCHK disabled, PULCHK disabled
       configuration hash MD5:
       00 E9 B6 7A A2 85 ED C7 34 08 36 98 17 FE 4E 26
       data hash MD5: 16K
       73 F3 9F 1D 48 66 C9 3C 17 D4 FB AC B6 73 35 43>)
$$ ##END=
$$ 
$$ hash MD5
$$ 35 40 E7 21 9F 36 CF 4D EA E1 D7 8D F2 E4 67 BC
##$RELAX= 
##$RELAX= 
##$RELAX= 
##$RELAX= 
##$RELAX= 
##$RELAX= 
$$ Bruker specific parameters
$$ --------------------------
##$DU= <F:/spectra>
##$EXPNO= 1
##$NAME= <H-F>
##$PROCNO= 1
##$TYPE= <nmr>
##$USER= <she>
##$AMP= (0..31)
100 100 100 100 100 100 100 100 100 100 100 100 100 100 100 100 100 100 
100 100 100 100 100 100 100 100 100 100 100 100 100 100 
##$AQSEQ= 0
##$AQ_mod= 1
##$AUNM= <au_zg>
##$AUTOPOS= <>
##$BF1= 200.13
##$BF2= 200.13
##$BF3= 200.13
##$BF4= 200.13
##$BF5= 200.13
##$BF6= 200.13
##$BF7= 200.13
##$BF8= 200.13
##$BYTORDA= 1
##$CFDGTYP= 0
##$CFRGTYP= 5
##$CHEMSTR= <none>
##$CNST= (0..31)
1 1 145 1 1 1 1 1 1 1 1 1 1 1 1 1 1 1 1 1 1 1 1 1 1 1 1 1 1 1 1 1 
##$CPDPRG= <>
##$CPDPRG1= <>
##$CPDPRG2= <>
##$CPDPRG3= <>
##$CPDPRG4= <mlev>
##$CPDPRG5= <mlev>
##$CPDPRG6= <mlev>
##$CPDPRG7= <mlev>
##$CPDPRG8= <mlev>
##$CPDPRGB= <>
##$CPDPRGT= <>
##$D= (0..31)
0 1.2 0 0 0 0 0 0 0 0.06 0 0.03 0 0 0 0 0.0002 0 0 0 0 0 0 0 0 0 0 0 0 
0 0 0 
##$DATE= 1594362972
##$DBL= (0..7)
120 120 120 120 120 120 120 120 
##$DBP= (0..7)
150 150 150 150 150 150 150 150 
##$DBP07= 0
##$DBPNAM0= <>
##$DBPNAM1= <>
##$DBPNAM2= <>
##$DBPNAM3= <>
##$DBPNAM4= <>
##$DBPNAM5= <>
##$DBPNAM6= <>
##$DBPNAM7= <>
##$DBPOAL= (0..7)
0.5 0.5 0.5 0.5 0.5 0.5 0.5 0.5 
##$DBPOFFS= (0..7)
0 0 0 0 0 0 0 0 
##$DE= 6
##$DECBNUC= <off>
##$DECIM= 24
##$DECNUC= <off>
##$DECSTAT= 4
##$DIGMOD= 1
##$DIGTYP= 9
##$DL= (0..7)
0 120 120 120 120 120 120 120 
##$DP= (0..7)
150 150 150 150 150 150 150 150 
##$DP07= 0
##$DPNAME0= <>
##$DPNAME1= <>
##$DPNAME2= <>
##$DPNAME3= <>
##$DPNAME4= <>
##$DPNAME5= <>
##$DPNAME6= <>
##$DPNAME7= <>
##$DPOAL= (0..7)
0.5 0.5 0.5 0.5 0.5 0.5 0.5 0.5 
##$DPOFFS= (0..7)
0 0 0 0 0 0 0 0 
##$DQDMODE= 0
##$DR= 18
##$DS= 0
##$DSLIST= <SSSSSSSSSSSSSSS>
$$ [...]
##$SUBNAM2= <"">
##$SUBNAM3= <"">
##$SUBNAM4= <"">
##$SUBNAM5= <"">
##$SUBNAM6= <"">
##$SUBNAM7= <"">
##$SUBNAM8= <"">
##$SUBNAM9= <"">
##$SW= 24.9337058887773
##$SWIBOX= (0..15)
0 0 2 0 0 0 0 0 0 0 0 0 0 0 0 0 
##$SW_h= 4990.01996007984
##$TD= 16384
##$TD0= 1
##$TE= 0
##$TE2= 300
##$TE3= 300
##$TEG= 300
##$TL= (0..7)
0 120 120 120 120 120 120 120 
##$TP= (0..7)
150 150 150 150 150 150 150 150 
##$TP07= 0
##$TPNAME0= <>
##$TPNAME1= <>
##$TPNAME2= <>
##$TPNAME3= <>
##$TPNAME4= <>
##$TPNAME5= <>
##$TPNAME6= <>
##$TPNAME7= <>
##$TPOAL= (0..7)
0.5 0.5 0.5 0.5 0.5 0.5 0.5 0.5 
##$TPOFFS= (0..7)
0 0 0 0 0 0 0 0 
##$TUNHIN= 0
##$TUNHOUT= 0
##$TUNXOUT= 0
##$USERA1= <user>
##$USERA2= <user>
##$USERA3= <user>
##$USERA4= <user>
##$USERA5= <user>
##$V9= 5
##$VALIST= <valist>
##$VCLIST= <CCCCCCCCCCCCCCC>
##$VD= 0
##$VDLIST= <DDDDDDDDDDDDDDD>
##$VPLIST= <PPPPPPPPPPPPPPP>
##$VTLIST= <TTTTTTTTTTTTTTT>
##$WBST= 1024
##$WBSW= 4
##$XGAIN= (0..3)
0 0 0 0 
##$XL= 0
##$YL= 0
##$YMAX_a= 372772
##$YMIN_a= -195927
##$ZGOPTNS= <>
##$ZL1= 120
##$ZL2= 120
##$ZL3= 120
##$ZL4= 120
##$ABSF1= 10
##$ABSF2= 0
##$ABSG= 5
##$ABSL= 3
##$ALPHA= 0
##$AQORDER= 0
##$ASSFAC= 0
##$ASSFACI= 0
##$ASSFACX= 0
##$ASSWID= 0
##$AUNMP= <proc_1d>
##$AZFE= 0.1
##$AZFW= 0.1
##$BCFW= 1
##$BC_mod= 2
##$BYTORDP= 1
##$COROFFS= 0
##$CY= 11.3945322036743
##$DATMOD= 1
##$DC= 2
##$DFILT= <>
##$DTYPP= 0
##$F1P= 16.9975609425685
##$F2P= -3.02152046262296
##$FCOR= 0.5
##$FTSIZE= 0
##$FT_mod= 4
##$GAMMA= 1
##$GB= 0.15
##$INTBC= 1
##$INTSCL= 1
##$ISEN= 128
##$LB= 0.24
##$LEV0= 0
##$LPBIN= 0
##$MAXI= 10000
##$MC2= 0
##$MEAN= 0
##$ME_mod= 0
##$MI= 1.114404
##$NCOEF= 0
##$NC_proc= 0
##$NLEV= 6
##$NOISF1= 3.799351
##$NOISF2= 2.8
##$NSP= 1
##$NTH_PI= 0
##$NZP= 0
##$OFFSET= 15.70392
##$PC= 1
##$PHC0= -9801.086
##$PHC1= 26.40092
##$PH_mod= 1
##$PKNL= yes
##$PPARMOD= 0
##$PSCAL= 0
##$PSIGN= 0
##$REVERSE= no
##$SF= 200.130013532006
##$SI= 16384
##$SIGF1= 3
##$SIGF2= 2
##$SINO= 400
##$SIOLD= 16384
##$SREGLST= <1H.CDCl3>
##$SSB= 0
##$STSI= 0
##$STSR= 0
##$SW_p= 3612.71676300578
##$SYMM= 0
##$S_DEV= 0
##$TDeff= 0
##$TDoff= 0
##$TI= <>
##$TILT= no
##$TM1= 0
##$TM2= 0
##$TOPLEV= 0
##$USERP1= <user>
##$USERP2= <user>
##$USERP3= <user>
##$USERP4= <user>
##$USERP5= <user>
##$WDW= 1
##$XDIM= 8192
##$YMAX_p= 0
##$YMIN_p= 0
$$ End of Bruker specific parameters
$$ ---------------------------------
##NTUPLES= NMR FID
##VAR_NAME=  TIME,          FID/REAL,        FID/IMAG
##SYMBOL=    X,             R,               I
##VAR_TYPE=  INDEPENDENT,   DEPENDENT,       DEPENDENT
##VAR_FORM=  AFFN,          ASDF,            ASDF
##VAR_DIM=   8192,          8192,            8192
##UNITS=     SECONDS,       ARBITRARY UNITS, ARBITRARY UNITS
##FACTOR=    0.0002004,     1,               1
##FIRST=     0,             0,               0
##LAST=      1.6414764,     0,               0
##MIN=       0,             -195927,         0
##MAX=       1.6414764,     372772,          0
$$ Real data points
##PAGE= N=1
##DATA TABLE= (X++(R..R)), XYDATA
0@%%%%%%%Qj6J6j6K4l2L9m7N6o8P8r2J10j31J54j78K04k37K74l12L56m05M59n20
31b76N86o57P35q22R17j022J139j264J400j552J723j908K109k335K589k874L193
48A681l558L978m463N038n730O581p657R066j1008J3876j8588K8066p9031K30847
62A69098J10074l33186p8750K00572Q2104j72476k2818J58872M3237j51190n6891
73e1354P1289K8518k5401O5077M5587j25892j59309M9466J51765J0744j09394
84d8904k7475M5228j3013n0624L1939Q4143K9491l3103l5078l3940j8070N6203
96a3203J07920K0091j04581p7450O0678R2782n224n1102J1417L4564l9538p7610
108d1256p436O1901M4958j0487n0822p1248l8449O0276J06370P483j01960n0136
$$ plain form
0 0 0 0 0 0 0 0 0 8 -8 8 -8 16 -16 23 -24 32 -36 42 -50 60 -71 83 -95 109 -128 146 -166 190 -215 244 -276
31 -276 310 -347 388 -434 483 -539 600 -664 736 -816 907 -1001 1108 -1227 1362 -1512 1681
48 1681 -1877 2101 -2362 2676 -3054 3527 -4130 4936 -6072 7804 -10784 17282 -61749 169098
62 169098 279172 -54014 -132764 67808 149912 -22564 -45382 113490 156727 5537 -51354
73 -51354 19935 48453 23052 88129 133716 7824 -151485 -102019 49746 60490 -48904
84 -48904 -76379 -31151 -44164 -94788 -62849 21294 50785 17682 -17396 -51336 -69406 -13203
96 -13203 94717 114808 10227 -67223 -6545 86237 81013 29911 41328 75892 36354 -41256
108 -41256 -48692 13209 58167 47680 -3142 -74390 -112839 -52563 53807 61290 -40670 -90806
120i0806O7433M2010o3226k7825J01780Q0733p5729j09868K3441J02139L7271
131H7353k7108k3600l1135m7007O522P1711L3771m7683l6629K3169j713o3328
143e5677j8091Q3840P1054n2292j08190k4786P2706P0231j51m6064l0344O924
155c0840J4041m694jL5660M3525j0697o2787m2589L0666P2245L8209l4933p0570
168b2765k9205L6130M5054l541k6087L159J2900l0279m8975O828O5009M3074k5448
181B5854n9951l6931J4781N6733M7819j4669n4049j7608L2046J5854j9219N049
193d291M6219J1908n7325n4034J7729N9397L5494p374l5259l9927o794M2098M0368
206D8209j7120m1377Q68K1835k5955m8789K2221Q3909K7587p2073p1781J7277
$$ plain form
120 -90806 -23373 18637 -44589 -72414 29366 110099 34370 -75498 -52057 50082 87353
131 87353 60245 36645 5510 -41497 -34975 36736 70507 22824 -13805 9364 7651 -55677
143 -55677 -73768 10072 81126 28834 -79356 -104142 -31436 38795 38644 -7420 -37764 -30840
155 -30840 -16799 -21493 -21494 14166 57691 46994 -15793 -58382 -27716 44529 82738 47805 -22765
168 -22765 -51970 -15840 29214 25673 -414 2745 15645 -14634 -63609 -56781 8228 51302 25854
181 25854 -34097 -71028 -56247 486 48305 33636 -20413 -38021 -5975 9879 -9340 -4291
193 -4291 41928 53836 -3489 -57523 -39794 19603 55097 47723 12464 -27463 -34257 7841 48209
206 48209 31089 -10288 -9420 12415 -13540 -62329 -40108 43801 71388 -685 -72466 -55189
218e5189O3862K4038k1565k0156l448r13J857J2135J6514J5395J2436p741m3769
231f544l8671K6924P2703K4209n7545o0655O652M1162J1753j3755j089Q985r218
244D911k6315j5989J2574L3641K8024j4743n6961l8864L3412O8866J9690l7362
256A0884l1121P669J4237k751J095K1767K0499p645l3622l2088M507M8949M5400
269F7780j7752o8555l7373L2360M4093o170l1155k596J6174j0167l2836k784M3749
282e232M3888o346n0457l9088J7115N4668L2525j7440l4639r391J4983P604o647
295A543J005J9561J2523k1916m2466j4225L8389N0854r78n8068m7183J6098M5663
308H00J3165k0274o859J4894j059k8966j5379K7200M1385R322l0172l6177m168
$$ plain form
218 -55189 8673 32711 11146 -9010 -12458 -13371 -11514 621 17135 32530 44966 37225 -6544
231 -6544 -45215 -18291 54412 78621 21076 -39579 -32927 8235 19988 6233 5144 14129 4911
244 4911 -21404 -37393 -24819 8822 36846 22103 -34858 -73722 -40310 28556 48246 10884
256 10884 -20237 -12568 1669 -1082 13 21780 42279 34634 1012 -31076 -26569 22380 67780
269 67780 50028 -18527 -55900 -23540 20553 14383 -16772 -19368 -3194 -13361 -46197 -48981 -5232
282 -5232 38656 32310 -18147 -57235 -40120 14548 47073 29633 -5006 -14397 586 8190 1543
295 1543 2548 22109 34632 12716 -29750 -43975 -5586 45268 44290 -13778 -60961 -44863 800
308 800 13965 -6309 -13168 1726 667 -28299 -43678 -16478 24907 34229 4057 -32120 -36288
321c6288L5453M3381R544l1960l2144M029K1273k00j3892R159K5208q504m8935
334b3876l0293K9183N2009J2271l6810m2633p808K6466L0028N250j4825p993Q550
347d81K39j8647m292L7472M1474j2701n5289k7210L1139M6743J2036k5227l1459
360f203j1330J1700J5063m06o037J0753J4356k2229m8379r475N3724M6373k6509
373B1401o1692j5428L7477K9884q32o323L544j235j0118o756N084J4863K3539
386C3408J3255k6684m9260q444N3391M5515k4790n4985r492K7838M612k1917O82
399a6871K7553O628l1912l1172K902L1276L2713R745k6795m0542m465M1273L3739
412C4072j3689k6704M437J6534j3361k2109J6761M2706J0998l4745l8939p977
$$ plain form
321 -36288 -835 42546 52090 20130 -12014 -7985 13288 13088 -804 8355 33563 25059 -23876
334 -23876 -54169 -24986 27023 39294 2484 -40149 -47957 -21491 8537 13787 -1038 -9031 -481
347 -481 -242 -18889 -23181 14291 55765 43064 -12225 -39435 -8296 38447 50483 25256 -6203
360 -6203 -17533 -5833 9230 8824 2787 13540 27896 5667 -42712 -52187 1537 47910 21401
373 21401 -40291 -55719 -18242 11642 10810 4487 8031 6796 -3322 -10078 -4994 9869 33408
386 33408 46663 19979 -29281 -37725 15666 61181 36391 -18594 -28086 -248 4364 -17553 -16871
399 -16871 10682 17310 -14602 -45774 -42872 -11596 21117 30862 4067 -36475 -40940 333 34072
412 34072 20383 -6321 -1884 14650 1289 -20820 -4059 38647 49645 14900 -24039 -32016
424c2016K3232L1514J1159k6637l9580o467K7392J4438j6165n651K2965O316l8242
437b7742l0568L0214N5294J2155l3379k9182k22J8981K4078J6239p627k2148o080
450A3J1672l619j7401J0250L6178O26n7001m2492L0070N6761P951l7209k4631
463b8832M108Q644K532O980Q579J484j387o681j6000n785L0926M5284L22n1983
477a809l4475K6387M3496M184k3692q502P485m627j5353l165J6887J9012r81k7880
491c033l6991n859L6746L7052r204m1430j8140K1209K0119l088k101J7111J2274
504B4665j6063k4738q44K6794K9563M934k7285l5734o627L1842L1061p424k9276
517H68j0177J0174k239j8297M37K8117J7260k4575m0191p564L2581L5572L469
$$ plain form
424 -32016 -8784 22730 33889 7252 -32328 -38795 -11403 3035 -13130 -18781 4184 10500 -27742
437 -27742 -58310 -28096 27198 39353 5974 -23208 -23430 -4449 19629 35868 28241 6093 13
450 13 11685 8066 -9335 915 37093 37719 -19282 -61774 -31704 25057 33008 -4201 -28832
463 -28832 -24724 -16080 -13548 -6568 2011 3495 2108 -4573 -20573 -26358 4568 49852 50174 -1809
477 -1809 -36284 -9897 33599 37783 14091 5589 13074 8447 -6906 -10071 6816 25828 24847 -3033
491 -3033 -40024 -45883 -9137 27915 18711 -22719 -40859 -19650 469 -2619 -4720 12391 24665
504 24665 8602 -16136 -16980 9814 39377 44311 17026 -18708 -25335 6507 37568 30144 868
517 868 -9309 865 -1374 -19671 -19234 8883 26143 1568 -38623 -46187 -13606 21966 25435
530B5435k6016k4787n9J8707J3688p29k235N133J354j5218j7490J0604L6266K2398
544D7051k1890m2786j5039K6252L1165n10k3876j4294L729L138r021l475J6996
557b560K1204n667l2974k4077J5366L9494K0344j9109l3463p176K1436J8561j999
570I380n673O982O605j4001k2701qK8331K5015p709l3899k3814J0625L2082J7054
584B8269j3853k3519l659J0317k003j1840N932K5156P309k8670l1515M337L5233
597A494K6202n888k6360j7505O462K0781J1288n417n756O386K638j7400j6365
610a9440J6881L7354Q666l3858l7157J437K9907K0355p582j9676j0112L499L319
623f407l708O25J4728J5421j0442l2802j5688K4791L7625O923k8053k5030L958
$$ plain form
530 25435 -581 -25368 -25427 -6720 6968 6239 4004 9137 10491 -4727 -22217 -11613 24653 47051
544 47051 25161 -17625 -32664 -6412 24753 24243 367 -13927 -10198 -7060 -16081 -19556 -2560
557 -2560 18644 12977 -19997 -44074 -28708 10786 31130 12021 -21442 -28618 -7182 11379 9380
570 9380 3707 10689 17294 3293 -19408 -19416 8915 33930 26221 -7678 -31492 -20867 11215 28269
584 28269 14416 -9103 -12762 -2445 -4448 -16288 -10356 14800 22109 -6561 -38076 -33739 1494
597 1494 27696 21808 -4552 -22057 -15595 5186 16474 11057 5301 11687 14325 -3075 -19440
610 -19440 -2559 34795 43461 9603 -27554 -26117 3790 24145 16563 -3113 -13225 -9726 -6407
623 -6407 -10115 -9490 5238 20659 10217 -22585 -38273 -13482 24143 31066 3013 -22017 -18059
636a8059K1068J2984j917l933L801J903j1993j6951L802K8355J9428j7686l7966
649a7164j5792K1537K8782K894j9847j7046q50O566m44m066P121J6851L348k3039
663a1149k4171J0308L9443K3507j7590l0269o993J5632J5130K201m470l448r34
676G197m774j1217o722J3557K6274K979l4210l4007Q664L7351J3963j9833j9240
689b0018J367O216j116L00R714J2317L998r253j9893r990K2141L7686N867l6753
703B583k9366J6999L0842R19j7017N71J0215q922k2432n283J6676J6326J737j3892
717d4k5650j4051K1159L6157M108l0465j7120J7909J4467j1442n981K1927J8507
730B9481j6722k7860j969K1208K0214P146r997k5679j6812J5996K7449j822k2897
$$ plain form
636 -18059 3009 15993 14076 10143 13944 15847 3854 -13097 -9295 19060 38488 20802 -17164
649 -17164 -32956 -11419 17363 20257 410 -16636 -17486 -10920 -11364 -15430 -8309 8542 11890 -11149
663 -11149 -35320 -25012 14431 37938 20348 -9921 -16914 -1282 13848 16049 11579 8131 7197
676 7197 2423 -8794 -15516 -1959 24315 27294 -6916 -40923 -32259 5092 19055 -778 -20018
689 -20018 -18651 -12435 -13551 -13251 -3537 8780 12778 3525 -16368 -26358 -4217 33469 39336 2583
703 2583 -26783 -9784 21058 21977 4960 5531 15746 6824 -15608 -20891 -4215 12111 13848 -44
717 -44 -25694 -39745 -18586 17571 21679 -8786 -25906 -7997 6470 -4972 -10953 10974 29481
730 29481 12759 -15101 -17070 4138 24352 31498 21501 -4178 -20990 -4994 22455 20633 -2264
743b264m583J4078n010k4839q45L2731J9374k1578l1529n820J6715J8685J0947
756A6062n339j9002j0296J3592J6342l961p256J4808J4420j9102l2763M663L8668
769B0836J9076k1774k9331n677J0998J0228N118k199q551o232J114k809q664M371
783a3496K4817J1563k6512l2151P010L7996J8430j6273j9082k07P253R66o34N246
797D926O637J709p185j6105r565J4630K9300O617k9692k9366N919K5955Q129j2456
811e47p119M248P10j0868o572J0977J8927P329j4025k2450p263J8895K6305M575
825B3122j9872j7285M486J3359K385n184K936J0740j651k0481j6300J1274K6915
838A4444R950j9103k5166l863J6542J5938J465q980n872K084O34p113l938J2872
$$ plain form
743 -2264 -6847 7231 2221 -22618 -23463 9268 28642 7064 -24465 -30285 -13570 5115 16062
756 16062 10723 -8279 -18575 -4983 11359 7398 142 14950 29370 10268 -22495 -17832 20836
769 20836 39912 18138 -11193 -16870 -5872 4356 9474 7275 -1276 -7508 -6394 -9203 -17867 -13496
783 -13496 11321 22884 -3628 -35779 -28769 9227 27657 11384 -7698 -7905 -652 314 -320 4926
797 4926 11563 13272 6087 -10018 -19583 -4953 24347 30964 1272 -28094 -22175 3780 11909 -547
811 -547 -7666 -3418 -2708 -13576 -20148 -9171 9756 17085 3060 -19390 -26653 -7758 18547 23122
825 23122 3250 -14035 -9549 3810 6195 1011 3947 14687 13036 -7445 -23745 -12471 14444
838 14444 24394 5291 -19875 -23738 -7196 8742 10207 1227 -4645 -2561 -1927 -9040 -12978 -106
852a06K0344j648k7587j8842J5812L0450P474j8044j4794J118N754K092J121L327
866F471K766J52p419j4600n406J8055K4083k448l0719j9513J5655K3569J446j2502
880d10k387N553k926r377M35J3536J3143J535j3824j8846m641J9639K3849l528
894B1751k5680j3434J2204J3438n239o815R066R876j0814k1038l989J7687J8728
907A5741R77j5363j8654k572J7987J7299k945j6056l638R566o85j2612N12K0987
921A0544J3472j5814k5051l556J8496J6986J296j2147j4025l943R787Q740m264
934E21n605O565N927j2832j8345O080K8065J3508j6479k3396l063J4410J3246
947H602P94o489o149J12K837k613m012P546J5219J036k2128j9643Q430K5029J0838
$$ plain form
852 -106 20238 18590 -8997 -27839 -12027 18423 25897 7853 -6941 -5823 -69 2023 3144 6471
866 6471 9237 9389 1970 -12630 -18036 19 24102 21654 -9065 -28578 -12923 10646 12092 -410
880 -410 -2797 2756 -170 -9547 -9112 4424 17567 19102 5278 -13568 -18209 1430 25279 21751
894 21751 -3929 -17363 -5159 8279 3040 -3775 5291 15167 4353 -16685 -20674 -2987 15741
907 15741 16718 1355 -17299 -19871 -1884 15415 12470 -3586 -7224 2342 1657 -10955 -10443 10544
921 10544 24016 8202 -16849 -20405 -1909 15077 16373 4226 -9799 -13742 -3955 4785 521
934 521 -5084 1481 7408 -5424 -23769 -17689 10376 23884 7405 -15991 -19054 -4644 8602
947 8602 9396 2907 -3242 -3130 -293 -2906 -6918 628 15847 16883 -5245 -24888 -16458 8571 19409
962A9409j2694j7364k715Q231O980j557q20L579L135o373j3778l072J6169K0471
976A9601j170k2496j7414Q671K0710Q368q518r578J713L884m965o079N418J4719
990A2864M296j5463j9204j469J8953J8161k396j8199j2569M654J1689K348m455
1003g90R46O652l50j2417q847J0778K1610O690j7656k1485q62J7643J3819l169
1017A2562j1388l646K877k31m876O29J0103P979n909j7811j0334J0462K1300P736
1031A9453j5484j8574o84J3577P232l793k297N765K898r557j1969L513J8119J2597
1045B0796q432k0100j0289J1268J8657M761j2053r911J411L770m742n090P052
1058b902J2527K12j6129j4785M674K0106J3199p448j8561q161Q946J2038J213
$$ plain form
962 19409 6715 -10649 -13364 -5133 1847 290 -530 3049 6184 -189 -13967 -17039 -870 19601
976 19601 18431 -4065 -21479 -12808 7902 16270 7752 -1826 -113 3771 -1194 -7273 -1855 12864
990 12864 17160 1697 -17507 -18976 -23 18138 15742 -2457 -15026 -10372 1317 3665 -790
1003 -790 156 6808 6458 -5959 -14806 -4028 17582 24272 6616 -14869 -15731 1912 15731 12562
1017 12562 1174 -2472 405 174 -4702 -4073 6030 14009 8100 -9711 -20045 -9583 11717 19453
1031 19453 3969 -14605 -15289 -1712 5520 1727 -570 5195 8093 -1464 -13433 -9920 8199 20796
1045 20796 12364 -7736 -18025 -6757 11900 16661 4608 -5303 -3892 -122 -4864 -9954 -2902
1058 -2902 9625 9837 -6292 -21077 -16403 3703 16902 9454 -9107 -17268 -8322 3716 4929
1071D929m924Q07N410k898j2669m781J4135J8385q85j9919j5661O079J6896Q296
1085A3200n945j0228m000J695J483j139J645P559O259p868j7881o597J7037K0875
1099A6095j114j9744j2342Q316J2874K618k811O44K243l627p931l733O355J2756
1113A0599P316r368j9512o989J5587J8700k504j6854o795O631L075n091q24R863
1127C834P980p082j4815o857R313J7151Q146r841j7446l945J3112J2351l666p369
1141H66K664M735o104j1248L289J6752R353q916j7393q031O289J3666O936p823
1155E035j3115l244Q666L360n622J53J1434M222j5147j6616O924K1426J0177q542
1169I111j4242m184N614Q747M710k110n111j001J747m927o238N863J6367K774
$$ plain form
1071 4929 5 812 6222 3324 -9345 -14126 9 18394 17509 -2410 -18071 -11992 4904 13200
1085 13200 7255 -2973 -6973 -5278 -3795 -4934 -3289 4270 10529 2661 -15220 -21817 -4780 16095
1099 16095 14981 -4763 -17105 -8789 4085 6703 3892 4536 6779 3152 -4779 -8512 -2157 10599
1113 10599 17915 8547 -10965 -17954 -2367 16333 13829 -3025 -9820 -3189 -114 -5205 -6029 3834
1127 3834 11814 4732 -10083 -16940 -7627 9524 17670 7829 -9617 -13562 -450 11901 8235 866
1141 866 3530 8265 2161 -9087 -5798 10954 20307 11391 -6002 -14033 -7744 5922 12858 5035
1155 5035 -8080 -11324 -2658 702 -4920 -4767 6667 10889 -4258 -20874 -13950 7476 17653 9111
1169 9111 -5131 -9315 -3701 5046 9756 7646 2535 1534 3281 -1646 -7884 -2021 14346 17120
1183A7120j9470j8402N528J8458Q340q923j0056k051K631J734J75Q89M841M008
1197D822l842j1960n147J3307J9462K203j8012j3404N818J2757L248m505k560
1210B187J672j238n790m367L607J0657N820r794j7996o427J4050J7033l37j4432
1224e355p386N895N955k239j764O762P336l128j1372n788P772J5457O328r101
1238I372j5105m464J0157J0682r56p567k270L099k057q128k695J0467J1263m515
1252G283j7457r385R926J6610N206r487j0033K67O374K795j436J041N906L150
1266A0760o803j1029k13J3770J2931n077j7367r786Q028J1881J226o941l490K113
1280Co12n919l037O294J1104K616j1245j3916Q76J6107J2767n388j3539m642P616
$$ plain form
1183 17120 -2350 -20752 -15224 3234 11574 2651 -7405 -9456 -6825 -5091 -4916 -4027 814 4822
1197 4822 980 -10980 -16127 -2820 16642 18845 833 -12571 -6753 6004 9252 4747 2187
1210 2187 3859 2621 -3169 -7536 -3929 6728 12548 2754 -15242 -21669 -7619 9414 9077 -5355
1224 -5355 -12741 -6846 -891 -3130 -4894 1868 9204 6076 -5296 -11084 -3312 12145 18473 9372
1238 9372 -5733 -10197 -40 10642 9686 2119 -151 2948 891 -7237 -9932 535 11798 7283
1252 7283 -10174 -19559 -9633 6977 12183 2696 -7337 -7070 -696 2099 663 1704 7610 10760
1266 10760 3957 -7072 -7285 6485 19416 14339 -3028 -12814 -4786 7095 8321 1380 -2110 3
1280 3 -609 -6528 -9565 -3271 7833 10449 -796 -14712 -13836 2271 15038 9650 -3889 -8531 -915
1295i15N190k695j302N997M256o449j1370l028Q532J1885K029j1630j3475k73
1309a3248J2976R295n169r572R37N244k894p966L019J3924O611r588j3537k418
1323a2386J0422J1689R20q322r354M0P835K527l798r64N804J610j0803r994N400
1338i374J5213O552r000j3520l031P995R801J703o664l999L184K740n274l582
1352g256P845J2344j897j5564r873Q360J3161M223p044q598k552L420N048R41
1366B558k455R74L984l176j1122l567J2442J4832k821j6074q567P464J1229K612
1380H313m916l719J12R26j394k828K921Q393L776r095j4075o54J3784J1814l826
1395I532j1565n040L958M522M15j352J461K740o31p382o608N833J4501N131j2906
$$ plain form
1295 -915 4275 1580 278 6275 10531 4082 -7288 -10316 -1784 10101 12130 500 -12975 -13248
1309 -13248 -272 9023 3854 -5718 -4781 463 -2431 -10397 -7378 6546 13157 3569 -9968 -12386
1323 -12386 -1964 9725 10645 2323 -7031 -6991 844 3371 -427 -1391 4413 6023 -4780 -14774 -9374
1338 -9374 5839 12391 3391 -10129 -13160 -5165 4636 6339 -325 -4324 -1140 1600 -3674 -7256
1352 -7256 589 12933 11036 -4528 -14401 -6041 7120 11343 4299 -4299 -6851 -3431 1617 2558
1366 2558 103 1077 5061 1885 -9237 -12804 -362 14470 11649 -4425 -12992 -5528 5701 8313
1380 8313 3397 -322 -210 716 -678 -3506 -585 7808 11584 2489 -11586 -12240 1544 13358 9532
1395 9532 -2033 -7073 -3115 1407 1822 470 1931 4671 4040 -3342 -9950 -4117 10384 15515 2609
1410B609j4822J730J3233O176m821m981J193J009l591l316L276O644L848l465
1424D722j0131p021N782J4491N660j0832j1836J722Q727J292l870J040N040m71
1438D315q448n589M075J0613O481m680j2895p465O825J2372L155p895n120L243
1452a013J929m879k393O796Q135k008j0621p248K894J1703Q352m060j2305o924
1466a1642O524Q147j198m415K695N715m606j0937j466J1874J0237l252j1535p325
1480a1184M082J0039N636l038o445k496K455R24k836P39P847M880p468j3308j940
1495a2113J2367J1636k950j1850o599M293O262J001k157J95L012j273o642l356
1509h174N957J0155M217q429j1725j411J0569R564j637p499l532J981J111k905
$$ plain form
1410 2609 -12213 -10483 2750 8926 4105 -876 317 1326 -2265 -5581 -2305 4339 8187 4722
1424 4722 -5409 -12430 -6648 7843 13503 2671 -9165 -7443 1284 2576 -1294 -254 4786 4315
1438 4315 -4133 -9722 -5647 4966 11447 6767 -6128 -13593 -6768 5604 8759 864 -4256 -1013
1452 -1013 916 -3963 -6356 440 8575 6567 -4054 -11302 -8408 3295 11647 7587 -4718 -11642
1466 -11642 -5118 3029 1831 -2584 111 5826 1220 -9717 -11183 691 10928 7676 -3859 -11184
1480 -11184 -7102 2937 8573 5535 -910 -3406 -951 -27 -2863 -2124 5723 10603 3135 -10173 -12113
1495 -12113 254 11890 8940 -2910 -9509 -5216 1046 2047 -110 85 3097 1824 -4818 -8174
1509 -8174 -2217 7938 12155 3726 -7999 -9410 1159 10723 9086 1587 -1945 36 1147 -1758
1523a758j43N615N685m140j1020n650O336J2239L329q086j0668j164Q091N838
1537D504k017l064K228J905m667o621K202J0888P835n719j1683m793O250R505
1551F753L063n771p058m30L892O84l140P32P111J484j0170j1484L773J4232O512
1566A0183p026j0238k002M637M600J935p41j141K84jl017k968N272J0431J969
1581A2177j2172j1859M280J3320M743o637p024l33J392j08l63J104L024J744l826
1596e38q527m237Q109J2901J162j2217q735N083R762J639m050L07K329p48m310
1611b070j678M046P361L842n811j1274m848R132J1327j281j0879m822M503L243
1625G91m252k537N096N643l672r150k997O844R888L616n861r168j864P069Q318
$$ plain form
1523 -1758 -1901 3714 9399 5259 -5761 -11411 -5075 7164 10493 2407 -8261 -9425 -1334 4504
1537 4504 2487 -577 1651 3556 -1111 -7732 -5530 5358 13193 7474 -4209 -9002 -2752 6753
1551 6753 9816 4045 -3013 -3443 449 1133 -2007 -1275 5836 7320 -2850 -14334 -10561 3671 10183
1566 10183 3157 -7081 -9083 -4446 154 2089 1348 207 491 490 -2527 -5495 -223 10208 12177
1581 12177 5 -11854 -7574 5746 10489 3852 -3172 -3505 -2113 -2221 -2584 -1480 1544 3288 -538
1596 -538 -9065 -13302 -5193 7708 8870 -3347 -12082 -6999 2763 4402 352 659 2988 2240 -2070
1611 -2070 -3748 298 7659 11501 5690 -5584 -10432 -1300 10027 8746 -2133 -6955 -2452 791
1625 791 -3461 -5998 -902 4741 1069 -8081 -11078 -4234 5654 9270 3409 -5759 -7623 -554 7764
1640G764q08m734k01L516j477o727q78Q871P326n250j2143n102N968R191J839
1655G155n838p042j436M007K099j625P5M596J810n701p700J949J1339P550l992
1670G246r454m091N003P318K300l401l304L70R98k637l647L005P073J359r579
1685a441j0478J770J0986N959m769q049j559L828K312o47O2L326K764k058o847
1700d841k342O945R647R42q920q822K110Q800M127m364m496R51J804l307m845
1715f611K203P135M245o312r740k529Q066Q397K55p350m795K053N068Q33j500
1730e82J284L847m63o334m827M620R166L636o283r428j794N805O132n77m855k141
1746b794K102n33l490j078N959O048j916q986m834N377R003L678n246o533j062
$$ plain form
1640 7764 6956 2222 2021 5537 4060 -2667 -3545 5326 12652 7402 -4741 -9843 -3875 5316 7155
1655 7155 1317 -5725 -7161 -3154 -1055 -2680 -2605 1991 3801 -1900 -9600 -7651 3688 11238 7246
1670 7246 -2208 -6299 -1296 6022 8322 4921 1617 1987 2985 348 -3299 -294 6779 8138 -1441
1685 -1441 -11919 -10149 837 6796 2027 -6022 -7581 -3753 -1441 -2088 -2026 1300 4064 2006 -4841
1700 -4841 -7183 -238 9409 10351 1431 -7391 -5281 3519 7646 3282 -1214 -263 1541 -1766 -6611
1715 -6611 -4408 2727 6972 660 -9080 -11609 -3543 4854 5109 -2241 -7036 -4983 85 918 -582
1730 -582 702 4549 4086 -2248 -7075 -2455 6711 10347 4064 -5364 -7158 -1353 4779 4202 -653 -2794
1746 -2794 -692 -1225 -4715 -5793 166 6214 4298 -4688 -9522 -4145 4858 8536 3290 -3243 -4305
1761d305L820L097j056j409K816K181m244o637l18Q039P522k431r935n186M399
1776c647P143K226l746l443O88J383j674k038K690O525J615p196q508J090R167
1791B275O042k646p396l557L246L702N43j912P26K635j057o155l623N124R943
1806G890J554r202q053K775P221L495k550k949O4K25j612j636J078M647L100l242
1822B805q535m660O618R587J009q028n610J969M497P57j266J730K280l46m708
1837a901l600K398P451N010m594r508l516O216P726p39n681j685J779l44l155
1852d143l30M602M162j909o526n280K500R041N251l552q495j834N460M609j780
1867A776j612K558K228m045n890N38P284N824k416p906n508K061P094M036m215
$$ plain form
1761 -4305 -485 2612 1556 147 2963 5144 900 -5737 -6055 1984 9506 7075 -2860 -8046 -3647
1776 -3647 3496 5722 1976 -1467 -779 604 -1070 -3108 -418 6107 7722 526 -7982 -6892 2275
1791 2275 8317 5671 -1725 -5282 -2036 1666 2209 297 1023 3658 2601 -3554 -7177 -2053 7890
1806 7890 9444 242 -7811 -5036 2185 5680 3130 181 245 470 -1142 -2778 -1700 2947 6047 2805
1822 2805 -5730 -10390 -3772 5815 6824 -1204 -6814 -4845 -348 409 -857 873 3153 2807 -1901
1837 -1901 -5501 -3103 4348 9358 4764 -4744 -8260 -2044 5682 4943 -738 -2423 -644 -988 -4143
1852 -4143 -4473 129 4291 2382 -4144 -9424 -6924 2117 7368 3816 -4679 -6513 -1053 3556 1776
1867 1776 164 2722 4950 905 -4985 -4447 2837 8661 6245 -1661 -7169 -5108 1986 6022 1807
1882A807n678N8K811r53k924J573O392K575n896p123J123Q198O997j864o740m278
1898c922K346N045J073k232k27K167o82n559l910M145P874J264p658p882J65O932
1914a061N448q89m981j882K180J394j890J7M351M359k907p672l340N896Q905J329
1930I257o565o380j12N034K857j789k184J242Q79l773n678J110Q232M666m735
1945B061q758k680N924O503J395l794l049J07K301L82j653J779N277J051p197
1960c51o892K975Q904M129n241p512j583K640K906O30r35p73M60m00l396k075
1976f514M654P717J48q701o378L803Q358K516l670l027j0M37M17J59P83K539J533
1993D764k465p430k383O377Q852q22r362n067L627M782J25j973O57J003j469k906
$$ plain form
1882 1807 -3871 -3813 -1002 -1955 -4879 -3306 3086 5661 -235 -7358 -6235 1963 8960 7096 356 -3922
1898 -3922 -1576 3469 4542 2310 2083 4250 3568 -1991 -5901 -1756 6118 7382 -276 -8158 -7993 -1061
1914 -1061 4387 3498 -1483 -3365 -1185 209 -1681 -1664 2687 7046 4139 -3533 -6873 -977 7928 9257
1930 9257 2692 -3688 -3800 1234 4091 2302 118 1360 2239 -1534 -7212 -6102 2130 6796 2061
1945 2061 -6697 -9377 -3453 3050 4445 651 -2398 -2291 10 392 -1261 518 5795 6846 -351
1960 -351 -7243 -4268 4636 8765 3524 -3988 -5571 -2931 -25 605 -330 -1103 -643 -1043 -4439 -6514
1976 -6514 -1860 5857 6005 -2696 -9074 -5271 3087 5603 1933 -1094 -1104 -667 -250 -91 692 3231 4764
1993 4764 2299 -5131 -7514 -1137 7715 6893 -2469 -7536 -3909 873 998 -975 -318 685 -784 -3690
2009c690q02K473N195L414l085q201k561P690P853j303p014k472L214O03k548
2024a234K75L988K514l250n887k412K894O804L089m381q253j012O146M666k342
2039A605l068K325K035l508m514K541O936L104l477o454k967L081O946K776m111
2054C250n754K08L858j44k579J166M818l16o983n651K886P521L366k944n865l074
2070f237K736M791K093k424j660J254L67l058k209M667O792m70p587n416K820
2085c541N742L481k233m362k451R91K315p42p38K380K684k471o742k112O578O736
2101E515n56o783m862J852M502K263p07j968L10J113j507k690J804N863L528n169
2117B508p686j474O633N266r12m308l221O04J808J25n64J361K279p10n160l936
$$ plain form
2009 -3690 -4492 -2019 3176 6590 3505 -4696 -7257 433 8286 6983 -31 -2503 711 1314 -1234
2024 -1234 -959 3029 5543 2293 -3594 -6006 -3112 3692 6781 2400 -5853 -6865 -719 3947 1605
2039 1605 -1463 862 2897 -611 -5125 -2584 4352 7456 3979 -2475 -5442 -2361 4585 7361 3250
2054 3250 -2504 -2296 1562 1418 -1161 5 4823 4507 -2476 -8127 -5241 2280 5646 2702 -3163 -6237
2070 -6237 -3501 1290 3383 959 -701 553 920 -2138 -4347 320 7112 6642 -945 -6361 -3541
2085 -3541 2201 5682 3449 -913 -3364 -2373 -58 -800 -1538 842 3526 1055 -5687 -7799 -1221 5515
2101 5515 4959 -1824 -6686 -4834 -332 1931 1224 -744 -434 679 -828 -3518 -1714 4149 7677 2508
2117 2508 -5178 -6652 -19 5247 4335 27 -3194 -2590 -782 -657 -1221 140 2419 1709 -3451 -7387
2133g387L590Q069K609n206o658M5M899L129m74j636k47m45n57k294L38M152M285
2150F212j504p079m465M325O845J991m569m497L54K214R1m41Q53J870M15l412
2166g97m043M40N621N398j753p501l454M014N453O67k562j009J120l52k262r72
2182a992K370M409N93n370o092P52O562M909k268n909j883K763K342j391o88K532
2198A639J397k552m624j412M251N984M03n505n420J159N830L243k116k943M41
2213b25J052j180k304J446M964K220l739o201j787M392N985Q8n879l995R10L298
2229i55P54j568N72K415J31m439k786K925N962K560l538o056j877M889M813L6
2245C838l319j657J748K79k185q83L676L510j509o065l914L004O022K713l822
$$ plain form
2133 -7387 -3797 4272 6881 1675 -4983 -4938 -39 3090 2616 980 733 288 -269 -2563 -2225 1927 6212
2150 6212 4708 -2371 -6836 -2511 4334 6325 1756 -2741 -2387 -173 -82 -523 330 2200 2615 -797
2166 -797 -4840 -4400 1221 6619 4866 -2635 -6089 -2075 3378 4045 1483 474 1594 1242 -1020 -1992
2182 -1992 378 4787 5380 10 -6082 -5330 1232 6141 3873 -2036 -3919 -1156 1186 -205 -893 1639
2198 1639 3036 484 -4140 -5552 -1301 4683 5086 -419 -5839 -4680 1150 4393 2277 -666 -225
2213 -225 827 -353 -2657 -1211 3753 5973 2234 -3967 -5754 -1362 4623 4711 -1168 -5163 -4253 -955
2229 -955 -201 -1769 -1197 1218 1349 -3090 -5876 -2951 3011 5571 2033 -4023 -5900 -1011 3802 3838
2245 3838 519 -1138 610 889 -1296 -2179 1497 5007 3498 -2567 -6481 -3477 2545 5258 1436
2260A436n200j555L447K882j296j088J486J669k476m116L38O149M823k047n411
2275i59l190K841M984J800k689k879l49J634j241j801J042M035J310m857o038
2290f357P75O534L960k459m909k252K333K782O73o22QJ409j45k541k514K988N921
2307E584J095n112n623N67N661K953j807l300p20Q43o09o58j06K206J655j775
2323H54n289k434M024N684J508n014l911J492L928R12j237k25K143j23k497k816
2339c001J948M381K919k859o293k097L915M773m72m059k099J165J025j807r94
2354c555K483L726m58m653l559K500N455K698k269n155j434K893L069j50j477
2369A14N02J463j096l411k32L734M099j294n302l892K297M497J833k120l163k03
$$ plain form
2260 1436 -3764 -5319 -1872 1010 -286 -1374 112 1781 -695 -4811 -4473 1676 6499 4452 -959
2275 -959 -4149 -1308 3676 5476 2787 -92 -441 1193 -48 -1849 -807 3228 4538 -319 -6357
2290 -6357 -5582 952 4912 2453 -2456 -4708 -2375 407 1080 458 466 1875 1730 -811 -3325 -337 5584
2307 5584 6679 1567 -4056 -3489 2172 5125 3318 18 -702 141 -468 -1126 -1232 974 2629 854
2323 854 -4435 -6869 -2845 2839 4347 -667 -4578 -3086 842 1754 517 292 2435 2312 -185 -3001
2339 -3001 -1053 3328 6247 3388 -2905 -5002 -1087 3686 3214 -845 -2944 -1779 -754 -2561 -3555
2354 -3555 -1072 2654 2196 -2457 -6016 -3516 1939 4637 2368 -2787 -4221 -1328 1741 1591 114
2369 114 616 2079 983 -2428 -2660 1074 5173 3879 -1423 -5315 -3018 1479 3312 1192 -1971 -2174
2385b174J024P7j096P23K605J886k885m725K8N405M699j375n062k592K033L089
2401A660N43n12q20M14m10k055j910J953M399J784m389n001n6N262L834j653l843
2418h00j127J034Q98p25j76K059J945j505l715k296K946N371J444m307m450M64
2434b940L843J909j294j265O95J275k274k390N35L854K713k537n238k019L293
2449a840M775P13l173k350M93J798l83j202J784K175l52l739l125J238M934L022
2465D768k397m703k081L094L148j33k019M20P49n54k844n46L545L847o31m770
2481a107l680J381M708K455k328l771r71K094P41o51q2K899J205k788l768l82
2497d045M303M096o23m385l383N98M105J770j422j715R43N28k152j775J538M640
$$ plain form
2385 -2174 -1150 -1073 -2169 -1446 1159 3045 160 -4565 -4537 868 5567 4192 -870 -3462 -1429 1660
2401 1660 2203 1691 871 1285 875 -1180 -3090 -1137 3262 5046 657 -4344 -4400 862 4696 3043 -800
2418 -800 -1927 -893 5 -720 -896 1163 3108 1603 -2112 -4408 -1462 3909 5353 1046 -3404 -2940
2434 -2940 903 2812 1518 253 948 2223 -51 -2441 -1906 1948 4661 2124 -3114 -5133 -1840
2449 -1840 2935 3648 475 -1875 -1382 416 33 -1169 615 2790 2438 -1301 -4426 -3188 1746 4768
2465 4768 2371 -2332 -4413 -1319 1829 1696 -323 97 846 292 -2552 -3098 447 4294 3663 -1107
2481 -1107 -4787 -3406 1302 3757 1429 -2342 -3313 -1219 -478 -1129 -1211 1688 2893 105 -3663 -4045
2497 -4045 258 4354 3731 -654 -4037 -3439 666 2436 1014 -701 242 770 -1382 -3157 -1619 3021
2513C021J601m392m641PL952L842m56l095k133O11J893j21j285J267K393q16l783
2530b135k850L276N541J236l688l831m09K936K542l99j683n69L83n34j594l39
2546b117L091L651j335n901k444L355M742N46k895k468K7J364O64j55M46J599
2562B170M25k472l640O26M516L338k107n059j783K609L532j10j305k58L35o08
2578B09j477p13J896L312K97m033m735Q61N274L310k053l737r79K061P67l20p
2595f7J658R71k135l195p64L024M608K32m513m276R77M240J859j750j800K68K52
2612d11j294q22J302L273J186k382m169j135L382M909j1m515k891J544K332j21
2628A77r19J313J599r99l252j763K629L986J301k979m407j223L572L330l25k305
$$ plain form
2513 3021 4622 230 -4411 -4404 -452 3390 2934 -161 -2294 -1683 210 89 -1196 71 2464 1648 -2135
2530 -2135 -4985 -1709 3832 5068 1380 -2451 -2860 76 2618 2219 536 -33 350 -184 -1778 -2117
2546 -2117 974 4625 3290 -2611 -5055 -1700 3042 3588 693 -1775 -1748 -384 280 125 571 2170
2562 2170 2595 123 -3517 -2891 1625 4963 2856 -2203 -3986 -1377 2155 2045 740 482 817 209
2578 209 -1268 -1981 -85 3227 3524 -509 -5244 -4383 891 4201 2148 -1589 -2568 -507 260 -60 -67
2595 -67 1591 2562 427 -2768 -3532 -508 4100 4332 -181 -4457 -3480 760 2619 869 -931 -663 -411
2612 -411 -1705 -2527 -1225 2048 3234 852 -3317 -4452 -1070 3839 3828 -687 -3578 -2034 298 177
2628 177 -742 571 2170 1171 -2081 -3844 -1215 2771 4072 1093 -3314 -4537 -965 2365 2040 -265
2644b65p39J010l98j765PL040K496j387m077k023K415M458J933k462l990q14K554
2661gK032j416p72J378Q89k833l036R84M347K536k070l439k203J467L577J864
2677C298j724k306k4J015q95j018J498M018n9l996l497J454M066K260j188l987
2693a085j298P19K049J135j102j28R62n03l029j334K806M674j91m626l408J454
2709b905L471K039p12j897k73J84L97n13K8J730J836j180n046j898L820M666n17
2726C230l917j930Q55J555N84m77M11M7m54j298j308Q34L164K490k073m607j233
2743d127L603L332j086k051p45O90m15o59Q61J622J567p85l096k414J245M214
2759A756K257l092l968k52K303J685q78n91J214m7j052j993K57L243K756j085
$$ plain form
2644 -265 -1004 6 -392 -2157 -2150 890 3386 1999 -2078 -4101 -1686 2772 4705 2243 -1747 -2561 -7
2661 -7 2025 609 -163 1215 2104 -729 -3765 -2781 1566 4102 2032 -1407 -3610 -2143 1434 3298
2677 3298 1574 -732 -756 259 -636 -1654 -156 3862 3803 -193 -3690 -2236 1830 4090 2902 -1085
2693 -1085 -2383 -1664 385 1520 418 290 1252 749 -2280 -3614 -808 3866 3675 -951 -4359 -2905
2709 -2905 566 2605 1893 -4 -277 -93 304 -209 -181 1549 3385 2205 -2841 -4739 -919 3747 3230
2726 3230 -687 -2617 -1762 -207 377 -100 311 358 -96 -1394 -2702 -1868 1296 3786 1713 -2894 -4127
2743 -4127 -524 2808 1722 -329 -1074 -384 -799 -1458 -597 1025 2592 1807 -1289 -3703 -2458 1756
2759 1756 4013 921 -3047 -3299 -996 689 -189 -780 434 387 -665 -2658 -2401 842 3598 2513
2775B513l428k878J930L986J047j786k117L23Q77p16j038J431J958J25k778k725
2791c276L71L106L248j187k990k231J576K303J43j026J30P65k95k353q38K060
2807d94L398Q10l191l065J33L103K981r55k678j057R20L65j187R9K341J602j939
2824A186l615r31K305L475M75k694k888Q3K475J522m92p52P15L37j226k440Q49
2841a616L730J606k186l653j122K236K858R36k101j786l1J150l23q05J231J782
2857A906J79l270k887J563L967K224k543l123p90J772J486K33o22k74N58n28j485
2874a634j165K726L356l81l724k843J724L361Q41j480j990k36L17P96m33L82J496
2891A113J081k021k993n44L437L231j010l584j784J209K510N85r36l45O89m19
$$ plain form
2775 2513 -915 -3793 -1863 2123 3170 1384 -733 -410 467 -249 -1287 144 2102 2227 -551 -3276
2791 -3276 -2905 201 3449 2262 -728 -2959 -1383 920 1063 37 167 932 637 -1716 -2554 -494
2807 -494 2904 3714 523 -2542 -2409 694 3675 2720 42 -1015 -95 270 -917 -818 1523 3125 1186
2824 1186 -2429 -3360 -1055 2420 2895 201 -2687 -2604 -129 1393 901 149 864 1201 -25 -2465 -1616
2841 -1616 2114 3720 1534 -2119 -3241 -1005 1853 2789 688 -1098 -1129 21 -302 -1107 124 1906
2857 1906 2085 -1185 -4072 -2509 1458 3682 1139 -1984 -2774 -1002 484 717 95 -179 379 -149 -1634
2874 -1634 -2799 -73 3283 2902 -822 -3665 -1941 1420 2261 781 -1209 -1445 -1128 -332 -765 -383 1113
2891 1113 2194 173 -2820 -3364 73 3304 2294 -1290 -3074 -1865 645 1230 294 -51 638 219
2907B19r98j197J107K915Q01k495l079o21L567K889q65j931j170P26N65p00p2
2924c39J302J086n78l260j400J734L752J235k482l252R2K398J498r35q35J01M94
2941F11j284j185N02K714K018j360l282j622J944L268P97j956j995J98R98J05
2957D71n13O60J569l75k334k765J030L180J811j001l535j537J578K521Q32j183
2973D09l82O84l74j207l20J709K634m73k973k843J143K869J894j167k686m52O17
2990i18R76m65m30J224P08j531k555l07K712L176j84l124j951M61K425J269p93
3007F93q07K2K56n49r80Q91K206J274k139l058p40K669K263j30k831j422J85J479
3025g18J34k41P98R16k87j908j798J857K914J514k070k975k12K228K245o04q94
$$ plain form
2907 219 -779 -1976 -869 2046 2847 352 -2727 -3348 219 3108 2243 312 -858 -132 433 -267 -339
2924 -339 963 2049 1471 -1789 -3189 -1455 2297 3532 1050 -2202 -2110 288 1786 851 16 117 611
2941 611 -673 -1858 -1356 1358 3376 2016 -1266 -2888 -944 2324 3121 1165 -830 -632 366 471
2957 471 -42 618 2187 1812 -522 -3287 -2257 923 2734 1733 -1802 -3339 -1761 760 1592 409
2973 409 27 711 337 -870 -1190 519 3153 2680 -293 -3136 -1993 876 2770 1603 -1083 -1535 -918
2990 -918 58 -407 -837 387 1095 -436 -2991 -3298 -586 2590 2406 -718 -2669 -2208 217 1486 693
3007 693 -114 -92 164 -385 -1365 -474 1732 3006 867 -2191 -2931 -262 2001 1871 -960 -2382 -2197 -718
3025 -718 -584 -825 -27 889 602 -1306 -3104 -1247 1667 3181 1111 -1864 -2076 152 2397 1793 899
3042H99m40L05o98j224J3J887J603j004l113j372J203L480J142k135k057j9J218
3059c12Q25o78J50J383L6j818j686N88K838K073j097k836j542J293K548M73j165
3076A073j498M60K18o76q57J138K439o5k515k728P84K578J672o77k249q76P27
3093a052J569K96k51K2J461j397k104m71J835K687k15k827k133M92K301J433p54
3110H92j459L7N81l80o13j55K193R00j192l138p58K927K452j56k368j406O60Q49
3128a34M33r8Q1L62m64j479j173J208K636J508k114k661q47K274J938l85j453
3145c68l47J27K69m83N3J528J619r58k493j642J584K618R05j618k458J70Q06J174
3163D86m08j14Q11k99j116j498M60K318J645k50k944j503J452K500Q61j494r98
$$ plain form
3042 899 459 764 66 -1158 -1145 742 2345 1341 -1772 -3144 -1941 1539 2681 546 -1511 -1530 -312
3059 -312 513 -165 -15 1368 1404 -414 -2100 -1512 1326 3399 2302 -534 -2076 -783 1765 2238 1073
3076 1073 -425 35 253 -423 -1280 -142 2297 2232 -283 -3011 -2227 351 2023 1346 -903 -1779 -1052
3093 -1052 517 813 562 584 2045 648 -1456 -1927 -92 2595 2380 -447 -2580 -2088 213 1646 892
3110 892 -567 -530 51 -329 -942 -1097 1096 1996 804 -2334 -3092 -165 2287 2131 -237 -1643 -983 -134
3128 -134 299 201 282 644 180 -1299 -2472 -1264 1372 2880 766 -1895 -2742 -468 1470 1085 -368
3145 -368 -715 -588 -319 -802 -749 779 2398 1440 -1053 -2695 -1111 1507 2412 794 -1664 -1494 -688 486
3163 486 78 -36 775 476 -640 -2138 -1678 640 2285 2035 -909 -2412 -960 1540 2401 907 -91
3180i1q7P19o47p01R55J647j50j990k114L97K393K243q57k567j172J108J568O3
3198G17m85J06P17q02j119n82J192K499N64k116k276k10K515J479o55j670m39
3215e65P23r1j014O06J277J092j439k462n50J772K014N22j682k229K59J822R14
3232I69l66m30Q86P9j338j390Q78K408R36j750k522n85J284K353J46j015j192
3249f49q2O07n93m64O44J989o51k084j422J207K748R54j247k066o20R71J397j18
3267E21l66j05L31l98j221m65K216K266r68k788j672J464J771P60q51j526k6Q4
3285i73Q35n89L43J205L43j101k330J57K727J861q47k212j084P95J560M55n05
3302F40J76n98J02j055l41O12J988N83j877k480J87K195J732n82j471l14J03L38
$$ plain form
3180 -91 -178 541 -106 -807 148 1795 1645 -345 -2459 -2062 331 2574 1717 -850 -2022 -914 654 717
3198 717 232 338 1055 253 -866 -1448 -256 2243 2807 691 -1585 -1795 720 2199 1544 -126 -565
3215 -565 158 67 -947 -341 936 2028 589 -1873 -2423 -651 1363 1885 203 -2026 -1767 55 969
3232 969 603 173 1059 1138 -200 -1590 -712 1696 2632 882 -1640 -2225 -941 1412 1558 543 -649
3249 -649 -731 -124 -717 -1181 -537 1452 801 -1283 -2705 -1498 1250 2204 957 -1109 -1729 -758 639 521
3267 521 155 50 381 -17 -1238 -1703 513 2779 1811 -977 -2649 -1185 586 1346 495 -1031 -1057 -973
3285 -973 -138 -727 -384 821 1164 63 -2267 -2110 617 2478 1631 -581 -1665 -870 690 1145 640
3302 640 816 218 320 -735 -1076 -464 1524 2107 230 -2250 -2063 132 1864 1282 -189 -503 -400 -62
3320f2kk98Q74Q23n18j668j160J731K733l09j320j946Q4J172Q32j48p32L52l81
3339E7m98p39N34J753J045j062k283j006J298J815Q17j349j141L75O89m31r2O22
3357D04R64j41j578j100L77K066J342j324k167q12J461J274j68o29R0Q8o79j239
3375a771N47J314J260n88j256j515M78K038J219p84j857j25J224m58q3K06J320
3392A169J84j529j429J37J667J674j88j755j990L64J326J256o55r99L72O72j430
3409a154l90J129J864J73j194k060p0J683J264K56j354j274O49P42m54O1J97J208
3427A276p74j506r77J662J641K81j610j589o7J307J001J86n44n5R7n64l93J38
3445d90J467J174r65k302o51J744J624l4j044j090R4O70l39L7K07N92J18j379
$$ plain form
3320 -62 -64 -362 512 1335 817 -851 -2011 -280 2453 2144 824 -1122 -1038 134 966 818 86 438 57
3339 57 -441 -1180 -646 1107 2152 1090 -1193 -2199 -901 914 1731 382 -759 -384 305 -126 -218 404
3357 404 1368 1227 -351 -1451 -1074 992 2334 1010 -1157 -1969 -508 766 598 -31 59 147 -532 -1771
3375 -1771 -1224 90 1350 762 -494 -2009 -1531 507 1726 942 -915 -1040 184 -274 -357 -151 1169
3392 1169 1353 -176 -1605 -1468 199 1873 1685 -70 -2060 -1696 -370 886 231 -768 -396 276 -1154
3409 -1154 -1544 -415 1449 1622 428 -1632 -1702 -19 1245 1501 147 -1127 -478 264 -190 -129 68 1276
3427 1276 502 -1004 -1981 -319 1322 1603 -7 -1596 -1663 -356 645 831 287 232 329 -235 -628 -490
3445 -490 977 2151 1186 -1116 -1767 -23 1601 1567 523 -567 -473 197 -142 -105 102 694 812 -567
3463e67j183M78K393J054j251j548p10R95J272k00k77M2j48k19m66j79J084J265
3481A835J82k016j903N41J834J093q26j831J20L99L32K54Q0O23L27r43j123o07
3499a629J771J456K76j886j622Q81J241N41o31m05j11p1n82m20P54J114M31o74
3517D34j929m83J731J434N3j513j181P27N70j21R8M69L57k44j278n54J104J616
3535A290M12r92j941p54J776J284o37n05m90L94j57q54M50R90J113k15k039j005
3553a880J237J705Q88j018j823J71Q29Q27o26k09P41R5q89j267K73J482J171o82
3571A025j800j000Q63J737J33o52k51q7K98l74m63O69J383j26j315j392M09J809
3589H66J064n09j322j047L87N22L43k10R9M85m44j614k89J560J361o4j472j507
$$ plain form
3463 -567 -1750 -1272 1121 2175 924 -624 -1334 -339 933 733 456 498 350 131 -335 -514 570 1835
3481 1835 2017 1 -1902 -1361 473 1566 740 -1091 -971 -572 -240 14 94 717 1044 101 -1022 -1629
3499 -1629 142 1598 1874 -12 -1634 -753 488 1029 398 -7 -118 -189 -771 -1191 -437 677 1108 434
3517 434 -1495 -1978 -247 1187 1240 -273 -1454 -727 -157 -278 -180 289 646 402 -876 -1430 -326 1290
3535 1290 1702 710 -1231 -1985 -209 1075 438 -67 -557 -163 -320 -1174 -724 266 1379 1164 -875 -1880
3553 -1880 -643 1062 1950 932 -891 -720 109 936 310 101 842 937 48 -1219 -946 536 1707 1025
3571 1025 -775 -1775 -912 825 958 306 55 -32 266 -108 -571 98 1481 1355 40 -1352 -943 866
3589 866 1930 1421 99 -948 -561 -39 304 94 193 678 234 -1380 -1669 -109 1252 1188 -284 -1791
3607a791N69J311P23r8m42l79J87jj47L62Q05M40j014j389q16J321J472p5j406
3626c68q37K27O67K49J93l40J88j15q59k77K36J654J120j120j570l47J064J462
3644A227l8r98m11n0L80m23J0N93P11j55j828p62O19J717Q55j466j323j27Q66
3663f03N26l3L7J99j60r5q86Q0J577R41n96j427r30P28J495L94r85n28M8P2j16
3684b62P5Q4Q83Q4j151j038J32J634Q73o11j468n35R44N04N4R0M83l69r5p93j82
3705f64N03J618K10j791j081L43J422P06l64q46o87L60J1k59M93N22N64q88j230
3724a058m26J379J702j34j100j476M13R99L25K8l29O9n3q40l11M61J235N76j043
3743D17j314r54J268J290L21j173n02M05J01j07j8P83J78N4j328p75N18J499N16
$$ plain form
3607 -1791 -1222 89 812 714 272 -107 80 79 -68 294 1099 1539 525 -864 -1680 -359 1113 1038 -368
3626 -368 -1205 -978 -311 -62 131 -209 -21 -136 -995 -1272 -1036 618 1738 618 -952 -1299 -235 1227
3644 1227 1189 191 -220 -270 110 -313 -303 290 1001 846 -982 -1744 -1125 592 1447 -19 -1342 -1469 -603
3663 -603 -77 -110 -73 126 -34 -129 -1015 -935 642 1583 987 -440 -1370 -642 853 1247 262 -266 -218 -146 -262
3684 -262 -187 -103 780 864 -287 -1325 -1193 441 1314 703 -765 -1300 -356 148 202 292 775 406 311 -482 -664
3705 -664 -161 1457 1667 -124 -1205 -862 560 1266 902 56 -631 -271 -260 -519 -26 496 1060 172 -1058
3724 -1058 -1484 -105 1597 1463 363 -1113 -700 299 624 652 323 392 339 -501 -812 -351 884 1460 417
3743 417 -897 -1851 -583 707 1028 -145 -647 -242 -141 -248 -266 517 695 749 -579 -1354 -836 663 1179
3762A179o66j139m72Q50Q28k50k9k65K10l43q95N5J199Q34m72j144r97N45J739
3781G67M41p42j321J36R24m13m75O26M70N0n44j137J17J299J124l56j079j290
3799a403P24Q73J26k64O6mj60p12l12J073Q68M17j232j452M28J066P63p8q83n81
3819f77K70N94l22J66L10M61o08j159r5Q44J071K75r66j544L51J159P86k30n33
3838A53J56p0k27o10L59P62P38q80j209m51Q53J496j28p64p78j75O85L60k79J29
3858A20M20J03j098m26J5J508R79j074j053o08Q44O90J79l76m75M25l58j23k13
3877e21P91R50m27j008j282O99J367N06p57r26j2M06M12n20L81J66L49q33n77
3896h36k01O21J431l52j083m97J65J194K65m45m11j37K05p84L06L3R19N60j126
$$ plain form
3762 1179 513 -626 -1098 -248 580 330 301 36 246 -97 -992 -937 262 1096 624 -520 -1517 -972 767
3781 767 1208 466 -855 -719 205 -208 -683 -57 413 463 -81 -1218 -1101 198 1322 966 -113 -1403
3799 -1403 -679 194 320 56 122 118 -42 -754 -1066 7 875 1292 60 -1392 -964 102 865 787 -96 -677
3819 -677 -407 187 -135 31 341 802 194 -965 -1060 -216 855 1130 164 -1380 -1029 130 916 686 153
3838 153 309 239 12 -598 -239 523 1261 381 -828 -1279 -426 1070 942 178 -600 -775 -90 270 -9 120
3858 120 540 643 -455 -881 -866 642 1621 547 -506 -1114 -270 420 599 223 -252 173 -185 -308 -521
3877 -521 270 1220 793 -215 -1497 -798 569 1075 318 -608 -620 -214 198 -322 59 225 574 -259 -836
3896 -836 -1037 -416 1015 663 -420 -917 -752 442 707 262 -149 -286 -81 -865 -559 -526 393 953 -173
3915a73q53j19J034J353n72r22q42P65J44O2K82l2K03j32q01k53O66J247J96j016
3935B37j117k13J245M62l25m06j0l0K5o10O33N00P81r41p13m61N74J251L6j034
3955a16m56k3P18J85k3pN04j01o89p36L84J153L82l55j059p99P58J036r1n23o4
3976G8k86Q7n00k9M87R45O7r98o16OJ530J86k52q51k34k0P31r4k77M22Ll14r09
3999h38Q3J080Q69o51q30n95M10O27M92n23k19m04N93l86l11M80L87N43n81r20
4019f94l67J053J115j74j386j59p8N46J54J56r8K02j24p70l01M14J194P6p49j006
4039i96j29J070M21Q4l96k38N1n4J01P8N31K19k06r42p03P55J246K76r59o87j47
4060f25N54mL97l16j69M88m84n82lR86M71j98q11q46O97R74n7k20j64m34L94k11
$$ plain form
3915 -173 -1026 -1145 -111 1242 670 -252 -1094 -329 -185 -123 159 127 330 198 -603 -856 -190 1057 1253 237
3935 237 -880 -1093 152 614 289 -117 -127 -157 -132 -742 -109 391 1172 231 -482 -943 -369 882 918 -116
3955 -116 -572 -595 123 308 285 278 782 681 -8 -744 -360 793 1175 820 -239 -1038 -280 756 665 142 78
3976 78 -208 -121 -621 -650 -163 782 849 -149 -765 -759 771 957 705 -146 -380 -400 331 237 -40 382 385 71 -838
3999 -838 -755 325 1194 543 -287 -882 -472 155 647 124 -95 -499 94 -292 -603 -123 264 807 226 -694
4019 -694 -1061 -8 1107 933 -453 -612 -690 -144 10 166 68 270 146 -624 -925 -511 683 759 10 -996
4039 -996 -1125 -55 366 450 54 -184 -133 -187 -86 -8 523 742 536 -406 -1109 -354 892 1168 209 -478 -625
4060 -625 -71 -75 322 6 -163 325 -159 -741 -744 242 713 515 -296 -1142 -445 529 472 252 88 -346 48 -163
4082a63P8M98L95p4r73o35M94P75N59m67p17m00K53N98o6j97P5J09k73n43O9R91
4104C86N78k83r91n24K98J004P03q73k39l48J53N9k23K34O42nk67r47j32P02Q88
4125H15k1j047m87M63M03M0j58P4j2R5o11k40M17J066P9q03q91k08O52J106Q6
4146H18p65m65J71L95l75l39Q39K08o4q17q44N96J050K61o18r57j50N26P03K4
4166A97j08j36L02l55n68O4J059M72q92o44o20Q62Q45J66m36m55l12N80k38J16
4186a01j8O15np50p87N57R25M68p36o55N4l1N90M41m25j07m6J3l16l8O73L78J85
4209H84j228k00J9J114L08l25p56m16L22M85j95j60M8N03k9j165L04J85R38K97
4229I33j053n42L87M75K53q0m6n2k27q1l52L2O18M91p58p18j03Q69Q95m64o48
$$ plain form
4082 -163 -85 413 808 734 -239 -874 -380 395 954 487 -230 -630 -377 221 155 -42 33 142 -131 -674 -605 386
4104 386 964 681 -310 -834 -536 468 1171 298 59 -289 -136 -77 -300 -66 576 571 304 -643 -775 -73 815
4125 815 794 -253 -740 -277 126 166 8 82 70 165 -446 -686 -269 797 876 73 -818 -1026 -374 732 818
4146 818 53 -412 -241 154 -221 -560 279 487 423 -394 -1238 -642 408 669 51 -906 -1056 -530 173 197
4166 197 89 -47 255 -100 -668 -604 455 927 35 -609 -1229 -367 478 644 208 -247 -559 21 -217 -101
4186 -101 -119 496 491 -259 -1046 -489 436 904 168 -487 -433 -464 126 567 142 35 -11 2 -314 -352 321 699 884
4209 884 -344 -544 -525 589 897 572 -184 -600 -278 207 12 -148 -100 403 374 -791 -487 -302 636 933
4229 933 -120 -662 -275 200 453 373 327 275 48 -33 -385 -353 265 756 -2 -720 -823 46 941 477 -171
4250a71k50J06M24j04J97j12K21K7o89m46J17J212N98o12j117N1M92L39K12l18
4270A77l90J82n1m37K91P23L38o13o42n72L93R65J4J0p99j61O97q5k35j2M74M7
4292C14p51j44N7N42N72m48q23j02N18O43j66k17j81J92J09m16R2j24P88J14o62
4313i3n47K58O29M92l23o96l40M29L09j04q7J47J81k80k90l70N12J069m7j025
4333a76n21R3P53P9l0k9k20L15j12m94K27O37L80n00q74j91O13R94m55o25k37
4354c73J38L96k77o4M2M78J58n60p96L31R09N11m47r19j28K99Q52K22p88n6j50
4375b22M06m88J16J91O00l8p36o40O77P43Om73p57J53M69O7j66M5j02L47p1p74
4397f47K87M20L75Q7p00m69K4Q21L59l80o04K22J22q6m5K03J83M01r08m12L0N99
$$ plain form
4250 -171 -421 -315 109 5 202 90 311 338 -351 -797 -680 532 1130 518 -599 -548 -56 283 495 177
4270 177 -213 -31 -82 -519 -228 495 833 220 -422 -994 -601 364 378 388 -411 -572 125 40 -195 -207 267 314
4292 314 -437 -581 -524 18 590 142 -681 -783 -265 378 212 -5 -186 6 115 -301 -209 -333 455 569 -93
4313 -93 -640 -382 247 739 416 -280 -620 -191 118 14 -73 74 255 -25 -315 -685 -173 896 849 -176
4333 -176 -697 -604 149 228 198 169 -51 264 152 -342 -115 522 902 402 -472 -663 -50 944 489 -136 -373
4354 -373 -235 161 -116 -180 -138 340 498 -62 -858 -527 382 893 446 -473 -601 -302 550 772 -16 -72 -222
4375 -222 184 -304 -188 3 603 565 -171 -811 -134 609 615 142 -615 -462 7 74 -92 -47 -149 198 127 -647
4397 -647 -360 60 435 522 -178 -647 -623 198 557 177 -427 -205 -83 -169 -214 -11 172 573 -335 -747 -717 -118
4419a18Q67l14o77n51N51M68M7k82n7N39l20m90p3K70N90K23p64n60P9L63O95
4440D86m09r5k17L78j66j94RK01M98lj038l60Q79Q92k01n69m92L1M61j0J37k15
4462CK34J93m40l62K16K91N09k14r56l92O33Q76q7m29l06J19k28K88j09L06M32
4483E77pm03p25J67J119J54o69k18j13J54L3J25M07l54j51k46j06K15K53M39j03
4504E48o73p56K91Q45L37m02m05l83P18k96P7J62L07L06q71j75k77O98P11k70
4524D92n56l71L24M06l81K21j62J77k34k60q6K46P74J27n03j123L08J006j46K15
4544D74p60k99O74j11O7k12K94K55l33n27l19N44O57M05n51p61L01M20n1l63K08
4565A2P5m40J24p8j75Q65Kk61n47j83J73P77O6m49M4l41K96j08R5N9L18Q6o37
$$ plain form
4419 -118 749 435 -242 -793 -242 226 273 -9 -66 473 153 -337 -410 -140 450 673 -91 -651 -572 -209 486
4440 486 77 -18 -235 143 -23 -217 -208 -7 491 488 -550 -910 -31 861 660 91 -401 -370 91 81 218 3
4462 3 237 430 -10 -372 -156 135 644 430 -526 -918 -285 591 504 75 -231 -112 -340 -52 -161 145 577
4483 577 570 167 -558 -391 728 882 213 -5 -118 36 69 194 601 247 96 -150 -256 -41 212 651 548
4504 548 -125 -881 -590 255 592 190 -215 -598 120 -176 -99 63 370 676 -195 -370 -647 51 762 492
4524 492 -64 -435 -111 295 -86 135 -27 150 -84 -344 -430 -184 590 717 214 -909 -601 405 259 474
4544 474 -286 -585 89 -22 45 -167 127 382 49 -478 -797 -253 404 809 258 -503 -202 218 167 -196 12
4565 12 87 -353 -229 -307 -482 383 385 124 -423 -606 -433 344 410 -39 5 -336 -40 -148 -53 6 324 410 -227
4588b27l06J82O03L36J52q71k37P4N01m6l97K38L82k64n19K05M31M10k55o35k01
4609d44J82M23K53J25q95J16M89l95j4J91J84M35n56l52k98P44O18o15j34k38
4629a81r2J87L58J9j07k37J46l80j19K76N50o4k94m77K00K51M15m3n07j60j09
4650c68O9k0L21n3J73Kk19p5r6L89P6j68o90K99L18L83K2k35j12J6L1m11L7M95
4674A84L36l96n74k02N22L80J83n36k94J36j20K23K24Q1L15k63k46n14M14J97
4694E0N50m19m25k26Q5O07oj61j83K54p1J2k72M94P6k20l25l94J37P94Kn4n34
4717b29j14K97K5P4j36K97J06p20n1J36M67K86n3k20p73L64O21J59m09j72L15
4738B70j05l33j50L23L29K23k61p23J23L09M45R8m47m89l3R85l72j85N2k54M07
$$ plain form
4588 -227 -533 -351 252 588 740 -131 -368 -294 207 161 -236 2 384 120 -399 -194 237 647 392 -243 -444
4609 -444 -262 161 414 539 -356 -240 249 -146 -160 31 215 650 94 -258 -556 188 806 191 57 -181
4629 -181 -273 -86 272 291 184 -53 93 -287 -406 -130 420 356 62 -415 -215 36 451 408 -99 -259 -368
4650 -368 -299 -319 2 -51 122 124 -95 -170 -266 123 199 31 -659 -360 -42 341 363 128 16 32 63 -348 -311 184
4674 184 520 124 -450 -652 -130 250 433 -103 -397 -261 -381 -158 66 147 462 199 -47 -561 -147 50
4694 50 600 181 -244 -470 -385 222 216 55 -128 126 55 67 -205 289 365 145 -180 -574 -437 357 359 305 -229
4717 -229 -343 -46 -21 53 -83 214 320 -400 -451 -315 152 438 385 165 -608 -244 377 536 127 -45 270
4738 270 165 -168 -318 5 334 557 296 -427 -304 5 450 548 101 -388 -421 564 192 7 59 -195 212
4759B12n95O9N00R2K4l45l95m4J54N07j9p5j65k3Q1J8p1N64J58l74l67l53j0Q39
4783C82K83k76l47j76O4L86j40k63o6P8o2j4l51N47K80n1o96j36M27K69j14J29
4805A53k11K74k14m04K38L67l9J81n70J16j86K86M89n76J85o69L50jR2q6R8M04
4827B77q7n55M1M15L80M1n58m30K42L66J20j55k28J41J26q7NJ16J53o7l99k33
4849c76n2K63P67j67m29m93K06L17j63J95r1K66q2l14j39L35J85N05m37l85P1
4870a8rJ75j9n3L09m40j40K89k19L09R1j52j22l31R8O10K35n53k41j06M38J23
4892B74k68P2k8J01n6l13L1N50J84j92o34k67N65L71n5k15k93L0J59J5j90O9O11
4915E21k17l42l66j0M08J96k5k84k58K91K93l1J24k69j4Oj93k9K13K36N8n21l51
$$ plain form
4759 212 -383 -314 186 278 302 -43 -438 -482 -328 179 160 85 -80 -103 -22 -4 -75 489 647 273 -94 -447 -457 382
4783 382 665 389 42 -134 -70 316 176 -87 -153 -75 -137 -151 -502 45 325 274 -422 -558 -131 138 24 153
4805 153 -58 216 2 -402 -164 203 164 345 -225 -109 -295 -9 480 -96 89 -580 -230 -231 -139 -225 -127 277
4827 277 190 -365 -324 91 471 512 -46 -476 -234 132 252 97 -131 10 136 49 54 170 323 256 -143 -376
4849 -376 -428 -165 602 435 6 -487 -281 36 -127 68 -23 243 161 -153 -292 43 228 733 296 -89 -18
4870 -18 -27 148 129 76 385 -55 -195 94 -125 184 275 123 1 -330 -232 378 613 60 -181 -287 151 274
4892 274 6 78 50 151 95 -218 -187 363 547 355 -279 -546 19 390 335 120 -173 -143 16 31 -159 -90 521
4915 521 304 -38 -404 -414 -6 190 165 -119 -377 -86 207 176 300 31 17 23 -170 -199 14 250 308 -213 -564
4938e64NM84L81k55Q6m20J34J93k54J37R4L64j96l83k40N91L44m3p06j97N57k96
4960a84L47K01n11M18l02P4j65L63o9R0l74j03m42M53L55QJ0j40Q2k01j70J6M81
4983B37j63K91m38j85l55O39N06o5q12L3J75K37Q0J7k07K21l14J12j05N00O5J7
5005D86l91n50L52K2L18O5l75j16J3J80J47o3O28p31J77m23k05M04P2M53n21l29
5027c87J98M32J44m41J94J24l04k84R1K28K19J91k03q59K41P44j52k41q7l37N36
5048D7j62K11k88L19K35k36o40l9K35P34J0m82n10N79j33N70j31j91J62n8l05
5069g3j36j19K03P13o61k55k8K07N29J36m16l26O5O7o7q2J73L28j66j71k13q6
5091c78O89K78k18p54M8L19L39n3k27j39k4j50j16J96K78P0L71l32n08K78L99
$$ plain form
4938 -564 -559 -75 306 51 137 -283 -149 44 -210 -73 21 385 189 -194 -434 157 501 458 -248 -445 112 -184
4960 -184 163 364 -147 271 -31 43 -122 241 172 262 -112 -215 -657 -204 151 159 169 29 111 -90 -260 -244 237
4983 237 74 365 -73 -258 -613 26 532 467 -345 -312 -137 100 180 197 -10 211 -103 9 -96 404 469 486
5005 486 95 -455 -103 -81 237 302 -73 -189 -176 4 151 88 716 -15 162 -261 -466 -62 10 463 -58 -387
5027 -387 -189 243 387 -54 140 264 -40 -324 -233 -5 214 405 202 -657 -416 328 176 -65 -152 -489 47
5048 47 -115 96 -192 127 362 126 -514 -553 -318 416 426 -56 -566 13 -120 450 319 128 290 232 -73
5069 -73 -209 -328 -125 588 -73 -328 -356 -149 380 516 100 -226 -161 -94 -161 -243 -70 258 92 -79 -292 -378
5091 -378 311 589 371 -383 -335 -16 323 270 43 -96 -120 -270 -386 -190 88 158 529 197 -311 -33 366
5112C66M6k76j47k21L64o3M4J03K7k0k55J0k34N63L00l63k70o34M79J05O17n17
5134B4j76K98ok81l69N14K50j55J6m38J71M8O44j35m23M10n73K20J7J54j7o4q
5157A21m06J7L42L56j73l21k91j18M52J70J30l98j24N28m30oJ09L53r9k81k13
5178b82j93M09K66L4k25k45lL49J33q5K99k63j11m05oK02L05O7k07o5l15K2M10
5201I1K65k37m14J09K56k42O1k79N12J66m97l22P6P05m7n5k0K03k71P2j04J91
5223B19J9k14n9n8p1nM64l88q0Kn1L41L5l1l4k02J9L52n17M42P2K20o19k52L05
5248i1R5M03ml66l02J65K5L88j84k38J33K0n17K45K57r5N5R7j80q8j17O59k97
5271F3j67P9K2j49K39k39L43p3J37j78k27L36p6J33l87o3n7L30j30J36m1M14k78
$$ plain form
5112 366 412 136 -11 -232 132 69 113 216 243 223 -32 -22 -256 307 607 244 -26 -660 -181 -76 541 24
5134 24 -152 146 140 -141 -510 4 254 99 115 -323 -152 -104 540 405 -18 392 -181 39 56 210 193 129 121
5157 121 -285 -268 74 430 257 -64 -355 -473 -21 149 279 -119 -243 285 -145 -151 -42 311 212 -69 -282
5178 -282 -475 -66 200 234 9 -236 -239 110 243 158 457 194 83 -322 -328 -126 179 246 39 -26 -341 -319 91
5201 91 356 119 -295 -186 70 -172 -111 -390 122 288 -209 -531 -455 250 203 148 128 331 60 132 28 219
5223 219 238 24 -35 -93 -164 -169 295 -93 -173 -171 -222 119 154 123 89 -113 -94 258 -259 183 255 475 -144 -396 -91
5248 -91 4 407 403 37 -265 -100 -75 313 129 -109 24 44 -473 -228 29 -66 -11 86 -94 -182 -299 360 63
5271 63 -104 -25 -3 -152 87 -152 191 118 255 77 -150 186 110 243 -144 -207 -264 66 -64 72 31 445 167
5294A67j56n86L70K64j47L02j20m22M80j5L41l21o0j42q6K32k68J33M32j49j28
5315A21m90J60L55J60j55k33k18J48K41j58k61N30k35K91l57K9J83J1k62p3j27
5336c40J14lJ43J41k23J49L01l50K30k61L12Q2n21J05l94P30J9Q2n01J72j01j2
5358a26K53q9J25j12K40j89k37J15K33o5O0m17m8L25k2J38m9l27L41j58j44J90
5380C7J29J56l6k08m43L26j6L00l96q1K84j07J46Pj78J26L00l16l51N28k22R2
5402G7L06m67J05k80L25K17l50j13P3mM1r8J74K72l62j71K86l19M49K6n7p0j90
5425a30P0L01j44l20J17J48R6l16N7K96M7kk11m36J04L99J82j99k25J6K85l43
5447b08K63q1j52J89M3m77N0K89K56J14l81M0j90K06Ro2j69M51j43k62K71J99
$$ plain form
5294 167 11 -575 -205 59 -88 214 94 -328 152 137 478 157 97 -45 -131 101 -167 -34 398 249 121
5315 121 -369 -209 146 306 151 -82 -300 -152 89 -69 -330 200 -35 256 -101 -72 111 122 -140 -213 -340
5336 -340 -226 -229 -86 55 -168 -19 282 -68 162 -99 213 295 -226 -121 -515 215 234 316 -185 -13 -114 -126
5358 -126 127 38 163 51 291 102 -135 -20 213 148 208 -209 -257 68 46 184 135 -192 149 -9 -153 37
5380 37 166 322 286 78 -365 -39 -55 245 -151 -232 52 -55 91 98 -80 46 346 30 -321 207 -15 77
5402 77 383 -84 21 -259 66 283 -67 -180 -107 -111 -70 -168 6 278 -84 -255 31 -288 161 187 130 60 -130
5425 -130 -60 241 97 -223 -106 42 138 -178 -121 175 222 220 9 -427 -323 76 258 59 -166 -150 135 -208
5447 -208 55 -26 -178 11 54 -423 -373 -84 172 286 -95 -55 -245 -39 -30 -92 -261 190 47 -215 56 255
5469B55p9m8o7k38k71L65K89j2n5j63M4j85K63j60N06N1n24O4l27K42j95M26m8
5492A33j9k72L0N0K4K39j76j16O0k42N04j92K16o2l15K45l69K27O2k8J56k61K1
5515h5J87m27L64K5J74m66J24n0K60J71l63L61j52n34O98R4l15J25q8l21K05j03
5537a16J57K2J53k67l2O7kj5R8j39J42M7k01j6K66P4p4J2n3m36K63K87l97M67
5561C07l62k45L27K38j12k65M7L1j05J44P2m8K45Rn10L6Q1K51R0j4m68J94ojq7
5586a51L01k24K07p0k88L31M9L4l24k66L38K7R1L8j6r7j77P7j21K01o5J95R1k76
5610i5l24K71J11L35l89J47O1j93r4O7L26j72J75n18l4N57m22L84p7k14j46o2
5632c06K38k17K94NM9j80J22j92j00L46N3k07m62L63K31J86M8k80l18N36j25p2
$$ plain form
5469 255 176 128 61 -177 -448 -83 206 194 139 -24 20 -165 98 -62 444 495 -29 35 -292 -50 -245 181 133
5492 133 114 -158 -128 -78 -54 185 9 -107 -47 -289 215 23 239 177 -138 107 -262 -35 27 -1 155 -106 -85
5515 -85 102 -325 39 64 238 -228 -104 -154 106 277 -86 275 123 -411 287 381 66 191 103 -218 -13 -116
5537 -116 41 63 216 -51 -83 -16 -18 -33 65 -74 68 115 -86 -102 164 238 164 176 123 -313 -50 237 -160 307
5561 307 -55 -300 27 265 153 -112 -65 -34 -139 5 77 29 274 283 -227 -191 -110 141 231 217 -251 -57 -63 -64 -151
5586 -151 150 -74 133 63 -225 106 155 189 -135 -401 -63 -36 55 93 77 -20 -197 -120 -241 -40 -105 90 181 -95
5610 -95 -419 -148 -37 298 -91 56 117 -76 -170 -103 223 51 226 -292 -326 231 -191 193 116 -98 -244 -306
5632 -306 -68 -285 9 14 63 -117 5 -187 -287 59 112 -95 -557 -194 37 223 271 -9 -327 209 84 12
5654A2lJ93o1r6p6k4J64J85l1l94k9J28j49J60o3j34N46k20O7k54Q5J00r1K33
5678B48l70J22j81L52Q0j9j60j70J34j71mK67M7k65m9N9j10J21J84K50o72o4j6
5701c87N62mO2j60j34k25L54j84J74L11m30R6q9l7K02J22l8J14m33j71L20R8n24
5724d01K34M95n03k12N33l03J62M74l02k15o3K60J67m56M0L30m29j03M40k81L52
5745B19R4m69J80k65K94K82n48M03m13J6o9K19J18j82%j44J57K38l72M22N4M2
5767B76n75K42M01j71j16N2p8p4j85K23j20q3L97m52J42J02j87L59K17n95J24
5788a01j86K53j84J93M6n7J98j23l52K94J42J65j10k65J10n9L56k39QJ15j97k48
5810b41K63l17L76L29m17j66K97l52R5L7M30n97L08j45O4k4R1L36m00j35L21q7
$$ plain form
5654 12 9 202 141 45 -31 -55 109 294 263 -131 -160 -32 -181 -21 -84 -218 328 108 175 -79 6 106 15 248
5678 248 -122 0 -181 171 251 232 72 -98 36 -135 -139 128 175 -90 -139 -80 -190 -69 115 365 -307 -371 -387
5701 -387 175 171 233 73 -61 -286 68 -116 58 369 -61 35 -54 -91 111 233 195 309 -124 -295 25 123 -401
5724 -401 -167 328 -175 -387 146 -157 5 479 177 -38 -101 159 326 -130 -90 240 -189 -292 148 -133 219
5745 219 313 -156 24 -241 53 335 -213 190 -223 -207 -276 -57 61 -121 -121 -265 -108 130 -242 180 234 276
5767 276 -299 -57 344 173 57 109 31 -43 -228 -5 -125 -208 189 -263 -121 -19 -206 153 370 -225 -101
5788 -101 -287 -34 -218 -25 21 -36 162 39 -313 -19 123 288 178 -87 23 -36 320 81 89 204 7 -241
5810 -241 22 -295 81 410 -7 -173 124 -228 -133 -96 334 -263 45 -100 -36 -60 31 367 -33 -168 153 66
5832F6k6l7j26l1J10J2j19L97m05L52q0j47M11l76q8q7L54j07p8Q7k03K59q2Q4
5856A40k45J8J09K13m8Qm10J55L1j10o5J31K13j53j34J75k42K98J59p17K49J47
5878g8L82j59k97L59M6q6j09P9l7r6r9K57J3k37J93k26k21K40q4K85R8l89l1J80
5902a7L1m9J7M2P6k52L01J11l08k10K03k2n4J52j43L83j17l34J11L58j75J7q8
5925C3l7n0k3K0K99k90pj01m2K0K34K14l42k1R9j65N4J21J2J29p2j48Rq3J65j15
5951h7L0J23l57L38k07K40J42m96N5P9q4q5L83l9jJ08k21m3J48o0Q8K08m09k52
5975c99J27J54R0J81k73K53l30J28O3q1J51J82m68K37r3K84l59J89J38k81P8J76
5997A47Rl16K82l06L37l27L72p1l8R0j00j28K09k30P3j39r7N1N8m3L77j93j04
$$ plain form
5832 66 40 3 -123 -154 -44 -32 -151 246 -159 193 113 -34 377 1 -87 -174 180 73 -5 82 -121 138 56 140
5856 140 -105 -87 22 235 187 195 -215 -60 -29 -139 -204 -73 140 -13 -147 28 -214 84 243 -474 -225 -78
5878 -78 304 145 -152 207 253 167 58 137 100 4 -95 162 175 -62 131 -95 -316 -76 -160 125 223 -166 -197 -17
5902 -17 14 -35 -18 24 100 -152 149 260 -48 -258 -55 -77 -131 21 -122 261 144 -190 -79 279 104 121 33
5925 33 -4 -54 -77 -57 242 -48 -55 -156 -198 -178 56 270 -72 -93 6 -159 -105 16 28 157 85 -63 -54 -137 28 -87
5951 -87 -57 66 -291 47 -160 80 222 -274 -219 -140 -224 -309 74 35 34 142 -79 -122 26 -34 54 262 -147 -399
5975 -399 -272 -118 -28 153 -120 133 -197 -69 -6 -87 64 246 -222 15 -78 206 -153 36 174 -107 -29 147
5997 147 156 -160 122 -184 153 -174 198 127 89 179 79 -49 160 -70 3 -136 -233 -182 -124 -167 210 17 -87
6020h7K83n09K67J04K75j48r2j75J38j09N2k40O19m6m00J84k51j1j68N00j30K94
6042C50k67k46M78j96l1N6m16M72l79L02l65L83p3R7k87K52j68J11K08k54J9k66
6064b20L34J45m2k16jK38K9n21J98L44Pj37j54oR9j80KL28k26j8K7j53K17j65
6088g1Q8k71L17j25J57K63m73j13K08j48j01N59m35L14O2j55j77J49K0k5M3p9
6110GJ71r9J03l49Nk6Q5o1L31m66L96j18J91l17M65n34K85Q2q5j6j62pL28m11
6134b02J33p5J39L25k27j90O1J40k41J41m8K38k04l12L77j0n1J44j99L9p0NJ03
6157A6lj56Q4k79K43JJ81k29l23O12Nj45J38%r5K04m14J73r2J39l45L45j28l0
6181i8Q7l00L07j20L04k20m6M18j83o3m26N05O4j35j36m8j5j04K63j79k70L63
$$ plain form
6020 -87 196 -313 -46 58 333 185 93 -82 56 -53 -1 -241 378 332 -68 116 -135 -146 -314 186 56 350
6042 350 83 -163 315 119 88 144 -272 200 -179 123 -242 141 68 165 -122 130 -38 73 281 27 46 -220
6064 -220 114 259 217 1 0 238 267 -254 -56 288 295 158 4 -2 97 -83 -81 247 21 3 30 -123 94 -71
6088 -71 17 -254 63 -62 95 358 -115 -228 -20 -168 -269 290 -145 169 231 76 -101 48 68 43 86 7
6110 7 178 79 182 -167 -162 -188 -103 -164 167 -299 97 -21 170 -147 318 -216 69 151 66 50 -112 -119 209 -202
6134 -202 -69 -144 -5 320 93 -97 -36 104 -137 4 -44 194 -10 -322 55 45 -6 138 -61 -22 -92 -87 16
6157 16 13 -143 -59 -338 -95 -94 87 -142 -465 147 152 7 145 145 50 254 -160 13 -79 60 -285 60 -68 -98
6181 -98 -11 -311 -4 -124 180 -40 -86 332 149 86 -340 165 229 94 -42 -90 -105 -209 54 -125 -395 -32
6203c2j72J86K74l36L1J25J23k32o9j3L98j2l45O2j09L22k02p2N40n21L02j57
6225I1l69P55k69N4k08n0n5J38r2L5l6J85j65J12j13j78J75K41j40k71P9J68k70
6248a83k69M75P9j03k65L25J95j62j00J8k1J07l62qL31j15K73m27l1N30k45j57
6270a15l7M6K94J43o78M85J06k57J79l25j53N81m29K36k80j19j0M13k17M04N2
6291C19n05L23k43J50q9J54j47K29M5l22Q5p3j83J74J64l8j33J01J95j10l66K10
6313f0k27K14Q7J38j86O3N9j3K08j77n9j47J06q7J0j11M9J33J27p4j50J59Rk31
6337a60K47K3K8k17K1K87k09P3J13j58j67L3O1M26n71J95J12k4j65q3J78O2k68
6360a63M9M24k48J23j21k46K14P6j97K80l29O4L85k73J54o8k85M7J95j03j4J12
$$ plain form
6203 -32 -204 -18 256 -80 -49 76 199 -33 -102 -115 283 271 -74 -12 -121 201 -1 -73 467 -54 248 91
6225 91 -278 477 208 262 54 4 -51 87 -5 30 -6 179 14 126 13 -165 10 251 111 -160 -81 87 -183
6248 -183 -452 23 102 -1 -266 59 254 92 -8 10 -11 96 -266 -274 57 -58 215 -212 -243 287 42 -115
6270 -115 -152 -106 188 331 -347 138 244 -13 166 -159 -312 269 -160 76 -204 -323 -333 80 -137 267 319
6291 319 -186 137 -106 44 -45 109 -38 191 236 -86 -1 -74 -257 -83 81 43 -90 11 206 96 -270 -60
6313 -60 -287 -73 14 152 -34 29 88 75 283 106 47 -100 6 -81 -71 -182 -133 0 127 53 -97 62 71 -160
6337 -160 87 110 138 -79 -58 229 20 93 206 48 -119 -86 -25 401 -170 25 137 113 -52 -135 43 105 -163
6360 -163 -114 310 62 185 64 -182 32 108 -89 191 -138 -74 311 38 192 124 -161 -114 81 -22 -36 76
6382G6J23J8j99K27j52k78J88m0K38q3q4l5K51k11K69k59k19K66o6J8n2j82J44
6405d2L33j81J57n34K54m0J9j68J31q1J47J46ok93Rp2K92M9o6j12J74L0k60L34
6429B20j23j1K1j13Qk1n6L20j16l61P6K91K22j85j98K85M3k89j35n8l7L66k07
6452e8p1M5j24j23N00k79o2J57k67J74J50k46M38j91J59k43k34L81N1q4l88L69
6474E4j45k9K98j09m09K74o4j02L95k3j2r4L65k51l83J34J67q7ql87N55j42r3
6497i6J19r7N8p1Q7Pl27K44k9K3L17j55O8k8j66R4J05j86j14L32l60N5J47k6P2
6522G3L55n50L19L9l33k4K18j52j6R0l26N50l52J89qjJ05q2m0p8K2l5L11m78p0
6547b74q1L53J8l48L42L4m2k78M05j92k36N78k92L5M8k41L25k18J32j19k38K46
$$ plain form
6382 76 199 217 18 245 93 -185 3 -37 201 118 34 -1 250 39 308 49 -170 96 30 48 -4 -186 -42
6405 -42 291 110 267 -267 -13 -53 -34 -202 -71 -152 -5 141 135 -158 -149 -221 71 120 54 -58 116 146 -114 220
6429 220 97 86 107 -6 2 -19 -75 245 129 -232 -156 135 357 172 -26 259 302 13 -122 -180 -217 149 -58
6452 -58 -129 -84 -208 -331 169 -110 -172 -15 -282 -108 42 -204 234 43 202 -41 -275 106 157 73 -315 54
6474 54 -91 -120 178 69 -340 -66 -130 -232 163 140 128 34 399 148 -235 -101 66 -21 -29 -416 139 -3 -96
6497 -96 23 -74 -16 -87 0 7 -320 -76 -105 -82 235 80 148 120 -46 48 153 -33 -147 185 -175 -120 27 1 73
6522 73 428 -122 197 236 -97 -121 97 -55 -71 19 -307 243 -109 80 72 71 176 94 54 -24 -2 -37 274 -204 -274
6547 -274 -355 -2 16 -332 10 44 2 -276 129 -63 -299 279 -13 22 70 -171 154 -64 68 -51 -289 -43
6569d3L9k8M4M1j94K2p0J67k51L65p1j79K33r3m11M90J39N4m63K76J15K5l64J0
6593a47K24j83k8P6Q5J5K2p7K32l21K5N4PR2N1j21J30k18J13R4j04j88m4j50J16
6618b45O5K80k47K20j00N3O7m79L81r8J92m3j01k29K75J22j18R1l23j11L45K6
6640B3J07j24j81L15n09P61n56Q8K06l47J51j00J93J4M2m88O4K78J11j63K26J47
6662B58m29j19p7M13L4j79J45Mk98L38j57LQ3P4n6q9l18L67Q6j92J14k08N17l72
6686e8j17N2K88j46K12o23N41n4j61J62N9M6p5l29K37k14J93j1j51J38k00L22
6708A11L9R3l83j09K35K91m95J27L54o8k45R0k93L68r8k7r4L25K16m94J8K89k12
6731C8j83M86n06K39R1Oj38J53j59o4l5j98J24Po6L30K1q1j11J21k7r3K39l44
$$ plain form
6569 -43 -4 -32 12 53 -141 -119 -189 -22 -273 92 21 -158 75 -18 -429 61 200 254 -209 67 182 207 -157 -147
6593 -147 77 -106 -134 -58 27 42 64 -13 219 -102 -77 -23 -16 76 127 6 136 -82 31 125 21 -167 -211 -361 -245
6618 -245 -180 100 -147 73 -27 26 93 -386 -5 -103 89 46 -55 -284 -9 113 -5 86 -237 -348 -3 23
6640 23 130 6 -175 140 -369 392 -164 -76 130 -217 -66 -166 27 41 83 -405 -341 -63 48 -115 111 258
6662 258 -171 -290 -367 46 80 -99 46 50 -248 90 -67 -64 19 93 37 -52 -370 -3 83 -109 5 -203 314 -58
6686 -58 -175 -123 165 19 231 -392 149 95 -66 96 155 201 126 -203 34 -180 13 2 -149 -11 -211 111
6708 111 150 243 -140 -249 -14 277 -218 -91 263 195 -50 40 -253 115 17 -10 -104 221 437 -57 -39 250 38
6731 38 -145 341 -165 74 165 171 33 186 27 -37 -72 -270 -146 -139 -205 125 146 65 -46 75 48 -45 194 -150
6755a50J47oR4l58O20j32O2j97k17M04j54L4l14J26m54K75M87k11j54mj50M41
6777A89l26K20j09P2O9k54K10p9j40O9p2l3J29k18L76q3K15l56j31J74M9K93r
6800B55k33oJ60o4o1k81J55L2j44J65M7j34K81m72K71O8o4K3J44N5j65m12N52
6823A72q6k25J73l18N17o08N50k81K09O3j22Oj41J00k07L82p0k27Q9J39j49k26
6845b60M80o6k37J4K80p3m37M48K34l90J9M15m89J54p7k02qK48Lo41M84K53l6
6868A16L4m34J17J12j81M34j15J5j48M3K1R8k24K69J13k58J14j1j9Q5Q2p9n15
6891c31Q8L79K33k72l3n72N27R3j85P2L03J84n14J95r5K11k74Q0k28J3K24J15
6913B13j73j32j14R4J34J42l06r3J91J20pj82J41Q1j57K59m35K55k00L83m66K75
$$ plain form
6755 -150 -3 -9 85 -273 347 215 277 80 -137 267 113 147 -167 -41 -495 -220 267 56 -98 -102 -252 189
6777 189 -137 83 -26 46 115 -139 71 -8 -148 -79 -151 -184 -55 -273 103 20 235 -121 -252 -78 -29 264 255
6800 255 22 16 176 112 51 -230 -75 -43 -187 -22 25 -109 172 -300 -29 39 -25 -2 142 197 32 -380 172
6823 172 86 -139 34 -284 233 -375 175 -106 103 166 44 50 -91 9 -198 184 114 -113 -24 115 -34 -260
6845 -260 220 154 -83 -69 211 138 -299 149 383 -7 12 427 -62 92 15 -187 -195 53 56 -585 -101 152 116
6868 116 150 -284 -167 -55 -236 198 83 98 -50 -7 14 112 -112 157 270 12 126 115 96 181 263 184 -331
6891 -331 -243 136 369 97 64 -508 19 112 -73 -1 302 486 -28 167 72 283 9 89 -139 -126 98 213
6913 213 40 -92 -206 -112 22 164 -142 -235 -44 76 69 -113 28 109 -48 211 -224 31 -169 214 -252 23
6935B3q3J4J95m67K36J96K5L1j99r2J89j05k0K2j00J52K2n16K02K30K29j23k16
6958a55K08j99M2N1l5J90l30N79k96J0m2L17k28l06N52m89L46j57o5L02l62k38
6980c05L04n1J74n7k81L53l3j74R0O7j67K34j76J28kJ03n09J77J44J5L18k91J12
7003A73j38o3J54l16j52K10K66N5j20k24J15J22k7j27K7LJ67l36J17K64j30l45
7025c05L65k06J76j31R6k2L47l55K26m22J43L6QJ51j44lk0j09l41M21J62j19k40
7048b86jQ7L3p1l9L02kJ79j71K4J03j49K01p5k51K26j3J33k65j40O1j97L45q2
7072d8K16nj55O6n30O55k3m27J34J9L3j28j7L81j98R2q7m3q8R4k77O78l14j1p9
7097f2J17p0J37l15L02j44Jk1J18k60L76p8n0K1j34N6J54j19o0K00l0l5k3j7j76
$$ plain form
6935 23 -60 -46 149 -318 -82 114 139 170 -29 -121 68 -37 -57 -35 -135 17 39 -477 -275 -45 184 61 -155
6958 -155 53 -146 -104 -53 -88 102 -228 351 55 65 23 340 112 -194 358 -131 215 58 -7 295 -67 -305
6980 -305 -1 -52 122 65 -216 137 104 -70 20 87 -80 154 -22 106 104 207 -302 -125 19 34 352 61 173
7003 173 35 -28 126 -190 -342 -132 134 189 69 -155 -40 82 55 -72 -45 -42 125 -211 -94 170 40 -305
7025 -305 60 -146 30 -101 -5 -27 320 -35 191 -231 -88 -52 -44 107 -37 -40 -60 -169 -510 -89 73 -46 -286
7048 -286 -287 -200 -167 -238 -277 25 23 202 31 55 158 9 210 135 -116 110 97 230 -35 -175 -114 -311 34 -48
7072 -48 168 163 8 74 -456 199 176 -251 -117 -98 -65 -193 -210 171 -27 65 -22 -65 -153 -59 -336 342 28 17 -62
7097 -62 55 -15 122 -193 109 -35 -34 -55 63 -197 179 101 51 72 -62 -6 148 29 -31 169 139 104 81 64 -112
7122a12qJ85R0j93k7M0k22L75m13J73J7K94k04p5j57j03K85O6j64L29o5k6J9p3
7146C1l3l55K29n1O10l06k65K56j58K68k33j01MK31r0l33K67l05L99O6k80Q4m0
7169a05n5J33j0N6j50K83k50K43k6l57j5N11k77M09j28j95k23L57j75lO2j17K05
7192A73k00k20M00k01Qj65M38j35j5k81K31j83q9M31N1r2j81m2j37J97r7K11m9
7215E3K8l10J55J61j75q2p2K01J70j8j83Q5j78j00L69J1j59m7k5J34k8o5M7j9
7239d7l7J17k41R1J28L19k4l79K3m41N41J75K6p0N4k88p5J13J08K62k73j00J82
7262A64j45K10k63J25k82J99l74L61k6J43j33P0k00P8L98l51M5j61L49j47J31
7283A91k99J00q1L3J74O7m23j30L64K8j84l9R7L60p3Q2k26o8j15K25O1l57J65
$$ plain form
7122 -112 -120 65 155 -38 -65 -25 -247 128 -285 -112 -95 199 -5 -80 -237 -340 -55 11 -153 176 111 85 104 31
7146 31 -2 -357 -128 -179 431 125 -140 116 -42 226 -7 -108 -104 127 37 -296 -29 -334 65 131 -149 -65 -105
7169 -105 -160 -27 -37 19 -131 152 -98 145 119 -238 -253 258 -19 390 262 67 -156 201 26 23 85 -32 173
7192 173 -27 -247 153 -48 -40 -205 233 98 83 -198 33 -150 -239 192 243 151 -30 -72 -209 -12 -109 102 53
7215 53 81 -229 -74 87 -88 -170 -242 -41 129 111 -72 13 -165 -265 104 115 -44 -91 -116 18 -10 -75 -28 -47
7239 -47 -84 33 -208 -117 11 330 306 -73 -50 -491 50 225 251 181 235 -53 -128 -15 93 355 82 -18 164
7262 164 19 229 -34 91 -191 8 -366 -5 -31 112 -21 49 -151 -73 325 -26 19 -142 207 60 191
7283 191 -108 -8 -89 -56 118 185 -238 -368 -4 24 -160 -199 -102 258 185 267 41 -27 -142 83 144 -213 -48
7306d8J46n4k88K46J35J45j06k98k5J24K45R3m86J98M6j86L1K28l12J58K06k4
7328A74J11m27J41rj89PK21R8k93K52Nj21p8J01nJ17M9l13j27L73jJ52k22j51
7352a35r9J50Q4P7k06M3m2J67R1j72Q7l15N02j89q0n5K40j81j92K60j91L11l6
7375A19j66J69Lj46K37q3j20l9L09l21l0J22J41r9l32N20n13J9L52Q3j00j05m6
7398b6K5n1m8l02N28j5k52M21j12j24k53L79m16l1N3K47K47J5j61j73J13j6m5
7421CJ46n6O0K8l26j34M07J1l30L4L14r8j34N0k69m3L65k10K03j09K60k12j86
7444b26J94L24l78n5K11k45J59J48l77K06K27k18J66k94K15j60P0j58J29K33J17
7465B88m64J95m1o7J65q7M5m7j11K82k99l5K48K28n51O09m51L7J83k43p3J38R3
$$ plain form
7306 -48 98 44 -244 2 137 282 176 -122 -147 -23 222 315 -171 27 73 -113 -82 146 -166 -8 198 174
7328 174 285 -142 -1 -10 -199 -192 29 127 -166 86 91 -30 -108 -7 -12 105 154 -159 -286 87 86 238 16 -135
7352 -135 -234 -84 0 77 -129 -86 -128 39 130 -42 45 -270 232 43 -37 -92 148 -33 -225 35 -156 155 119
7375 119 -47 122 125 -21 216 133 13 -26 283 -38 -68 54 195 96 -236 284 -229 -210 142 225 125 20 -26
7398 -26 -1 -52 -100 -402 126 111 -141 280 168 44 -209 170 -246 -277 -224 23 270 285 124 -49 64 48 3
7421 3 149 93 153 181 -145 -279 128 139 -191 -157 157 59 -75 -25 -294 -337 28 -182 21 -88 172 -40 -226
7444 -226 -32 292 -86 -141 70 -175 -16 132 -245 -39 188 -30 136 -158 57 -103 -33 -191 -62 171 288
7465 288 -176 19 -22 -89 76 -11 34 -13 -124 158 -141 -176 72 300 -251 358 -93 -56 127 -116 -189 -51 42
7488D2Q1R2j22m8k33J10k06l0M39J60N5m48K13j1j05K23j45P7j00O5k97J55L42
7511C09m54Q9J72n8l22J30N5J13J86k03j94J87R8m76N85m6l12o4K77j85L29j97
7533A9l60J77Q3J13k21K72k60L8N2K24Nm55M16L1j49K95k23o2K69k99j4L2J45
7556A28Ml19J03J3N7m3p3l8j9M93k07J59k61j86K85n3K55m55J18M0n8J94l84R0
7580a57Q6J77kj20k0J3J52k07K78l96l8N46j31N6o9L0o9jl38K20r8J0K89k85o6
7605a40L47k95k5N44l75k45L33Q3n36L64J60j50k04J21J7J07N0l13M36l45K6n5
7627i5J81r0o1j29r7N09j28k24J24K64k49j93pM35k55j4p0K72k33j34K98R1l14
7650a19L34l27j87M18j31R6K2Q8k21J8k17RM84l73K67k73J09NJ71j8p4l6j44J54
$$ plain form
7488 42 123 215 93 45 -188 -78 -284 -314 125 285 340 -108 105 94 -11 212 67 144 44 109 -188 -33 309
7511 309 -145 -56 116 58 -264 -134 -79 34 220 17 -177 10 108 -368 217 171 -141 -205 72 -113 216 19
7533 19 -341 -164 -81 32 -189 83 -177 -139 -87 137 142 -313 103 134 -15 280 57 -5 264 -35 -49 -17 128
7556 128 132 -187 -84 -71 -14 -57 -130 -168 -187 306 99 258 -3 -189 96 43 298 -157 -39 1 -57 137 -247 -157
7580 -157 -71 106 104 -16 -36 -23 129 -78 200 -196 -234 312 181 237 168 198 129 128 -210 10 -88 -78 211 -74 -140
7605 -140 207 -88 -113 431 56 -189 144 227 -309 55 215 65 -139 -18 -1 106 156 -157 279 -66 -40 -95
7627 -95 86 -4 -65 -194 -291 218 90 -134 -10 254 5 -188 -195 240 -15 -29 -99 173 -60 -194 104 195 -119
7650 -119 215 -112 -299 119 -12 84 106 194 -27 -9 -226 -217 267 -106 161 -112 -3 2 173 155 81 45 -99 55
7674E5k58M39j80K25k84q5j33J47K48J06k41j15J38r1j67L13j21N5j96K10r6k94
7696c25L08K76m2k70j92N08k23J89j44r9j54R8J00j13L94k82O8k14K88l49J90
7717A2kn4K87m8l99K51J43m14L45n35M96n5l6K14l02r8L86k36j48J97l9L9qJ53
7741A49J92m27L08k14N7j21M2k26K21k16K56N0K50j41k06K3K29j64J3o3J19q1
7763E0k89O26k37j78o4K85l33%K49J9k64k0J51J3l14J49j4N9K27N5j24m5n3J64
7787A12j69l1J69l55L10J53k01J23l36K19k02L50n82L01L13n9kJ1j32q0p2K48
7809H8j92J91L12j66k35k12J94L1J14k33K53J04j17nj3P7k99j81K67J11l6j68
7831a15m4J0K36ol30L33J32j53j96J47K12q5j94j06K47j75M8J93k55j04J87N2
$$ plain form
7674 55 -203 236 56 281 -3 -88 -221 -74 174 280 39 -76 62 -29 -196 117 -4 51 -145 65 -31 -325
7696 -325 -17 259 217 -53 -245 263 40 229 85 -14 -168 -70 30 -83 311 29 97 -117 171 -178 12
7717 12 10 -44 243 195 -204 47 190 -224 121 -414 82 27 -9 205 -97 -195 191 -45 -193 4 -35 4 -4 149
7741 149 341 -86 222 8 65 -56 -14 -240 -19 -235 21 71 321 180 -26 -3 226 62 75 12 131 50
7763 50 -239 387 150 -28 -92 193 -140 -140 109 128 -136 -156 -5 8 -306 -157 -171 -112 115 170 46 1 -52 112
7787 112 -57 -88 81 -274 36 189 -12 111 -225 -6 -208 142 -440 -139 174 115 113 124 -8 -88 -160 88
7809 88 -104 87 399 233 -2 -214 -20 11 125 -108 145 249 132 127 114 191 -108 -289 -22 89 53 -115
7831 -115 -159 -149 87 81 -249 84 216 63 -133 14 226 141 -53 -159 88 -87 -39 154 -101 -205 -18 34
7853C4l41R4J85k47J51J17R9r8j06M3M05o42K61J49P5j15K0j61k1K40j52J8P8
7876H6j40J9m9o9O2j19M57k10q6J65k6k68K71R7l96K68k25l46K67K35K03j94Q7
7899H9q2o6N3q9J33J60j38j36qk9M5J08J90j52j22o4L46m98L13q6P7K11o19M3
7923c21K36Rl7K5J94j48j8K03l46J84N7m8j00J01O3r4j69L41np5j16j46J05q0
7947a85K77q0o1M3J8K0j43lJ26r3L36k67p3K42k89mR7k3K0K09j43m60K65R9Q5
7972A3O1J19j39j23P5Q6J1j37L34m88q7J56J72k62K42J25M9P4l87J08K41k78O
7995b9q7L46j94j24J60m0j63R5K05l3j20o8R8r2J84k05L26n4j73M5k3J48k09J92
8019A85j06J47Pj21m2j55o0N2J81j26J9n9j36L08N0j40K35l61P7j28K28M2j87
$$ plain form
7853 34 -307 -213 -28 -275 -124 -7 92 -6 -112 -69 336 -306 -45 104 179 64 84 -77 -98 142 -10 8 86
7876 86 -54 -35 -84 -153 -91 -210 247 37 -49 116 90 -178 93 190 -206 62 -163 -509 -242 -7 196 2 89
7899 89 7 -59 -6 -95 38 198 60 -76 -84 -113 -68 40 230 78 -44 -108 238 -260 53 -33 44 255 -364 -321
7923 -321 -85 -76 -113 -88 106 -42 -60 143 -203 -19 38 -10 -110 -9 54 -40 -209 132 127 52 -64 -210 -105 -185
7947 -185 92 12 -49 -6 12 32 -111 -114 12 -81 255 -12 -85 157 -132 -136 -39 -62 -42 167 24 -436 -171 -72 13
7972 13 74 193 54 -69 6 92 103 -34 300 -188 -275 -119 53 -209 33 158 207 281 -106 2 243 -35 -29
7995 -29 -116 230 36 -88 72 32 -131 -36 169 136 16 -52 46 -46 138 -67 259 205 32 77 54 202 -7 185
8019 185 79 226 233 112 70 -85 -145 -93 88 -38 -19 -78 -214 94 144 4 239 -122 -45 -173 55 97 -90
8042i0J78K3j55j43M59j65r0n1j91j5m2N05k20j57j61K88j07o9R4K68l9j09K22
8065B33k85n3K49r2l40K77j18M3J31M5k83j9M65j86j23Q9m90N31j69J77R7j24
8087E5O3j52%k42J53L47l32l3L53k23n8K2p1Q8k33K75l5N0j0j66M0P5N2j22q1
8112a85K63J03k46m7J26P1j56K8l9N4jl6M16k02j34K57l73o1R8L89j12m53K55
8135A5k70M18j00r1m0k4K91l27om5K10o1j32K90J01j5j51l1Q6l85K29o4P8K48
8159B24k94K04k66K86l6j03K43m97j56M19l2J34k85K72l31J23P2pK11j38R9k77
8181a35M0j72K21J22j49j10N4J97M3k13
$$ plain form
8042 -90 88 111 -44 -187 272 107 17 -34 -225 -240 -282 223 3 -154 -315 -27 -134 -203 -109 159 120 11 233
8065 233 -52 -105 144 52 -288 -11 -129 -86 45 90 -193 -212 253 67 -56 33 -457 74 -95 82 179 55
8087 55 118 -34 -34 -276 -123 224 -108 -141 212 -11 -69 -47 -118 -30 -263 12 -23 27 17 -149 -109 -34 18 -104 -185
8112 -185 78 181 -65 -112 14 85 -71 -43 -82 -28 -29 -65 351 149 15 272 -101 -162 -64 325 213 -240 15
8135 15 -255 163 63 -28 -68 -92 199 -128 -134 -179 31 -30 -162 128 229 214 63 32 118 -267 -38 -102 -24 224
8159 224 -70 134 -132 154 118 15 258 -239 -395 24 -8 126 -159 113 -218 -95 -23 -30 181 43 142 -135
8181 -135 -95 -267 -46 76 -73 -183 -129 68 111 -102
8191a02
$$ Imaginary data points
##PAGE= N=2
##DATA TABLE= (X++(I..I)), XYDATA
0@%%%%QqQj6K2l0L2m0N6o4P3r7J20j38J62j92K27k67L10l58M12m71N38o13O94
29C68p84Q84r94J116j249J396j557J733j925K133k364K621k903L214l559L943
45B073m371M854n406O036o763P617q641R888j1445J3461j6185K0091k6206L7201
59B2204o3063K29787J83844m42215o9798K23567J00529k02911m0864J45132L1971
70A18183j76010n1110J03257N3153n1283J4997J2479j08575j11018J00192J67981
81G2246p092j33036j9705P6634J8107l4642L8918P5988K50o6169l9208k325J8071
94a963N6821O8036k6304j18642n6974Q3097Q9218l3245q0125m464K9370l5113
106c0288n9119J9865P5749K8894m1902n6897l2883J5608Q1405Q4311k4134j09521
$$ plain form
0 0 0 0 0 0 8 0 8 -8 14 -16 16 -24 32 -32 41 -56 64 -74 88 -104 123 -144 166 -192 220 -251 287 -326 368
29 368 -416 468 -526 590 -659 737 -820 913 -1012 1121 -1243 1378 -1525 1689 -1870 2073
45 2073 -2298 2556 -2850 3186 -3577 4040 -4601 5287 -6158 7303 -8882 11209 -14997 22204
59 22204 -40859 188928 372772 -69443 -139241 84326 184855 -18056 -58920 86212 118183
70 118183 -57827 -108937 -5680 47473 -3810 11187 23666 -84909 -195927 -95735 72246
81 72246 65154 -67882 -87587 -10953 7154 -27488 11430 87418 87668 21499 -17709 -20034 -1963
94 -1963 54858 122894 96590 -22052 -79026 4071 93289 60044 -20081 -24545 4825 -30288
106 -30288 -89407 -69542 6207 35101 -6801 -63698 -96581 -80973 432 84743 60609 -48912
118d8912l2778Q7442N3934n4613k6530Q5743N0731r6474j01491N1081J12080P991
130H8204p2730m4701j3570j3937K4658O6139J4846o5634m3714K8631J5379l8116
142e4545M55Q0939M4655p4384r3928J6839J00997N8226l3734o3169k1078K5068
154a3659K7218K282k61K2271J8198l1341o0635j6720N2603O2754J925o3001o4910
167f3276j422N7559M3558j7545l8617k153J4269j8161k6617K6732O4724K0119
179E9170n0289n7699n612M5093N7184K1584l8634n7543n525M4256K1201k1170
191A2016m369K9468l266n7506l4851M2944O4445J1607l8152m4246k1712J4747
203b8875M5744K5929l2049m6305L542K9541j1119k9094L1691P0879K47q5150n3896
$$ plain form
118 -48912 -81690 5752 59686 5073 -21457 64286 115017 18543 -82948 -31867 80213 88204
130 88204 15474 -29227 -42797 -56734 -32076 34063 48909 -16725 -60439 -31808 -16429 -54545
142 -54545 -54090 26849 71504 -2880 -96808 -79969 21028 79254 45520 -17649 -38727 -13659
154 -13659 13559 15841 15580 37851 56049 24708 -35927 -52647 -44 62710 64635 1634 -63276
167 -63276 -64698 -7139 36419 18874 -19743 -21896 -7627 -25788 -52405 -25673 39051 59170
179 59170 8881 -48818 -54430 -9337 47847 69431 30797 -26746 -32271 11985 33186 12016
191 12016 7647 37115 33849 -23657 -58508 -15564 48881 60488 22336 -21910 -43622 -28875
203 -28875 16869 42798 10749 -35556 -32014 -2473 -13592 -42686 -10995 59884 60131 -25019 -78915
216g8915M8381P5668R275m1901k5928N621J1146P316J1533R541n12q252k0229
229B744l3553j4741M0436N9384m553p3385m9531L1304N5198Q403k5631r312P341
242e896o985j8057J10K4777K9240P705k8724m6457r305N4197O1723m135n7231
255I62l0857J9884K4434j682l487J2301N175k1595l2557j3693K3084M4579J9220
268D5768m0810o5755j2721N3967M6114j5976l8031k60K3110k373j9711J0903M4901
281B9126K5088k8758n2576j7175L9045N3560J0549l9516m0606r31K4284J0248
293A2338q941k651J0435J019k5918k9693O801M5467L4291k3333o0664k5480M0958
306b5371N3961M057l1242j1793J4655J921k0261k639L3548L1274r936m0556k4917
$$ plain form
216 -78915 -30534 45134 54409 12508 -13420 -7799 3347 10663 22196 31737 31225 22973 2744
229 2744 -30809 -45550 -5114 54270 49717 -23668 -73199 -41895 13303 21706 -3925 -13237 -5896
242 -5896 -12881 -30938 -30828 -6051 23189 30894 2170 -44287 -53592 605 62328 58193 962
255 962 -29895 -10011 14423 12741 9254 21555 26730 5135 -27422 -41115 -18031 26548 45768
268 45768 4958 -60797 -73518 -19551 26563 10587 -27444 -27704 -4594 -6967 -26678 -15775 29126
281 29126 54214 25456 -27120 -44295 -5250 48310 58859 19343 -21263 -22194 2090 12338
293 12338 3397 746 11181 12200 -13718 -43411 -36610 8857 43148 19815 -40849 -66329 -25371
306 -25371 28590 32647 1405 -10388 4267 6188 -14073 -16712 16836 48110 38174 -2382 -27299
319b7299J5808M0856K6901j6129m5068k7392J4943K6872l7j6845L523J5682j4076
332b261l9973q564M4836M6744q756m8451l1117J6329M1413K5943q078k3259r154
345d348R870M637j0894K164L0587K0652l0975n4303q615M6256M0309j0164m2064
358f888k8654L731K3900J6425l890j0171L029N743k0396l0758J0799N7205K9921
371D9996m2922n6847O729N5165K9709j5193j9319j097m58p978j537J0336J2576
384A9160Q272o588l1612l4848J0511N5374K7581m3359n6251L982M1720J0915k1809
397a6952M24K4717J347l1186j7746K3044L8574J9063j2213l4587k7826J3028M6036
410B5723K2655k8415l3873N382J9527q823j6918J6976L1953p067m5747l0029J4014
$$ plain form
319 -27299 -11491 29365 56266 40137 -4931 -32323 -17380 9492 9455 -7390 -3867 11815 -2261
332 -2261 -42234 -50798 -5962 40782 32026 -16425 -47542 -31213 10200 36143 28065 4806 -4348
345 -4348 5522 10159 -735 1429 32016 52668 21693 -32610 -41225 5031 45340 35176 -6888
358 -6888 -35542 -31811 -7911 8514 4624 -5547 -2518 3225 -17171 -47929 -37130 20075 49996
371 49996 7074 -49773 -43044 12121 41830 26637 7318 6221 5763 -2215 -3752 6584 19160
384 19160 27432 20844 -10768 -45616 -35105 20269 47850 4491 -51760 -47778 -6058 4857 -16952
397 -16952 -16528 8189 9536 -21650 -39396 -16352 22222 41285 29072 -5515 -33341 -20313 25723
410 25723 48378 19963 -13910 -8528 10999 2176 -14742 2234 34187 27120 -18627 -48656 -34642
423c4642L5176K2811p043l3565k8770J0483L7797J5396j8164r395J8939M752l0507
436a6732j3958M0375M8252q688m9010k4767J6621K7749J5387j983k0204k5103
448a2061l793J4709J374j3016O888K4251r600n0542k0648M9007N5750r424m9821
461a6926j9551K1094K0109M056L857M079l153o999m695n388M789K7221K5348k0985
475C2856n4771k0501M0507M1996j0405l7420j1284J1509L24j0838K326J7641J0116
488A2056j2750k8064j7778J5112M3192K5966k3227m2062m672L4652K4267p499
500A9193r007Q966M235j9707j9567R045K8540J4832j5242l4715k4597J0285L7321
513I582K0668k2086l4203n659J8316M778j0870M041K4849P486k8760k9217J1530
$$ plain form
423 -34642 534 23345 16302 -17263 -46033 -35550 2247 17643 -521 -9916 9023 13775 -16732
436 -16732 -30690 9685 57937 49249 239 -24528 -7907 19842 35229 33246 13042 -12061
448 -12061 -15854 -1145 229 -12787 -5899 18352 8752 -41790 -62438 -13431 42319 32895 -16926
461 -16926 -36477 -15383 4726 8782 12639 16718 13565 6566 1871 -3517 1272 28493 53841 32856
475 32856 -21915 -42416 -1909 40087 29682 -7738 -19022 -7513 -7189 -18027 -15701 1940 12056
488 12056 -694 -28758 -46536 -31424 11768 37734 14507 -27555 -32227 2425 26692 19193
500 19193 10186 19152 23387 3680 -15887 -6842 21698 36530 21288 -13427 -38024 -27739 9582
513 9582 30250 8164 -26039 -31698 -13382 -8604 -19474 -15433 9416 16902 -11858 -41075 -29545
526b9545M2980K6130j4911l4513j7215J3458K4748J1300q273r099J64n92j1191
539f559q054J5655K8657L366l4660l8170K380L7573K5751j3196l0722j0242J2763
552a5458J0614l154J19J5625J1716j4097k8785p381K8360L6595M242l2509l0414
565b4527N495L0377J6561j0049j3682J494K254j2966j4491R718K7850J2264k1682
578H616l3272r359K4604L2008M801k5266k4125L052J6742L273q347O141J8352
591A7220r80k9262j9064J9928L8618J3770k2295k9980q036J7984K2368M571j3407
604A1435j1260L014J854j2703p591J9020K7203p371m1193k6525J8670L7177J2078
617B3808j9180k3158l582J1793R335q6J217J0185N777j5752k4995n30L3057L0998
$$ plain form
526 -29545 13435 39565 24654 -9859 -27074 -13616 11132 22432 14159 5060 5224 4632 -6559
539 -6559 -14613 1042 29699 33065 -1595 -39765 -37385 188 25939 12743 -17979 -28221 -15458
552 -15458 -4844 -7998 -7879 7746 19462 5365 -23420 -30801 -2441 34154 38396 5887 -24527
565 -24527 -19032 11345 27906 17857 4175 5669 7923 -5043 -19534 -9816 18034 30298 8616
578 8616 -24656 -34015 -9411 22597 27398 2132 -21993 -18941 -2199 1074 -7273 -1132 17220
591 17220 16240 -13022 -32086 -12158 26460 40230 17935 -12045 -20081 -2097 20271 24842 11435
604 11435 175 3189 5043 -7660 -15251 3769 30972 23601 -17592 -44117 -25447 11730 23808
617 23808 4628 -18530 -22112 -10319 -984 -1070 147 10332 16109 357 -24638 -25168 7889 38887
631C8887r852l6120j8619J6356K6501O966j1289j0634r14k63r952q756R785K3229
645A5325N690k7119l2999Q71L3359K5328q528k6305j2712R218J4097L649j861
658a987O139J0462k874k0767j2574K0790L6299O013l1895l1230K752K3974J3187
671A8289o264j1803o227j376k751m641J291J4581J6158q734l4068j9542K5152
684a9935L9868N350k8656j8773J0258J4672K449O58P919N837m704j3148j2659
697a0864K116K3948K4946j0663m1911k0618K6953L1434o289k5448l724R829o801
710g092j7269M228K1926J2270p965j7658j4738K786K8387K9469p578l5534j2291
723b1059K4652J8026j1602q971J6412J0280k2362k4778P859K6875J2204r103j9507
$$ plain form
631 38887 29035 -7085 -25704 -9348 17153 24119 12830 2196 1282 1019 -8933 -17689 -7904 15325
645 15325 21015 -6104 -39103 -38232 -4873 20455 11927 -14378 -27090 -17872 -3775 -126 -1987
658 -1987 4152 14614 11740 -9027 -21601 -811 35488 41501 9606 -21624 -18872 5102 18289
671 18289 12025 222 -6005 -7381 -10132 -14773 -13482 1099 17257 8523 -25545 -45087 -19935
684 -19935 19933 25283 -3373 -22146 -11888 2784 5233 5891 13810 19647 14943 1795 -10864
697 -10864 -8748 15200 40146 29483 -12428 -33046 -6093 25341 19052 -6396 -10120 -291 -7092
710 -7092 -24361 -20133 1793 14063 6098 -11560 -26298 -23512 4875 34344 26766 -8768 -21059
723 -21059 3593 21619 10017 1046 17458 27738 5376 -19402 -11543 15332 27536 18433 -1074
736a074k1268m619K2875K3835q224k7472l884J7239k2j7430N405L0535R852k9328
750c580k7576Q984K8122J6522j506j3300j7570k921J8216J5709q000j1538P428
763H990P326k0212k4220J3535L6978O870l3709k8749O239K2282J0511j825o358
776b342q574m007N136L281j750O600J7646K055k7207k2271J9524L9309P099k8129
790F370k2375N881J3247K128k728K509K637m008r401r806l7J7938K0445o543l3068
805a6811k0311J8844L0408L401j8350r588P244L853o058r84J3768J3908k942j8536
819b154j6806M793K4417J9626q238k6043j3751J1661J6920L78q948n88O015n171
833B111j6947o989J8473K3738j097k5720j9123Q025K3585J2759o443j3499n501
$$ plain form
736 -1074 -22342 -26961 -4086 19749 11525 -15947 -19831 -2592 -2614 -20044 -14639 15896 25748 -3580
750 -3580 -31156 -22172 5950 22472 20966 7666 -9904 -12825 5391 21100 13100 1562 8990
763 8990 16316 -3896 -28116 -14581 22397 29267 -4442 -33191 -26952 -4670 5841 4016 -2342
776 -2342 -10916 -14923 -9787 -6506 -8256 -1656 15990 18045 -9162 -31433 -11909 27400 34499 6370
790 6370 -16005 -10124 3123 5251 2523 5032 7669 3661 -5740 -15546 -15583 2355 22800 16257 -16811
805 -16811 -37122 -18278 12130 15531 -2819 -12407 -5163 -1310 -7368 -8352 5416 19324 16382 -2154
819 -2154 -18960 -14167 10250 29876 21638 -4405 -18156 -6495 10425 10803 1855 1267 7282 2111
833 2111 -14836 -21825 -3352 20386 19289 -6431 -25554 -17529 6056 18815 12372 -1127 -6628
846f628M206L310k918j97J1135J2116r110k5873q916K4146K7600m294k6590j4845
860a6858Q219J1283K467j295Q0l87l725o884p161K942J8793J5225j2240l0463
874b0004q869K5196K4490n725j8490l037Q060r66n863L612J2664O377q277j6255
888g087j1845N697K1562J5382j3152k7559p343J9915J5014o981r424N998O192
901F369j1189j5802M748K2614J3341r549j9949j1104P831K0943J1716j0413j9061
914i505k047J2104K391r334J676J7729M863k0985k0768O606K3888J2191r167j6709
928g067j0612M023J3468Q303n933p355M215M899r999j0867J2087K5224L989k4800
942d25k0862O880K0881R988n869j1111n651K271M458j11j844N448Q947n557k1061
$$ plain form
846 -6628 -2422 888 -2030 -2227 8908 21024 11914 -13959 -22875 1271 28871 24577 -2013 -16858
860 -16858 -8639 2644 5111 3816 3896 3509 -216 -7100 -14261 -11319 7474 22699 10459 -20004
874 -20004 -28873 -3677 20813 15088 -3402 -6439 1621 655 -5208 -1596 11068 17445 9168 -7087
888 -7087 -18932 -13235 8327 23709 10557 -17002 -24345 -4430 10584 3603 -5821 177 6369
901 6369 -4820 -20622 -15874 6740 20081 10532 -9417 -20521 -12690 8253 19969 9556 -9505
914 -9505 -11552 552 2943 -6391 -4715 13014 17877 -3108 -23876 -17270 6618 18809 9642 -7067
928 -7067 -17679 -13656 -188 8115 2182 -5173 -958 3941 -6058 -16925 -4838 20386 24375 -425
942 -425 -21287 -14407 6474 16462 10593 -518 -6169 -3898 560 449 -1395 4053 13000 7443 -13618
957a3618j0663J7533K5287J977k0465j6528M043J4377O821l477l548Q12P55n689
971b383p619L278J7114J2824j0723k3868r040J7065K1442J326j6201j0897L788
984c894N550k335m289O263J0294k668j6914j2767Q813K1737J1106j1530k0478
997a1112o597J2044J4104N51p061j410M408j306r879l310J3764J5873l698k2530
1011f159j5852Q397K2238Q829j0520j5011j816O503K098k685J346P723L208j0314
1025b015j4352j388J6735J8406k140k0101j4976P244J8196O077p718n092L989
1038B865R23q747o346Q264J6190L695j5498j8224j280J7235J6539k979j7357r743
1052a4463N493O921j624k758O949Q659m673j5352p566J2933K0055M658j5305j8014
$$ plain form
957 -13618 -24281 -6748 18539 20516 51 -16477 -12434 1943 8764 5287 1739 2551 3306 -2383
971 -2383 -10002 -6724 10390 23214 12491 -11377 -20417 -3352 18090 19416 3215 -7682 -3894
984 -3894 1656 -679 -4968 1295 11589 8921 -7993 -20760 -11947 9790 20896 9366 -11112
997 -11112 -17709 -5665 8439 8990 1929 519 4927 3621 -6258 -9568 4196 20069 16371 -6159
1011 -6159 -22011 -13614 8624 17453 6933 -8078 -9894 -3391 -1293 -3978 -2632 5091 8299 -2015
1025 -2015 -16367 -17755 -1020 17386 15246 -4855 -19831 -12587 5609 11686 3968 -1124 2865
1038 2865 3788 -4959 -11305 -3041 13149 16844 1346 -16878 -18158 -923 15616 12637 -4720 -14463
1052 -14463 -8970 -2049 -3673 -6431 518 9177 4504 -10848 -18414 -5481 14574 19232 3927 -14087
1066a4087p35J4956J2071k539q389j490M041l159q834O61J4412J1695r298k1530
1080a2225p982J3452J8697K345j2948j1252m34O435L807Q25R70M113J265r186
1094b118j2003J893K0062J5230r885k2113o689J4771J4454j462p402k799Q16l177
1108d22n521N03Q730Q988j040j3364j4824J739J9096J4631r661j9048m368J1699
1122b862O114m076o28P780L952j0173j1979R00J4423J3669m46j5444j4587K802
1136a0555J6639R511q191j0408J189M840m929p328N679J4453K133j4781j5692
1149a7440j49J3472J2921L31j1770j1466K295J1504M917n609j196Q584Q71j4220
1163f955r877J2742K1629K806j7588j4034J631J0475P992j61o221o632o93K120
$$ plain form
1066 -14087 -14822 134 12205 9666 1277 -213 3828 669 -8165 -7504 6908 18603 9305 -12225
1080 -12225 -20207 -6755 11942 14287 1339 -9913 -10347 -3912 -105 720 1690 5803 7068 -2118
1094 -2118 -14121 -12228 7834 23064 13179 -8934 -15623 -852 13602 12140 4738 1939 2755 -422
1108 -422 -5943 -5440 3290 12278 11238 -2126 -16950 -15211 3885 18516 8855 -10193 -14561 -2862
1122 -2862 3252 -824 -1452 6328 10280 107 -11872 -10972 3451 17120 16674 1230 -13357 -10555
1136 -10555 6084 15595 7404 -3004 -1815 3025 -1904 -9232 -3553 10900 13033 -1748 -17440
1149 -17440 -17589 -4117 8804 9135 -2635 -14101 -11806 -302 4615 -994 -2190 6394 7265 -6955
1163 -6955 -16832 -4090 17539 20345 2757 -11277 -9646 829 8821 8660 2439 -4193 -4886 -2766
1177b766j304l347O424J1087l303k0288j1235J3677K1364K803j4507j0537K856
1190i076P153L564K15M72L096O01n169p899P42J5088J3001p162k1294r413J1699
1205d382J4640o30r350m268J677K0m132p13N627P489k24j1255j2663K876J8450
1220C162J3973p252j6508m338J0755Q305k249l287M290L851n740r780j505J1103
1234D780J1633k185j4591j2754K227J3851Q186n201j0740k252M215l0m953R76
1248f838J0410O985q452j5149k091J6044J5059j264j4619r021M671R265K465k934
1262D531p21K731m07q191p081M285J3118O221j1411j7398l197J3624J2483k852
1276E735j0381l077L639J406l077k15P802P798k478j2420q308P142J6815O685
$$ plain form
1177 -2766 -4070 -7417 -993 10094 6791 -13497 -24732 -11055 10309 13112 -1395 -11932 -9076
1190 -9076 -1923 1641 1856 2328 5424 6025 856 -7043 -6301 8787 21788 14626 -6668 -16081 -4382
1205 -4382 10258 9628 278 -3990 -2313 -2293 -6425 -7138 -1511 5978 5754 -5501 -18164 -15288 3162
1220 3162 17135 9883 -6625 -10963 -208 8097 5848 2561 6851 10702 4962 -4818 -6323 4780
1234 4780 16413 14228 -363 -13117 -10890 2961 11147 5946 -4794 -7046 -2831 -2861 -7814 -6838
1248 -6838 3572 10557 2105 -13044 -15135 909 15968 14704 85 -8936 -4265 5000 7465 4531
1262 4531 3810 6541 6134 -2057 -9138 -4853 8265 14486 3075 -14323 -17520 -3896 8587 5735
1276 5735 -4646 -7723 -4084 -2678 -5755 -5970 1832 9630 7152 -5268 -13576 -6434 10381 17066
1290A7066j1685j5222p1J1210N361m119l457L601J441p504q821J711J1859Q397
1304I767l986j3453q620O426J5015O283r682r936K049P646j299n310L993J1697
1318A0590J222j2902j1340L930J3387Q078m951j1544o792M195R108K075n353k140
1332b437M361j30q794n063J0023J3746K37j3295j0719K596J2308P808k796q662
1346h17l849M479L185l156k651P621P806o734j5402m331J2990J3129j506j1588
1360h24p627J587O685N122q43l490m43J749k528p000J134J3183R913r100j6895
1375i377l338J2221J1515j830q711l945J457K323k66j306K802N326o72j0464r028
1390a3293N304J5778O586r747j2837j575P974N824j064k172r9J137j584n044k123
$$ plain form
1290 17066 5381 -9841 -9912 1298 6659 2540 -917 2684 4125 -3379 -12200 -10489 1370 9767
1304 9767 5781 -7672 -16292 -9866 5149 11432 1750 -8186 -6137 1509 210 -5100 -1107 10590
1318 10590 11812 -1090 -12430 -8500 4887 12965 8014 -3530 -10322 -6127 2981 5056 -297 -2437
1332 -2437 1924 1794 -7000 -12063 -2040 11706 11943 -1352 -12071 -9475 2833 10641 7845 -817
1346 -817 -4666 -187 2998 -158 -2809 4812 12618 5884 -9518 -13849 -859 12270 10764 -824
1360 -824 -8451 -6864 -179 4943 4100 610 167 1916 -612 -7612 -6478 6705 16618 7518 -9377
1375 -9377 -12715 -494 11021 9191 480 -3465 -2008 315 49 -1257 1545 6871 6199 -4265 -13293
1390 -13293 -7989 7789 14375 4628 -8209 -9784 -1810 4014 2950 778 679 1816 232 -4812 -6935
1405f935P212J1119q66j5406j1236P727J5523L642r551o416J952K275k075r97
1419d032M440M955l48o096q047j181R359J1836r1j4166r651N993J1276R15n688
1434e26n69M105k020p093k554P852R283P93r148j0986j364J0939J1694j500j1209
1449b303m357M468L626l431j075O596M644n423j0172k729P741J1053K810q734
1463B714j2388j542J0090Q602k957o154J507M056l664q267K337J2279O589q404
1477D798j2563j906Q416J0378J428p046p742n80M698J764j514P36M369J450q858
1492b172r655L406J4268P693q266j3350k245Q411P838r97l975m15J714j490m400
1507c635j76P430P490j713j1284q177L745J1892O586o392r871k668M795K572k148
$$ plain form
1405 -6935 277 11396 10530 -4876 -16112 -8385 7138 10780 1229 -5187 -3235 -960 -3035 -4032
1419 -4032 408 5363 5015 -1081 -9128 -10309 -950 10886 10795 -3371 -13022 -7029 4247 5162 -526
1434 -526 -1095 3010 990 -6103 -8657 -805 8478 9271 123 -10863 -12227 -1288 10406 8906 -2303
1449 -2303 -6660 -2192 1434 -1997 -3072 3524 8168 2745 -7427 -10156 -2415 8638 11448 2714
1463 2714 -9674 -11216 -1126 7476 4519 -1635 -128 3928 264 -8003 -5666 6613 13202 4798
1477 4798 -7765 -9671 -1255 9123 10551 3505 -4237 -4817 -119 1645 131 867 5236 6686 -2172
1492 -2172 -11827 -8421 5847 13540 5274 -8076 -10321 -1910 5928 4931 956 541 2255 765 -3635
1507 -3635 -3811 3619 11109 9396 -1888 -10065 -6320 5572 12158 5766 -4105 -6773 -1978 594 -1554
1522a554O0M250K333n719r182p84J0268J0122j800j1307p726L805J0410M706m521
1537C361m547J134J977l892l826M674R856K403j0086j0975q9J0190Q269j712q611
1552a874o229K013N360J300k865L30M623j067q995o080Q480J4259J957j1951r082
1567i821K340Q460M584m32k668k245l40M50j426j238M919P146k706j3251p772
1582a4000R324J3602K79j0567o839J980M483N24j86J328J785n57l998m844J162
1597f524R437R809m152j3097n556R077J0893r09p190j257K031m98l405n05M775
1612B929M641j021q401q435O81J1277Q530n481j1729l172P660M689l461j937M856
1627A626M186n039p094J164R525P222j308r320p097J933R075N615l677p381j028
$$ plain form
1522 -1554 -1494 2756 5089 -630 -9812 -10596 -328 9794 7994 -3313 -11039 -7234 3176 7882 3361
1537 3361 -1186 -52 1925 -1967 -5793 -1119 8737 11140 1054 -9921 -10010 180 8449 6737 -1874
1552 -1874 -8103 -6090 -730 570 -2295 -1965 2658 1591 -7404 -13484 -5004 9255 11212 -739 -9821
1567 -9821 -7481 979 5563 5131 2463 218 -122 328 -1098 -2336 2583 9729 7023 -6228 -14000
1582 -14000 -4676 8926 9205 -1362 -8201 -6221 -1738 -1214 -1400 -72 1713 1156 -2842 -7686 -6524
1597 -6524 2913 12722 8570 -4527 -10083 -1006 9887 8978 1788 531 2562 2064 -1341 -1846 2929
1612 2929 7570 6549 -1852 -10287 -9606 1671 10201 4720 -7009 -10181 -2521 2168 -1293 -3230 1626
1627 1626 5812 773 -6321 -5157 4368 11590 10282 962 -6135 -4202 4873 10488 6811 -570 -1598
1642a598L357j069n148P57P753L155q164j0748RJ0183P855j848p813n837K418
1657f738O501K768j489n85K822M30n365m432N126J0669L010q709r861o52Q207
1672A702N857j450o287l846Q23J734j439j888L043M890j510r557n882O825J2083
1687E098K816q015p571J509O313L506j408p56K009J114l483m740M25P070O413
1702A0300l756j0992n271N139R686J457o934n421J907L041k401k321L169O644
1716D247O22p649p060K418J0237O747l667q606k982N141N311K85k871j6K076j686
1732B547n599j822N922P023n13q917p673J940Q143M699k773o313j181L153J265
1747i9k050M25N592L629n075p869r83Q002P791q46q052n632J159N919K857k208
$$ plain form
1642 -1598 1759 690 -4458 -3701 4052 7207 -957 -11705 -11696 -1513 6342 4494 -3319 -9156 -6738
1657 -6738 -237 2531 1042 457 3279 3709 -1656 -6088 -962 9707 12717 4008 -5853 -6505 1702
1672 1702 7559 6109 -178 -4024 -3201 -1467 -2906 -4794 -1751 3139 1629 -7928 -13810 -6985 5098
1687 5098 7914 -101 -7672 -6163 150 3656 2248 1492 3501 4615 1132 -3608 -3183 3887 10300
1702 10300 6544 -4448 -9719 -4580 5106 6563 -371 -5792 -3885 -844 -3245 -5566 -2397 4247
1716 4247 4869 -2780 -9840 -7422 2815 9562 5895 -2711 -5693 -552 4759 5044 2173 2157 4233 2547
1732 2547 -3052 -4874 1048 8071 7558 -1359 -9032 -7092 1051 5750 2977 -3336 -4517 -1364 -99
1747 -99 -2149 -1724 3868 7497 2422 -5447 -6430 1572 9363 8517 465 -5167 -4008 1911 4768 2560
1763B560k678J139J010l478m498K645Q350M055o422r638j599P580P527q93o005
$$ plain form
1763 2560 -118 1021 2031 -1447 -5945 -3300 5050 9105 2683 -6955 -8554 -974 6553 5660 -345
$$ [...]
8191b7
##END NTUPLES=NMR FID
##END=
