##TITLE=1H_SAV-70(f6)
 CDCl3, 8 sc, 
 10.7.2020
##JCAMPDX= 6.0         $$ Bruker NMR JCAMP-DX V2.0
##DATA TYPE= NMR FID
##DATA CLASS= NTUPLES
##ORIGIN= UXNMR, Bruker Analytische Messtechnik GmbH
##OWNER= root
$$ XWIN-NMR		Version 3.5
$$ Fri Jul 10 10:31:20 2020 Russian Standard Time (UT+4h)  she@DPX200
##.OBSERVE FREQUENCY= 200.1315
##.OBSERVE NUCLEUS= ^1H
##.DELAY= (6, 6)
##.ACQUISITION MODE= SIMULTANEOUS
##.ACQUISITION SCHEME= undefined
##.AVERAGES= 8
##.DIGITISER RES= 18
##SPECTROMETER/DATA SYSTEM= spect
##.PULSE SEQUENCE= zg30
##.SOLVENT NAME= CDCl3
##.SHIFT REFERENCE= (INTERNAL, CDCl3, 0, 15.7039)
##AUDIT TRAIL= $$ (NUMBER, WHEN, WHO, WHERE, WHAT)
$$ ##TITLE= Audit trail, XWIN-NMR		Version 3.5
$$ ##JCAMPDX= 5.01
$$ ##ORIGIN= Bruker BioSpin GmbH
$$ ##OWNER= she
$$ F:/spectra/data/she/nmr/H-F/1/audita.txt
$$ ##AUDIT TRAIL=  $$ (NUMBER, WHEN, WHO, WHERE, WHAT)
(   1,<2020-07-10 10:30:30.75 +0400>,<she>,<DPX200>,
      <created by zg, POWCHK disabled, PULCHK disabled
       configuration hash MD5:
       00 E9 B6 7A A2 85 ED C7 34 08 36 98 17 FE 4E 26
       data hash MD5: 16K
       27 52 B6 90 AC 21 09 01 A6 61 1C 2D EF DD BE D1>)
$$ ##END=
$$ 
$$ hash MD5
$$ B9 C2 51 93 24 2F DF 39 C6 07 B5 DB 16 1E 46 F4
##$RELAX= 
##$RELAX= 
##$RELAX= 
##$RELAX= 
##$RELAX= 
##$RELAX= 
$$ Bruker specific parameters
$$ --------------------------
##$DU= <F:/spectra>
##$EXPNO= 1
##$NAME= <H-F>
##$PROCNO= 1
##$TYPE= <nmr>
##$USER= <she>
##$AMP= (0..31)
100 100 100 100 100 100 100 100 100 100 100 100 100 100 100 100 100 100 
100 100 100 100 100 100 100 100 100 100 100 100 100 100 
##$AQSEQ= 0
##$AQ_mod= 1
##$AUNM= <au_zg>
##$AUTOPOS= <>
##$BF1= 200.13
##$BF2= 200.13
##$BF3= 200.13
##$BF4= 200.13
##$BF5= 200.13
##$BF6= 200.13
##$BF7= 200.13
##$BF8= 200.13
##$BYTORDA= 1
##$CFDGTYP= 0
##$CFRGTYP= 5
##$CHEMSTR= <none>
##$CNST= (0..31)
1 1 145 1 1 1 1 1 1 1 1 1 1 1 1 1 1 1 1 1 1 1 1 1 1 1 1 1 1 1 1 1 
##$CPDPRG= <>
##$CPDPRG1= <>
##$CPDPRG2= <>
##$CPDPRG3= <>
##$CPDPRG4= <mlev>
##$CPDPRG5= <mlev>
##$CPDPRG6= <mlev>
##$CPDPRG7= <mlev>
##$CPDPRG8= <mlev>
##$CPDPRGB= <>
##$CPDPRGT= <>
##$D= (0..31)
0 1.2 0 0 0 0 0 0 0 0.06 0 0.03 0 0 0 0 0.0002 0 0 0 0 0 0 0 0 0 0 0 0 
0 0 0 
##$DATE= 1594362630
##$DBL= (0..7)
120 120 120 120 120 120 120 120 
##$DBP= (0..7)
150 150 150 150 150 150 150 150 
##$DBP07= 0
##$DBPNAM0= <>
##$DBPNAM1= <>
##$DBPNAM2= <>
##$DBPNAM3= <>
##$DBPNAM4= <>
##$DBPNAM5= <>
##$DBPNAM6= <>
##$DBPNAM7= <>
##$DBPOAL= (0..7)
0.5 0.5 0.5 0.5 0.5 0.5 0.5 0.5 
##$DBPOFFS= (0..7)
0 0 0 0 0 0 0 0 
##$DE= 6
##$DECBNUC= <off>
##$DECIM= 24
##$DECNUC= <off>
##$DECSTAT= 4
##$DIGMOD= 1
##$DIGTYP= 9
##$DL= (0..7)
0 120 120 120 120 120 120 120 
##$DP= (0..7)
150 150 150 150 150 150 150 150 
##$DP07= 0
##$DPNAME0= <>
##$DPNAME1= <>
##$DPNAME2= <>
##$DPNAME3= <>
##$DPNAME4= <>
##$DPNAME5= <>
##$DPNAME6= <>
##$DPNAME7= <>
##$DPOAL= (0..7)
0.5 0.5 0.5 0.5 0.5 0.5 0.5 0.5 
##$DPOFFS= (0..7)
0 0 0 0 0 0 0 0 
##$DQDMODE= 0
##$DR= 18
##$DS= 0
##$DSLIST= <SSSSSSSSSSSSSSS>
$$ [...]
##$SUBNAM2= <"">
##$SUBNAM3= <"">
##$SUBNAM4= <"">
##$SUBNAM5= <"">
##$SUBNAM6= <"">
##$SUBNAM7= <"">
##$SUBNAM8= <"">
##$SUBNAM9= <"">
##$SW= 24.9337058887773
##$SWIBOX= (0..15)
0 0 2 0 0 0 0 0 0 0 0 0 0 0 0 0 
##$SW_h= 4990.01996007984
##$TD= 16384
##$TD0= 1
##$TE= 0
##$TE2= 300
##$TE3= 300
##$TEG= 300
##$TL= (0..7)
0 120 120 120 120 120 120 120 
##$TP= (0..7)
150 150 150 150 150 150 150 150 
##$TP07= 0
##$TPNAME0= <>
##$TPNAME1= <>
##$TPNAME2= <>
##$TPNAME3= <>
##$TPNAME4= <>
##$TPNAME5= <>
##$TPNAME6= <>
##$TPNAME7= <>
##$TPOAL= (0..7)
0.5 0.5 0.5 0.5 0.5 0.5 0.5 0.5 
##$TPOFFS= (0..7)
0 0 0 0 0 0 0 0 
##$TUNHIN= 0
##$TUNHOUT= 0
##$TUNXOUT= 0
##$USERA1= <user>
##$USERA2= <user>
##$USERA3= <user>
##$USERA4= <user>
##$USERA5= <user>
##$V9= 5
##$VALIST= <valist>
##$VCLIST= <CCCCCCCCCCCCCCC>
##$VD= 0
##$VDLIST= <DDDDDDDDDDDDDDD>
##$VPLIST= <PPPPPPPPPPPPPPP>
##$VTLIST= <TTTTTTTTTTTTTTT>
##$WBST= 1024
##$WBSW= 4
##$XGAIN= (0..3)
0 0 0 0 
##$XL= 0
##$YL= 0
##$YMAX_a= 251398
##$YMIN_a= -142163
##$ZGOPTNS= <>
##$ZL1= 120
##$ZL2= 120
##$ZL3= 120
##$ZL4= 120
##$ABSF1= 10
##$ABSF2= 0
##$ABSG= 5
##$ABSL= 3
##$ALPHA= 0
##$AQORDER= 0
##$ASSFAC= 0
##$ASSFACI= 0
##$ASSFACX= 0
##$ASSWID= 0
##$AUNMP= <proc_1d>
##$AZFE= 0.1
##$AZFW= 0.1
##$BCFW= 1
##$BC_mod= 2
##$BYTORDP= 1
##$COROFFS= 0
##$CY= 11.3945322036743
##$DATMOD= 1
##$DC= 2
##$DFILT= <>
##$DTYPP= 0
##$F1P= 16.9975609425685
##$F2P= -3.02152046262296
##$FCOR= 0.5
##$FTSIZE= 0
##$FT_mod= 4
##$GAMMA= 1
##$GB= 0.15
##$INTBC= 1
##$INTSCL= 1
##$ISEN= 128
##$LB= 0.24
##$LEV0= 0
##$LPBIN= 0
##$MAXI= 10000
##$MC2= 0
##$MEAN= 0
##$ME_mod= 0
##$MI= 1.114404
##$NCOEF= 0
##$NC_proc= 0
##$NLEV= 6
##$NOISF1= 3.799351
##$NOISF2= 2.8
##$NSP= 1
##$NTH_PI= 0
##$NZP= 0
##$OFFSET= 15.70392
##$PC= 1
##$PHC0= -9787.797
##$PHC1= 7.200921
##$PH_mod= 1
##$PKNL= yes
##$PPARMOD= 0
##$PSCAL= 0
##$PSIGN= 0
##$REVERSE= no
##$SF= 200.130013532006
##$SI= 16384
##$SIGF1= 3
##$SIGF2= 2
##$SINO= 400
##$SIOLD= 16384
##$SREGLST= <1H.CDCl3>
##$SSB= 0
##$STSI= 0
##$STSR= 0
##$SW_p= 3612.71676300578
##$SYMM= 0
##$S_DEV= 0
##$TDeff= 0
##$TDoff= 0
##$TI= <>
##$TILT= no
##$TM1= 0
##$TM2= 0
##$TOPLEV= 0
##$USERP1= <user>
##$USERP2= <user>
##$USERP3= <user>
##$USERP4= <user>
##$USERP5= <user>
##$WDW= 1
##$XDIM= 8192
##$YMAX_p= 0
##$YMIN_p= 0
$$ End of Bruker specific parameters
$$ ---------------------------------
##NTUPLES= NMR FID
##VAR_NAME=  TIME,          FID/REAL,        FID/IMAG
##SYMBOL=    X,             R,               I
##VAR_TYPE=  INDEPENDENT,   DEPENDENT,       DEPENDENT
##VAR_FORM=  AFFN,          ASDF,            ASDF
##VAR_DIM=   8192,          8192,            8192
##UNITS=     SECONDS,       ARBITRARY UNITS, ARBITRARY UNITS
##FACTOR=    0.0002004,     1,               1
##FIRST=     0,             0,               0
##LAST=      1.6414764,     0,               0
##MIN=       0,             -142163,         0
##MAX=       1.6414764,     251398,          0
$$ Real data points
##PAGE= N=1
##DATA TABLE= (X++(R..R)), XYDATA
0@%%%%%%%%qJ6j6J6k4L2l2M0m9N7p1Q6j02J18j35J55j78K06k37K70l06L46l92
31b08M42m96N56o22O96p77Q64r59J063j178J304j443J597j768J959k174K416k692
49a420L009l378L812m329M965n768O817q254J0355j3754K0372n5368K05210M3249
63B05518l09507p303K43930K4059k54900l2992K11050M0665k00643l8084J71356
74E3149N2964j36201k9704J04723k010j20124P255J25879K5073r3374k4321N3075
86A6384M710l5790J5752K7311k3846j3699L5463l205n4227P149O3279k4770r2120
99g7609J6590J09855L443r4863J0049J05920q856j03205K2428J17435k8290j43050
111g0153L555J30967j2548j46474j222J54236L1713j25175k1099J23002K2403
$$ plain form
0 0 0 0 0 0 0 0 0 0 -8 8 -8 8 -16 16 -16 24 -25 32 -39 47 -55 63 -72 83 -95 111 -126 144 -162 184 -208
31 -208 234 -262 294 -328 368 -409 455 -504 559 -619 685 -758 839 -929 1030 -1144 1272 -1420
49 -1420 1589 -1789 2023 -2306 2659 -3109 3708 -4546 5809 -7945 12427 -42941 162269 205518
63 205518 -103989 -111292 132638 156697 -98203 -131195 79855 120520 -80123 -118207 53149
74 53149 106113 -30088 -59792 44931 42921 -77203 -69948 55931 81004 -12370 -36691 16384
86 16384 21094 -14696 1056 28367 4521 -9178 26285 23080 -31147 -23998 39281 14511 -77609
99 -77609 -61019 48836 52279 -42584 -32535 73385 64529 -38676 -16248 101187 72897 -70153
111 -70153 -66598 64369 51821 -94653 -95875 58361 90074 -35101 -56200 66802 89205
122H9205j27387m7040R4741L9495o9152j0637P7897P093p5337j063P2137j6464
134C3488r7879r600Q8702K4462o2578j0487O1327J0072o2738k2900M9483L6440
146C7792j1508j1993J257q671o580J0301r008m0590j6669L1262K2151j2889N751
159i394L9930Q284m4107k3646K7735J7548k4132j2458K2346Q039k4581l416L4711
172A6859J4280l3141k7653J3263J9137j0245j6244N460J2324j1k762J3174J9439
185B3880N257j0292j2508n944l990n128N42N279k929j4578j104K1907J1551k2812
199a0869j9879K1964L2620o020j9154J6527K2622k4364m1401N929L0051o790k4587
212b3351J6698L3539q708k4593J5354J9295l5181m4160K2796M9639n056k6512
$$ plain form
122 89205 -38182 -85222 9519 49014 -20138 -30775 47122 54215 -21122 -22185 49952 33488
134 33488 -64391 -73991 14711 39173 -23405 -33892 27435 37507 -25231 -48131 1352 37792
146 37792 26284 14291 15548 6877 297 10598 1590 -39000 -55669 -24407 -2256 -15145 -9394
159 -9394 30536 38820 -5287 -28933 -1198 16350 -7782 -20240 2106 10145 -14436 -17852 16859
172 16859 31139 -2002 -29655 -16392 2745 -7500 -23744 -18284 -5960 -5971 -8733 4441 23880
185 23880 29137 18845 6337 393 -3597 -8725 -8183 -2904 -5833 -20411 -21515 392 11943 -10869
199 -10869 -30748 -8784 23836 17816 -1338 15189 37811 13447 -27954 -22025 8026 1236 -23351
212 -23351 -6653 26886 18178 -6415 8939 28234 -6947 -51107 -28311 21328 16272 -10240
224a0240K3847L9016k0027m1746J1133K9601k2778m0788R719K9123j0248j8867
236b2255K1319K0688k4857k1780K9255K9881j7093j7626J8223P928k8393j0945
248a5655K6379M172l1999l530L2684j346l3628J0684M4642j2137n5182P366O0054
261C2504l301o1377J142O2749K660n8843L570O7297L167p0107j5912N2111l16
274A5344o3276q789N9678J3941m3912M754O0012O660n5168j2260M1340j76m4809
287b6661j191M2682P4l7687K904L5615o854l6575L105K8809m290j8091J8888K2889
301B3617k1250k4064K0320J7194k6067j1917L8158J5871m3546j7529M8783J8582
313C8152o0644l6648M9394L3427m8969k9276O3145N0122m8001m7503M5569N0155
$$ plain form
224 -10240 13607 52623 32596 -9150 1983 31584 8806 -31982 -22263 6860 -3388 -22255
236 -22255 -936 19752 -5105 -26885 2370 32251 15158 -2468 15755 23683 -4710 -15655
248 -15655 10724 14896 -17103 -20633 12051 10705 -22923 -12239 32403 20266 -34916 -27550 32504
261 32504 29203 -32174 -31032 31717 34377 -24466 -20896 46401 49568 -20539 -36451 15660 15344
274 15344 -47932 -56721 2957 16898 -27014 -22260 37752 44412 -10756 -23016 18324 18148 -26661
287 -26661 -27852 14830 14904 -22783 -19879 15736 8882 -27693 -24588 4221 -69 -18160 728 23617
301 23617 2367 -21697 -1377 15817 -10250 -22167 15991 31862 -11684 -29213 19570 38152
313 38152 -22492 -59140 -9746 23681 -25288 -54564 8581 58703 10702 -36801 8768 58923
325E8923m1229n4858K5716L9484l3442m2734L3050M7401k2405l8768K3650L6833
337C1621k2738l4202K1753L1957k4218l3466K3715L9214j2603l0870R705K3183
349B3051j3843k6086P327J9967n773j5056L170O262n241K611J2454l050j2182
362f389J3790K5941p377k7989P239K6871j8206m7308J834M3448J500m0175L026
375b3795N0747Q806m4596r696M1847P064m5969j3486M0980J3661l6480p775M1331
388B2639R738m4009j3795L8817Q123m5253j3911M4179J5992m1354j4841M5254
400A1579K4168l6455k0636L4218K0670l0996k0898K4640J3885k6335j7969J5645
412h484O533j7049J553K2627M69j6917J1470K5299j2311l0208J0648K7175j9272
$$ plain form
325 58923 17694 -37164 -11448 28036 -5406 -48140 -15090 32311 9906 -28862 -5212 31621
337 31621 8883 -25319 -3566 28391 4173 -29293 -5578 33636 21033 -9837 -132 23051
349 23051 9208 -16878 -9551 10416 4643 -10413 -7243 -981 -6222 -3611 8843 5793 -6389
362 -6389 7401 33342 25965 -2024 5215 32086 13880 -33428 -31594 11854 13354 -26821 -23795
375 -23795 26952 35758 -8838 -18534 23313 30377 -15592 -29078 11902 25563 -10917 -18692 22639
388 22639 32377 -11632 -25427 13390 21513 -23740 -37651 6528 22520 -18834 -33675 11579
400 11579 35747 -708 -21344 12874 33544 2548 -18350 6290 20175 -6160 -24129 -8484
412 -8484 -1951 -19000 -17447 5180 5649 -11268 202 25501 13190 -17018 -6370 20805 1533
425A533l7443J6146M2404q400l7335J0771L6930j2530m1608O863L4939j0828l4379
438c2937J3886L8272p591k7143J9443L2174k1244l7043J7518L1778k4577l8068
450c5532K0626L5550k2479l6284K4625M1155j7642l5092K0091L5490j6930l0052
462a6474J8497K6747k3234l0097J9064K3629k1636k1572K6681K4059k5952k2580
474b2868K7132K2169k8746k5922K4989K4010k2162j7901K9377K6517k0572k3636
486g613J5006J3723k0960j9560J1906R874j3480n365J8246P973j1300J762J6794
499A7006k343j9390L790K0483n863k4546J857K0896n565k3763N863K4384m392
512H417k2702O077K3886n081k3885L751K1952m885k2914P067K6236k547k3710
$$ plain form
425 1533 -35910 -19764 22640 14240 -23095 -12324 24606 12076 -29532 -22669 12270 1442 -32937
438 -32937 -19051 19221 11630 -15513 3930 36104 14860 -22183 -4665 27113 2536 -35532
450 -35532 -14906 20644 -1835 -38119 -13494 27661 10019 -25073 -4982 30508 13578 -16474
462 -16474 2023 28770 5536 -24561 -5497 18132 -3504 -25076 1605 25664 -288 -22868
474 -22868 4264 26433 -2313 -28235 -3246 20764 -1398 -19299 10078 36595 16023 -7613
486 -7613 7393 21116 156 -19404 -7498 2376 -11104 -16469 1777 9750 -1550 212 17006
499 17006 14663 -4727 -937 19546 13683 -10863 -9006 11890 6325 -17438 -11575 12809 8417
512 8417 -14285 -8208 15678 10597 -13288 -9537 12415 7530 -15384 -8317 17919 15372 -8338
525h338K433K3634j516k6995n891J8359Q02k1829n681K0489J1300j1512n241J6023
539F037J3207q950j2664L327N926q524j3000J462J2044J788r396k233R609N705
553D338o782n810N096N622m662m668M937O312k254m201J095J792q60R27K701k987
569E96n702j31J200o224n303P717Q228n395m154J4762J3124r546j2237J0238R827
584A7000j8141j8701J4677J7021j6464j9427J8228K4251j5508k1320J8529K5103
596B5248j7028k6834J6539K5923j8298k6560J8311K8658j6149k6680J7100K5992
608B6222j8000k8170J3399K2535j6811k2748J7165K2046j3462j3856K0098J4950
620B3368j9238r914K2228O859k8387r510K5773K342l3833m144L6962O821l5267
$$ plain form
525 -8338 -5905 17729 16213 -10782 -16673 1686 2488 -19341 -25022 -4533 6767 -4745 -9986 6037
539 6037 19244 10294 -2370 957 6883 -1641 -14641 -13179 -1135 653 -8743 -10976 -1367 4338
553 4338 -2444 -8254 -3158 2464 -2198 -6866 -1929 4383 2129 -2072 -977 815 -45 882 3583 596
569 596 -5106 -5237 -4037 -10261 -15564 -7847 381 -5014 -9168 5594 18718 9172 -3065 7173 17000
584 17000 -1141 -19842 -5165 11856 -4608 -24035 -5807 18444 2936 -18384 145 25248
596 25248 8220 -18614 -2075 23848 5550 -21010 -2699 25959 9810 -16870 230 26222
608 26222 8222 -19948 -6549 15986 -825 -23573 -6408 15638 2176 -11680 8418 23368
620 23368 4130 -5784 16444 23303 -5084 -14594 11179 13521 -20312 -24456 12506 19327 -15940
633a5940k716M1315O626m0153n362L8760J777m3441l631M1962M316m0391j290
646a8168M1966o75m4659m72M2498j898m4753L18M3179m38m0756M621M3575p24
660B3614l8493L453L7126n574l6975L764K8349j2862l2389J2288L0700j2585k4208
673b3792K1321K7274k2234k4958K6114K5364k9867k8348K8540K5715l2200k5407
685c2478L4400K7122l4488k8166L3447K7108l2700k5888L2012K2301l3502k1113
697c1945L5404K3689l0127j7226L2115J5998l3590j5633L1117J0893l5867j5266
709c0438L1193J2940k7898p263L1726R796k6445n097K6803M390k6229k684K1041
722A1835n152k4318O782K5844p281k4345R942K5964j0651k7304J0918K7247j2225
$$ plain form
633 -15940 -18656 22659 29285 -10868 -16230 22530 24307 -19134 -22765 19197 23513 -16878 -18168
646 -18168 23798 23123 -21536 -22008 20490 18592 -26161 -25843 17336 16898 -23858 -19237 24338 23614
660 23614 -14879 -11426 25700 20126 -16849 -13085 15264 2402 -29987 -17699 13001 416 -23792
673 -23792 -2471 24803 2569 -22389 3725 29089 -778 -29126 -586 25129 -7071 -32478
685 -32478 1922 29044 -5444 -33610 -163 26945 -5755 -31643 369 22670 -10832 -31945
697 -31945 3459 27148 -2979 -20205 11910 27908 -5682 -21315 9802 20695 -15172 -30438
709 -30438 755 13695 -14203 -21466 10260 20056 -6389 -11486 15317 19707 -6522 -9206 11835
722 11835 6683 -17635 -10853 14991 7710 -16635 -6693 19271 8620 -18684 -7766 19481 7256
735G256k8599J1234K9813o839k4989R232K5503q422k4527N759K0542p988k1318
748a3343M307J6227o788j4197Q256J5837m703r753Q602J0796p186q971N521M239
762H844r802p734N953M180n748m34Q361J788p217N54O910k573q914K248Q333l759
778I90p954N079J2229j412j0644N74Q164k897j1314j666P258J070p417k500O236
793d204O464L79l336L06M225K499m536m712K662M077n847q910J475R402j754q154
809i964K985J1771j600r914L428J1638m011j4587J265J3223j741j1722M910J4342
823A0023l442j3922K959J2385n721j6037K606J1778l708r645Q811J3727n578r198
837d962Q820R266j0662r997J0107N986j4688q247J5472Q279j6777o742J9049P464
$$ plain form
735 7256 -21343 -10109 19704 12865 -12124 -2892 22611 14189 -10338 -4579 15963 7975 -13343
748 -13343 -9036 7191 403 -13794 -5538 10299 5596 -4157 4445 15241 8055 -916 4605 8844
762 8844 -958 -8692 -2739 1441 -4307 -4741 3620 5408 -1809 -1255 5655 3082 -5832 -3584 4749 990
778 990 -6964 -1885 10344 8932 -1712 -1138 7026 4129 -7185 -8851 -1593 -523 -7940 -10440 -4204
793 -4204 2260 2639 -697 -391 3834 6333 1797 -2915 -253 3824 -2023 -10933 -9458 -56 -1810 -9964
809 -9964 -6979 4792 3192 -6722 -3294 8344 4333 -10254 -8989 4234 2493 -9229 -4319 10023
823 10023 6581 -7341 -4382 8003 2282 -13755 -11149 629 -3079 -12724 -3913 9814 4236 -4962
837 -4962 3858 13124 2462 -7535 2572 8558 -6130 -14377 1095 9374 -7403 -14145 4904 12368
851A2368j8508n613K2211P238k2540p066K1912O637k3378p178K2740O609k2883
864g451m922K4921N777k4995o576K1673L107k4010k801K4016M149k0005J026K4165
878A8074J024k2290l51J8990o053k3600K996K1036n292j9154Q973K2193p935k0420
892a1809J0535J9732j2151k0690J3511K0513j4572k1640J5132K2038j6214k2701
904a8316J5060K1528j6210k1207J6533K2214j6671k2337J4846J9437j4647j7868
916a7638J6986J9387j5010j6664J5992J5799j6348j7026J1083J0305j6298j0446
928a9878J7774J2725j3495p587J6331P262j5535o089J5178J805j9833m417K0206
941D447N333j7203k310J7551J03k0021j499J9811J894j9866j681J8998K296j7415
$$ plain form
851 12368 -6140 -11753 10458 17696 -4844 -11910 10002 16639 -6739 -13917 8823 15432 -7451
864 -7451 -12373 12548 18325 -6670 -13246 8427 11534 -12476 -15277 8739 12888 -7117 -6091 18074
878 18074 19098 -3192 -3543 15447 9394 -14206 -11210 9826 4534 -14620 -5647 16546 8611 -11809
892 -11809 -1274 18458 6307 -14383 -872 19641 5069 -16571 -1439 20599 4385 -18316
904 -18316 -3256 18272 2062 -19145 -2612 19602 2931 -19406 -4560 14877 230 -17638
916 -17638 -652 18735 3725 -12939 3053 18852 2504 -14522 -3439 6866 -9432 -19878
928 -19878 -2104 10621 -2874 -10461 5870 13132 -2403 -8492 6686 8491 -11342 -15759 4447
941 4447 9780 -7423 -9733 7818 7921 -12100 -13599 6212 8106 -11760 -13441 5557 7853 -9562
955i562R24J9546j55k0941j243J9994K674j7310k657J5302l12j8170j868J6103
969B325K393j3275o1J4782K670j0139J161J1657l367j5283j266J0586q34r291
983g942L429J1876j996j0171L332R831l575j2039K322R363k860q862O985J2162
997A1855l772j1628L277J0753n160j2649L019J2365l264j2579J416J2659l0j1971
1011e709P53J1735Q75j0609O67J1748J258j0399l252O780k82r872j460Q411K625
1026C269n570M55O523R61n397J47L082l529o285K862O256j360k970N762M620o619
1042B207p735N020M911q082p518P090Q284o833n722J0495R324j0240j1028Q752
1056a075J0620r904j1069J0347J2309j0930j4985Q791J4883q520j5449P073J6060
$$ plain form
955 -9562 -8638 10908 10753 -10188 -11431 8563 11237 -6073 -8730 6572 6260 -11910 -13778 2325
969 2325 4718 -8557 -8618 6164 8834 -1305 -144 11513 8146 -7137 -8403 2183 1349 -7942
983 -7942 -4513 7363 5367 -4804 -1472 8359 4784 -7255 -4933 4430 1570 -7292 -307 11855
997 11855 8083 -3545 -268 10485 5325 -7324 -4305 8060 4796 -7783 -6367 6292 6262 -5709
1011 -5709 -4956 6779 7654 -2955 -2288 9460 10718 319 -2933 3847 3565 -6307 -7767 644 3269
1026 3269 -2301 -1846 4677 5638 241 388 3470 -59 -6344 -3482 2774 1414 -1556 4206 8826 2207
1042 2207 -5528 -508 4403 -3679 -11197 -4107 4177 -2656 -8378 2117 11441 1201 -9827 -1075
1056 -1075 9545 -359 -11428 -1081 11228 298 -14687 -5896 8987 467 -14982 -7909 8151
1069H151m431j3665O349J4074m298j5526J308J1177j826j0082L462J0866j577
1082C982q232K636O660m250p794J451M295l162k993O427N590k486j831L882O51
1097D826o291k204M902p37o742J119Q255q9p277K057Q092j968j0221J950J1350
1112G022q56j0354J102J1544Lj2518j588J0778J377j1254j891J1852L897q985
1126A29m032P802K524q854m071O597M642m649j683O877L979m275l851J760M93
1141C388n293l356L157L594j126o22L001K596j322k525M97N46j477k449J031J768
1157A408R32K45n1p98k113n59O00J40j339M0K919R08k884j080L530J078m630l698
1175e352M182N108k600l345L686M755n372p887K429N263k993o391M501P925j776
$$ plain form
1069 8151 3720 -9945 -3596 10478 6180 -9346 -8038 3139 1313 -8769 -5307 5559 3982
1082 3982 -4250 -1614 5046 796 -6998 -5547 -1252 -4414 -7407 -980 4610 2124 293 4175 4826
1097 4826 -1465 -3669 1233 496 -6246 -5127 3128 3039 -4238 -2181 5911 3943 -6278 -4328 7022
1112 7022 6166 -4188 -3086 8458 8461 -4057 -5645 5133 6510 -4744 -6635 5217 9114 129
1126 129 -3903 3899 6423 -2431 -6502 95 4737 88 -1595 5282 9261 4986 1135 2895 3388
1141 3388 -1905 -5261 -2104 1490 364 -258 2743 5339 4017 1492 1989 2535 1058 -1391 -360 1408
1157 1408 2340 2585 2534 1736 -377 -936 -336 -196 -1535 -1495 1424 2332 -552 -1632 1898 2976 -1654 -5352
1175 -5352 -1170 3938 1338 -2007 1679 6434 1062 -6825 -4396 867 -2126 -8517 -4016 3909 2133
1190B133n181M753O299o290r084K432O853m007o428O935P524n546p385O465P033
1205F506p699q534O573P405p542o487J0123Q832r184q679Q560P439r641p396J0149
1220D25P361j0587p064J1143P064j1430p368J1499N684j2152n112J4519P599j2322
1234g41n436J1481L661j4687m742J2772L400j2192o92J4017K180j2270P2J2710
1248I533l904j5929J912J5580j982j3352N792J6189n733j6649N432J5348p778
1261D459j7566Q058J7749p990j7139J0147J9335j0481k0631Q178J9574p491j7932
1274a1730Q708J8761q133j8816O783J6347q040j5676P773J4314q019j2040J0936
1287A168J2581j0745j1935R363R100j1883r218J2557Q344j1193o834J2900N987
$$ plain form
1190 2133 -3048 1705 8004 1714 -7370 -4938 1915 -2092 -8520 -1585 5939 393 -6992 -527 6506
1205 6506 -1193 -9727 -3154 4251 -3291 -9778 345 9177 -7 -8686 -126 7313 -2328 -9724 425
1220 425 7786 -2801 -9865 1278 8342 -3088 -10456 1043 6727 -5425 -10537 3982 11581 -741
1234 -741 -6177 5304 8965 -5722 -10464 2308 5708 -6484 -7176 6841 9021 -3249 -3177 9533
1248 9533 5629 -10300 -8388 7192 5210 -8142 -2350 13839 8106 -8543 -3111 12237 4459
1261 4459 -13107 -5049 12700 4710 -12429 -2282 17053 6572 -14059 -5881 13693 6202 -11730
1274 -11730 -3022 15739 7606 -11210 -4427 11920 3880 -11796 -4023 10291 2272 -9768 1168
1287 1168 13749 3004 -8931 432 9532 -2351 -11569 988 9332 -1861 -8695 4205 10192
1300A0192j2712m441J2317Q31j6101j740J6859J986j5705J302J8240p32k0003
1313i707r99J8991p19k0362Q77K0525O98j9130M95J9588j141k1057j752J8617
1327D924L071j5631m99J6206O77j4992j956J0976n9j0369J722R410j563o375M624
1342A66O987o314q641M573N213m986l959P004O172o323l866O198J963p533j431
1357d777Q242n54r784J563J1679o2j2199k62J3527J016j4668j895J4004K948j3397
1372d619m172J2494N633j0049m706Q705M113q344m644O311M418m010k741M162
1386B551K752k657l111L35m8n52N51J158J260J372Q55j392k685J34L11l026r27
1403c119M115L380k360j458M776J366q002m920N934M774n765m321Q067O591o322
$$ plain form
1300 10192 -2520 -6961 5356 6187 -9914 -11654 5205 7191 -8514 -7212 11028 10296 -9707
1313 -9707 -10706 8285 7566 -12796 -11919 8606 9304 -9826 -9331 10257 9116 -11941 -13693 4924
1327 4924 7995 -7636 -8135 8071 8748 -6244 -8200 2776 2717 -7652 -5930 3480 1917 -4458 166
1342 166 7153 839 -7802 -3229 1984 -3002 -6961 43 6215 -108 -3974 2224 4187 -3346 -4777
1357 -4777 3465 2911 -6873 -5310 6369 6307 -5892 -6154 7373 8389 -6279 -8174 5830 8778 -4619
1372 -4619 -8791 3703 9336 -713 -5419 3286 7399 -945 -5589 722 5140 1130 -1611 2551
1386 2551 5303 2646 -465 -130 -178 -730 -179 979 2239 3611 4466 3074 389 523 834 -2192 -3119
1403 -3119 996 4376 2016 558 5334 6700 -1302 -6222 -288 4486 -1279 -5600 2467 9058 2736
1418B736p300L739N764m071n353K694N186j325k193J658J74k796l12K233j509
1433f75l329L280N147l057n806K779N755l437n360L633M889m652n195M986N019
1448C977n830l686O519L822p841l912Q819L240j1118m089J1144N720j0274l202
1462f711J1445M410j4021o541J1541N482j1349m456J3248O144j1839m833R793
1475B313L235j1532l405J1080L285q565J13J0745p50j2396j065J0633j223j0292
1489g824K321J2593k85j1894Q32R738j911j0320J473R825k225o749N041P515n915
1504B215p953N766O045p904o241R855P248r298p807J0214P156j0526p358J1964
1518C376O937j1250o876J0975O552j2118n716J2634N765j2781n773J2921N976
$$ plain form
1418 2736 -4564 -825 4939 868 -4485 -1791 3395 2070 -123 1535 1709 -1087 -1399 834 -675
1433 -675 -4004 -724 4423 1366 -4440 -1661 4094 657 -4703 -1070 3819 -833 -6028 -1042 3977
1448 3977 -1853 -5539 980 4802 -3039 -6951 1868 5108 -6010 -10099 1045 6765 -3509 -6711
1462 -6711 4734 9144 -4877 -11418 123 5605 -5744 -10200 3048 9192 -2647 -7480 2313
1475 2313 5548 -5984 -9389 1691 4976 -3589 -3476 7269 6519 -5877 -6942 3691 2468 -7824
1489 -7824 -5503 7090 6805 -5089 -4257 5481 3570 -6750 -5277 4548 2323 -4426 615 8130 2215
1504 2215 -5738 28 6073 -1831 -8072 1783 9031 -267 -8074 2140 9296 -1230 -8588 3376
1518 3376 10313 -937 -7813 3162 9714 -2404 -8120 4514 10279 -2502 -8275 4646 10622
1531A0622j4402o409J2947O388j1851m710J3155O165j3165p099J0950M645j1283
1544d047l991J1869N428j0155m645Q382K564r420l370P992K937n937K82P595j97
1559E287p371k61M837l352n241M349P184l310o463M089M979n348p484N573O583
1574D051n190n353P097O769o264p444N250N955o320o657O582P702n410p686M409
1589b509O562m907o383M903O711l974o298M322N547l349n627K986N814k575m998
1604c775K752M419k393m674K05K711J65r33J215J482K11q56m95j009r76K097K552
1621B698j383k647K573K847k862n154R36M455n04m534J577O896Q51n915k325M417
1637A926J000m733j312N532L329l945k979L242K595m371m163K928L629k235k847
$$ plain form
1531 10622 -3780 -10189 2758 9146 -2705 -7415 5740 11905 -1260 -8359 2591 7236 -4047
1544 -4047 -8038 3831 9259 -896 -5541 2841 5405 -4015 -7385 607 3544 -2393 -2111 5484 5287
1559 5287 -2084 -2345 2492 -860 -6101 -1752 5432 2122 -4341 -252 4727 -621 -8105 -2532 4051
1574 4051 -1139 -6492 605 7374 1110 -6334 -1084 4871 -1449 -8106 -1524 6178 768 -6918 -2509
1589 -2509 4053 -854 -7237 -2334 4377 403 -5895 -1573 3974 625 -5002 -2016 3798 1223 -3775
1604 -3775 -1023 3396 1003 -3671 -3466 -755 -590 -1523 -308 1174 1385 529 34 -975 -1951 146 2698
1621 2698 1315 -1332 1241 4088 1226 -3928 -2992 1463 959 -3575 -1998 4898 5749 -166 -2491 1926
1637 1926 2926 -1807 -3119 2413 5742 1797 -1182 2060 4655 284 -3879 -951 2678 443 -2404
1652b404L562M396k994n164J990M987j815m658K040N867j423o519l60N150O56
1667C311m904k290N080K764l216k422J810K357j069j572L25J047N42K45j009j961
1683i62K4K122k33k617m42L419J271l855k571K446K208k131j541L482K305j837
1699A088j456K228m22l830q09L269k34l688M12N461R25o028j165M610J451m810
1715b998j448N753L204m920l284L981K373l873l247K450K700j439j863J706J259
1730C54j913j182J526k77j216J349L285k40l183K17L428m50m042l94L094Q77k820
1747a587j904K383K014j706j091J123J768R27k80m80q80J89R09l79k301j64L010
1764A551J066k624k040K002K160j966k240J236K515M28j863p6J995J74j560k67
$$ plain form
1652 -2404 1158 5554 2560 -2604 -614 4373 2558 -2100 -60 5807 4384 -2135 -2495 2655 3311
1667 3311 -1593 -3883 1197 3961 745 -1677 133 2490 1421 -151 174 1221 1763 2008 999 -962
1683 -962 -938 1184 951 -1666 -2108 1311 2582 -1273 -3844 -1398 810 -1321 -2862 620 2925 1088
1699 1088 -368 1860 1438 -2392 -3201 68 -166 -3854 -3442 2019 2944 -3084 -4249 361 1812 -2998
1715 -2998 -4446 1307 4511 -409 -3693 288 2661 -1212 -4459 -2009 691 -748 -2611 -905 354
1730 354 -1559 -2741 -1215 -1492 -2708 -1359 1926 1686 -1497 -1280 2148 1698 -2344 -2738 356 1233 -1587
1747 -1587 -3491 -1108 906 -800 -1891 -768 1000 1927 1647 1167 287 476 1385 1006 -1295 -1459 1551
1764 1551 2617 -7 -2047 -45 2115 149 -2091 -855 1660 2088 225 149 2144 2318 758 491
1780D91J377J94j466j29Q63p53j615m6J335l85j950J267L691Q09l355l40L316
1797C304J159m967k664M553K928m035m113L388M436l138n004K541N083k065m843
1812c437J759M775j044l908J549K547j313k510K225K273k147l151J816K009l482
1827b039k471L458K752k921k432L216L126k408j665K623J102l279p98K435q0l943
1843c324O45L808k166m145K053O452j678o729K306O535k205p198K864Q187k275
1858C130q682K324Q547j857q404J853P523k890q242J733Q883k252p407K593P813
1873D665j962o685L349P200l079p469K559N660l677n888M097N183m502m859M746
1888f62M989l704m094N702L293o110l050O643K750o272k814P194J581p339j986
$$ plain form
1780 491 1868 2062 596 467 1330 577 -1038 -1084 251 -134 -2084 -817 2874 3683 328 -12 3304
1797 3304 4463 -504 -3168 1385 4313 278 -3835 -447 3989 851 -4153 -1612 3471 1406 -3437
1812 -3437 -1678 3097 2053 -1855 -306 2241 928 -1582 643 2916 769 -2382 -566 1443 -2039
1827 -2039 -4510 -1052 1700 -1221 -3653 -437 2689 281 -1384 1239 2341 -938 -1736 699 619 -3324
1843 -3324 -2679 1129 -1037 -5182 -3129 3323 1645 -5084 -2778 3757 1552 -5646 -2782 5405 3130
1858 3130 -5552 -3228 5319 3462 -4942 -3089 4434 1544 -6698 -4965 3918 1666 -5741 -3148 4665
1873 4665 2703 -3982 -633 6567 3488 -3981 -1422 4238 561 -5327 -1230 3953 -549 -5408 -662
1888 -662 4327 623 -3471 2231 5524 -586 -3636 3007 5757 -515 -3329 3865 5446 -1893 -3879
1903c879Q268J821q861k936Q150J965q124j000Q868K229q525j397Q555J584p626
1918i08j136P197m67q646o42P374K70o881N20O310o77n332K326O320k426n959
1934b757K420M713l703m895M799N294m672n906M304N425n168n240M918M737n455
1949a186m542N328M983m615l733N269K967n066k504N725K047o635k955M919J160
1964A162n718j640O693K092n565j376O021J981m573j081M189m07m007l91L450
1979H30k94l607J977J829k283k160L406K499l467l096L216K649l522k141M591
1994D27L698l566k614L170K388l689k341K320R47l505q51L096Q82k816Q66L756
2010B168n34l141J310L944p41l984M68K937j230l443O43K173m36j365J158J816
$$ plain form
1903 -3879 4389 6210 -2651 -5587 2563 4528 -3596 -4596 4272 6501 -2024 -3421 5134 6718 -908
1918 -908 -2044 5153 4686 -3960 -4602 2772 3042 -3839 -3319 2991 2314 -3018 -692 5628 3202 -2757
1934 -2757 -337 4376 673 -4222 577 5871 1199 -4707 -403 5022 -146 -5386 -468 4269 -1186
1949 -1186 -5728 -400 4583 -32 -3765 1504 4471 -595 -3099 2626 4673 -1962 -4917 2 1162
1964 1162 -4556 -6196 497 2589 -2976 -4352 1669 3650 -923 -2004 2185 1778 -2229 -2620 830
1979 830 536 -3071 -1094 735 -1548 -3708 -302 2197 -1270 -4366 -1150 1499 -2023 -4164 427
1994 427 4125 559 -2055 1115 3503 -186 -2527 -207 740 -2765 -3616 -520 362 -2454 -1588 2168
2010 2168 1634 -1507 -197 3747 3006 -978 -510 2427 1197 -2246 -1603 570 134 -1231 -73 1743
2026A743j854j008K014L14k846L80L658J13l860M06N641J23n703o01M172n5n163
2043b526p21M874Q7m330M32L668O05k432K251K477k140l425K646L295m330l811
2059c380L491L212m884l277N044M490n136l821L995L687l854k497M809J458m540
2074a203j814M828J744m896q14N652n21o692n74O667p07o870q63O644J432n498
2090c485P92P166O43o361o86M589o69m994M74M310k472m419L308M316l484m008
2106d980M500M374n177m434O147N221o222n084N701N090n592n248N867N305n679
2121b11m909M702L301n426l579N811K936m930k134O608K751n372j520O525J196
2136E749p493k820O524J350o726j400N643J160n345P56O341K96n078Q9M406j502
$$ plain form
2026 1743 -111 -1119 895 1209 -1637 -1257 2401 2514 -1346 -940 4701 4824 -879 -1480 2692 2637 -2526
2043 -2526 -3247 1627 1714 -2616 -2184 1484 2089 -343 1908 4385 2245 -1180 1466 4761 431 -3380
2059 -3380 111 3323 -1561 -4838 206 4696 -440 -4261 -266 3421 -433 -2930 1879 3337 -1203
2074 -1203 -3017 1811 3555 -1341 -2155 3497 2976 -3716 -4290 2377 1670 -5200 -6063 581 2013 -3485
2090 -3485 -2693 4473 5116 -1245 -1931 2658 1989 -3005 -2531 1779 -693 -5112 -1804 2512 -972 -4980
2106 -4980 -480 3894 -1283 -5717 430 5651 -571 -5655 46 5136 -456 -5704 163 5468 -211
2121 -211 -5120 -418 2883 -2543 -6122 -311 2625 -2305 -4439 2169 4920 -452 -1972 4553 5749
2136 5749 -1744 -4564 1960 3310 -3416 -4816 827 1987 -3358 -2602 3739 4035 -1043 -954 3452 1950
2152A950m447K445M792k627n369K874N429k889n585K992N077m439n293L853N837
2167D600l256m763L286M791k853l740M195M260l974m321K526K839m184l306L287
2182f13J952l694j779N239L199l450j930L505J732m277j762L717J150l838j357
2197b206L154P45k659k71L050o93l663N70L003j435k939J744L601q03l026J965
2213A37L700j928l455Q69K996k413l691Q11K542j193k296J676K774o58j745K048
2229A74K209o11j899K56L90j473n97Q59L89j309m72J355M76n12k51J134n85k528
2247b995O95J697R06j016N96J741m29j141M02J270j258j748o70K75o70J3O56J188
2265d88m15k17J307J177M96r1q9l91r51q8n9n28o25M53m01l74N31J563K07j259
$$ plain form
2152 1950 -2497 -52 4740 2113 -3256 -382 5047 2158 -3427 -435 4642 203 -5090 -1237 4600
2167 4600 1344 -3419 -133 4658 1805 -1935 2260 6520 2546 -1775 751 3590 -594 -3900 -613
2182 -613 1339 -2355 -4134 1105 4304 854 -1076 2429 4161 -116 -1878 1839 2989 -849 -2206
2197 -2206 948 1693 -966 -1237 1813 1120 -2543 -1973 1030 -405 -3344 -1600 2001 1198 -1828 137
2213 137 3837 1909 -1546 -677 2319 -94 -3785 -2974 -432 -1625 -3921 -2245 529 -129 -1874 174
2229 174 2383 1772 -127 129 519 -954 -1551 -692 -303 -1612 -2084 -729 -253 -765 -1016 118 -467 -2995
2247 -2995 -2300 -603 303 -713 -117 1624 1195 54 456 1726 468 -1280 -1950 -1675 -2345 -2332 -1676 -488
2265 -488 -903 -1120 187 1364 1860 1769 1680 1289 338 250 191 -337 -962 -509 -910 -1284 -753 810 1017 -242
2285b42J00Q53L41j360k3J636N65j438j55K280P01j802j643R07o6j635r06N64
2303a323Q82j010M23K232Q73m90M74N81j071j008K99P81j254j939M4J538j82q11
2321i61P27J083n85q81P62J703p69r79N36k54q53j00K011O64k156j102J523P84
2339A153j912j212J145K27k353j105L000J951j68q40R82J158l97r37N03q00j444
2356a049j270j92L71M92O45J065q66o23R49J444m91j086K24O12l81j028N83J680
2374A079k73j720J6O91K0q34j34K37m77q74M73J474J5m47J108J934J44j064l34
2393A034Q76l39k339j212J190L51j707l63J427J923J9o37N07J227m12j063L82
2410H64M01m2j460n0R58J55j61O74k39j916j23P12N17j105o2J460n7m94L96K108
$$ plain form
2285 -242 -142 711 1052 -308 -331 1305 1870 432 277 2557 3258 1456 -187 720 654 -981 -1887 -1323
2303 -1323 -441 -1451 -1028 1204 2077 1587 2061 2642 1571 563 862 1643 389 -1550 -1506 32 -150 -961
2321 -961 -234 849 264 -617 145 1848 1079 100 636 382 -471 -571 1440 2104 -52 -1154 369 1153
2339 1153 -759 -1971 -826 -599 -2952 -4057 -1057 894 726 -114 868 2026 1629 692 1195 395 -1049
2356 -1049 -2319 -2511 -2140 -1648 -1003 62 -804 -1427 -478 966 475 -611 -387 225 -156 -1184 -601 1079
2374 1079 806 -914 -898 -207 -187 -1021 -1155 -918 -1395 -2269 -1796 -322 -307 -754 354 2288 2432 1368 1034
2393 1034 1910 1571 -768 -1980 -790 -439 -2146 -2509 -1082 841 860 223 730 1957 1545 482 864
2410 864 1265 1223 -237 -287 671 826 665 1339 1100 -816 -939 -227 290 -815 -877 583 526 32 428 2536
2430B536J009j378j493J095J31j786n41Q62o90k033k35K219N86p60J069K277o96
2447B172k377L57K708m78l270p45K201k3k302P34K956k45l233l36K493l8k373
2464a799K28J910p0j943J050L142m35k192N63J948k091k615J153J780k233k849
2480d453K212K301j253j410K641K374j654k288K420J323k355k080J984J006k923
2495b155j469K753J977k820j198L463J075l318j495L314J198l068q75L199J237
2510A818k499j45L439M05l923j031K103p07l093R76K927q29l141K245M251p60
2526B036k562J110L483k150l973J546L319k242l639J763K911j876k531K421L380
2541B996k243k835K246K480k251j826J974J957k248j410L007J559k568q24J746
$$ plain form
2430 2536 3545 2167 674 1769 1900 114 -427 435 -255 -2288 -2523 -304 282 -478 591 2868 2172
2447 2172 -205 152 2860 2382 -888 -1633 568 545 -1757 -1023 1933 1688 -1545 -1881 612 574 -1799
2464 -1799 -1571 339 269 -1674 -624 2518 2083 -109 454 2402 311 -2304 -1151 629 -1604 -4453
2480 -4453 -2241 60 -1193 -2603 38 2412 758 -1530 890 2213 -142 -2222 -238 768 -2155
2495 -2155 -3624 -871 1106 -1714 -2912 551 1626 -1692 -3187 127 1325 -1743 -2618 581 1818
2510 1818 -681 -826 2613 3018 -905 -1936 167 -540 -3633 -2657 270 -559 -3700 -1455 2796 2036
2526 2036 -526 584 4067 1917 -2056 -510 2809 567 -3072 -1309 1602 -274 -2805 -384 2996
2541 2996 753 -2082 164 2644 393 -1433 541 2498 250 -1160 1847 3406 838 14 1760
2556A760J86l388q02K242L80k695J88L520Q38k188O82L570j083l145M60J947j486
2573I86l554Q71L182j386k958J598L532j501k601K341K471j793k886J471K836
2588B609j914k280J864J970j833j772J801J272j979j802J269Q56k620m30K474
2603e15J106j628K87K972j80j548K0J885j610l229N34K106j319k715J498K899
2619E63j285j767J846L086j546k577J657K060k201k318K249K118k120k343K513
2634f5J854k525j360J974J168k702j604K716P71j663pK726P55j929J85K563o88
2651B169k922J93J547j517l164J325K961r17k060K131K955j451j948K214K261
2666C777k881k964K019K589k456k296K576K316k726j863K686J676k860k195L112
$$ plain form
2556 1760 1946 -1442 -2244 -2 378 -2317 -2129 1391 2229 41 723 4293 3210 65 525 2472 986
2573 986 -2568 -1697 1485 99 -2859 -1261 2271 770 -1831 510 2981 1188 -1698 -227 2609
2588 2609 695 -1585 279 2249 416 -1356 445 1717 -262 -2064 -795 61 -2559 -2989 -515
2603 -515 591 -1037 -750 2222 2042 494 514 2399 789 -2440 -1906 200 -1119 -3834 -2336 563
2619 563 -722 -2489 -643 2443 897 -1680 -23 2037 -164 -2482 -233 1885 -235 -2578 -65
2634 -65 1789 -736 -2096 -122 1046 -1656 -3260 -544 227 -1436 -1443 1283 2038 109 294 2857 2169
2651 2169 -753 -560 987 -530 -3694 -2369 592 -325 -2385 -254 2701 1250 -698 1516 3777
2666 3777 896 -2068 -49 2540 84 -2212 364 2680 -46 -1909 777 2453 -407 -2602 510
2681E10J045k719r22L732J510k803m61L114L21k966j041K902q20l654m69L357
2697F36m50k808J095L797n43k918J840L528j578l773J231K571k079l649K139K965
2713B004j951k796K476K695k464k527K010K621k900k418K674K669k740j333L576
2728A596K043l014j966K509R44l881j410K679Q28l834q20M246J160k749P30L652
2744B713m34l548M90L394j013m258M0L118j251k717J441L489j285k990J360L152
2760A701j236k772J110K725k141k444K807L203j812k640J917J847k857k024K318
2775b98R83k920j830K832K053j783n95K983J487k398q78K737N64l787p23K081
2791E08j36k874j08L330K99k742K77L321r9k608L53K325j85k672N89K577l68k152
$$ plain form
2681 510 1555 -1164 -2086 1646 3156 353 -108 3006 3327 361 -680 2222 1402 -2252 -2721 636
2697 636 186 -2622 -1527 2270 1727 -1191 649 4177 2599 -1174 57 2628 549 -3100 -961 2004
2713 2004 53 -2743 -267 2428 -36 -2563 -553 2068 -832 -3250 -576 2093 -647 -1980 1596
2728 1596 3639 625 -1341 1168 2112 -1769 -3179 -500 328 -3506 -4326 -80 1080 -1669 -939 2713
2744 2713 2279 -1269 -779 2615 1602 -2656 -2616 502 -749 -3466 -2025 1464 179 -2811 -1451 1701
2760 1701 465 -2307 -1197 1528 -613 -3057 -250 2953 1141 -1499 418 2265 -592 -2616 -298
2775 -298 685 -2235 -4065 -1233 820 -963 -1558 1425 2912 514 -364 2373 2937 -850 -1573 508
2791 508 372 -2502 -2610 720 1019 -1723 -1446 1875 1776 -832 -479 1846 1661 -1011 -422 2155 1787 -365
2809c65P58K021o81k054L42J515j836j860J238J554j099q95J996J935j491k97
2825G81K152K73k242j772J912l98j923q67J752L09j749L90K803O63j952o94K335
2842A773l81k201L08K007n02k089K9J946N24j938M17J003p94j907M47J104n22
2859g76j418J363J043m19J44J563L60q94j171R95m15j444p94J159o62j148k8K597
2877E5L58j178K56J998j37k158R4J464l71k330M27J394O15j764L43J590j47k037
2895a528K89J455j024j021L22J508J50n09Q19Q23m50m65R35K92j500p03K27m18
2913g98j246N19R83N52r72Q89J803J56j373J7J273n25j798k45J780k00j944N03
2931f26J610m00j435P87J216k67j603o6J496q23l57N06J490j09l46L53O48n23
$$ plain form
2809 -365 393 2414 1733 -321 21 1536 -300 -2160 -922 632 -467 -1362 634 2569 1078 781
2825 781 2933 3206 964 -808 1104 706 -1217 -2084 -332 -23 -1772 -1382 1421 2084 132 -562 1773
2842 1773 1392 -809 -501 1506 1004 -1085 -1056 890 1414 -524 -107 896 102 -1805 -1358 -254 -776
2859 -776 -2194 -831 212 -207 -63 1500 1860 966 -205 790 375 -1069 -1863 -704 -1366 -2514 -2542 55
2877 55 413 -765 -509 1489 1352 -806 -712 752 381 -1949 -1522 -128 487 -1277 -934 656 509 -1528
2895 -1528 -1239 216 -808 -1829 -1507 1 151 -358 461 1284 834 369 1304 1596 96 -607 -380 -798
2913 -798 -2044 -1525 -542 10 -962 -73 1730 1886 513 530 1803 1278 -520 -765 1015 815 -1129 -626
2931 -626 984 584 -851 -64 1152 885 -718 -784 712 -111 -468 38 1528 1419 1073 1426 2074 1551
2949A551j274Rq6q83p60M99P60o04o5J462P90n01j87Q36nj089k90J21k85q59j96
2970a056J154k57n62L06J008j97j072k1Q27n0j354r0J359M97o82N67J061n30o28
2989B80n34J95k22j101m13L60mm9Q31Q75L90l54K24N40n5o83m02n7o97o52m7N69
3011a006K71K0o6P69l65J12K67K34r59J89j45J15J87K12N60L89o58k19OK36q23
3032f74m26J18l89J97l72M66J079N38L94n7P59J74j154n43j23k20p50J53OK6K06
3053e92N15L38J21l09Q09L70l85p86J68N79m93q59Q32J257j78j137J52O64p36
3072C30o69n1N95r21l26P79P11L74k44Q49Q23q10o75K51L86j543j100N33N33o77
3092h52k50J222P00m94k64Q85J91q20p8N54m83q55RJ058l00p90N43J449p56j832
$$ plain form
2949 1551 277 286 200 -683 -1443 -944 -184 -788 -853 609 1399 898 711 1547 1542 453 163 284 -1 -860 -1056
2970 -1056 98 -159 -721 -415 593 396 -676 -697 130 80 -1274 -1364 -5 492 -190 377 1438 908 280
2989 280 -254 -59 -281 -1382 -1795 -1435 -1439 -1488 -657 218 608 254 478 1018 963 280 -122 -179 -876 -1528 -1575 -1006
3011 -1006 -735 -715 -781 -12 -377 -265 2 236 -723 -534 -679 -564 -377 -165 395 784 126 -93 -87 149 -674
3032 -674 -1100 -982 -1371 -1174 -1546 -1080 -1 537 931 874 1633 1807 653 110 -13 -233 -983 -830 -824 -798 -592
3053 -592 -77 261 382 73 882 1252 867 81 249 828 335 -524 308 1565 1387 250 402 1066 330
3072 330 -339 -390 205 -716 -1042 -263 448 822 578 1427 2250 1440 765 1016 1402 -141 -1241 -708 -175 -852
3092 -852 -1102 120 820 326 62 947 1138 318 240 794 311 -544 -535 523 223 -567 -24 1425 669 -1163
3112a163J04J505o08j401J30J703O4r46K49K016k34j183k84J294r06j600J03P96
3130c61r41p11P11J339l34n85P48J482n35j131N51P72j319r63O10P40n97r43J711
3149B44J30r95j53R44n6j425L1J429j22j411J36K101K12j506N89J792o83k021
3167g64K07J118o50j660J28J801j37j108O07J740K17j509P58J227j011j555N14
3184g7J133j409p48J137J051j149q58J515Q49p87j105Q11N75j201o77J752M05
3201A217j105K73J178L28j831K73J002o23j842l02J600n08j211R82J855n74q82
3218a70R10J885j028j805J26R71r71j627O77J539r37r19J219J435j453k04O88
3235C36M94j362o92J327P17j445n05K128k6j510j76J735K98k297o77J234K29j795
$$ plain form
3112 -1163 -1059 446 -162 -1563 -1433 270 334 -612 -363 1653 1419 236 -48 1246 340 -1260 -1157 -361
3130 -361 -1302 -2013 -1302 37 -297 -882 -134 1348 813 -318 233 1005 -314 -1277 -667 73 -524 -1467 244
3149 244 374 -621 -774 170 114 -1311 -1280 149 27 -1384 -1248 853 1065 -441 148 1940 1257 -764
3167 -764 -557 561 -89 -1749 -1621 180 43 -1065 -458 1282 1499 -10 748 1975 964 -591 -77
3184 -77 1056 -353 -1101 36 1087 -62 -920 595 1444 657 -448 363 938 -263 -940 812 1217
3201 1217 112 385 1563 1891 60 333 1335 712 -1130 -1432 168 -340 -1551 -569 1286 712 -170
3218 -170 740 2625 1597 -208 -82 889 -82 -1709 -1032 507 -430 -1349 -130 1305 -148 -352 336
3235 336 830 -532 -1224 103 820 -625 -1130 998 972 -538 -714 1021 1319 -978 -1655 -421 -192 -1987
3253a987K21K138k60j238O69J726p9j710N77J087p49j981K08J227o82j179R19
3270a093J505m87j425J495J240j429j144J060O07j163p68J418J428j799n72J871
3286G44N84k006l51J488j04k075n08K625j66j453K04K795j5k123J70K264m82k027
3304d36l56J454n41k098O05K112l88j236P21K083j057j584Q57J913j654j935J340
3321b00J711j068j564J634J549j310j683J445J083j708j183J503N72j690n04K413
3337A000N23r75l82J688J45k095j52J650m06k371l72J815N85j906P00J874K6k008
3355f61L07K055n40j955N19J307j124j089J058J446j004j522J396J305j743j305
3371a550J316J194j386k093K104J565j099p54J566J214j550j370J526M02k081
$$ plain form
3253 -1987 -1766 372 112 -1126 -457 1269 1190 -520 57 1144 395 -1586 -1378 -151 -833 -2012 -1093
3270 -1093 412 -75 -1500 -5 1235 -194 -1338 -278 329 -834 -1602 -184 1244 -555 -1127 744
3286 744 1328 -678 -1029 459 355 -1720 -2228 397 231 -1222 -1018 1777 1762 -361 -191 2073 1591 -436
3304 -436 -792 662 121 -1977 -1372 740 352 -884 -163 1920 863 -721 136 2049 395 -1540 -200
3321 -200 1511 443 -1121 513 2062 752 -931 514 1597 -111 -1294 209 781 -909 -1413 1000
3337 1000 1523 548 166 1854 1999 -96 -248 1402 996 -1375 -1747 68 653 -1253 -553 1321 1347 -661
3355 -661 -354 1701 1161 -794 -275 1032 -92 -1181 -123 1323 319 -1203 193 1498 -245 -1550
3371 -1550 -234 960 -426 -2519 -415 1150 51 -703 863 2077 527 -843 683 1085 -996
3386i96o19J199M70j931KK494K19j439q3J909J73k023M2J519n42j772N9J495j59
3405A7j023K22J167j87j033N55J094j015j234Q21J448j473q45J813J029j012j388
3422a044J754R37j703j554J132J076j463q41J574P03j463L07J444Q29j271k31
3438A86J296l87j825j05J250K90j425k35J766J65j299M27O83J90j387n4O85J8
3456B39q26Q02N88n16n21J205M17q28o04L96P69j901l92J235O63j271l90J215
3474B80J402j327o08J468K69j446l91O57K3j330J41J058r4n07q7J493k46j138
3492c83r9J093j63j387N03Q50j67q50M60R63k13j108O97J33m68q98L22O46q91
3511i60n12J279O87o59m37J079P77j230p01O01L40j376n28J194J67r17o7R46O23
$$ plain form
3386 -996 -1615 -416 54 -1877 -1875 619 838 -601 -684 1225 1398 -625 -583 936 394 -1378 -1319 176 17
3405 17 -1006 -784 383 196 -837 -282 812 -203 -1437 -616 832 -641 -1486 327 1356 344 -1044
3422 -1044 710 1647 -56 -1610 -478 598 -865 -1706 -132 571 -892 -585 859 1688 417 186
3438 186 1482 1095 -730 -835 415 705 -720 -955 811 976 -323 104 787 977 -410 -464 221 239
3456 239 -587 215 803 287 -234 971 1388 560 -44 352 1121 -780 -1172 63 726 -545 -935 280
3474 280 1682 355 -253 1215 1484 38 -353 304 327 -1003 -862 196 102 -405 -492 1001 755 -383
3492 -383 -482 611 448 -939 -436 414 247 -603 -143 820 607 -501 196 329 -139 -1037 -715 -69 -960
3511 -960 -1472 -193 494 -165 -602 477 1254 24 -677 -76 264 -1112 -1640 -446 -279 -1196 -1263 -317 306
3530C06o63q3R86j82j300K57Q28k89n47J30R00j66q45L74P90k62r46j17J096p71
3550e04p20O91P69q27k3N97J058n46l07P31K3r88n76J69Q61r70l17J013N55r61
3570b72J46J207q0o57m82P19q3q21n3R07j49n53J79O72L12r74N3P32q12o11O81
3591F1J73n6k95k4J049k56l61M96N20k84q65k40L66l30o84M99N60k13k36L14L54
3612E48M01j43m81p4Oq01O03r0l20m4N36P6l90K27J73J74p89m7O4J29m77L37N10
3635A28L7m30L36K78K98o42j95L87p80m30N7O93k49j0J28P33k80n0O8L53O0j003
3657e13o5K79l0l19J81J88r6O7j06L31J62Mk49p1l9k70L73o4O7r2L62O3j90J73
3681A46k24K08j91l84K5J45k14M58k62K98L70k20M0M52j34p2j87j40k18j79J8
$$ plain form
3530 306 -357 -440 546 364 -936 -679 149 -140 -687 -557 343 177 -668 -294 496 234 -712 -829 267 -504
3550 -504 -1224 -533 236 -591 -614 -17 1041 495 188 919 942 -46 -622 -453 408 -562 -879 134 689 -272
3570 -272 -126 1081 1001 344 -138 581 498 -323 -376 531 382 -171 8 680 992 18 71 803 -9 -620 61
3591 61 234 178 -117 -141 908 652 291 787 1307 1023 158 -82 284 -46 -730 -231 329 116 -120 194 548
3612 548 949 806 325 251 257 -544 59 -31 -351 -395 141 217 -173 54 227 401 -388 -435 -371 -242 -719 -382 128
3635 128 165 -265 71 349 647 5 -190 197 -583 -1013 -956 -263 -512 -522 -394 339 59 9 77 430 490 -513
3657 -513 -578 -299 -329 -648 -467 -279 -375 -308 -414 -83 79 83 -166 -237 -276 -546 -173 -237 -170 -262 100 163 -27 146
3681 146 -78 130 -61 -445 -420 -275 -489 -31 -293 5 375 155 195 647 513 441 254 114 -104 -283 -265
3702b65M69K01m77L94K11q4k83JL68K3r76K33M41L99n33L8M25O5n40J23J08m7
3724B94l55k19j8N2o3L47K16k80K46L99N3nm93J8L50p67j56L8K98n7R2L52n08
3747a66K93%lK31o80k0M36L02n90k84O19K86l01k75O66j03o49o00Q21k07n97j4
3769h35P38O3l43J39N09K1m25K19K27m44n62j16O27m07m28P47M42m97o2L86L25
3790C24p99k69J84Q49j109J81O16J47n30k09N14K37j33o66Q41j26q53l2P88J19
3810G4p86K48J061j40k56j1N68j26o58p4K35l86k62N96J36j07l81O31L62j49n14
3831F1M33J21o72n99O40O43n75m30N12N31m12k61O52K26r89j15O35Q8r75K43P60
3852E17Ko65J13J087m66o43K75M16k15r66O4J186l76r37P34L30k25j74M37L78
$$ plain form
3702 -265 204 405 -72 322 533 449 166 167 535 558 -418 -185 256 655 122 160 585 650 110 233 341 294
3724 294 -61 -280 -298 -246 -309 38 254 -26 220 619 672 667 174 192 542 -225 -381 -343 -45 -102 -10 342 -166
3747 -166 127 127 124 355 -325 -345 91 393 -197 -481 138 424 123 -152 514 411 -238 -838 -17 -224 -821 -835
3769 -835 -97 -34 -377 -238 271 292 -133 86 313 -131 -693 -809 -182 -589 -1017 -270 172 -325 -387 -1 324
3790 324 -475 -744 -560 289 -820 -639 -23 124 -406 -615 -101 136 3 -663 178 52 -801 -833 -45 74
3810 74 -712 -464 597 457 201 190 758 632 -26 -100 135 -251 -513 83 219 112 -269 362 724 575 61
3831 61 494 615 -57 -656 -16 627 52 -378 134 665 253 -8 644 870 -119 -234 401 489 -486 -243 517
3852 517 519 -146 -33 1054 588 -55 220 636 421 -545 -481 705 329 -608 126 456 231 57 494 872
3872H72q53q81Q34O74j019j09N08O27q99m76J327K68q32p21R25K37r53n35J274
3891B68M44j324J13O36K84r00J67P20k3j222J85Q77j48r70M11R15p6q38N2J045
3911F16M6j251L23P26q33r63R54R63q94r25P82Q92q45k31P91O65j149p72P33L88
3931A6k05q75J406J43p27l13P70O71j119n46J260k19r79k06J459n4j033J96P28
3950C73L04j083L35J200o39j358N72N59j26j101R52R12p62p58Q75P28m41j118
3968e76P33Q71j092r09J007R41r60q11J050Q50r47p10O54R23j342l41O81O11p89
3987a56l77J179Q14j561k30Q37L09j184l72J309k65j054O8J123K32j292L91R25
4005F96m06m87J82O40o57q17O36P89p86o96Q77N46m49p46P10O91m02j073P57N74
$$ plain form
3872 872 19 -862 -28 646 -373 -482 26 653 -246 -722 605 873 41 -680 245 482 -471 -1006 268
3891 268 712 -612 -499 137 421 -479 -312 408 385 -837 -652 225 77 -893 -482 433 357 -481 -429 616
3911 616 662 -589 -266 460 -373 -1336 -382 581 -313 -1238 -456 436 -409 -640 151 816 -333 -1105 -372 16
3931 16 -189 -1064 342 485 -242 -555 215 886 -233 -779 481 262 -717 -923 536 482 -551 -355 373
3950 373 677 -406 -71 1129 490 -868 -296 263 137 -964 -12 900 138 -620 255 983 542 -576
3968 -576 157 1028 -64 -973 34 975 15 -796 254 1104 157 -553 101 1024 -318 -659 22 633 -156
3987 -156 -533 646 1460 -101 -331 506 815 -369 -741 568 303 -751 -683 440 672 -620 -229 696
4005 696 290 -197 -15 625 -32 -849 -213 576 -210 -906 -29 517 68 -678 32 723 321 -752 5 579
4025E79j114l06P66N68p49m09N87L56l92n36P74M12j721J73J197l1q48k7J132
4044D11k51j026N73M59L13j296L14O46j73q26N09O64m13m70N78N85n26n10N70
4063A31L08n60p17O56R28r28n36P13N74n24m33N12L74m61l55L01K31n98K64N29
4083D09K45r16Q3Q58j00p74RR85k04q48J13N96j71p49N23P52k21m79R8O14n73
4104B50o46M53N53n40p63O04R32n79n00R44l30k91m73P98K32q61N9N75L50j206
4124d39J97P65L39j000mN73j60r44K79N24L9r44P22N58l65k97M5Q85n93r38K15
4145e43J099n19o19L23L31o1p29N01O96l23m06L47J7l83j93J79N08o86j53N03
4165a11P09j095l31P34M00p68k51Q87L4n99k66O06K05p16M75O64m83m72J70M19
$$ plain form
4025 579 -535 -841 -75 493 -256 -665 -78 278 -114 -650 124 536 -1185 -1012 185 154 -694 -721 411
4044 411 160 -866 -293 166 479 -817 -503 143 -30 -856 -347 317 -96 -566 12 597 71 -439 131
4063 131 439 -121 -838 -182 746 -182 -718 -5 569 45 -388 124 498 37 -318 -17 214 -384 -120 409
4083 409 654 -262 -179 679 579 -195 -186 799 595 -253 -140 456 285 -464 59 811 590 111 209 823 250
4104 250 -396 57 610 70 -693 -89 843 264 -236 708 378 87 -386 412 644 -217 -158 417 767 -439
4124 -439 -242 523 862 -138 -142 431 271 -673 -394 130 169 -775 -53 505 140 -157 -112 773 180 -758 -543
4145 -543 556 37 -582 -259 72 11 -718 -217 479 156 -250 97 114 -269 -462 -283 225 -461 -614 -111
4165 -111 598 -497 -828 -94 306 -462 -713 174 208 -391 -657 -51 154 -562 -87 577 94 -378 -208 211
4185B11l65l82l1R19k78o66j70J002k27j51J93P17n89p73K92M25l1m48L12K21
4205A81l24j52K64M77n52m05M80L09Jp44P52J27n33j94O10K89o77L77K6K84o29
4226c3J15R2k2k95j05M67K7J6k65O39P5m69k43M38j76n09J80O82j97j65l64J18
4248FJ00l8j2J69o7n47K12L81k59J19L4K51n00j33N09L97m18l58j32K81j00k64
4270c69K39L78j51o38L84O90n86J07L6O8j65o56N26j73L20m22M68j72j43pJ59
4291a07J75l51R4m0J36j81K27K16j83k01M9K28j12j9l42K88p9j15j61L18J95j79
4313a44J06j06K99m6K25k77M7k28kM8K0m24L99K8l0m6j36J67N10m23j37N48q1
4336C17m4j93J55l3j24K24qj31j60R9PK46l35j57K70K2P8j46M28j57o7m09L04
$$ plain form
4185 211 -154 -536 -567 352 74 -592 -762 240 13 -138 55 772 183 -590 -298 127 96 -352 -40 181
4205 181 -143 -295 -31 446 -106 -511 -31 278 279 -465 287 414 -119 -313 297 586 -91 286 312 596 -33
4226 -33 82 174 152 -143 -248 219 246 262 -3 636 711 242 -1 437 261 -248 -68 614 417 252 -112 6
4248 6 106 68 56 225 158 -389 -177 204 -55 64 98 349 -151 -284 225 622 204 -154 -286 -5 -105 -369
4270 -369 -130 248 97 -541 -157 533 -53 54 90 158 -7 -663 -137 -310 10 -412 56 -116 -259 -266 -107
4291 -107 68 -283 -189 -229 -93 -274 -47 169 -14 -215 -166 62 -50 -69 -411 -123 -202 -317 -478 -160 35 -144
4313 -144 -38 -144 155 109 334 57 104 -124 -126 -78 -58 -482 -83 -55 -85 -131 -267 -100 410 -13 -150 398 317
4336 317 273 80 235 202 78 302 294 163 3 102 109 355 20 -137 133 155 233 87 515 358 291 -118 186
4359A86j40M68m72N3J71j19k22n1L96j97R0J78Q5k22k99N05K8k56k26P5J49j16
4381F4K13J08l65l69L97O8j57n7j0J79J48j49j5J92P5j17j30L8n5j35r1N67n79
4404a80j7j31N6Q3m22L76n7L38K4P4l66L08j99K50K18n33O7m07L77k69J7K09o7
4427b51k60L04j3K07l5j11L19l45l43N40m0k68P0K51N9k64J67rj53j57r5J38P1
4450b18j91L12K70k51j01J04L49k31k56L33L1l03k08L27J64j10r0m3L76k71k44
4471b51K84N85o81P2J81J38k98R6K08j00j61n83O92J20l09JK24Rk54nM18l7j40
4494B09k2R8K2m93M53K81l65k60J47K94j90m15J36L52l34j93M62K24m22j90N86
4515C80M07o69n51Q37K19o11m66P20K02q35m15J026P9o98R6L28N03q00J3O19J42
$$ plain form
4359 186 46 514 42 95 266 147 -75 -126 270 73 163 341 426 204 -95 410 438 182 -44 31 180 64
4381 64 277 385 20 -349 48 116 -41 -98 -108 71 219 70 55 247 322 205 75 113 58 -77 -168 399 -180
4404 -180 -197 -328 -272 -189 -611 -235 -292 46 70 144 -222 86 -113 137 355 -178 -111 -518 -141 -410 -393 -184 -251
4427 -251 -511 -207 -220 -13 -48 -159 160 -185 -528 12 -28 -296 -226 25 84 -180 -13 -22 -175 -332 -427 -289 -218
4450 -218 -409 -97 173 -78 -179 -75 274 43 -213 120 151 -152 -360 -33 131 21 -69 -112 264 -7 -251
4471 -251 33 618 -63 9 190 328 30 126 334 234 73 -510 182 302 -7 -6 218 227 -27 -32 386 349 209
4494 209 187 285 307 -186 267 548 183 -77 70 364 174 -241 -105 247 -87 -280 182 406 -16 -206 380
4515 380 787 118 -433 404 623 12 -454 266 468 -367 -782 244 323 -375 -279 49 552 -248 -235 384 526
4536E26j020J01N80J13p96M09L25l13o79M7P42k67m69L31N28j81o17N03Q26n43
4556A46m76r4R83o30n56K03N40k93m66M00K88l68l74O73L57o67k04P36M63o28
4576C3j70M55m5l36m11N11M12q37l14N19M22o07R9N44L19p67l71R15L46p85l7
4597a05O02j81o48M0P03j76o69L15P42n28j48J32O27p21k34M33O47m90n88N90
4617C43N93r58m17M40N93M4p74K46O6j83j45L46K17k98l16Q56j62m60L1L94K06
4638F62p06r4L34R4o31l0P27k21m54J62N94k13k89K66L53K7n58o8M14k9p70K78
4660a52J08j08k05M20K75o66N7L6M49j14n16L90L70n56k68O55j75j78l59N73M6
4681H2k73m19N76k13l48P2N47J21k97K1L61k63j56K4J98N1n73J47K67k14j14M73
$$ plain form
4536 526 -494 -393 187 300 -496 -87 238 -75 -754 -707 35 -232 -701 -370 158 -23 -640 -137 689 146
4556 146 -330 -424 559 -71 -627 -424 116 -177 -643 -243 45 -323 -697 -24 333 -334 -538 198 661 33
4576 33 -137 318 273 -63 -474 37 449 -388 -702 -183 239 -368 -269 275 594 -173 -544 371 717 -68 -105
4597 -105 497 316 -332 -292 411 235 -434 -119 623 95 -53 79 706 -15 -249 184 831 341 -247 343
4617 343 936 -22 -439 1 594 638 -136 110 176 -7 -152 194 411 113 -203 653 491 31 62 456 662
4638 662 -44 -138 196 290 -341 -371 356 135 -319 -157 437 224 -65 201 554 581 23 -45 369 340 -430 -152
4660 -152 -44 -152 -357 63 338 -328 -271 -235 214 100 -416 -26 344 -212 -480 175 0 -178 -537 36 82
4681 82 -191 -610 -34 -247 -595 -523 24 145 -152 -131 230 -33 -189 -165 33 84 -489 -342 -75 -289 -403 70
4703G0j6q1p03P64M74o68n8N06K18o37k05O48K19o40k18L56O0l09k27N34k03k34
4725c50q0P07l4n17RQ41j70l65K79R1l15k29M6L01q4o90M96L28j32j56K05O0J68
4748D09p86O04K17m61k6N17J85n39k67M14j03l11j36J85N14p79m4L31K91l04l50
4769d39P38J07o84L35M18j39n16K53K47o2p21N2N67K0p07M27N45k68o20J42N74
4790B69n7o87P41J90l72k57j05O66k8p95R2N97n25l65M71K77l41m59M89N63l17
4811D7k42N08o6n47l38N97L26m96l96L84j13k24L8O61r3l51j22P12j07k61k25
4832c08P76q60K13j46L04L54n14J26M17n18j24j53O74k78j62K44J24Q6l57M00
4852B98N5Nn63M11R4l46k9J27J4lj97J23M43m56O5M47j24k26j39O09k57j67k30
$$ plain form
4703 70 54 -27 -730 34 508 -160 -218 288 506 -131 -336 312 531 -109 -327 29 89 -220 -447 87 -116 -350
4725 -350 -430 277 243 -274 -265 576 406 41 320 411 96 -133 -87 214 130 -560 -64 264 132 -24 181 241 409
4748 409 -377 227 444 -17 -43 474 659 120 -147 267 164 -147 -283 -98 416 -363 -407 -76 215 -89 -439
4769 -439 299 406 -278 57 475 336 -180 73 320 258 -463 -411 156 176 -531 -104 441 173 -447 -305 269
4790 269 212 -475 266 456 84 -173 -278 388 360 -435 -343 254 -271 -636 -165 112 -229 -688 -199 364 47
4811 47 -195 313 247 -300 -638 -41 285 -211 -607 -223 -336 -560 -522 139 46 -305 -427 285 178 -83 -308
4832 -308 468 -392 -179 -325 -21 333 -181 -55 362 -156 -280 -433 241 -37 -199 45 169 255 -102 298
4852 298 353 358 -205 206 300 -46 -75 52 66 63 -134 -11 432 -24 41 488 364 138 -1 608 351 184 -46
4875d6J96q5k17m4N32j6m91k87O39j50j44P0K34O8n40K28N25J73n33j74L13j96
4897E5j92J48L9l4k67K02J77j51QN9M12l93k94N84l23K37l34J6j12j4L8L7K28
4920A26k74j57lK5O7k2K38j81R6o8J76j45J33O4j77M4j40r7k57K09oL94k87k63
4944e05M22j38J01L22l06L8J57k1J89l02l98K76J97k89k29M12P7k73J62n1P3N5
4966c1J86k13j71L48j83P4J36k07J12Q6k95o7J22Q3l36M97l70L25j47k80K41N26
4988D36l68J35k18L82l12j63N2q1J80J04m79K54K67n6N5k5o9L3k2J39K23j80m61
5011a74L90K60m90J04oK10k24m0k3k79L9K52K6L4NJ60k35M38j87M7l54N9K5q7
5035e0o7J2q6K83q8k15q5K60M0J03k84K17n8m3Q2k26L03j55J9l10K88m6k68K46
$$ plain form
4875 -46 150 65 -152 -196 336 320 -171 -458 181 31 -113 -43 191 259 -281 -53 472 645 112 -62 251 55
4897 55 -137 11 50 16 -251 -49 128 -23 -15 44 456 63 -231 353 30 267 -67 -51 -163 -177 -139 -102 126
4920 126 -148 -305 -308 -283 -216 -238 0 -181 -85 -153 23 -122 11 75 -102 -58 -198 -295 -552 -343 -349 45 -242 -505
4944 -505 -83 -221 -120 202 -104 -66 91 70 259 -43 -441 -165 32 -257 -486 -74 3 -270 -108 -159 -86 -31
4966 -31 155 -58 -229 119 -64 10 146 -61 51 137 -158 -225 -103 -20 -356 141 -229 96 -51 -331 -90 436
4988 436 68 203 -15 367 55 -108 -56 -137 43 147 -332 -78 189 133 188 163 94 127 105 244 467 287 -174
5011 -174 216 476 -14 90 84 294 70 30 7 -272 -233 19 45 79 84 244 9 447 260 307 -47 12 37 -50
5035 -50 -117 -105 -191 92 4 -211 -296 -36 4 107 -177 40 -18 -61 21 -205 98 -57 -38 -348 -60 -106 -374 -128
5059a28J72m2j97pj78L98J41m63P05p4j8j98Ol40qK01r5j27Jj85K83P5k92K45
5083a25P8K39M4j66L9k22J31J1J67k31j78r3K41J88K9j64k61M68k14l08L38j11
5105a00p3kO47l34J98k93L10j64j19l92K96Pk96N9n2M11l83J67M96R4n26K33J29
5128C13j49j58J38q8K00k02k10M87p9l61j68L41l3r6R3K18m9n22L14M15j4m03
5150a3L62K73m09n80K66M22l56m09M05L36k37n39L09M60k81m69P14J85n03k69
5170c33M26K98n90j24L36j1j39l40L35R2k90Q4K76J43m65K45K46o3k89j05J83
5191h5L96o67M5K85J84o30L18p6J01m26J21L62J20m55M14K91j86n31L32L39j58
5212I4k54l24O63o1l78P5K75K60p74M69J94n57j22N12J75l90l52M51M49m61L62
$$ plain form
5059 -128 44 2 -195 -202 -380 18 159 -304 401 327 309 111 117 -223 -231 -30 -125 -252 -251 -436 -153 -78 -370 -125
5083 -125 -47 192 236 70 109 -113 18 29 196 -35 -213 -306 -65 123 152 -12 -273 195 -19 -327 11 -100
5105 -100 -173 -175 472 138 336 43 353 189 70 -322 -26 -19 -315 -256 -308 103 -280 -113 383 477 -49 184 313
5128 313 164 6 144 56 256 54 -156 331 252 -109 -277 64 31 -65 28 246 197 -325 -11 404 390 -13
5150 -13 349 622 213 -367 -101 321 -35 -444 -39 297 60 -479 -170 290 9 -460 254 439 -64 -333
5170 -333 93 391 -199 -323 13 2 -137 -477 -142 -50 -340 -256 20 163 -302 -57 189 126 -163 -268 -85
5191 -85 311 -356 -311 -26 158 -472 -154 -230 -129 -555 -434 -72 48 -407 7 298 112 -419 -87 252 94
5212 94 -160 -484 179 118 -260 -185 90 350 -424 45 239 -318 -440 72 247 -143 -495 -44 405 -56 306
5233C06m25j16o7j57M63J64n36k4M43J78J09l77M56M1m26j01PL75l96k46O01k98
5255b6k07O0L36m08J3J19O60p22n5N30K9l3k69J01J79l40j91P34m07j8j37oK55
5278A97l06j97M85J43l16j00K74K82m33j52M40j80l39L02L6q3o37J64N59q2p4
5299a7K6q5N8J87j85Q4l9k00K50j20j93J3N14j10j58k06J52l9k4l43K88M0l26
5322d33K17j5K49J0K05j74M6m08Q1L12j35m84M74K76o02J68J47K65m7k45L19j02
5344A24j13m17L79J96j70l87K44K68q8k9q0L24m43Q8J5N14n16k96L49K54J39l52
5366CM61n9j78k4J43o0k42j31M11r0m72n4M15N8N1j49J96J52l36j21L97m67m1
5389a37L6L10k38j60K34N37m98k96L48K74m91r8N09M03o08j78J90m5n3R3M21k50
$$ plain form
5233 306 -119 -235 -302 -459 4 168 -368 -392 51 229 338 -39 417 458 32 -69 -62 313 -83 -329 272 -26
5255 -26 -233 -173 163 -245 -232 -113 547 -175 -230 300 329 296 27 128 307 -33 -224 510 103 85 -52 -58 197
5278 197 -109 -306 179 322 6 -94 180 462 29 -123 317 137 -202 100 136 53 -584 -420 139 57 -17
5299 -17 9 -76 -18 169 -16 68 29 -171 79 -41 -234 -221 293 183 25 -181 -29 -68 -92 -435 -147 -107 -433
5322 -433 -216 -231 18 28 233 59 105 -303 -222 90 -45 -529 -55 221 -381 -213 -66 199 152 -93 226 124
5344 124 11 -406 -27 169 -1 -388 -144 124 36 7 -73 251 -192 -104 -89 425 -91 -387 -38 216 355 3
5366 3 464 405 227 203 346 286 44 -87 324 234 -238 -292 123 181 232 83 279 431 95 -26 371 -96 -137
5389 -137 -101 209 -29 -189 45 582 84 -212 136 410 -81 -179 330 733 125 -53 137 92 39 132 553 303
5411C03n39N5M28m65k24k3M47L83m48j3L50K98m07j64K5J37m15k05J15N34n25
5432c53l4M01j25p9k35O20J06q40J61M45k82j92M20K62k75l33K7N03m02J05l19
5453d19L51k42qP6m2J85r5J55L69n01O6J70J03l61j10K68m1j26l43L13L77k06
5475f1j20P6L27j55j60N28l00k06l80N17j4J40l27M14m02q7K86j53J34o71K77
5496c37L74k27J12J9J31J97M7l25J12j68M5J29K23l98j76J01L54k09j20K42M08
5517E34p02L39J82j26j70j3L74k11k30j77M64J45k56j14L74m45K03j25k95J31
5537a18Rj20K00Q1M80m17m8M22k00j11Q3l30J67j86k90O3K11j61K42m5K68l0p9
5560I1j52Q7k6j11K72k85q3K13J0K0k62j38N66l20Nk9l95L17j24J6K85Q2L0j50
$$ plain form
5411 303 -236 -181 247 -218 -442 -465 -18 365 -83 -96 254 552 145 -19 6 143 -272 -477 -362 172 -353
5432 -353 -387 14 -111 -190 -425 195 301 -539 -378 67 -215 -407 13 275 0 -333 -306 197 -205 -100 -419
5453 -419 -68 -310 -318 -242 -284 -99 -194 -39 330 -171 -105 65 168 -193 -303 -35 -76 -202 -545 -232 145 -61
5475 -61 -181 -105 222 67 -93 435 135 -71 -451 66 52 192 -135 279 -123 -210 76 -77 57 -614 -337
5496 -337 37 -190 -78 -59 72 269 316 -9 103 -65 -20 109 332 -66 -242 -141 213 4 -116 126 534
5517 534 -168 171 353 227 57 44 418 207 -23 -200 264 409 153 39 413 -32 171 46 -249 -118
5537 -118 -109 -229 -29 52 532 115 67 489 289 178 261 -69 98 -88 -378 -315 -104 -265 -23 -68 200 170 91
5560 91 -61 26 0 -111 161 -124 -207 6 16 36 -226 -364 202 -118 -113 -142 -537 -220 -344 -328 -43 39 69 -81
5584h1M9M54m31j61J07L8k26j57K88Q1l5m0J6M1K60m04J47K32k34kk08K28K5m01
5608d14K87K24J59n62J57J54jo1p7J36j1j27m1L53pLk22j60L97j15K47m53K58
5631A24k4M0j22l54J31K41L52Nl23K0M06n54J95p9j37J40J61n3l56N5J84K53j06
5654A99k18M8N6j94k21M17j67K58l01L58q1j31J41k02J88k0P2l96K91j60j5n4
5676a32R4K96m78K54R1P3k61j12J74J98j25j17J21j24J1j75M54n47N51k87j13
5697a54k4O4l62M35q8k25K10j30M50k48O0J37l6j38l57L18l51K42j00L56m25N70
5719B04J25o5k4k42q0j8j85m3Q2J47Mk30j8L03lO2L29J25l58k30k13N53l77j03
5743b55K56L57l69k2L3m3j25n2M57j70k1n95L17K85J36k52L66J77k81j80J60j11
$$ plain form
5584 -81 -32 422 -9 -170 -63 -25 -251 -408 -120 -39 -74 -114 -98 -57 203 -201 -54 178 -56 -58 -266 -38 -13 -414
5608 -414 -127 97 256 -306 -149 5 4 -57 -134 2 -9 -136 -177 176 169 172 -50 -210 187 72 319 -134 124
5631 124 100 140 18 -336 -205 36 388 393 70 90 496 -58 137 58 -79 61 222 169 -187 -132 52 305 199
5654 199 -19 29 85 -109 -330 87 -80 178 -123 235 154 23 164 -38 150 130 202 -194 97 -63 -78 -132
5676 -132 -38 258 -220 34 125 198 -63 -175 -1 197 72 -45 76 -48 -37 -212 242 -305 246 -41 -154
5697 -154 -178 -114 -476 -41 -129 -354 -144 -274 176 -72 -12 125 89 -49 -406 -88 -439 -197 -297 59 -366 204
5719 204 329 264 240 -2 -82 -100 -285 -328 -246 -99 -95 -325 -343 -40 -43 19 348 473 115 -115 -328 225 -152 -255
5743 -255 1 358 -11 -33 0 -43 -168 -220 237 67 46 -549 -232 53 189 -63 303 480 199 19 179 68
5765F8O0k61K73k05j01l22N38n6J93j1J98j08k08j43L98k18m03K85q6K54n6K28
5787C17j70R6k99J24n2M13p02M66m07K57k77K91K16j31l28N68L0l24k65O6J74
5808F3j89j99R1K88J79j12j81P31p54k47M4M41l14o1m8M70n76K75L00K23p21p8
5830c75L09K18j31k83L62l13j16J18L67k32k1O5K49J81l98j61K60k5j59l62K66
5851a81J53l18o1M07k08M37l02L05J16l75k09M46k60k00K69M6J76n64K12O5J31
5872H5o2L4L85l75m01L4P81m24k02P47o15lj49L97l67K51j11r1L84q28N08j93
5894b15L42R9j74J92m9k01L90l74k5N5l92O6J34K01J1L7k85M31L7j63l6L9k12
5917i2N2L6J46LJ6R5j12M5J22l18k57M55k06k5j65J91J46l37K36k6J57j77qM44
$$ plain form
5765 68 128 -133 140 -65 -166 -488 50 -6 187 176 374 266 58 -85 313 95 -308 -23 -109 145 89 317
5787 317 147 243 -56 68 16 429 -273 193 -214 43 -234 57 273 142 -186 382 412 88 -177 -111 63
5808 63 -126 -325 -234 54 233 121 -60 671 -83 -330 -286 155 -159 -220 -268 202 -374 -99 201 424 -297 -375
5830 -375 -66 152 21 -262 100 -213 -329 -211 156 -76 -97 -32 217 398 0 -161 99 74 -85 -447 -181
5851 -181 -28 -346 -407 0 -208 229 -73 232 348 -27 -236 210 -50 -250 19 65 241 -323 -111 -46 85
5872 85 23 57 442 67 -334 -300 481 57 -145 602 -13 -16 -165 232 -135 116 5 -86 298 -530 -22 -215
5894 -215 127 226 52 244 195 -6 384 10 -15 40 -352 -286 -152 49 60 97 -188 243 280 117 81 120 -92
5917 -92 -40 -4 142 145 161 256 144 189 311 -7 -264 191 -15 -40 -205 -14 132 -205 31 5 162 -15 -23 421
5941D21l75n9m4J02l8m96L41J26q7k02K12K44m7l28K55J51o73M90J01m6k09L42
5963A81j59O5o6l51L64R9k39k51J68J35mq3J51J51k44J94J36m27m0M2M08k67l04
5986c41J52J47j61j37P17q2j67J49l57K60k27K10m70M65K7m28K28k4m7l63N15
6007F6J23L04o99J30m7Q4J1J30J57k38P4K06p1jl3N2N8l80n5N3M9l9R0J68l7j54
6033AQ3L56j32n94O91n27K17k52k67Q11m30j25N4M10k62q4j0K77l66p5K14O8m1
6056A7j91M28Q1l91j34K47M3k01j12P7J40r5Q5L54k52q4p4K92K13l89m15M62R9
6079B00k20k68N89n45J39o2M09l17k41J83L46K1q7k89Q2R2j27N6q3M81l77j16
6101a34L90k25J2l84M97m26N6N6j12J93L41m75M45j15j56nj1p9p3M21l51J39q
$$ plain form
5941 421 46 -13 -57 45 7 -489 -148 -22 -109 -311 -99 145 98 -230 25 176 -497 -7 94 48 -161 181
5963 181 22 87 21 -330 34 133 -106 -357 -189 -54 -58 -141 10 161 -83 111 247 -180 -220 -178 230 -37 -341
5986 -341 -189 -42 -203 -340 377 295 128 277 -80 180 -47 163 -307 158 185 -243 -15 -39 -86 -449 66
6007 66 189 493 -206 -76 -123 -39 -28 102 259 21 95 301 230 229 196 248 306 -74 -129 -76 -27 -66 24 192 155 1
6033 1 84 440 308 -286 405 -122 95 -157 -424 387 -43 -168 -114 296 34 -50 -60 217 -149 -224 -10 58 17
6056 17 -174 254 335 -56 -190 57 100 -101 -213 -136 4 -91 -6 348 96 12 -62 230 443 54 -361 101 200
6079 200 -20 -288 301 -244 -105 -167 242 -75 -316 -133 213 234 147 -142 -60 32 -95 -39 -122 359 -18 -134
6101 -134 256 31 43 -341 156 -270 -214 -158 -270 -77 264 -211 234 119 -37 -42 -53 -132 -205 216 -135 4 -4
6124dJ03J95k80j2J75m4k83j9o1O73m05n1P7j1o9l00P13k17k36j06J50P5j54K5
6148f6J86l41O7M83j79p0J15K49l03J51K42m05j86l4P6Q1K75n05J75k09K95p9
6170A8J93n4j66M5j69J60n8N3J16l82K53K46j39j10o9q7r5J80J0J65k29J99l87
6193c07L46J12J23m81L47k74J38jl8J22j52R8k14L12j44p7j3K45j05j32j47N8
6215a84K14m8r2K7j54P3J9L65m64J67J34n8Qj30J72n06M35j57J48J53q0l8j12
6238a08J94n86L55J01j83K75J51j73l4k67K22K0j28jq6M44n15J40l9n6L40m72
6260d06L89P2k03J37Qo4j07J37J89j90J03j44L81ql02J3J60k21R4J13j55P3M5
6283A14j85j2O3j25P6j20N88o61L24q0L30j18j48j19m8K17p6K34l8J77k55j81
$$ plain form
6124 -4 99 294 14 2 177 133 -150 -169 -230 443 38 -13 64 53 -16 -316 397 180 -56 -162 -12 63 -91 -66
6148 -66 120 -221 -154 329 150 80 195 444 141 292 534 129 -57 -91 -15 66 341 -164 11 -198 97 18
6170 18 211 157 -9 36 -133 27 -31 22 138 -244 9 255 116 6 -63 -150 -245 -65 -55 110 -119 80 -307
6193 -307 39 151 274 -207 140 -134 4 3 -35 87 -65 33 -181 131 -13 -90 -103 142 37 -95 -242 -184
6215 -184 30 -18 -110 -83 -237 -164 -145 220 -244 -77 57 -1 7 -123 49 -457 -22 -179 -31 122 42 4 -108
6238 -108 86 -500 -145 -44 -227 48 199 26 -8 -275 -53 -33 -161 -162 -248 196 -319 -179 -218 -274 66 -406
6260 -406 -17 55 -148 -11 -3 -67 -174 -37 152 -38 65 -79 302 294 -8 5 165 -56 38 151 -4 69 114
6283 114 -71 -83 -20 -145 -69 -189 399 -262 62 -18 312 194 46 -73 -121 96 20 254 216 393 138 -43
6305d3O6k78M44l32K15n9ok7J14P6j44J30j40K0j31j41K1K49l40Q8J50Rk14M76
6329B03j85k48m2N69k4p8j30j14J94k78o3J51K12m57L98l0L87m25L33l88Oq4R4
6352AJ21j49M0J2qM8K7k50J92j04o0J49k07J76k14L2K82N8k26L72k38J96j89m45
6376c84L79l3P1m11J49o7J88j15K02r0j52Q6L21P8m40J64l5j21l15M81K78r5n0
6399H9j16K39m2j40K1r6M08m21J69J04nj9N8j19j51P0k68K06K41k54n2K62kk85
6423a03J28K07lk09m8K7K1N1j14qM3j39K74j18n8J37J7J48l83J58r4N9j01R6j24
6448a36K36k82M30K4Nk92MR0j1j92M1m8Q7J24p9j41J26j29M00k42m9l05M99P0
6472B30r4j91j54J85o2L9J66%o9J39j70J1k59O5j46r8p3N29j94l4p3J12L77j89
$$ plain form
6305 -43 23 -255 189 -143 72 13 7 -20 94 170 26 156 16 36 -95 -236 -215 34 -306 -218 -68 -59 -273 203
6329 203 18 -230 -272 297 273 195 65 -49 145 -133 -196 -45 167 -290 108 78 465 40 373 -15 -9 -93 1
6352 1 122 -27 13 25 17 65 92 -158 34 -70 -130 19 -188 -12 -226 -194 88 146 -80 292 54 250 61 -384
6376 -384 -5 -38 33 -378 -229 -296 -108 -223 -21 -111 -263 -177 144 222 -218 -54 -89 -210 -525 -44 234 139 89
6399 89 -27 212 170 30 51 -45 363 -58 111 215 210 191 249 130 -21 49 -219 -13 228 -26 -78 184 182 -103
6423 -103 25 232 229 20 -28 -1 20 71 -43 -51 -8 -147 127 9 -49 88 105 253 -130 28 -66 -7 -108 -12 -136
6448 -136 100 -182 248 272 277 -15 -11 79 68 -124 -83 -131 -44 80 1 -140 -14 -143 257 15 -34 -339 160 230
6472 230 136 -55 -209 -24 -86 -47 119 119 50 189 19 30 -229 -164 -310 -408 -481 48 -146 -180 -253 -141 236 47
6496D7R1k81J39k88K85Mj22L00j89N6J07k41J07k05K46M93n17k19J26j76K68P5
6518A06l2P8o9J6k43k2L43P4j07k65J52j18O7M46n51j48L75%J07k44R7j90L6k90
6542c82L59k7K72k64L61k63j12p6K65kk54N9R6l35K61L97l91K88m0M0j65j73J01
6565A5j17Q7l69M40P4l55K02L4J4k12J58J24k39M25j57k91M3NL8K47m13L11j47
6588h3J75O3j02M93l80j79k68L49m3j7jk29M45k20j60k0K84j20K7p1j17k05L20
6611e9P0j22O3j2J85J38n03j2P05o84j14M1J82p6N6L42j06L6k35K55Q0j45j94
6634a09J45j99j3Q2K01J60n1n76J89L80k59j30L78j46k22N6j69N10o28J44J36
6655a21O73m19j26L89m38k4l5L98k13l3nlJ45l0j76j04K41k04J39J18l77K11l32
$$ plain form
6496 47 138 -143 -4 -292 -7 -3 -125 175 -14 42 149 -92 15 -190 56 549 32 -187 -61 -237 31 106
6518 106 74 152 83 99 -144 -166 177 251 144 -121 31 -87 -20 426 -125 -273 102 102 209 -35 62 -128 -92 -382
6542 -382 -23 -50 222 -42 319 56 -56 -132 133 131 -123 -64 32 -303 -42 355 -36 252 212 252 87 -86 15
6565 15 -102 -15 -384 56 130 -225 -23 11 25 -187 -29 95 -144 281 124 -167 -124 -119 -81 166 -247 64 -83
6588 -83 92 155 53 546 166 -13 -281 68 25 8 7 -222 223 3 -157 -177 107 -13 14 -57 -174 -379 -59
6611 -59 11 -111 -48 -60 125 263 -240 -252 453 -231 -345 -304 -122 -198 -142 200 94 130 -105 150 230 85 -109
6634 -109 36 -163 -176 -94 107 267 216 -360 -171 209 -50 -180 198 52 -170 -114 -283 227 -401 -257 -121
6655 -121 552 133 7 396 -42 -66 -101 297 84 51 46 43 188 158 -18 -122 119 -85 54 172 -205 6 -326
6678c26L28k5k7j29M19l08J26L18k8l65M3j76K19o2k5O7J83k27l6j09K27R3j60
6701B0P9j0mK32l03J06L72p04q9K60j31J99q8M21n81K09J14p4j59j10K36j64J56
6724a3j2N7J06l44L6M99l56Q7r9l43N28n08R2O30n25J73j3J00k57K13J52m11L93
6747A85m31N29j28m34N59J54k77j89K2J8k51K49j59j33L15k15q0J91K76p9l6P1
6769A57N4l92L90m12R6J86K0N7r3k03J91Q3L1k57J16K11k41K9q9Q4M7n5J45J88
6793C43m94N26l04mR3j99M66n0l70j9K3mk2k70L00N1k02J36J59m89K94m7m1L70
6817B46j81R3j43Q8r5P9J68k7m20K68K44o00N66l22R4o9J95J42l99R6k18L38o1
6840H2rn8J64J8J9k44M4k4l2j03M33n63Q9K25K31j80k70J21j71K11J48j90J50
$$ plain form
6678 -326 2 -23 -50 -179 240 -68 58 376 348 -17 26 -150 69 7 -18 49 232 5 -31 -140 87 180 20
6701 20 99 89 85 317 14 120 492 -212 -301 -41 -172 27 -61 360 -221 -12 102 28 -131 -241 -5 -169 -13
6724 -13 -25 32 138 -206 -170 329 -27 60 -39 -382 146 -362 -270 360 -165 8 -5 95 -162 51 203 -208 185
6747 185 -246 283 155 -279 280 434 157 -32 -10 8 -243 6 -153 -286 29 -186 -266 -75 201 122 86 157
6769 157 211 -181 209 -203 -107 79 99 156 63 -140 51 134 165 -92 24 235 -6 23 -66 18 65 10 155 343
6793 343 -151 375 71 67 160 -39 427 377 7 -12 11 7 -15 -285 15 66 -136 0 159 -330 -36 -83 -124 246
6817 246 65 158 15 103 8 87 255 228 -192 76 320 -280 286 -36 58 -11 184 326 -73 23 -195 143 82
6840 82 73 15 179 197 216 -28 16 -8 -40 -143 290 -273 -184 41 272 92 -178 -57 -228 -17 131 -59 91
6863I1m0k90K13K07p1p2K48r1k89L8k73N63m91O4L02l6k03K7L74l67m7Q0J7k61
6887c07L10q5k86N28n5k36J36J72j76j33k17K59P5m6j40K86J22l18N2m7K25k00
6909h1P0j42K93m16J16nK81j61K41O8k40L8K0j22K11j46Q0o8j9Q0j59L10m15N21
6933C55k60K6J43j91O5j90l1LJ82m2J73m84L24L1pOP3m29J63J07p7p9J58k84P26
6958D61o12K42L15m39k0l27L28k8K08n26M61J9J83k59J20K7l64J96K47k82J0J1
6980b9J21L62l02j21j81K00P6l89J91O7r7J54k2r5Q3j02K0J26k10LK40k5k74R5
7004a09J63l8p0j35L63k08rj59J74k11Q7O1K3R9n0K04qK1k47j22J35J34l16k09
7028d27M30o0j81j35L45N4K75m05K22q3M4k44K80J15m04p7N29K3j57j31J2N5j87
$$ plain form
6863 91 51 -239 -26 181 110 38 286 195 -94 -56 -329 234 -257 -193 109 73 -130 -103 271 -96 -143 -63 -46 -307
6887 -307 3 -82 -368 160 105 -131 5 177 1 -132 -349 -90 -15 -61 -201 85 207 -111 -59 -106 119 -81
6909 -81 -11 -153 140 -276 -160 -165 116 -45 196 264 24 62 82 -40 171 25 105 37 18 98 -61 249 -166 355
6933 355 95 121 264 73 138 -52 -83 -80 102 60 233 -251 73 104 97 103 176 -253 -90 17 -60 -139 19 -265 461
6958 461 -151 91 406 -33 -53 -380 -52 -80 128 -398 63 82 265 6 126 153 -211 -15 232 -50 -40 -29
6980 -29 92 454 152 31 -150 50 126 -263 -72 -5 -102 52 30 -65 18 -84 -64 62 -148 -145 95 70 -204 -109
7004 -109 54 16 -54 -189 174 -34 -43 -202 -28 -239 -152 -91 -68 31 -19 185 177 198 -49 -171 -36 98 -218 -427
7028 -427 3 -57 -238 -373 -28 26 301 -104 118 35 79 -165 115 230 -174 -251 278 301 144 13 25 80 -107
7051a07l4K7L3j05K99LK9k10L28k89j0K5l72M38L6KR4l37K78j16P0J07o2k69R9
7076d3j22J72j49K17mJ36j35o4n0K69k61R2j69J38Q4J46l29K81m75R9K01L2j79
7099a13L93M7k78k3j91p3O3J84j47L01k25j81L02Q3j90J48K7J46n44K30l8p3K24
7122G2k66J06K12j7j1q9l10M28j35J87l30J28J80k05Q0j50K21j06P5K0o8l91L11
7145e8j43N46n62K65r7J48j01j40N20l17q6K44j40k63L83m66M96j25K2Q6k18j13
7167a19N3M30m65k4K84j06J5j20Q4O4k69K75k99J58J74j67k20L98o4m75M21p9
7189e1J72P9m3j60m2j48J6L09K60k46j72K09k03j93M08l23K40k60K33j15Jo7r
7212a05j5P9m4M73k84J88k77j21L23j64j04J4o1J84o0N5J7l66L57J17j88K06l00
$$ plain form
7051 -107 -141 -114 -81 -186 113 116 145 -65 263 -26 -36 -11 -383 55 91 93 187 -150 128 12 82 189 127 -142 -43
7076 -43 -165 7 -142 75 71 207 72 8 -42 227 -34 58 -111 27 111 257 -72 209 -266 -167 34 66 -113
7099 -113 280 327 49 26 -165 -238 -175 9 -138 163 -62 -243 59 142 -48 100 127 273 -271 -41 -79 -152 72
7122 72 -194 -88 124 107 96 7 -303 125 -10 177 -153 -25 155 -50 30 -120 101 -5 70 90 22 -369 -58
7145 -58 -201 345 -217 48 -49 99 -2 -142 378 61 -25 219 79 -184 199 -267 229 104 126 212 -6 -119
7167 -119 -66 364 -101 -125 159 53 68 -52 32 96 -173 102 -197 -39 135 -32 -252 146 82 -393 28 -51
7189 -51 121 200 157 -3 -45 -193 -177 132 392 146 -26 183 -20 -213 195 -128 112 -148 85 -30 -29 -96 -105
7212 -105 -120 -41 -85 388 104 292 15 -106 217 53 -51 -37 -98 86 26 81 98 -268 89 206 18 224 -76
7235g6J10j49o2Q6mR5Ro3O9j44k50K79K58q2l93L35k06J56M4j58L59j03K9k36
7259i7P6J06p4J97n9l16J83k57J34K9o3mp5J01O2N5J07j9k30k5K21k82N22l12
7283b0j94J11L21N7l95J86j72M05j75r7j61K54m4k24j37M91l46J33j02k9L01l08
7305a45K18l48M60m9Kl15J94K16m10L20J62p3k12J55jp4l10M39r6m4l92L9M90
7328B26k47K80l9j67m5K78k31p8J22K04j85j18J58j38j08L64K21n47n3J12k13
7349b04L95k07K98j81N8j56j12K12j24j77J70l17L68r8K12k38M6K03k75P2J97
7370A42m18K95l4J23M9l02L72l45K91q5j35J64m35K56J76j37K3lj44J49j27K53
7392A28J5j64k96M87k8k17Q2j60J89R3j19j65K15k89Q2R4K10k49j08M73j14k27
$$ plain form
7235 -76 34 -115 -177 -91 -95 0 9 -54 15 -129 -379 -100 158 76 -317 18 -188 -32 12 -146 213 110 139 -97
7259 -97 -21 85 11 208 149 -167 16 -241 -107 -78 -141 -145 -220 -119 -57 -2 105 86 -144 -169 52 -230 292 -20
7283 -20 -214 -103 218 275 -120 66 -106 299 124 27 -134 120 76 -148 -285 206 -140 -7 -109 -138 163 -145
7305 -145 73 -275 185 136 138 -177 17 233 -177 143 305 232 20 175 174 100 -210 229 133 89 -303 -264 226
7328 226 -21 259 220 53 8 286 55 -23 99 303 118 0 158 20 -88 276 497 -50 -103 9 -204
7349 -204 191 -16 282 101 159 3 -109 103 -21 -198 -28 -345 23 -75 137 -101 -55 148 -127 -55 142
7370 142 -276 19 -15 108 157 -145 227 -118 173 88 -47 117 -318 -62 114 -23 0 -3 -147 2 -125 128
7392 128 143 -21 -317 170 142 -75 7 -153 36 129 10 -155 60 -229 -147 -53 157 -92 -200 273 159 -68
7414f8J39p0Jj47r7L45N6o4k52Q4rJ66k96K84K03l52L26l25R6r0J65J07l34M34
7438C02j01k11l6K91q9l67J49J01J21m8n8q8J63J44j1j74j16o9K4M0J27K91l54
7461C1l3J9J88lm78J25M54m84J32L5J98j38roJ4Q6k94R5k04R9J1R9J7K66k48J8
7487a0O9k56J73J2J26L9j1l27Q0R5r0K68n06K92l3NJ70j92K16j97L8k91L33m9
7511d6n2q2M00k4j44j17p8K00oj33m1J31k74L19j74M7O1j6j12L83k03M2k00k67
7535c86N87k36J39j16%J49k50Q1j58J18K05r9O4J86l19K50j83Q3J68l38Mj16J19
7558d8M1j5M3R2J5q3M8q1Q7O2k77K33J25k28K68j04%l57J31P9j33Jj4M5j13L80
7584A97j66j17J96o8r5l7K7J93P3r7nj24r7P9mkj75qJ96j90M12o0J34k45j68M95
$$ plain form
7414 -68 71 1 2 -145 -242 103 159 95 -157 -73 -82 84 -212 72 275 -77 249 -76 20 -70 95 202 -132 302
7438 302 201 -10 -46 245 156 -211 -62 39 160 112 54 -34 129 273 262 88 -28 -97 -73 -33 94 385 31
7461 31 -2 17 205 202 -276 -151 303 -181 -49 -14 184 46 37 31 45 131 -163 -68 -272 -173 -162 -63 -46 220 -28 -10
7487 -10 59 -197 -24 -12 114 153 142 -185 -105 -10 -100 168 -338 -46 -79 -74 96 -96 120 -77 -39 -330 3 -46
7511 -46 -98 -180 220 196 52 -65 -143 57 51 -82 -123 8 -266 53 -121 -74 -13 -29 -141 242 39 81 -119 -386
7535 -386 201 -35 104 -12 -12 137 -113 -32 -190 -72 133 34 98 284 -35 215 32 115 283 -55 -51 -167 -48
7558 -48 -7 -22 21 113 128 45 93 12 99 161 -116 117 242 14 282 178 178 -179 -48 31 -102 -101 -115 -70 -183 197
7584 197 31 -86 110 42 -53 -90 -63 130 203 106 101 -23 -120 -41 -45 -47 -222 -230 -34 -224 188 128 262 17 -151 344
7610C44k51n9l2K15l76P2J02J70M2n4j43N4k5L4j08p4J49m93K53J08k2k7L02k34
7634e3J01l3J2k17j73M64j30Q1m6m2%K84l51L8qQ7q1Ok8K75j26k30k64L71Q3l36
7660c16L46J31k55j62K64J13j43P6J14Q6o16J93n8P0L57j27j50J24j60J47J85
7681B19n98N04L9j25O4q2k10Q7K00J14l05j24K92k39P3J23K50m28PL48l02K25
7703A32j94K44P0j76R7k89J12q5j33J10J26K13k50J97o8j17o8L68l88K9J09n2
7725a3J66j95j1L7J82k33j16K80L18m71p6L69l38k11J00J74n8L2K67k09P1j82
7747a17N4J3J61j85nJ32n8j75q3K06j4J31M4k8k16K63j98o4K6J49p5j94mM23l24
7772a38Q6K62km6o2O6k56n1K75q1k89N52l30r9J58j81K31k39K78k94J90k21M71
$$ plain form
7610 344 93 34 2 217 -159 -87 15 185 227 173 30 84 59 93 -15 -89 60 -433 -180 -72 -94 -121 181 -53
7634 -53 48 15 27 -190 -363 101 -29 52 6 -36 -36 248 -103 -65 -73 14 -67 -61 -89 186 60 -170 -434 -63 20 -316
7660 -316 30 161 -94 -256 8 121 -22 54 168 254 -362 -169 -227 -157 200 73 -77 47 -113 34 219
7681 219 -379 125 164 39 103 21 -189 -102 98 212 -93 -217 75 -164 -91 32 282 -146 -139 209 -93 132
7703 132 -62 182 252 76 173 -116 -4 -89 -222 -112 14 227 -23 174 106 -11 -79 289 -99 -70 39 -13
7725 -13 153 -42 -53 -16 166 -67 -183 97 415 -56 -132 237 -101 -312 -212 -38 -96 -64 203 -6 65 -117
7747 -117 -63 -50 111 -74 -79 53 -5 -180 -263 -57 -71 60 104 76 -140 123 -75 -139 -113 36 -39 -233 -237 186 -138
7772 -138 -52 210 208 162 100 166 -90 -141 134 53 -236 316 -14 -113 45 -136 95 -144 134 -160 30 -191 280
7795B80k42j65L1j59L09L2O6O6j04r0j14J35K8j69J08Q9j56M3K20k09o4K34j40
7818B9j76K23m72M61k43L8N7J69kk53J42K15l69M74k88K10j62R1j12Q6j7K65m83
7841a17J91k30K45j32J34j52k97L11K36k65J21n7M12j97l8R4j22l33M98l65k29
7862b92K90R7k12k05L48K34l42j98M57m37P9r4M67l24M52l30k3j65K61j82q7K88
7884H2k03M7K56R6l50J7J85m05N62l56j97J95r3K54j80r9L25k28J46j47K21l93
7906b65N15j74O0j07k60K94K6k18J6rK03m5k04N8K01j92j82M03m1M7n7L44n0j36
7930B27k54J62n28J05L73j41r7j7l0N3J54p0J28J38J02j78kn9n2O0l3P3j71K34
7954A77j81m6k79K82J61l1QJ08l29L9K5J01K5q5M5k39N22o8ql72q8p1K74K50k22
$$ plain form
7795 280 38 -127 -96 -255 54 86 152 218 114 24 -90 45 73 -96 12 101 -55 -12 208 -1 -65 169 29
7818 29 -147 76 -396 65 -178 -140 -83 86 84 -169 -27 188 -181 293 5 215 53 144 32 118 101 366 -117
7841 -117 74 -156 89 -43 91 -61 -358 -47 189 -76 45 -12 400 203 165 259 137 -196 302 -63 -292
7862 -292 -2 95 -117 -322 26 260 -82 -280 177 -260 -181 -275 192 -132 320 -10 -33 -198 63 -119 -206 82
7884 82 -121 -74 182 278 -72 -55 130 -275 287 -69 -266 -71 -164 90 -90 -189 136 -92 54 -93 128 -265
7906 -265 250 76 136 29 -231 63 89 -129 -113 -122 81 36 -168 -110 91 -101 -283 120 79 126 69 413 363 227
7930 227 -27 135 -393 -288 85 -56 -153 -170 -200 -147 7 -63 65 203 305 127 125 66 14 74 41 114 -57 177
7954 177 -4 -50 -329 -47 114 83 91 199 -130 -91 -66 35 60 -25 20 -219 303 235 227 -145 -233 -304 -30 220 -2
7979bL1o2o2j9L03m29OK49J5K20l76k6P5J65R1k1k00J95l55K87j55R4R6j59K75
8004B36O3m12l2L49m0k01PJ25k98kPQ6J61j82J81j74n8Q4J13j19M32m84J9M00
8028B61k50r5J08J59j55j71K05qP1j30J32k07J84n3R0Q0n14K01J16J65M0J07n87
8051b51K41o7K55n13K98M16j91k26J49j18J95Q6k33Q1r9n8J82q3K09o68M82k63
8073a76K55k02L22k26J25j24M5n3j68K51j8J28k70K37k28j49K33N7rK27j03m06
8095b52M50k83K36O3j44Q9k08J92K1J24l89j7K30J29l49k73N09k81O6k8j40J52
8117a03J86J66l97Q1K2N6K15k32k80M61j60J00r1j26Q2l99P87k93Q6k28K25l69
8139b11M28P5k96M9l21K79J03J2O6k28J10ln9K4j43j16J73M1k36ML66J4k1J14
$$ plain form
7979 -2 29 -33 -95 -114 189 -240 -234 15 30 250 -126 -152 -77 88 179 158 -42 153 -202 85 -70 24 120 -39 236
8004 236 299 -113 -145 204 164 -37 -30 95 -203 -205 -198 -112 49 -133 48 -126 -184 -100 13 -106 326 -158 -139 261
8028 261 11 -84 24 183 28 -143 62 54 125 -5 127 -80 104 51 141 221 -293 -92 24 189 229 336 -251
8051 -251 -10 -77 178 -335 -37 379 188 -38 111 -7 188 274 41 122 23 -35 147 64 273 -395 87 -176
8073 -176 79 -123 199 -27 98 -26 19 -34 -202 49 31 159 -111 126 -102 -251 -18 39 30 257 154 -252
8095 -252 198 -85 151 214 70 159 -49 143 164 288 -101 -118 112 241 -108 -381 128 -153 -87 -115 -255 -103
8117 -103 83 249 -148 -67 -45 11 226 -6 -286 175 15 115 24 -102 -20 -419 368 75 161 -67 158 -211
8139 -211 217 292 -4 45 -276 3 106 118 184 -44 66 63 4 28 -115 -231 -58 -17 -253 -249 117 131 110 224
8163B24N2l60K14K20m70J43J4n8j9k3m9K29J3j76J98m3j90M0j84K85j7R1k59r
8187a34J63j91M8M6
$$ plain form
8163 224 276 -84 130 350 -120 23 37 -21 -40 -63 -112 117 130 -46 152 109 -81 -41 -225 60 43 134 -125 -134
8187 -134 29 -162 -114 -68
8191f8
$$ Imaginary data points
##PAGE= N=2
##DATA TABLE= (X++(I..I)), XYDATA
0@%%%%%%Qj6J6j6K4l2M0m8N6p2Q8j04J24j48J76k07K39k74L15l62M12m68N32o02
30c19O78p63Q57r59J069j190J325j473J635j812K007k222K460k725L018l345L717
47A958m138M618n178N833o613P568q764J0309j2395J5388k0069K8470m8145J73475
61A42317J09081l73411k943K42886K5904k66562j9435K24167M6153k10192l1334
72a13369J83233N2086j59218m1322J12196J5785j11038J3365J25578J1811j15739
83b6632k8468O9172J6620m3905P832K9587k0357k2609K7647K431m4852M558N9065
96C0089j5297p4029K5868J07594k944j01501K602R7793j2083j07281J1482J04162
108F6455l1743j34770J4180J37285m747j33669J1718J57262K0325j40427l0110
$$ plain form
0 0 0 0 0 0 0 0 8 -8 8 -8 16 -16 24 -24 32 -40 48 -56 68 -80 96 -111 128 -146 169 -193 219 -249 283 -319
30 -319 359 -404 453 -506 563 -627 698 -775 860 -952 1055 -1167 1293 -1432 1586 -1759 1958
47 1958 -2180 2438 -2740 3093 -3520 4048 -4716 5593 -6802 8586 -11483 16987 -31158 142317
61 142317 251398 -122013 -124956 117930 143834 -122728 -142163 82004 128157 -82035 -113369
72 -113369 69864 121950 -37268 -78590 33606 49391 -61647 -48282 77296 89107 -26632
83 -26632 -55100 14072 30692 -13213 -5381 24206 3849 -18760 8887 11318 -33534 -28976 30089
96 30089 14792 -59237 -33369 74225 71281 -30220 -27618 70175 58092 -49189 -37707 66455
108 66455 34712 -100058 -85878 51407 46660 -87009 -75291 81971 102296 -38131 -68241
119f8241J19052J6994j29800l5249J14384M9164p7759k3908P1408N180p9909q110
131d6794O9547j1018q4495Q110R9678K2354p1985j7968N9951Q229o2895j4432
143d1718N9016L1950l0875k8818j86l700o924O731l006k4844J630M3362K7378
156B9996j5313n677K4369l954m7244j9492L4978K1881k4386j4474K3470J0747
168A4901k2425m421K9440O044l6508k3172K2942K5188q771j5183R966J7166O37
181A5804m914P890R937q035k0291j4790j947K871J399L573O739n50q099L689K0747
196A4023P373k1374j3991K5008K7901j3655k7821O901J5653k4604l4198J5405
208b3379L8439k915k3840J3937K9818j3457l1741Q087J8334k6768k9454L4375
$$ plain form
119 -68241 50811 67805 -61995 -97244 17140 66304 -11455 -35363 36045 41225 -38684 -46794
131 -46794 22753 11735 -72760 -64650 35028 57382 -14603 -32571 27380 35609 -27286 -41718
143 -41718 17298 49248 18373 -10445 -10631 -14331 -21255 -14524 -17530 -42374 -40744 2618 29996
156 29996 14683 9006 33375 29421 -17823 -37315 -2337 19544 -4842 -19316 4154 14901
168 14901 -7524 -11945 17495 23539 -12969 -36141 -13199 11989 3218 -11965 -1999 15167 15804
181 15804 10890 18780 28717 20682 391 -14399 -16346 -13475 -12076 -8503 -1764 -2314 -10413 -6724 14023
196 14023 21396 22 -13969 11039 38940 25285 -2536 4365 20018 -4586 -38784 -23379
208 -23379 15060 12145 -11695 2242 32060 18603 -13138 -5051 13283 -13485 -42939 -8564
220h564N2512r463l6542J2104K8770k7201m5489J0493L2929j7992l5393J8182
232b5654L8441n863k1070J7297K0576k2849j9959K8316K6352k4525k6252J4275
244i15J0073k5481j0282K7520P681k8255k956L3616K820l1845O134L9181j2426
257A4865n0899J0039N8459m812o0528K718O2556J236o0799q84O1110l801p3173
270d3913j3073N9852R469n4878J58O7510J6605m8047k976N0414k719o2235j3264
283c7097M5516N798m2290O41M5089J111l9461J547L6697n261l6034O065L5276
296A7597j565k1781J2165J9304k2409k4660K0730K0798k2539j3464L2016J2398
308B8590m2200j7706M4385J6231n6257k7054N7766L9672m4624k7347N8650M0371
$$ plain form
220 -8564 43948 34485 -2057 10047 38817 11616 -33873 -23380 9549 -8443 -43836 -25654
232 -25654 12787 6924 -14146 3151 23727 878 -19081 9235 35587 11062 -15190 -915
244 -915 9158 -16323 -26605 915 8596 -19659 -22615 11001 13821 -18024 -11890 27291 14865
257 14865 -36034 -25995 32464 27652 -32876 -30158 32398 33634 -27165 -28049 33061 29260 -43913
270 -43913 -56986 2866 12335 -42543 -42385 25125 41730 -6317 -9293 41121 38402 -23833 -37097
283 -37097 8419 14217 -28073 -27432 17657 18768 -20693 -19146 17551 12290 -23744 -17679 17597
296 17597 16032 -5749 6416 25720 3311 -21349 -619 20179 -2360 -15824 16192 28590
308 28590 -13610 -31316 13069 29300 -26957 -54011 3755 43427 -1197 -28544 30106 70477
320G0477n7487n1919M3407M5771m6360n5817L1579M7726k7924l8220L6711M7474
332D5418k6594m3128K2259L7271k3961l5718K1438L2399k2486l1406K5116L6780
344C7388j9014l6909Q211K5094j3392k4709J1124K4039n681j6839N166J2443k684
357D237m75J0010k015j1701P546J8373j3781l0356L327K4034j5078l7596J1945
370c1530M9195L618l8670K887M6332K099m9614j0896M0857P051m4976j0167M4434
383A0620J5200l7894j0541L8072O741m4480j3173M0549J1152m0993r122M6536
395A2667J6737m1098j3694M4801J9381m1836k3665L3608J8992l4327k2486K5986
407d934J6113k5922j5838K2099J4547j3442L76K2130J004j9266M629J9380j4353
$$ plain form
320 70477 12990 -38929 4478 50249 3889 -51928 -20349 27377 -547 -38767 -2056 45418
332 45418 18824 -24304 -2045 35226 11265 -24453 -3015 29384 6898 -24508 608 37388
344 37388 18374 -18535 -10324 14770 1378 -23331 -12207 11832 6151 -10688 -5522 6921 4237
357 4237 3762 13772 11757 56 7602 25975 12194 -18162 -14835 9199 -5879 -43475 -31530
370 -31530 17665 21283 -17387 -14500 31832 33931 -15683 -26579 14278 21329 -23647 -33814 10620
383 10620 25820 -12074 -22615 15457 22198 -22282 -35455 5094 16246 -24747 -33869 12667
395 12667 29404 -11694 -25388 19413 38794 -3042 -26707 6901 25893 -8434 -30920 -4934
407 -4934 11179 -14743 -30581 -8482 6065 -7377 -7001 15129 16133 -3133 1496 20876 6523
420F523k9869R979K7342j4875l1115J9677M1791j1082m0560Q778L6271j2933l9682
433b9755R543L9770p237l2223J4872L8506r847l2535J1765K6742k3361l7130J8075
446a2815L3076k1111l4354K3704L8342j9932l3373K5273L9737k0380l7671J8200
458a304L4342j9367l4197J5914K6985k2036k9192K1127K7591j8869k1467K5514
470E041K2973k6524k3546K5820K1571k8153k3935K8516K6194k2283j9716K5927
482A1885K0943k7580k8338J4858J6596j9051j7069J7768J6639j0208m549J8111
494A0005P783j4472l467J2594l679j9364K023J8357n572k4151L645K2603l155
507C150k1392O549K4820m178k3196M938K3639n339k5139M120K3476l952k1998
$$ plain form
420 6523 -23346 -13367 13975 -900 -32015 -12338 29453 18371 -22189 -13411 22860 9927 -29755
433 -29755 -20212 19558 12321 -19902 -5030 33476 23629 -8906 2859 29601 6240 -30890 -12815
446 -12815 20261 -850 -35204 -11500 26842 6910 -26463 -1190 38547 18167 -19504 -1304
458 -1304 33038 13671 -20526 -4612 22373 337 -28855 -7728 19863 994 -20473 5041
470 5041 28014 1490 -22056 3764 25335 -2818 -26753 1763 27957 5674 -14042 11885
482 11885 32828 5248 -23090 -8232 8364 -10687 -27756 -9988 6651 -3557 -8106 10005
494 10005 17788 3316 -151 12443 8764 -10600 -8577 9780 4208 -19943 -16298 6305 3150
507 3150 -18242 -11693 13127 8949 -14247 -9309 14330 8991 -16148 -12028 11448 7496 -14502
520a4502O449K4827n087k5563Q69K2273l610k6631k868K2472M384j7854j162K3964
534G961J1069j4585p616J3128Q098j4824j5333L694P852o379r702O757J4006J254
548E380r639j191J0484M325q652n776O167N489m672m635M907N426l473n887Q89
563h58K824j201o34J083k643n015J050L651j893j167Q988Q911m771n043J0370
578A3652P591j4059j5001P779Q481j5173j4197J7172J8950j4434j6426J8872K2557
591B5764j6266k2580J6025K3352j9048k6972J6716K5907j7084k6320J8336K7390
603B5220j6898k8488J5584K5529j8684k7778J6125K5310j4291k1146J8762K3997
615B3242j4204j7527J6529J3248k0748j3993J8741P083k6936q947K6649O249k8803
$$ plain form
520 -14502 -8053 16774 11687 -13876 -13007 9266 5656 -20975 -23843 -1371 3013 -14841 -16003 7961
534 7961 19030 4445 -3171 9957 18055 3231 -12102 -8408 -556 -6935 -16637 -9880 4126 5380
548 5380 -4259 -5450 5034 9359 707 -5069 1098 6587 1915 -2720 2187 7613 4140 -1747 -858
563 -858 1966 765 131 1214 -1429 -6444 -5394 -1743 -3636 -4803 4185 13096 8325 3282 13652
578 13652 21243 7184 -7817 -38 8443 -6730 -20927 -3755 15195 761 -15665 3207 25764
591 25764 9498 -13082 2943 26295 7247 -19725 -3009 22898 5814 -20506 -2170 25220
603 25220 8322 -20166 -4582 20947 2263 -25515 -9390 15920 1629 -19517 -755 23242
615 23242 9038 -8489 8040 21288 540 -13453 5288 12371 -14565 -23512 3137 9386 -19417
628a9417j387L7015P234l5479l967L8121L609m2013p543L8416K983m1618l090
641b7136M3579M913m1381l027M0879n45m3556M3M3011O6m3656K484M4655R89m0908
656a9590L441M2148k764m2355Q15L6580o164l8609L878L1910q064k9023J4594
669a3203L3810j0496k6025J7204K5526k2845k6568K3438K4393k9622k7245K9446
681b187K7148l0137k4878L3554K6822l4669k7682L4081K7860l2932k6543L2749
693C186K4435l1408k0786L5315K2787l2625k1264K9964J5401l4123j7218L1676
705E340J2734l3190j2389L4937J6147k7780q659L0381Q452k9144q564K5576L045
718A6886k7028m824K2810j154k2256P001K5807o414k4712Q187K5062j0527k7155
$$ plain form
628 -19417 -20804 16211 23445 -12034 -16001 22120 25729 -16284 -23827 14589 17572 -24046 -27136
641 -27136 16443 21356 -20025 -23052 17827 17282 -26274 -26231 16780 16846 -26810 -24326 20329 21318 -19590
656 -19590 -16149 25999 23235 -19120 -18305 18275 12111 -26498 -22620 9290 1226 -27797 -13203
669 -13203 20607 10111 -15914 1290 26816 3971 -22597 841 25234 -4388 -31633 -2187
681 -2187 24961 -5176 -30054 3500 30322 -4347 -32029 2052 29912 -3020 -29563 3186
693 3186 27621 -3787 -24573 10742 33529 904 -20360 9604 25005 -9118 -26336 5340
705 5340 18074 -15116 -27505 7432 23579 -4201 -12860 17521 25973 -3171 -11735 13841 16886
718 16886 -10142 -14966 7844 6690 -15566 -8565 17242 10828 -13884 -5697 19365 8838 -18317
731a8317J1567K6855j1358k7473J2313L0086q695k7313O897K3950r985k6165O460
744a1178K1885p494k1005O622J9660m100j4427R035J5734o026j2886O514R012
757A1346r476j1198M708N929q537n889Q517P167m701j187P478P86p798q26O427
772B746k231q098K973R010k578q053M867J0174m151j2232J69Q533k824r687N59
787a0823R668K477n949p12P552N565k459m720n93K703K10n541m239L006L870m504
803d489o667M828J0429n90p613L080J0378k125j1003J562J0444m168j3256K327
817f863J4375q27j1612L529J2523m338j4980K180J2475m747j3985M607J5068j358
831F047r515P993J1855p153j2358O120P700j0594j0300R204Q090j2264o384J5789
$$ plain form
731 -18317 -6750 20105 8747 -18726 -6413 23673 14978 -12335 -5438 18512 8527 -17638 -11178
744 -11178 10707 3213 -17792 -11170 8490 4390 -10037 -1002 14732 8706 -4180 2334 11346
757 11346 1870 -9328 -4620 1309 -7228 -13117 -4600 2567 -2134 -3321 4157 4943 -2855 -3681 2746
772 2746 515 -7583 -4610 4400 1822 -6231 -1364 8810 4659 -7573 -7404 1129 -1695 -11382 -10823
787 -10823 -1155 1322 -4627 -5339 2213 7778 5319 599 6 2709 2919 -2622 -6861 -3855 15 -4489
803 -4489 -11156 -6328 4101 3511 -4102 -1022 9356 7231 -3772 -2210 8234 4066 -9190 -6863
817 -6863 7512 6685 -4927 -1398 11125 6787 -8193 -6013 6462 1715 -12270 -7663 7405 6047
831 6047 -3468 4525 16380 9227 -3131 2989 10689 95 -10205 -1001 7089 -5175 -11559 4230
845D230Q796j5738o687J8267P849j8727o497K0027O165k2932p916K1904O781k3216
859g694p273K3956O762k2843n527K3665M673k5251o885K3118M982k2038k280K5469
873A2834M547k1544j577K1703k026k4546j765J8855l603k1149N026K3233l340
886F648j8623Q016K1116r082k1089Q320J9723j1595k0863J2459K0589j4221k1509
899b0111J5072K1644j5671k2875J5513K2419j5166k1350J6539K1449j6287k2049
911b0873J5589K1351j4093j8566J6396J8815j6531j8343J4517J5130j7328j7362
923b1298J3133J4295j2690q376J8617J2713j5010j0194J4188O939j6641p545J4403
936B534L272j7052k505K0809N374j8024m266J6852R45j8606q54K0436K000j9552
$$ plain form
845 4230 13026 -2712 -9399 8868 16717 -2010 -8507 11520 17685 -5247 -13163 8741 15522 -7694
859 -7694 -14967 8989 15751 -7092 -12619 11046 15719 -9532 -16417 6701 11683 -10355 -12635 12834
873 12834 17381 -4163 -5740 15963 13937 -10609 -12374 6481 2878 -18271 -13245 9988 6648
886 6648 -11975 -3959 17157 8075 -13014 -4694 15029 3434 -17429 -4970 15619 1398 -20111
899 -20111 -5039 16605 934 -21941 -6428 15991 825 -20525 -3986 17463 1176 -20873
911 -20873 -5284 16067 1974 -16592 -196 18619 2088 -16255 -1738 13392 -3936 -21298
923 -21298 -8165 6130 -6560 -14936 3681 16394 1384 -8810 5378 12317 -4324 -11869 2534
936 2534 5806 -11246 -13751 7058 12432 -5592 -9858 6994 7939 -10667 -11521 8915 10915 -8637
950h637j290J9875J887j7571l83J8165j632k0417l47K0110K047j8813l309J5989
964E674O86j6597M16J7591L345j3867m69J4113J391j2788j484R630l994j4056
978a0409O16J3444R11q843L215J1039k624j1561J953R718l702j1553L285J0890
992F379j863p966N200J0434n734j3108K582J0566m588j1840L828J3011k957j2546
1006h602K981J3194q75j1666K05J1865K16j1246L8J0524o68j2179l025Q278J026
1021F6p588K71R913K904o514j557O486Qp007j008L634j963m357M072O673j297
1037B736m306K864L128p293o994N361N965o075n948Q630R045n658o767Q662P302
1052A0652j1438j0556Q888J0948r407j0987J0538J1079j0628j3674J0104J5023
$$ plain form
950 -8637 -9927 9948 11835 -5736 -6119 12046 10414 -10003 -10350 9760 11807 -7006 -10315 5674
964 5674 6360 -10237 -9821 7770 11115 -2752 -3221 10892 12283 -505 -1989 7641 3647 -10409
978 -10409 -9793 3651 4562 -4281 -1066 9973 7349 -4212 -2259 7459 3757 -7796 -4511 6379
992 6379 4516 -3450 1750 12184 6450 -6658 -4076 6490 1902 -9938 -6110 6901 3944 -8602
1006 -8602 -5621 7573 6698 -4968 -4763 7102 7318 -3928 -3890 6634 5966 -6213 -9238 -960 66
1021 66 -7522 -7251 2662 5566 -948 -2505 3981 3989 -3018 -4026 -392 -2355 -6712 -2640 4033 2736
1037 2736 -1570 1294 4422 -2871 -9865 -4504 1461 -4614 -10562 -1932 7113 1455 -5312 3350 10652
1052 10652 -786 -11342 -2454 8494 -913 -11900 -1362 9717 -911 -14585 -4481 10542
1064A0542q213j4545Q469J6269n159j4510M781J3317o201j5138K634J3444j199
1077D491r770L196J0713l017r454J742O352l612p505L091O813j441j976N538M066
1092I227m373m289K388K33n925j732N602M68m668J522P964n13p303P75P584k255
1108D705r377K244J0849j172j0725O75J0238m75j2740j033J1548K088j0876j273
1122e324J1335L279j0479m588P746K534p734l242Q423M894m902k605N336J986
1136F659o434m578J539J375l507j150N187M248j310j749K225R33k678l146K79
1151b107J015j039q97J186K387K67j042o43j260j120k29J402P56p18M29K256M56
1168A099k875r72K761J136m497k200M917M845l676m361K668L542n355o733M439
$$ plain form
1064 10542 2329 -12216 -3747 12522 7363 -7147 -2366 10951 4750 -10388 -7754 5690 4491
1077 4491 -5279 -2083 8630 5613 -3841 -2099 4253 641 -6864 -3773 3040 1599 -377 5161 9227
1092 9227 4854 565 2953 3186 -2739 -4471 1131 1599 -3069 -1547 6417 5904 -1399 -624 6960 4705
1108 4705 -4672 -2428 8421 7249 -3476 -2801 7437 6962 -5778 -6811 4737 6825 -4051 -5324
1122 -5324 6011 9290 -1189 -5777 1969 4503 -3231 -6473 1950 6844 1942 -663 4673 6659
1136 6659 225 -4353 -2814 -1439 -4946 -6096 -909 3339 2029 280 2505 3438 760 -2386 -2107
1151 -2107 -1092 -2131 -3028 -1842 545 812 -230 -873 -2133 -3253 -3482 -2080 -1324 -2042 -1613 643 1099
1168 1099 -1776 -2748 13 1149 -3348 -5548 -631 4214 538 -3823 -1155 2387 -2968 -9701 -5262
1183e262O893j972n389M957P352k747o481K511M689n977q646M444Q719k890n549
1198e348N787O825n873p675N555P063p218q148P542Q369o401o155R071P650j0196
1213H48r331Q842P688r041p127J0067P529j0145p519J0898P061j1352p440J2206
1227C184O228j0943n087J3561O295j3592p405J1250L727j3392l794J3859M754
1240H645j1180j971J3077J496j3484j580J1589k281j4489L548J6103q79j4318
1253e724L949J4470o646j7255N174J5778o290j6356Q432J7876p912j7525R215
1266b814J8069j0750k0571R316K0437p438j8880Q138J8502r202j8975P451J6906
1279A0189p353j5505P902J5269q099j2315R798J1507j0993j2903J0047J0129j1039
$$ plain form
1183 -5262 1631 -341 -5730 -773 6579 3832 -2649 -138 4551 -1426 -10072 -5628 3091 201 -5348
1198 -5348 439 7264 1391 -6284 -729 6334 -884 -9032 -1490 6879 478 -5677 3394 11044 848
1213 848 -8483 359 8047 -994 -8121 1946 9475 -670 -8189 2709 9770 -1582 -9022 3184
1227 3184 9412 -1531 -6618 6943 13238 -354 -7759 3491 7218 -6174 -9968 3891 8645
1240 8645 -2535 -4506 8571 10067 -3417 -4997 6592 4311 -10178 -6630 9473 8594 -5724
1253 -5724 -1775 12695 6049 -11206 -6032 9746 3456 -12900 -4468 13408 5496 -12029 -2814
1266 -2814 15255 4505 -16066 -6750 13687 6249 -12631 -4493 14009 4807 -14168 -6717 10189
1279 10189 2836 -12669 -4767 10502 2403 -9912 -114 11393 400 -12503 -2456 7673 -3366
1292c366q768J2807R423j1749p639J2118N738j2910n883J2428K129j3858j142
1305a0672J7585K524j5618o20J6472j526j9810k10J9283n5j8752Q31K1169K50
1319A0851j9948n34J9389j143k0758q9K0613K827j6429j354J4932K12j6207j615
1333i253J2829J430r889J176J0484j245q274L160N811n806q417N660P541m234
1347I73m684P327M876o764n064N571K460o718j993P990N19q482J062J1354q23
1362G604j2658L21J2801J76j3927j582J3908K900j3769l535J3114N176j1357n457
1376f285R252M344q907m355P429M623m845l152L545K333m023l170J374J892k01
1391a46O96J004N29J63j31k556k525L85J680j071p4L779K869l581k708L285L19
$$ plain form
1292 -3366 -12134 673 10096 -1653 -9292 2826 8564 -4346 -10229 2199 4328 -9530 -10672
1305 -10672 6913 9437 -6181 -6801 9671 8145 -11665 -11875 7408 7353 -11399 -10568 10601 10851
1319 10851 -9097 -9631 9758 8615 -12143 -12232 8381 11208 -5221 -6575 8357 8569 -7638 -9253
1333 -9253 3576 5006 -4883 -3707 6777 5532 -2742 418 6229 423 -7994 -2334 5207 973
1347 973 -3711 3616 8492 1728 -3336 2235 4695 -2023 -4016 3974 4493 -3989 -2927 8427 7604
1362 7604 -5054 -4733 8068 8244 -5683 -7265 6643 9543 -4226 -7761 5353 10529 -828 -6285
1376 -6285 2967 7311 -1596 -5951 1478 6101 1256 -1896 1649 3982 -41 -3211 -1837 55 -146
1391 -146 550 1554 2083 2246 2115 -441 -2966 -2581 -901 -1972 -2046 1733 4602 1021 -1687 1598 1917
1408A917p090k991P085N207n145m025P128M857p480p158M670O356l696n662L270
1423b757N878k060l535P98J010k477j38K812l60k717L073M068l453n876L244N601
1439C111k988n688L452N129l778n253N067M852n002l968O081L748p683l987Q390
1454A483L765r696l408J0995N627r958m991J0294L277j3106n450J2698O788j1004
1468b686m670J2565N279j2187o039J0088M145j0715l105J1786L998r699j226R122
1482F656r16j2691q0J1669O22j0404K391J1982j398j3063L51J0625j390j0165
1496e811K485J0143j503q190L430O906o125p929N582P168o710n631Q613P476r982
1511g8p811R732P644j0263p237J1060O706j1480o910J1055O654j1756o198J2189
$$ plain form
1408 1917 -5173 -8164 -1079 4128 -1017 -5042 2086 6943 -537 -7695 -3025 3331 -365 -6027 -2757
1423 -2757 3121 1061 -2474 -1676 -666 -3143 -3281 -469 -829 -3546 -473 3595 142 -5734 -2490 3111
1439 3111 123 -5565 -2113 3016 -762 -6015 -948 3904 -1098 -5066 1015 4763 -2920 -6907 1483
1454 1483 5248 -4448 -7856 3139 8766 -1192 -6183 4111 7388 -5718 -11168 1530 8318 -2686
1468 -2686 -7356 5209 10488 -1699 -7738 2350 6495 -4220 -7325 4461 8459 -1240 -2466 6656
1482 6656 5740 -6951 -7031 4638 5260 -5144 -2753 9229 7831 -5232 -4881 5744 4354 -5811
1496 -5811 -3326 6817 5314 -2876 554 7460 1335 -6594 -1012 6156 -554 -6185 2428 9904 -78
1511 -78 -7889 1843 9487 -776 -8013 3047 9753 -1727 -8637 2418 9072 -2684 -8882 3307
1525C307O211j2698o364J2782N626j3612o000J3780O778j1910n957J2924M595
1538I462j3994o473J1793N625j0662l906J1788M841j1509n372Q820L877r263k584
1552g557R070L586n982j477O692p96q344n96N763j086m287M005O338l455p342
1567e468L548N010m880n925O585O709n039n329N786O354o815p871N520O375n935
1582a375n908O721P910o751p671N017P641m689o319N102O606l960o432L992N408
1597E292l606n629L786N098k706n129K302M272k291m901J268M449N82j582O04
1612A809J016j016j157l47k60K9J671J786j909k325J479K286l023m610K364N518
1628C311o01l899J801N145n16o922j724M657J614l892j032N265K416m822l872
$$ plain form
1525 3307 9518 -3180 -9544 3238 8864 -4748 -10748 3032 9810 -2100 -8057 4867 9462
1538 9462 -4532 -11005 788 6413 -4249 -8155 3633 8474 -3035 -8407 413 4290 -4973 -7557
1552 -7557 1513 5099 -883 -2360 4332 3536 -4808 -5404 359 -727 -5014 -1009 5329 1874 -5468
1567 -5468 -1920 3090 -1790 -7715 -1130 5579 540 -4789 997 7351 536 -7335 -1815 4560 -1375
1582 -1375 -7283 -562 7348 597 -7074 -2057 5584 895 -5424 -322 6284 2324 -4108 -116 5292
1597 5292 1686 -3943 -157 4941 2235 -2894 -592 3680 1389 -3512 -2244 2205 2787 1205 1809
1612 1809 2825 1809 652 305 45 74 1745 3531 1622 -703 776 3062 39 -4571 -2207 3311
1628 3311 2710 -1189 612 5757 5241 -1681 -3405 1252 2866 -1026 -2058 3207 5623 801 -3071
1643c071L252K313l842l210L609M295k299k649K818L567l613m826K257M626j751
1658A476m549J696M679j771o430L51N928N58n044j138N202K762l806l096K634
1673e48K146j429k141Q39J411l58o21j084j260K30K242K55k296l30L290P16l291
1690b229k232L271K459k109j349K993K228l070k261J716M7l017n09L672J062l472
1706b800Q77M611L17n884j171N637J523m854j120N473K170n615l348M033L020
1721B869m209k933L626L460j860k485J907P25j470r20J915M09j093J114K609j219
1737B445l343J73L152q19m146K59L557Q07k982j222L145K239j870j322J212J605
1753B890o8j491p80o68K65R74m93j543K85K281P52k653j418J953J922j420k444
$$ plain form
1643 -3071 181 2494 -1348 -4558 -949 3346 1047 -1602 1216 4783 1170 -3656 -1399 3227 1476
1658 1476 -3073 -1377 3302 1531 -4899 -4548 1380 1938 -3106 -4244 958 3720 -86 -3182 -548
1673 -548 1598 169 -1972 -1133 278 -80 -701 -1785 -3045 -2815 -573 -318 -2614 -2944 346 1062 -2229
1690 -2229 -4461 -1190 1269 -840 -2189 804 3032 -38 -2299 -583 -536 -3553 -4062 -390 672 -2800
1706 -2800 -1923 2688 3005 -2879 -4050 1587 3110 -1744 -2864 2609 4779 -836 -4184 -151 2869
1721 2869 -1340 -4273 -647 2813 953 -1532 375 1100 -370 -1290 625 1034 -59 1055 3664 2445
1737 2445 -898 -725 2427 1608 -2538 -2279 1278 2085 -897 -2119 1026 3265 1395 73 1285 2890
1753 2890 2822 1331 551 -117 148 1122 629 -914 -629 1652 2404 -249 -1667 286 2208 788 -1656
1770a656J544L116m29k359l30J576r5j629m64J331J81j290n82Q18m25j275O69
1787a299J872l1j514Q81L522l26l889o57K796M45m513k096M725K929m306l912
1803e373L997M596l159m873L182M669j861m999J811M791q09m479J004L224j750
1818b9k661J543K987k903l164K347K540k290k111L816K572k765k669L859K477
1833C549k855k533K417O70k850j241L040J39l003J47M063n92m117K265N536j501
1849C134o639J526O542j940p130K747P542k612q064K091Q262k013q537J924P883
1864D716k214q274K652R031j656p788K245P872k113p328K572O554l557p492K198
1879b582O577l331n459M332N118l534n185M992N147m241m194M474L295n534l490
$$ plain form
1770 -1656 -112 3004 2575 216 -114 1462 1367 -262 -726 605 786 -504 -1086 -268 -693 -1968 -1299
1787 -1299 573 542 -972 -91 3431 3105 -784 -1441 1355 1800 -2713 -4809 -84 2845 -1461 -5373
1803 -5373 -1376 3220 61 -4812 -1630 3039 1178 -3821 -2010 2781 1972 -2507 -1503 1721 -29
1818 -29 -2690 -1147 1840 -1063 -4227 -1880 660 -1630 -3741 75 2647 -118 -2787 1072 3549
1833 3549 694 -1839 578 1248 -1602 -2843 197 336 -2667 -2520 1543 951 -3166 -901 4635 3134
1849 3134 -3505 -1979 4563 2623 -4507 -1760 5782 3170 -4894 -2803 5459 3446 -5091 -3167 4716
1864 4716 2502 -5772 -3120 5911 4255 -3533 -1288 6584 4471 -2857 -285 6269 2712 -4780 -2582
1879 -2582 3995 664 -4795 -463 4655 1121 -4064 928 6075 1834 -2360 2114 5409 -125 -3615
1894c615N741L235o716k533O684J910p633j926Q193J481q807k418Q572K809p684
$$ plain form
1894 -3615 2126 5361 -1355 -3888 2796 4706 -2927 -4853 3340 4821 -3986 -6404 2168 4977 -2707
$$ [...]
8191i7
##END NTUPLES=NMR FID
##END=
