##TITLE=1H_SAV-68-f5(1d)
 CDCl3, 8 sc, 
 5.6.2020
##JCAMPDX= 6.0         $$ Bruker NMR JCAMP-DX V2.0
##DATA TYPE= NMR FID
##DATA CLASS= NTUPLES
##ORIGIN= UXNMR, Bruker Analytische Messtechnik GmbH
##OWNER= root
$$ XWIN-NMR		Version 3.5
$$ Fri Jun  5 11:18:52 2020 Russian Standard Time (UT+4h)  she@DPX200
##.OBSERVE FREQUENCY= 200.1315
##.OBSERVE NUCLEUS= ^1H
##.DELAY= (6, 6)
##.ACQUISITION MODE= SIMULTANEOUS
##.ACQUISITION SCHEME= undefined
##.AVERAGES= 8
##.DIGITISER RES= 18
##SPECTROMETER/DATA SYSTEM= spect
##.PULSE SEQUENCE= zg30
##.SOLVENT NAME= D2O
##.SHIFT REFERENCE= (INTERNAL, D2O, 0, 15.7039)
##AUDIT TRAIL= $$ (NUMBER, WHEN, WHO, WHERE, WHAT)
$$ ##TITLE= Audit trail, XWIN-NMR		Version 3.5
$$ ##JCAMPDX= 5.01
$$ ##ORIGIN= Bruker BioSpin GmbH
$$ ##OWNER= she
$$ F:/spectra/data/she/nmr/H-F/1/audita.txt
$$ ##AUDIT TRAIL=  $$ (NUMBER, WHEN, WHO, WHERE, WHAT)
(   1,<2020-06-05 11:17:48.18 +0400>,<she>,<DPX200>,
      <created by zg, POWCHK disabled, PULCHK disabled
       configuration hash MD5:
       00 E9 B6 7A A2 85 ED C7 34 08 36 98 17 FE 4E 26
       data hash MD5: 16K
       7D DE 32 C6 61 C5 AB 9B D3 B2 44 24 77 ED F4 F5>)
$$ ##END=
$$ 
$$ hash MD5
$$ 8A A3 62 74 AE 41 F8 74 A7 62 E2 27 0C 94 7D E3
##$RELAX= 
##$RELAX= 
##$RELAX= 
##$RELAX= 
##$RELAX= 
##$RELAX= 
$$ Bruker specific parameters
$$ --------------------------
##$DU= <F:/spectra>
##$EXPNO= 1
##$NAME= <H-F>
##$PROCNO= 1
##$TYPE= <nmr>
##$USER= <she>
##$AMP= (0..31)
100 100 100 100 100 100 100 100 100 100 100 100 100 100 100 100 100 100 
100 100 100 100 100 100 100 100 100 100 100 100 100 100 
##$AQSEQ= 0
##$AQ_mod= 1
##$AUNM= <au_zg>
##$AUTOPOS= <>
##$BF1= 200.13
##$BF2= 200.13
##$BF3= 200.13
##$BF4= 200.13
##$BF5= 200.13
##$BF6= 200.13
##$BF7= 200.13
##$BF8= 200.13
##$BYTORDA= 1
##$CFDGTYP= 0
##$CFRGTYP= 5
##$CHEMSTR= <none>
##$CNST= (0..31)
1 1 145 1 1 1 1 1 1 1 1 1 1 1 1 1 1 1 1 1 1 1 1 1 1 1 1 1 1 1 1 1 
##$CPDPRG= <>
##$CPDPRG1= <>
##$CPDPRG2= <>
##$CPDPRG3= <>
##$CPDPRG4= <mlev>
##$CPDPRG5= <mlev>
##$CPDPRG6= <mlev>
##$CPDPRG7= <mlev>
##$CPDPRG8= <mlev>
##$CPDPRGB= <>
##$CPDPRGT= <>
##$D= (0..31)
0 1.2 0 0 0 0 0 0 0 0.06 0 0.03 0 0 0 0 0.0002 0 0 0 0 0 0 0 0 0 0 0 0 
0 0 0 
##$DATE= 1591341467
##$DBL= (0..7)
120 120 120 120 120 120 120 120 
##$DBP= (0..7)
150 150 150 150 150 150 150 150 
##$DBP07= 0
##$DBPNAM0= <>
##$DBPNAM1= <>
##$DBPNAM2= <>
##$DBPNAM3= <>
##$DBPNAM4= <>
##$DBPNAM5= <>
##$DBPNAM6= <>
##$DBPNAM7= <>
##$DBPOAL= (0..7)
0.5 0.5 0.5 0.5 0.5 0.5 0.5 0.5 
##$DBPOFFS= (0..7)
0 0 0 0 0 0 0 0 
##$DE= 6
##$DECBNUC= <off>
##$DECIM= 24
##$DECNUC= <off>
##$DECSTAT= 4
##$DIGMOD= 1
##$DIGTYP= 9
##$DL= (0..7)
0 120 120 120 120 120 120 120 
##$DP= (0..7)
150 150 150 150 150 150 150 150 
##$DP07= 0
##$DPNAME0= <>
##$DPNAME1= <>
##$DPNAME2= <>
##$DPNAME3= <>
##$DPNAME4= <>
##$DPNAME5= <>
##$DPNAME6= <>
##$DPNAME7= <>
##$DPOAL= (0..7)
0.5 0.5 0.5 0.5 0.5 0.5 0.5 0.5 
##$DPOFFS= (0..7)
0 0 0 0 0 0 0 0 
##$DQDMODE= 0
##$DR= 18
##$DS= 0
##$DSLIST= <SSSSSSSSSSSSSSS>
$$ [...]
##$SUBNAM2= <"">
##$SUBNAM3= <"">
##$SUBNAM4= <"">
##$SUBNAM5= <"">
##$SUBNAM6= <"">
##$SUBNAM7= <"">
##$SUBNAM8= <"">
##$SUBNAM9= <"">
##$SW= 24.9337058887773
##$SWIBOX= (0..15)
0 0 2 0 0 0 0 0 0 0 0 0 0 0 0 0 
##$SW_h= 4990.01996007984
##$TD= 16384
##$TD0= 1
##$TE= 0
##$TE2= 300
##$TE3= 300
##$TEG= 300
##$TL= (0..7)
0 120 120 120 120 120 120 120 
##$TP= (0..7)
150 150 150 150 150 150 150 150 
##$TP07= 0
##$TPNAME0= <>
##$TPNAME1= <>
##$TPNAME2= <>
##$TPNAME3= <>
##$TPNAME4= <>
##$TPNAME5= <>
##$TPNAME6= <>
##$TPNAME7= <>
##$TPOAL= (0..7)
0.5 0.5 0.5 0.5 0.5 0.5 0.5 0.5 
##$TPOFFS= (0..7)
0 0 0 0 0 0 0 0 
##$TUNHIN= 0
##$TUNHOUT= 0
##$TUNXOUT= 0
##$USERA1= <user>
##$USERA2= <user>
##$USERA3= <user>
##$USERA4= <user>
##$USERA5= <user>
##$V9= 5
##$VALIST= <valist>
##$VCLIST= <CCCCCCCCCCCCCCC>
##$VD= 0
##$VDLIST= <DDDDDDDDDDDDDDD>
##$VPLIST= <PPPPPPPPPPPPPPP>
##$VTLIST= <TTTTTTTTTTTTTTT>
##$WBST= 1024
##$WBSW= 4
##$XGAIN= (0..3)
0 0 0 0 
##$XL= 0
##$YL= 0
##$YMAX_a= 246484
##$YMIN_a= -117277
##$ZGOPTNS= <>
##$ZL1= 120
##$ZL2= 120
##$ZL3= 120
##$ZL4= 120
##$ABSF1= 10
##$ABSF2= 0
##$ABSG= 5
##$ABSL= 3
##$ALPHA= 0
##$AQORDER= 0
##$ASSFAC= 0
##$ASSFACI= 0
##$ASSFACX= 0
##$ASSWID= 0
##$AUNMP= <proc_1d>
##$AZFE= 0.1
##$AZFW= 0.1
##$BCFW= 1
##$BC_mod= 2
##$BYTORDP= 1
##$COROFFS= 0
##$CY= 11.3945322036743
##$DATMOD= 1
##$DC= 2
##$DFILT= <>
##$DTYPP= 0
##$F1P= 16.9975609425685
##$F2P= -3.02152046262296
##$FCOR= 0.5
##$FTSIZE= 0
##$FT_mod= 4
##$GAMMA= 1
##$GB= 0.15
##$INTBC= 1
##$INTSCL= 1
##$ISEN= 128
##$LB= 0.24
##$LEV0= 0
##$LPBIN= 0
##$MAXI= 10000
##$MC2= 0
##$MEAN= 0
##$ME_mod= 0
##$MI= 1.114404
##$NCOEF= 0
##$NC_proc= 0
##$NLEV= 6
##$NOISF1= 3.799351
##$NOISF2= 2.8
##$NSP= 1
##$NTH_PI= 0
##$NZP= 0
##$OFFSET= 15.70392
##$PC= 1
##$PHC0= -9802.349
##$PHC1= 25.80082
##$PH_mod= 1
##$PKNL= yes
##$PPARMOD= 0
##$PSCAL= 0
##$PSIGN= 0
##$REVERSE= no
##$SF= 200.130013532006
##$SI= 16384
##$SIGF1= 3
##$SIGF2= 2
##$SINO= 400
##$SIOLD= 16384
##$SREGLST= <1H.CDCl3>
##$SSB= 0
##$STSI= 0
##$STSR= 0
##$SW_p= 3612.71676300578
##$SYMM= 0
##$S_DEV= 0
##$TDeff= 0
##$TDoff= 0
##$TI= <>
##$TILT= no
##$TM1= 0
##$TM2= 0
##$TOPLEV= 0
##$USERP1= <user>
##$USERP2= <user>
##$USERP3= <user>
##$USERP4= <user>
##$USERP5= <user>
##$WDW= 1
##$XDIM= 8192
##$YMAX_p= 0
##$YMIN_p= 0
$$ End of Bruker specific parameters
$$ ---------------------------------
##NTUPLES= NMR FID
##VAR_NAME=  TIME,          FID/REAL,        FID/IMAG
##SYMBOL=    X,             R,               I
##VAR_TYPE=  INDEPENDENT,   DEPENDENT,       DEPENDENT
##VAR_FORM=  AFFN,          ASDF,            ASDF
##VAR_DIM=   8192,          8192,            8192
##UNITS=     SECONDS,       ARBITRARY UNITS, ARBITRARY UNITS
##FACTOR=    0.0002004,     1,               1
##FIRST=     0,             0,               0
##LAST=      1.6414764,     0,               0
##MIN=       0,             -117277,         0
##MAX=       1.6414764,     246484,          0
$$ Real data points
##PAGE= N=1
##DATA TABLE= (X++(R..R)), XYDATA
0@%%%%%%%%pJ5j6J6k2K9l1L8m7N6o8Q2r7J12j28J47j72J98k23K56k94L33l76M23
$$ 0 0 0 0 0 0 0 0 0 -7 8 -8 8 -14 15 -16 22 -25 31 -37 45 -52 60 -68 79 -93 105 -118 138 -156 177 -199 224
32B24m75N31n95O66p42Q28r22J022j132J253j386J534j698J883k091K323k587
$$ 224 -251 280 -315 351 -391 437 -485 537 -595 658 -728 806 -892 991 -1100 1223 -1364
49a364K889l241L657m154M762n527O527p890R879j3087J9309n1481J87208L9893
$$ -1364 1525 -1716 1941 -2213 2549 -2978 3549 -4341 5538 -7549 11760 -39721 147487 187380
63A87380k88779j5878K08931K1953k14194k222J89386J3446j92039j1701J71060
$$ 187380 -101399 -117277 91654 113607 -100587 -102809 86577 100023 -92016 -103717 67343
74F7343L4848j42803k0962J13164k5j19544M907J12940J5380q9449j4800N8904
$$ 67343 102191 -40612 -61574 51590 51565 -67979 -63072 49868 65248 -24201 -39001 19903
86A9903j409m5337J4824M0605k0845l3378K2147J5281l6203j1338M4016O023m7273
$$ 19903 18494 -26843 -12019 28586 7741 -25637 -3490 11791 -24412 -35750 8266 14289 -32984
99c2984n101N8536K945n7720Q786P1475l729p7507O481R1566P428q9967j4131
$$ -32984 -38085 20451 23396 -34324 -25538 45937 42208 -35299 -28818 62748 70176 -19791 -33922
112c3922P6056m626r7911m765J18883L9706r7047m2966P9613L8976q0500m4155
$$ -33922 42134 37508 -60403 -65168 53715 93421 -3626 -46592 33021 71997 -8503 -52658
124e2658O9503M2628o2913l7814N8221L0291n0773j9215N3472Q645q1616k9697
$$ -52658 16845 59473 -3440 -41254 16967 47258 -3515 -22730 30742 39387 -42229 -71926
136g1926P8637M8983n2792m9560L3576L4724l1560k3813L9129L5357j7991l3422
$$ -71926 6711 55694 2902 -46658 -13082 21642 -9918 -33731 5398 40755 22764 -10658
148a0658Q366J5085J487k893n056j7278j1578J4037J8079l377K233J9883j515
$$ -10658 -2292 12793 14280 11387 6331 -10947 -22525 -8488 9591 6214 8447 28330 26815
161B6815l3403j1213L4745J6761k9030k3166J7632J5959k2671o042L3587J8553
$$ 26815 -6588 -17801 16944 33705 4675 -18491 -859 15100 -7571 -13613 19974 38527
173C8527l5149l6605Q480K3052k483j0347R284Q744p766j2198N592K4066J1121
$$ 38527 3378 -33227 -24747 -1695 -4178 -14525 -5241 3503 -4263 -16461 -10869 13197 24318
186B4318j1536j8280l072L887L499L607J1489N160k0816k5766J1721L5744Q93
$$ 24318 12782 -5498 -8570 -4683 -1184 2423 13912 19072 -1744 -27510 -15789 19955 20848
199B0848k6793r89K8874J943k7569O126L3441N37m1975j5816K5401M647k2842
$$ 20848 -5945 -6934 21940 23883 -3686 2440 35881 36418 -5557 -21373 4028 8675 -14167
212a4167O188L4367J219l4482n158K6343k299l0651q84K2253l527k1599K0201
$$ -14167 -7979 26388 27607 -6875 -12033 14310 12011 -18640 -19524 2729 -798 -22397 -2196
225b196L8612l157l0922k185J2602j8719k1219K0885K8966j5902k8161J5071K4823
$$ -2196 36416 33259 2337 152 12754 -5965 -27184 -6299 22667 6765 -21396 -6325 18498
238A8498j2856j6280K2904K1396k6698k6510K2197K8156j6449k3875J6301J2483
$$ 18498 5642 -10638 12266 33662 6964 -19546 2651 30807 14358 -9517 6784 19267
250A9267k7192j8902K9762K2141k3436j8966J7535R043k9438q278L9924K2657
$$ 19267 -7925 -26827 2935 25076 1640 -17326 209 9252 -20186 -28464 11460 34117
262C4117l7436l0061K5044K3365k3372j1245L6566J3956m2261k6907L5678K6778
$$ 34117 -3319 -33380 -8336 15029 -8343 -19588 16978 30934 -11327 -38234 -2556 24222
274B4222l0737l0172K2611J9053k2059q727M3918K1060l6199k8837K4140J5450
$$ 24222 -6515 -36687 -14076 4977 -17082 -25809 18109 39169 2970 -25867 -1727 13723
286A3723k2414j1167L3339J1447l8147k1885L2040K4798k6789j8438K1885J1484
$$ 13723 -8691 -19858 13481 24928 -13219 -35104 -3064 21734 -5055 -23493 -1608 9876
298I876k6788o563L0270J6917k5095k0556J0072R613r530N490K3351l509k2233
$$ 9876 -16912 -23475 6795 23712 -1383 -21939 -11867 -2254 -11784 -6294 17057 13548 -8685
311h685m717J5292q190j7699J4246K2197j8125k9026J6921L9044j386k6847N718
$$ -8685 -13402 1890 -6300 -23999 -9753 12444 -5681 -34707 -17786 21258 19872 -6975 -1257
324a257K4172j3471l2479R431L2631m944l5329J587K9363J52k1208P491K6613
$$ -1257 22915 9444 -23035 -13604 19027 14083 -21246 -19659 9704 9856 -11352 -3861 22752
337B2752q769l5762J281L2056K272k4312N440K8723n717l3608L33L5292Q087l4762
$$ 22752 13983 -21779 -20498 11558 13830 -10482 -5042 23681 17964 -15644 -15311 19981 28068 -6694
351f694j8321K5539J5026k0084r035J9930J3938k1655j9308R651K1527L645n785
$$ -6694 -25015 524 15550 -4534 -13569 6361 20299 -1356 -20664 -11013 10514 14159 8374
364H374M689j3o646p094K265K210R7k114p312j1635N429K0401J2681r419j1604
$$ 8374 13063 13050 6404 -690 1575 3785 3882 1768 -5544 -17179 -11750 8651 21332 11913 309
379C09N015J319j0555l104J9118L450j7747p977J7256R447j2530m635J6863J283
$$ 309 5324 6643 -3912 -7016 12102 15552 -2195 -10172 7084 16531 4001 -634 16229 17512
393A7512l5241j2676L0538K2816k0487k2266J9492K0194j8020j8010K2485K6081
$$ 17512 -17729 -30405 133 22949 2462 -19804 -312 19882 1862 -16148 6337 32418
405C2418j9733l3026O098K9263m034k3118K348J8035n048k1243Q87K0704J0759
$$ 32418 12685 -20341 -14243 15020 10986 -12132 -9784 8251 3203 -18040 -17153 3551 14310
418A4310o851n822q14l557k45Q823K915n344n833R18m98j007N051J1050l411j3567
$$ 14310 7459 1637 823 -2734 -2979 5844 8759 3415 -2418 -1500 -1998 -3005 2046 13096 9685 -3882
434c882m131M596q97l009R016J0381r897j5249Q018K1189p83j4725P05R436j3306
$$ -3882 -8013 -3417 -4314 -7323 1693 12074 2177 -13072 -5054 16135 15352 627 1332 10768 -2538
449b538j7597J2089K5701o932l0724r86K4727O328j8153Q07K2790L345k5692r237
$$ -2538 -20135 -8046 17655 10723 -20001 -20987 3740 10068 -8085 -7278 15512 18857 -6835 -16072
463a6072K2937J0696j3437j2814Q405M619q050m199J5709R672q300j3842J887
$$ -16072 6865 17561 4124 -8690 -285 4334 -3716 -7915 7794 17466 9166 -4676 -2789
476b789N339l256j468L908K151j827k74J306N562R88L351m960p427q425j770J375
$$ -2789 2550 -706 -2174 1734 3885 2058 1784 3090 8652 9640 12991 8031 604 -7821 -9591 -8216
492h216L876Q214L77q254q268O470J4731K844j1419m930M318J352n771K830R951
$$ -8216 -4340 3874 4251 -4003 -12271 -5801 8930 11774 355 -4575 -257 1095 -4676 -1846 8105
507H105J872j3137r859P863R833k266m055K829M184p552o732M882J2467J017r534
$$ 8105 9977 -3160 -13019 -5156 4677 2411 -1644 1185 5369 -2183 -8915 -4033 8434 9451 -83
522h3q102M817N558J534j762L990j135o763r652J941N875k516m547K491L905j221
$$ -83 -8185 -3368 2190 3724 1962 5952 4817 -1946 -11598 -9657 -3782 -6298 -10845 -8354 -4449 -5670
538e670n308N798J3887K145j1140r918N16P41K184M522L783o183p245K76J0568
$$ -5670 -10978 -5180 8707 10852 -288 -10206 -9690 -8949 -6765 -2243 1540 -4643 -11888 -11612 -1044
553a044L482l86l410k512n421K82P736N888j894k673J408l518n610M074J2595
$$ -1044 2438 2052 -1358 -3870 -9291 -9009 -1273 4615 2721 48 1456 -2062 -7672 -3598 8997
568H997O2j4910p855N398M559o306J750J0309m93j7366J56J8983Q060j3507l478
$$ 8997 9059 -5851 -13706 -8308 -3749 -10055 -8305 2004 1511 -15855 -15699 3284 11344 -2163 -5641
583e641R896j735j4946l551J6405N005j1937l868Q565J230q128O073J3278j992
$$ -5641 4255 2520 -12426 -15977 428 5433 -6504 -10372 -1807 -577 -8705 -2632 10646 8654
597H654j3206j181R095p56l380O189P653r839j1623O522J3914o183r541P393L969
$$ 8654 -4552 -5733 3362 2606 -774 5415 13068 3229 -8394 -1872 12042 5859 -3682 3711 7680
612G680j5130j0441J5530J5166j1248j1521Q809P265j1524j342J7127J0206j9784
$$ 7680 -7450 -17891 -2361 12805 1557 -9964 -1155 6110 -5414 -6756 10371 20577 793
625G93j8505J2585J3660j0839r001J2823N440j5639q841K0393J5969j0394j4298
$$ 793 -17712 -5127 8533 -2306 -11307 1516 6956 -8683 -17524 2869 18838 8444 -5854
638e854P802O797j2574n223J5863J0473j4640r193J0620N276o982j060R731k873
$$ -5854 1948 8745 -3829 -9052 6811 17284 2644 -6549 4071 9347 2365 1305 11036 8163
652H163j9329j573J5123M422j1858n92J3132j241j6340L719J8443j209j8486n36
$$ 8163 -11166 -12739 2384 6806 -5052 -5644 7488 6247 -10093 -6374 12069 10860 -7626 -8162
666h162J4296n575j8222N021K1473l173j9593J793J9489l453j4204Q066J9281
$$ -8162 6134 559 -17663 -12642 8831 5658 -13935 -12142 7347 3894 -10310 -2244 17037
679A7037j0901k1648O797K1730k272j6643L847J3032r844j3697Q794J6744m730
$$ 17037 6136 -15512 -8715 13015 10743 -5900 -2053 10979 1135 -12562 -3768 12976 8246
692H246j4743J065N870o258k406J1659R491j3676q411P303P450m852j874J0710
$$ 8246 -6497 -5432 438 -5820 -8226 3433 12924 -752 -9163 -1860 5590 738 -1136 9574
706I574l043k1902k763J9182M932j2046k869J2152j412j2961M554J9715J992j8868
$$ 9574 6531 -15371 -18134 1048 5980 -6066 -8935 3217 1805 -11156 -6602 13113 15105 -3763
720c763l031J2007L67j1447K888J5745j861j9567Q34J5586M795j2274l085Q472
$$ -3763 -6794 5213 5580 -5867 -2979 12766 10905 -8662 -7828 7758 12553 279 -2806 5666
734E666k233j1262K880J1274L230q116k156N473k16m482O43L564r1o190M10l118
$$ 5666 3433 -7829 -4949 6325 9555 1439 -717 4756 4540 58 701 4265 4174 -2016 -1606 -4724
750d724j628L501P065j883p141j20O543K390l000O289K401n795j0185O48R280
$$ -4724 -6352 -2851 4214 2331 -4810 -4930 1613 4003 1003 7292 9693 3898 -6287 -5639 3641
765C641J967n783J638L130l877m261L346R303J237q968n671J412Q84J595M386
$$ 3641 5608 -175 1463 4593 716 -3545 -199 9104 10341 1373 -4298 -2886 -2002 -407 3979
780C979M651m362o967j539M912N560j622n350m205k951J526L521J676k878L804
$$ 3979 8630 4268 -2699 -4238 674 6234 4612 -738 -4943 -7894 -6368 -2847 -1171 -4049 -245
795b45N04m340j645O901O332m998o662J566L358m443l075N996Q026q191q898M351
$$ -245 259 -4081 -5726 1175 7507 2509 -4153 -2587 771 -3672 -6747 -751 7275 -916 -9814 -5463
811e463J0146q53n909L378L583o898q049P046P683l518m472M981K511o631m089
$$ -5463 4683 3830 -2079 1299 4882 -2016 -10065 -3019 4664 1146 -3326 1655 4166 -2465 -6554
826f554Q273O041q848n379J778J69m546K242J4720j105j1650k496J0536K449q983
$$ -6554 1719 7760 -1088 -6467 -4689 -4520 -9066 -6824 7896 6791 -4859 -7355 3181 5630 -3353
841c353K726R498q061j2275L150J6518j369j4804N565J1457p768j3537Q331K0439
$$ -3353 -627 8871 810 -11465 -8315 8203 6834 -7970 -2405 9052 1284 -12253 -3922 16517
855A6517n098j9523J996J5169l670j1754Q852J2058r451j7048R254J5657l983
$$ 16517 11419 -8104 -6108 9061 5391 -6363 2489 14547 5096 -11952 -2698 12959 8976
868H976j4974N899Q244j1012q864J0009J3624p477r265O885P676q876n180J2657
$$ 8976 -5998 -99 8145 -2867 -11731 -1722 11902 4425 -4840 2045 9721 845 -4335 8322
882H322P658j6351j1461J1032Q165j0764k000J3062L769j6904l079J6163M228
$$ 8322 15980 -371 -11832 -800 7365 -3399 -5399 7663 11432 -5472 -8551 7612 11840
895A1840j3680k944J3458J678j6497k639J7628M857j4314n815J2714Q06j3774
$$ 11840 -1840 -4784 8674 10352 -6145 -8784 8844 13701 -613 -6428 6286 7092 -6682
908f682k84J5708L616j6628o152J3075M309j0788k312J3556J963j2828k240J1423
$$ -6682 -6966 8742 12358 -4270 -10422 2653 6962 -3826 -6138 7418 9381 -3447 -5687 5736
922E736M077r382m038O381l747j0528M021J4377K17r882k008P726N27n188L809
$$ 5736 9813 431 -3607 2774 -973 -11501 -7480 6897 7114 -2768 -4776 2950 3477 -1711 2098
937B098P488p718j3605M806J2152K48q720N263N749q207j1659Q370J2908n485
$$ 2098 9586 1868 -11737 -6931 5221 5469 -3251 2012 7761 -446 -12105 -3735 9173 3688
951C688j1367L018P391l431p163R629J0256q205j3153L537J3316l340q953L128
$$ 3688 -7679 -4661 2730 -701 -7864 1765 12021 3816 -9337 -5800 7516 4176 -4777 -1649
965a649Q482o093j1625O895R127l787q785M718O995l287m707M379P884l187q990
$$ -1649 6833 740 -10885 -3990 5137 1350 -7435 -2717 4278 991 -3716 663 8547 5360 -3630
980c630J106L124l262l85M929L572n554k996K931M536l679k743M529K0p256j362
$$ -3630 -2524 600 -2662 -3047 1882 5454 -100 -3096 -165 4371 692 -2051 2478 2498 -4758 -6120
996f120P673O099l029l490K462N65p136k222J0104L159p644q017M289N357k034
$$ -6120 1553 7652 4623 1133 3595 4160 -2976 -5198 4906 8065 421 -7596 -3307 2050 16
1011A6k319L829M990p119n857O229R271l656p010J714L867m831o203M219R081
$$ 16 -2303 1526 6516 -603 -6460 -231 9040 5384 -1626 88 3955 -876 -7079 -2860 6221
1026F221j717r145J588O836n29n239J723N055m807o842J623P531J372k666O84
$$ 6221 4504 -4641 -3053 3783 3254 -1985 -262 4793 -14 -6856 -5233 2298 3670 1004 1688
1041A688J002l151k500K449L098j674n060J598R22l266R67Q412J216o831n109
$$ 1688 2690 -461 -2961 -512 2586 912 -4148 -2550 -1628 -4894 -3927 4485 5701 -1130 -6239
1056f239L948M824m349j702P067J069r030m985P744O797o921n732N656M233r384
$$ -6239 -2291 2533 -1816 -3518 3549 4618 -4412 -9397 -1653 5144 -1777 -7509 -1853 2380 -7004
1071g004j029J0492O689r517q398N356O210n017m849Q841M858o436o573N659P017
$$ -7004 -8033 2459 9148 -369 -8767 -3411 2799 -2218 -7067 1774 6632 196 -6377 -718 6299
1086F299l169q461K517K943l998l300M627R873m275m397J152P52j28k409L039
$$ 6299 3130 -5331 -2814 129 -3869 -7169 -2542 7331 3056 -1341 -189 563 435 -1974 1065
1101A065k26l630l64J004K807j28M87J478k659m555K530L639J907l544K451J527
$$ 1065 839 -2791 -3155 -2151 656 528 1015 2493 -166 -4721 -2191 1448 3355 -189 2262 3789
1117C789k299m888L040N018J86p185K4M859m25m227L076O510k622p984j480N989
$$ 3789 1490 -3398 -358 4660 4846 -2339 -2315 2544 2119 -2108 968 7478 4856 -3128 -4608 1381
1133A381K793k483q48M914j701m581j804O782L162o065n909J045N013k307o13
$$ 1381 4174 1691 843 5757 4056 -525 -2329 4453 7615 1550 -4359 -3314 1699 -608 -1221
1148a221L437M299k779o553J156L975J333p71l476O69o26R4P47K726K589l786
$$ -1221 2216 6515 3736 -2817 -1661 2314 3647 2876 -600 69 -557 -463 284 3010 5599 1813
1164A813j612k277M09K830R48r33O47l461L87qJ329K137J023r62m511J519L092
$$ 1813 201 -2076 -1667 1163 2111 1178 1825 -1636 -1249 -1257 72 2209 3232 2270 -2241 -722 2370
1181B370J255j472m118R21m06n272J858M834L538l874l428L387K360m690q92N114
$$ 2370 3625 2153 -1965 -1044 -1450 -6722 -4864 -30 3508 -366 -3794 -407 1953 -2737 -3629 1485
1197A485K761q393m142O192O419k691m875K144M237n393l748L928O009l485l679
$$ 1485 4246 -4147 -8289 -2097 4322 1631 -3244 -1100 3137 -2256 -6004 -2076 3933 448 -3231
1212c231J922K125j442k761M747K465n868m209K248O386j504p65K157j397o079
$$ -3231 -1309 816 -626 -3387 1360 3825 -2043 -6252 -4004 2382 878 113 2270 873 -5206
1227e206R89L759J867m120l13K244L6k470K889M722j698o805M33K436j440k641
$$ -5206 -4217 -458 1409 -2711 -3024 -780 -744 -3214 -325 4397 2699 -4106 -3673 -1237 -2677 -5318
1243e318L946N908j379q156J157O387l08o518l08N711k053n232L979P235Q47p262
$$ -5318 -1372 4536 3157 -4999 -3842 2545 2237 -4281 -4589 1122 -931 -6163 -2184 5051 5898 -1364
1259a364r2L599k434n222K969O264k079m949j108M863N64k080K282l9p61p348
$$ -1364 -1456 2143 -291 -5513 -2544 3720 1641 -3308 -4416 447 1011 -1069 1213 1174 413 -6935
1275f935L988M531K19l635N43J985m031j764M405K661k791k183K216J492l621
$$ -6935 -2947 1584 1803 -1832 -1289 696 -3335 -5099 -694 1967 -824 -3007 -791 701 -2920
1290b920O28N740J314p788m186N927J902k707N58M341n4o032o74M327K541n869
$$ -2920 -2292 3448 4762 -3026 -7212 -1285 617 -2090 -1532 2809 2755 -3277 -3951 376 2917 -2952
1306b952j538K294M6l361K763N514N29n835M04P39j381k138J333M197k119k995
$$ -2952 -4490 -2196 -2150 -5511 -2748 2766 3295 -2540 -2136 -1397 -2778 -4916 -3583 614 -1505 -4500
1322d500J792L324k602k774K900J716l254k686M466K991l460J103K924j959o443
$$ -4500 -2708 616 -1986 -4760 -1860 -144 -3398 -6084 -1618 1373 -2087 -984 1940 -19 -6462
1337f462n32P796K959m684m58J363J091n119K162M084j107n236j541L211K888
$$ -6462 -6994 802 3761 -923 -1381 -18 1073 -4046 -1884 2200 1093 -4143 -5684 -2473 415
1352D15k190K971J692m284k305J577K630j274j395K717Q20m127j063N158M474
$$ 415 -1775 1196 2888 -1396 -3701 -2124 506 -768 -2163 554 1374 -2753 -3816 1342 5816
1367E816n598k769M70L607k641l35M024P21l438k018N046J398l106l595M623J167
$$ 5816 218 -2551 -2081 1526 -1115 -1450 2574 3295 -143 -2161 2885 4283 1177 -2418 2205 3372
1383C372n326M55M146K032n00k729O83l07m283k03K975N238k392l903J081J914
$$ 3372 -1954 -1499 2647 4679 4179 1450 2133 1826 -2457 -2660 315 5553 3161 -742 339 2253
1399B253n1j584n73P51lj095N15R77L614J520k029n118j516L290J291k156j6L131
$$ 2253 2202 618 45 796 793 -302 213 1190 4804 6324 4295 -823 -2339 951 2242 86 70 3201
1417C201k41l365j213M908K601k773m302J161J747j943J058L912j142m357k029
$$ 3201 2960 -405 -1618 3290 5891 3118 -1184 -23 1724 -219 839 4751 3609 -748 -2777
1432b777K990L718l190J53J455K70n576k54M965L998l294l573N63J692j81j146
$$ -2777 213 3931 741 894 2349 2619 -2957 -3211 1754 5752 2458 -1115 -552 1140 959 -187
1448a87J235q19J08L33j012l85K228K803m846m714J015O439p68l941K776N620
$$ -187 1048 229 337 670 -342 -727 1501 4304 -542 -5256 -4241 2198 1430 -2511 265 5885
1464E885k946p750J675O563j233o007J036N881j60p669K431N753j134n257M86
$$ 5885 2939 -4811 -3136 3427 2194 -3813 -2777 3104 2944 -4725 -2294 3459 2325 -2932 -2446
1479b446K872ml162K893N854j988n682j343L565q74l54J240L027l554k433J709
$$ -2446 426 422 -2740 153 6007 4019 -1663 -3006 559 -315 -669 571 3598 44 -2389 -680
1495f80J044p3K2M83k568k531K676P328k364l686j502M576m133k505M041O454
$$ -680 364 291 313 796 -1772 -4303 -1627 5701 3337 -349 -1851 2725 -1408 -3913 128 6582
1511F582l456q818P50R225r20p174K637O086k664p623J970Q469j272p616M39P067
$$ 6582 3126 -5692 -4942 4283 3363 -3811 -1174 4912 2248 -5375 -3405 5064 3792 -3824 -3385 3682
1527C682o69o230K260N806k760q109J107P830j000n488K251M652o46n639K9M108
$$ 3682 3013 -3217 -957 4849 2089 -6020 -4913 2917 1917 -3571 -1320 3332 2686 -2953 -2924 1184
1543A184j681l165K632M486l273m374N141K245l370l416K143J509m436r9O887
$$ 1184 -497 -3662 -1030 3456 183 -4191 950 3195 -175 -3591 -1448 61 -4375 -4474 2413
1558B413L365p186l544M779K648o575l05P502J824q380l289P873L389o237k744
$$ 2413 5778 -1408 -4952 -173 2475 -4100 -4405 3097 4921 -3459 -6748 1125 4514 -1723 -4467
1573d467O304r03o420j169R915K008q317k692L834L805l011j472M229N95n815
$$ -4467 1837 934 -5486 -6655 3260 5268 -3049 -5741 -1907 1898 -1113 -2585 1644 2239 -3576
1588c576k387N303K045k976j575L279j53m010J224L674j115k266l47L217n96k641
$$ -3576 -5963 -660 1385 -1591 -3166 113 -40 -4050 -2826 848 -267 -2533 -2880 337 -259 -2900
1604b900K205L333j244m883J357K226j452j880L587L055l981l789L443L656k339
$$ -2900 -695 2638 1394 -3489 -2132 94 -1358 -3238 349 3404 -577 -4366 -923 2733 394
1619C94l295K968L719l146m877M374L881k004m335j61L801q58l351J559N616q01
$$ 394 -2901 67 3786 640 -4237 137 4018 2014 -2321 -2482 1319 461 -2890 -1331 4285 3484
1635C484o227k12L168K601k531n93K239N67k844J075L163J05k621m59P00p61j768
$$ 3484 -2743 -2955 213 2814 283 -310 1929 2496 -348 727 3890 3995 1374 915 1615 854 -914
1652i14K592L091r39k508j631J650K016k086M87J421p7k567j68J445K285k294
$$ -914 1678 4769 3830 1322 -309 1341 3357 1271 1758 3179 3102 535 367 1812 4097 1803
1668A803j788j6j50J332N75p44J953k030k38N37q07l76K586J968k076m544O60
$$ 1803 15 -1 -151 1181 1756 1012 2965 935 697 1234 427 51 2637 4605 2529 -2015 -1355
1685a355L990N93k053j023J668J260k395j932K250K773l621j121O32L228j225
$$ -1355 2635 3228 1175 152 1820 3080 685 -1247 1003 3776 155 -966 -334 2894 1669
1700A669J6K067l20k916k260J784N79r14J098K650k292l489l76M149J32l676n26
$$ 1669 1685 3752 3432 516 -1744 40 619 -295 803 3453 1161 -2328 -2704 1445 1577 -2099 -2625
1717b625L807n99k091J626K590n99l541K18J603J91q62J423J603j398l660Q13
$$ -2625 1182 583 -1508 118 2708 2109 -1432 -1214 389 580 -282 1141 2744 1346 -2314 -1501
1733a501K990n30j016J438J761k371l980L455M845o24l966l053L283J210j077
$$ -1501 1489 959 -57 1381 3142 771 -3209 246 5091 4467 501 -2552 731 1941 864
1748H64r38Q92N15l242l35Q13J994P89j572r2l97M48M85j35n19M45J415n56r98
$$ 864 -74 818 1333 -1909 -2244 -1431 563 1352 -220 -312 -709 -261 224 89 -430 15 1430 874 -124
1767a24n05J686J366j634j259k61J417m06j19J753M33k225j03m8J682J385q87
$$ -124 -629 1057 2423 789 -470 -731 686 280 161 1914 2347 122 19 -29 1653 3038 2151
1784B151q8r84j216k045K519K367j863l210J627R95k09k057J344L704r64m968
$$ 2151 2063 1079 -137 -2182 337 2704 841 -2369 -742 253 44 -2013 -669 3035 2071 -2897
1800b897j349N027J582j771l029J477K354k940k815L829K381r82m902J576L745
$$ -2897 -4246 781 2363 592 -2437 -960 1394 -1546 -4361 -532 1849 867 -4035 -2459 1286
1815A286k390j485K435K160j932k721K032J520q94j815J695J864l967j536J829
$$ 1286 -1104 -2589 -154 2006 74 -2647 -615 905 11 -1804 -109 1755 -2212 -3748 -1919
1830a919N060m188k975K417J719o00k614K817J429j360k453K240p11j200R96K905
$$ -1919 3141 -1047 -4022 -1605 114 -486 -3100 -283 1146 -214 -2667 -427 -1138 -2338 -1342 1563
1846A563k878k769O69M723j650k882NM723j755m544J630O755j580o005J60P091
$$ 1563 -1315 -4084 -3415 1308 -342 -3224 -3219 1504 -251 -4795 -3165 3590 2010 -3995 -3835 3256
1862C256j608n582K141N488k314n259k70O127r35n050N16M587L06m776Q36M825
$$ 3256 1648 -3934 -1793 3695 1381 -3878 -4148 1979 1044 -4006 -3490 1097 1403 -3373 -2537 2288
1878B288J319n421Q37K475o36m439L110L322k638l386K542K519o42l801K969K842
$$ 2288 3607 -1814 -977 1498 862 -3577 -467 2855 217 -3169 -627 1892 1250 -2551 418 3260
1894C260l527l724N411J300l086q74L490l05l149o61N433R70m788k220M052J837
$$ 3260 -267 -3991 1420 2720 -366 -1240 2250 1945 -1204 -1865 3568 4538 -250 -2470 1582 3419
1910C419m797j047N317J661n827k810N809K354m059j866N830J003n332k449L565
$$ 3419 -1378 -2425 2892 4553 -1274 -4084 1725 4079 20 -1846 3984 4987 -345 -2794 771
1925G71K656m832p56L615M70k419j073M111R95n217L02L135j072j879J767L041
$$ 771 3427 -1405 -2161 1454 1924 -495 -1568 2543 3538 -1679 -1377 1758 686 -1193 574 3615
1941C615l168k042J213K844n21k874K431P99j850m478K882L745p76l785J411K739
$$ 3615 447 -1595 -382 2462 1941 -933 1498 2297 447 -4031 -1149 2596 1820 -1965 -554 2185
1957B185j739k704L604K189l296l384L796K459l610l268L952J977k907l274L787
$$ 2185 446 -2258 1346 3535 239 -3145 651 3110 -500 -3768 184 2161 -746 -4020 -233
1972b33K288j177k148J153K291l671J3J231K465j130j429p53P58J23J830j183
$$ -233 2055 878 -1270 -117 2174 -1497 -1484 -253 2212 1082 -347 -1100 -342 -219 1611 428
1988D28o78j06p89n47m08K50K324n7j46j943K442L94L8m69P5j267r03o08L029
$$ 428 -250 -356 -1145 -1692 -2100 -1850 474 417 271 -1672 770 1164 1202 733 808 -459 -1362 -1970 1059
2007A059k86j366L20N94j203k99J235M58J629k116k07j99Q81M88m66r25O13n93
$$ 1059 773 -593 -273 321 -882 -1181 54 512 2141 25 -182 -381 500 988 522 -403 210 -383
2025c83m65m61J136J586K60l596m92K005J202j501o50J880J339p53k152K198R72
$$ -383 -848 -1309 -173 1413 1673 -1923 -2415 -410 792 -709 -1359 521 1860 1107 -1045 1153 2125
2042B125o47k296J37P23K23k017Q65Q75m87m31Q0R60k31r46K696J87j868k427
$$ 2125 1478 -818 -681 42 265 -1752 -887 -12 -499 -930 -850 110 -121 -1067 1629 1816 -52 -2479
2060b479J413J518o87p31J570J61l349M37J084K341k747j087N51J437j074j69
$$ -2479 -1066 452 -235 -966 604 765 -2584 -2147 -1063 1278 -1469 -2556 -2005 -568 -1642 -1811
2076a811L178j295j667J92K452K21k104m64J529n68m592J299M160N46l803k86
$$ -1811 1367 72 -1595 -1403 1049 1270 -834 -1298 231 -337 -4929 -3630 530 1076 -2727 -3013
2092c013M290r76l140J87N125r28m832J142J124J738k617J65J967r92k522J533
$$ -3013 1277 301 -2839 -2652 2473 1545 -3287 -2145 -1021 717 -1900 -1735 232 -760 -3282 -1749
2108a749K050j593j483J935N13j902k544K289M655k587j969J598J658j520j991
$$ -1749 301 -1292 -2775 -840 -327 -2229 -4773 -2484 2171 -416 -2385 -787 871 -649 -2640
2123b640K353J900l119j960L149J232l812q1L817P67l013p13L616O09k485m42
$$ -2640 -287 1613 -1506 -3466 -317 915 -2897 -2978 839 1606 -1407 -2120 1496 2105 -380 -822
2139h22K592o3l162j277M457N55k536p63J388J793k721O5J831n94j648j249K401
$$ -822 1770 1707 -1455 -2732 1725 2280 -256 -1019 369 2162 -559 -494 1337 743 -905 -2154 247
2156B47L62q96J259L79n59j892M02K417k89k057J005l61j404j89J994K203k026
$$ 247 609 -287 972 1351 792 -1100 -698 1719 1430 -627 378 17 -1387 -1576 418 2621 595
2173E95j842R64J640J615k751J455J711k259j810Q53J394j588o33J546K396l031
$$ 595 -1247 -283 1357 2972 221 1676 3387 1128 -682 171 1565 -23 -656 890 3286 255
2189B55k437K054K933j331l139R94J002K68j723K300Q69Q20k171j411N16P04l87
$$ 255 -2182 -128 2805 1474 -1665 -671 331 599 -1124 1176 2045 2865 694 -717 -201 503 116
2206A16Q3R28q66r89j012J806J788J328j446j034L40L4j277J901m9j59r21k311
$$ 116 199 1127 261 -728 -1740 66 1854 3182 1736 702 1042 1076 -201 1700 1651 1492 571 -1740
2224a740M68J818N89j396r03K15P83J163L33j049k20k137J429n02J297J158k170
$$ -1740 -1272 546 1135 -261 -1164 -949 -166 997 1330 281 61 -2076 -647 -1149 148 1306 -864
2241h64l01L42l12M80J32L77K47j941p88J3K512K93R86j649J985l98O19p79J158
$$ -864 -1165 -823 -1135 -655 -523 -146 101 -1840 -2628 -2615 -103 190 1176 -473 1512 1114 1733 954 2112
2260B112J65j845j141J982J370k748j552J238K205k151k16J247J287j501j011
$$ 2112 2277 432 -709 1273 2643 -105 -1657 -419 1786 -365 -581 666 1953 452 -559
2275e59p8J583j160p28J289J131n50r42M82q05m47J26J089M03k365l8J039k99
$$ -559 -637 946 -214 -942 347 1478 928 -14 468 -337 -784 -658 431 834 -1531 -1569 -530 -829
2293h29M02J360R61p18j698O8J809M10L19q92m83r09k752K504K869k233p44M71
$$ -829 -427 933 1894 1176 -522 -454 1355 1765 2084 1192 709 -200 -2952 -448 2421 188 -556 -85
2311h5P32J152l414K709K227j988k242n04K608L35j449p46J827j831j462L37K738
$$ -85 647 1799 -1615 1094 3321 1333 -909 -1413 1195 1530 81 -665 1162 -669 -2131 -1794 944
2328I44n42j407o24p81J422L28J285M08j791L33L1O86J58j82j00j49M91k264J813
$$ 944 402 -1005 -1629 -2410 -988 -660 625 1033 -758 -425 -394 292 450 268 168 19 510 -1754 59
2347E9L2O98j720P65Q38n90k65K221l00k626N22J29l99j077J157R65J2j795j538
$$ 59 91 789 -931 -166 672 82 -183 2038 1738 -888 -366 -237 -636 -1713 -556 409 421 -1374 -2912
2366b912K176J08r83J101k32J072k609m31J359K577j025j37m41J345j662m50Q75
$$ -2912 -736 -628 -1611 -510 -742 330 -2279 -2710 -1351 1226 201 64 -377 968 -694 -1144 -269
2383b69J220k76j725q94R49J395m94Q84L50o51j093K985r18j648N13j10P5j058
$$ -269 951 675 -1050 -1944 -995 400 -94 790 1140 489 -604 2381 1463 -185 328 218 293 -765
2401g65l76J804n02J73q34l28j99J075k82k13L9q15n43J843k25P83M61M19K50
$$ -765 -1141 663 161 334 -500 -828 -1027 48 -234 -447 -408 -1223 -1766 77 -148 635 1096 1515 1765
2420A765m33j999J294Q78j197q57P11j392L48k78K810P54jk989M04K616j032R89
$$ 1765 1332 -667 627 1505 308 -549 162 -1230 -882 -1160 1650 2404 2403 -586 -182 2434 1402 2391
2438B391q03n41m66j312M02J529l36j581P97P08j423n29K426J232l316J202p16
$$ 2391 1588 1047 581 -731 -329 1200 864 -717 80 788 -635 -1164 1262 2494 -822 380 -336
2455c36r1L82L40K410r04l258K56J537k69q69l83K458j812j651K388J338r90j308
$$ -336 -427 -45 295 2705 1801 -1457 -1201 336 67 -802 -1185 1273 -539 -2190 198 1536 546 -762
2473g62J782q31M17j750J143J029O3l578J112J195K82k004J557J050j656o57R16
$$ -762 1020 189 606 -1144 -1 1028 1091 -2487 -1375 -180 102 -1902 -345 705 -951 -1608 -692
2490f92J345j454n26MJ467r92q84J404N88q35O54J57Q2j503P24j87J760q09k343
$$ -692 653 -801 -1327 -1323 144 -848 -1732 -328 260 -575 79 236 318 -1185 -461 -648 1112 303 -2040
2509b040J928o84K5J200j08R42j627M25Q6K099k488r04J124N23l058M93K980L30
$$ -2040 -112 -796 -771 429 321 1263 -364 61 147 2246 -242 -1146 -22 501 -2557 -2064 916 1246
2527A246k387n38J580K67j869J666K223j422j666j062J244K694k759q42J971J15
$$ 1246 -1141 -1679 -99 168 -1701 -35 2188 766 -900 -1962 -718 1976 -783 -1625 346 461
2543D61j766J3J383n8j921J171J441k589J376J860R72n2k263L47J799l824J080
$$ 461 -1305 -1292 91 33 -1888 -717 724 -1865 -489 1371 2343 2291 28 375 2174 -1650 -570
2560e70K122n87l136p75J983N84j893K134K645j534k401J216J541K472m157l11
$$ -570 1552 965 -2171 -2946 -963 -379 -2272 -138 2507 973 -1428 -212 1329 3801 -356 -667
2576f67J926k04k683K71L230J46k745j008J388O8j86j276K317j128r95R52K74
$$ -667 1259 1055 -1628 -1357 1873 2019 -726 -1734 -346 -278 -464 -1740 577 -551 -1546 -594 -320
2593c20J120j1k93l67O1q80n06K276k249j48m08O13J133r05P19m8J65p82O04J008
$$ -320 800 789 496 129 190 -690 -1196 1080 -1169 -1317 -1725 -1112 21 -884 -165 -213 -48 -830 -226 782
2613G82k070L91K102J80k608q81J983R08k087p26K550n41k134q9J172J599k195
$$ 782 -1288 -897 1205 1385 -1223 -2104 -121 787 -1300 -2026 524 -17 -2151 -2240 -1068 531 -1664
2630a664M52J722j10j245J176N64J860j993j174N11K66q56J338j166r52p49J565
$$ -1664 -1212 510 400 -845 331 895 2755 762 -412 99 365 -491 847 -319 -1271 -2020 -455
2647d55J701j086K69J228p25p75j105K429l46r58j265J743j563l43P69J787M82
$$ -455 1246 160 429 1657 932 157 -948 1481 1135 177 -1088 655 -908 -1251 -482 1305 1787
2664A787k682K13Q99K18j407J451J436j043j428n61K805P83k231j30J075J83l081
$$ 1787 -895 -682 217 435 -972 479 1915 872 -556 -1117 1688 2471 240 110 1185 1368 -1713
2681a713Q64J436J41j011m3L47p0j357K328K049j007k936J536N6n51Q76J362m94
$$ -1713 -849 587 728 -283 -326 21 -49 -1406 922 2971 1964 -972 564 620 69 945 2307 1813
2699A813k309m53Q07J581q83m44K40R01j085j469K786O27j321k272K753o26n71
$$ 1813 -496 -949 -142 1439 556 112 352 1253 168 -1301 1485 2112 791 -1481 1272 646 75
2716G5j59J424J355l174p63J603J054j481j267M02Q53k239N37K736L05k254P42
$$ 75 -84 1340 2695 -479 -1242 361 1415 -66 -1333 -931 -78 -2317 -1780 956 1261 -993 -251
2733b51J061l67j858J048J410n31j595k75J568j041N54R6J848j097k066M77J441
$$ -251 810 443 -1415 -367 1043 512 -1083 -1358 210 -831 -277 -181 1667 570 -1496 -1019 422
2750D22k01o56O94J018j871j57K37K345j412j730J193M96j479j482J073K150j363
$$ 422 221 -435 259 1277 -594 -751 -514 1831 419 -1311 -118 378 -1101 -2583 -1510 640 -723
2767g23k399J524J744L00j699K182P59k645L25N39j56q04mJ255m46q13L8J253
$$ -723 -3122 -1598 146 446 -1253 929 1688 -957 -632 -93 -249 -1053 -1057 198 -248 -1061 -1023 230
2785B30k63L16m76M35j060N86J871L95j736j311R94L46Q7j112J455J214k271j939
$$ 230 -33 283 -193 242 -818 -232 1639 2034 298 -1013 -19 327 414 -698 757 1971 -300 -2239
2803b239J97K521k02k098K182p90O1j468J629K022J86j620n4j563J047j43L24
$$ -2239 -2042 479 277 -1821 361 -429 -368 -1836 -207 1815 2001 381 327 -1236 -189 -332 -8
2820hM27o01J8j213J648J690J26r02r46J21o6p99J155q07R62k78j116J094J06
$$ -8 419 -182 -164 -1377 271 1961 2087 1185 239 360 294 -505 650 -157 805 527 -589 505 611
2839F11l17K50j165j55J03m45R51J478o22l79r86J48Q10o84O00nO2M20j013j033
$$ 611 294 544 -621 -776 -673 -1118 -167 1311 689 310 -676 -528 282 -402 198 193 255 675 -338 -1371
2859a371J052l21L31M63j491N21m00J229J380r79n27l30r92L46J127O36o5k346
$$ -1371 -319 -640 -309 154 -1337 -816 -1216 13 1393 414 -113 -443 -1435 -1089 38 674 609 -1737
2877a737K278j20j163Q26J095j001j210l09J220l27P62O88p26K72j824n8L036
$$ -1737 541 421 -742 84 1179 178 -1032 -1341 -121 -448 314 1002 276 548 -1276 -1334 1702
2894A702R92l140r43J937o83j07j229K720n84j859m5R39K070j425O31M64j152
$$ 1702 2694 -446 -1389 548 -135 -242 -1471 1249 665 -1194 -1239 -300 1770 345 976 1440 288
2911B88n65P74J619j335l22r55R78l95o10N35K034q35O03n56n41o47J48O34K59
$$ 288 -277 497 2116 781 459 -496 482 87 -523 12 2046 1211 1814 1258 717 70 218 852 1111
2930A111L56j475J07q6r53J621M38J155k448n96L95Q23k62O79Q1m35k48J96N01
$$ 1111 1467 -8 99 13 -940 681 1119 2274 -174 -770 -375 448 186 865 946 511 263 459 960
2949I60J62n4q63P97o49J610j876J185Q41k262m33K3K532j14j68L11j760n08J6
$$ 960 1122 1068 205 1002 353 1963 87 1272 2113 -149 -582 -559 1973 1859 1691 2002 242 -266 -250
2968b50R74J185r04K63p59n31p7J676j023L27J28j527l51O29o71R78R22j552N66
$$ -250 724 1909 1005 1268 509 -22 -99 1577 554 881 1009 -518 -869 -240 -911 67 989 -563 3
2987Cp65J432J790j720J148r52j360K73p61P00j71M80j117M41M1R45r02M69J005
$$ 3 -762 670 2460 740 1888 936 -424 -151 -912 -212 -383 97 -1020 -579 -538 407 -495 -26 979
3006I79j084m62J004p14J167n67M29o5j011J63n14J149r28K7j0m30o90M32R10
$$ 979 -105 -567 437 -277 890 323 752 687 -324 -161 -675 474 -454 -427 -437 -867 -1557 -1125 -215
3025b15Q30l17r9j644K315K24l24J5j368Q07j549O25M41n42J11R42o0j252Q43
$$ -215 615 298 199 -1445 870 1094 770 785 -583 224 -1325 -700 -259 -801 -690 252 192 -1060 -217
3044b17R88l41o23k14j1K4M99N96n5l83j526j93J814J95l5k98j82J20q75n24K974
$$ -217 771 430 -193 -407 -418 -394 105 701 646 263 -1263 -1456 358 553 518 220 38 158 -717 -1241 1733
3065A733j296q71j34K26o7Q69n93J548K22j329r00n46N17J90K29O0n93k29R19
$$ 1733 437 -434 -568 -342 -409 460 -133 1415 1637 308 -592 -1138 -621 -431 -202 -142 -735 -964 -45
3084d5K33J187j012L11m22k56j22P78L50j521qo87J312n52J25J426L0k463N62
$$ -45 188 1375 363 674 252 -4 -126 652 1002 -519 -527 -1214 98 -454 -329 1097 1127 -1336 -774
3103g74n24N34j99l53J517n77N18j089J450r24M98j76r72K81n25O49M0O95r96
$$ -774 -1298 -764 -963 -1316 201 -376 142 -947 503 -421 77 -99 -1071 -790 -1315 -666 -626 69 -927
3122i27P6n66k02J831q5k84o92R03q4j011j22J751K16q50m21j624K592k71o49
$$ -927 -851 -1417 -1619 212 127 -157 -849 54 -30 -1041 -1163 588 804 -46 -467 -2091 501 230 -419
3141d19o20J128m70j195K53J042N91P9L15j274j44J07J022QM60k530k20J48Q05
$$ -419 -1039 89 -381 -1576 -1323 -281 310 389 704 -570 -714 -607 415 423 883 -1647 -1867 -1719 -914
3160i14L25Q62m48m20o0Q50J560q8r12p78L73j853O25P50J63M51p88K79j6q43
$$ -914 -589 273 -175 -595 -655 195 1755 1667 755 -23 350 -1503 -878 -128 35 486 -302 -23 -39 -882
3180h82J052J330j82j578j87j68J626p5n68J242M48k804R39J519O5j681l08l51
$$ -882 170 1500 1318 -260 -447 -615 1011 936 368 1610 2058 -746 193 1712 1777 96 -212 -563
3198e63N48r53N13R25N95j232P79m83P18k94k7J750j664k073Q69O88Q8R75O14
$$ -563 -15 -968 -455 470 1065 -167 612 129 847 553 526 2276 612 -1461 -592 96 184 1159 1773
3217A773l80j699m29K246J122k042l42J607j007j664R43J535K29j922O77L97q8
$$ 1773 1393 -306 -735 1511 2633 591 249 1856 849 -815 128 1663 1892 -30 647 1044 956
3234I56l785L097O90j024j939J173J466m2r63m27K222j886p98P24K322q46j201
$$ 956 -2829 268 958 -66 -2005 -832 634 592 -371 -798 1424 -462 -1260 -536 1786 940 -261
3251b61j90Q98o33q76J539N03n20j129Q21K80m40N30J510j344r83o24J133N11
$$ -261 -451 447 -186 -1062 477 980 460 -669 152 432 -8 522 2032 688 -295 -919 214 725
3269G25j679P59J260L03k180K20J01J318j351P63o99O9m03q60L005r26j586Q39
$$ 725 -954 -195 1065 1368 -812 -592 -491 827 -524 239 -460 -391 -794 -1654 1351 425 -1161 -322
3287c22P42O0o24j032J587N7j195j57R82L71J82j190J463j140j123K565p7K94
$$ -322 420 480 -144 -1176 411 468 -727 -884 98 469 651 -539 924 -216 -1339 1226 1149 1443
3305A443j706K84o65l38j84J006J687k333M27o84J152n61N44Q70p52j799k88J844
$$ 1443 -263 21 -644 -982 -1166 -160 1527 -806 -379 -1063 89 -472 72 942 190 -1609 -1897 -53
3323e3R75j190p8J467j98j557J28P11J606j958k79R47j34j317q17K401m19q83
$$ -53 922 -268 -346 1121 923 -634 -506 205 1811 -147 -426 521 387 -930 -1747 654 235 -648
3341f48N63M33r32K31N14J74O14j634P3k71Q76m31N31P02k361n87J252K028j755
$$ -648 -85 348 -584 -353 161 335 949 -685 -612 -883 -7 -438 93 795 -1566 -2153 -901 1127 -628
3360f28Q24oj851j74P11J963m41k64j787J241J005j597K32K258j023j879o53J090
$$ -628 196 190 -1661 -1835 -1124 839 398 134 -1653 -412 593 -1004 -772 1486 463 -1416 -2069 -979
3378i79L64P79j771J698K28k254J322J662L95j903J080j026k63o8R37L89o88r23
$$ -979 -615 164 -1607 91 319 -1935 -613 1049 1444 -459 621 -405 -668 -736 201 590 -98 -1021
3396a021p11K121J51j489Q55N09j628l39J326P32n53j075J056J084j307j53Q22
$$ -1021 -1732 389 540 -949 -94 415 -1213 -1552 -226 506 -47 -1122 -66 1018 -289 -442 380
3413C80M71r42j075L82J4j25k09K164m13k895J550J618J279j148l15n55q52M85
$$ 380 851 -91 -1166 -784 -770 -895 -1104 1060 647 -2248 -698 920 2199 1051 736 181 -671 -186
3431a86p11P40M22p30j22J390q58o65K80J950j69p33n23M14o29J071N11m1m39
$$ -186 -897 -157 265 -465 -587 803 -55 -720 -440 1510 1341 608 85 499 -130 941 1452 1411 972
3450I72j467L98p70J286J23n29J065j542j321K226J456j729j74J074J00r14j435
$$ 972 -495 -97 -867 419 542 13 1078 -464 -1785 441 1897 168 -6 1068 1168 254 -1181
3467a181K641M45q76j438M13R94j37n24N61J65j278m76J728K07m96N55j548J477
$$ -1181 1460 1905 1029 -409 4 998 861 337 898 1063 -215 -691 1037 1244 748 1303 -245 1232
3485A232j591p75J753m69L34j176N08J110o10j58N03L60j152Q23o31M97r93J604
$$ 1232 -359 -1134 619 150 484 -692 -184 926 316 158 661 1021 -131 692 61 558 -435 1169
3503A169q62N05r98k78J731k71j422J036k70j226m24J002J150j410k49L93J001
$$ 1169 307 812 -186 -464 1267 996 -426 610 340 -886 -1310 -308 842 -568 -817 -424 577
3520E77j180m85J706k86K76j304J197k57o79J210r46J403j070r26N05N06M88j509
$$ 577 -603 -1088 618 332 608 -696 501 244 -435 775 -171 1232 162 -764 -259 247 735 -774
3538g74J035q64L23m63R13J039j730J384j285R29K36j058O84k80n14r58r2J359
$$ -774 261 -603 -280 -743 170 1209 -521 863 -422 507 743 -315 369 89 -425 -1383 -1475 -116
3556a16j270R68J324j696J14J366J56j683R17o01k9L95l24R71P99j735J494j219
$$ -116 -1386 -418 906 -790 -676 690 846 -837 80 -521 -550 -155 -479 492 1291 -444 1050 -169
3574a69J25p48J166l11K61p5n43M25%Q64j744K493j443j430P33N85l71O99l95
$$ -169 -44 -792 374 63 324 249 -294 131 131 995 -749 1744 301 -1129 -396 189 -182 517 122
3593A22k38p6L89j011P25n16jP56j117J49J006l54J10m21J35q13Q92M79m86l0
$$ 122 -116 -192 197 -814 -89 -605 -606 150 -967 -818 188 -166 -56 -477 -342 -1155 -263 216 -270 -300
3613c00Q95p46L03M69l14J145m50j407j311J874m86P01l81O07p51j1N25n1j50
$$ -300 595 -151 152 621 307 1452 1002 -405 -1716 158 -328 373 -8 599 -152 -163 362 311 161
3632A61J482k512J79J49P87l22j27O90k64r41k13N42m42P65r26J056n85o8o37
$$ 161 1643 -869 -690 -541 246 -76 -203 487 223 -718 -931 -389 -831 -66 -992 64 -521 -589 -1226
3651a226J252L27j75j515J065q4q96P59k87J115o51j386J291J187n08J007j057
$$ -1226 26 353 178 -1337 -272 -356 -1252 -493 -780 335 -316 -1702 -411 776 268 1275 218
3668B18r87m10O20P45OP0n34k68M68k40M08J437j211K0p79n13M13J458q04r12
$$ 218 -769 -1179 -559 186 192 262 -272 -540 -72 -312 96 1533 322 342 -437 -950 -537 921 117 -795
3688g95Q34k48p76Q60M3L56k71m92N86K59j121J303P13j881Q10r41N47M41q5J620
$$ -795 39 -209 -985 -125 -82 274 3 -489 97 356 -765 538 1251 -630 180 -761 -214 227 142 1762
3708A762j273L54o54J188r09M40m19m76l36p7J60M30K49K72r27R3P88K26O04p95
$$ 1762 489 843 189 1377 468 908 489 13 -323 -400 -240 190 439 711 -216 -123 665 891 1495 700
3728G00j182N46L00N11j09p16P88M68j110n97K01M58J455l13n05p87J37K13n0
$$ 700 -482 64 364 875 766 50 838 1306 196 -401 -200 258 1713 1400 895 108 245 458 408
3747D08M66o50j096P06J179j378O29m75Q08q41j191J365O63N17j14m0M23j569
$$ 408 874 224 -872 -166 1013 -365 264 -211 597 -244 -1435 -70 593 1110 996 956 1379 -190
3765a90O47j043K055L64k968J311j035R71q72P51m97K22K37k52PJ021j045M39
$$ -190 457 -586 1469 1833 -1135 176 -859 112 -760 -9 -506 -284 -47 -299 -292 729 -316 123
3783A23N60r68M47q84J36L7M46k55O20q98J350K76n12j51r11J04J42m17K060p46
$$ 123 683 -285 162 -722 -586 -549 -103 -358 262 -636 714 990 478 327 -584 -480 -338 -755 1305 559
3803E59L85p52j082J348k383J294J287O8k37j481O50Q61j24O48j599O56J333k092
$$ 559 944 192 -890 458 -1925 -631 656 724 487 -994 -344 517 393 1041 -558 98 1431 -661
3821f61J088J045p01r54R1m95l6J527j558J805j742J486p16r71J219P4N02j298
$$ -661 427 1472 771 -183 -92 -587 -623 904 -654 1151 -591 895 179 -792 427 501 1003 -295
3839b95m22Q41K30l8j065J319j3j20J41m66J47o85N16j620J082m06J317n89N28
$$ -295 -717 124 354 316 -749 570 557 437 578 112 259 -426 90 -1530 -448 -854 463 -126 402
3858D02J134r64j037j76L79O63j07n07j93p99L83J232o89J027j211J348j133p91
$$ 402 1536 572 -465 -641 -262 401 294 -213 -406 -1205 -822 410 -279 748 -463 885 -248 -1039
3876a039J154n9j45l39j5J42j037J921J6p45J5J024l96l75j045P04Q86q47k5l83
$$ -1039 115 56 -89 -428 -443 -301 -1338 583 599 -146 -131 893 497 122 -923 -219 667 -180 -205 -588
3896e88J385j446K3q9J479j173j103J536L97l44j609J717l60L7P09L1j136P3N36
$$ -588 797 -649 -626 -715 764 -409 -1512 24 421 77 -1532 185 -175 -138 571 602 -534 -461 75
3915G5J94j294R73N29j536P09j19o14Q93q1m88J109l70K62j896J604R85q51n66
$$ 75 269 -1025 -52 477 -1059 -350 -469 -1083 -190 -271 -759 350 -20 242 -1654 -50 935 84 -482
3934d82K62K15q97L28M84M46o98J046p14k32J14N61r50J281q66p89N36L69Q80
$$ -482 -220 -5 -902 -574 -90 356 -342 704 -10 -242 -128 433 -517 764 -102 -891 -355 14 894
3953H94j391Q33J41r08O03K14j181J186n80P60K86k0j093J84P56p25J4J20R36
$$ 894 -497 336 477 -431 172 386 -795 391 -189 571 857 837 -256 -72 684 -41 -27 93 1029
3972A029j025Q39J69r01p69J12J507M65k84k41p61J16o59J64Q21P60j481k73Q18
$$ 1029 4 843 1012 111 -658 -546 961 1426 1142 901 140 256 -403 -239 582 1342 -139 -412 406
3991D06K52q49R37m96n09M8P10m34M77l73Q0M2j789M18J033k26R14L10j292L55
$$ 406 658 -191 746 250 -259 -211 499 65 542 169 249 291 -1498 -1080 -47 -273 641 951 -341 14
4011A4j533J652J207m54k93M14o90k98n36M00k6R39j058j511J946m28J201o63
$$ 14 -1519 133 1340 886 593 1007 317 19 -517 -117 -143 796 -262 -1773 173 -255 946 283
4029B83M02n41k107J735J71N51j726J825q46N15j128M20NP68n62q63K572k24j696
$$ 283 685 144 -1963 -228 -57 494 -1232 593 -253 262 -866 -446 -441 327 -235 -1098 1474 1250 -446
4048d46l13J205p33o69K43J165n55o14J057q28rJ44P01P51j076k98N78k06p73
$$ -446 -759 446 -287 -956 -713 452 -103 -717 340 -488 -497 -353 348 1099 23 -275 303 97 -676
4067f76M64P97o33m02Q13o83J94Q52k15Q04j789K17p92J898j739P15L33O08p17
$$ -676 -212 585 -48 -450 363 -320 -126 726 511 1315 -474 -257 -1049 849 -890 -175 158 766 49
4086D9J281j442R70J83l79q31Q42j174l74J201j8k16k74k56L49N46j52K28R0n70
$$ 49 1330 -112 858 1041 662 -169 673 -501 -875 326 308 92 -182 -438 -89 457 305 533 623 53
4106E3o16R38m91j48M57l02J26J76p54O19L02j78p85J126p92M1O18P16o25j156
$$ 53 -563 375 -116 -264 193 -109 17 193 -561 58 360 182 -603 523 -269 -228 390 1106 481 -675
4126f75N9J99O95L18q71J804n91j243J680j146k12l03J11l5N74j017O41K09q84
$$ -675 -616 -417 278 596 -275 1529 938 -305 1375 229 17 -286 -175 -210 364 -653 -12 197 -687
4145f87J188J47p15l39r33J686R8n02j508P03J932j221J20p7Q69K58j439M00J516
$$ -687 501 648 -67 -406 -1339 347 445 -57 -1565 -862 1070 -151 -31 -108 761 1019 -420 -20 1496
4164A496j621J06j43M36k18m66J607j47r34m16O90m36Q7k46j05J054j386L22j8
$$ 1496 -125 -19 -162 274 56 -410 1197 1050 116 -300 390 -46 41 -205 -310 744 -642 -320 -338
4183c38k03J100l71O97j493M90o3o94J433o15lK97K01j487J971L27p21q57M27
$$ -338 -541 559 188 885 -608 -118 -181 -875 558 -57 -60 237 438 -1049 922 1249 528 -329 98
4202I8N04j24j95n05J142j608J07K09J058n40R18p21O3q46J28J035n58k83J09
$$ 98 602 478 283 -222 920 -688 -581 -372 686 146 1064 343 406 -440 -312 723 165 -118 -9
4221iP73l7p42j013K052k85L4r71K76q66r5Q29J044o61M34n66N07L83j495J098
$$ -9 764 727 -15 -1028 1024 739 773 -198 78 -788 -883 -54 990 329 763 197 704 1087 -408 690
4241F90j091Q48m43m64N81k45M00k11Q61l13p20N3N81q5l29J13K7M16K4l03N49
$$ 690 -401 447 4 -460 121 -124 276 65 926 613 -107 -54 527 442 113 226 253 669 693 390 939
4262I39q35p44K62L9Q5J040K97j202L26j444J760j187J207n61l6Q41q31P17o60
$$ 939 104 -640 -378 -339 -254 786 1083 -119 207 -1237 523 -664 543 -18 -54 787 -44 673 13
4281A3Q51J12j006k34P95J83l08K76p30J288j132J190j015o34J003j465J888k109
$$ 13 864 976 -30 -264 531 714 406 682 -48 1240 108 1298 283 -351 652 -813 1075 -1034
4299a034N70Q28j37P83j131o00J36J29N86M03O08l0k062K09M58J559r58m69L25
$$ -1034 -464 364 227 1010 -121 -721 -585 -456 130 533 1141 1111 -951 -742 -284 1275 317 -152 173
4318A73j275R39k54P50m55L90q98o6L40n00J072n81M9N20m83JJ170j339J663j032
$$ 173 -1102 -163 -417 333 -122 268 -630 -696 -356 -856 216 -365 -316 204 -279 -278 892 -447 1216 184
4338A84R3j077L58M58J08l16K9N61r73J275o10M07n51K63l12M71q6M33o49Q44
$$ 184 277 -800 -442 16 124 -192 -163 398 -575 700 90 497 -54 209 -103 368 282 715 66 910
4358I10p84l63K76m57J116o48R67n25K95p79K79k83O23j103k59O33L4L33M44n22
$$ 910 126 -237 39 -418 698 50 1017 492 787 8 287 4 627 -476 -735 -102 -68 265 709 187
4378A87q25J67j12Q98n24j36N54N88m78Q60P6l10n90N2j886K238o78j12q10j15
$$ 187 -638 -471 -583 315 -209 -345 209 797 319 1179 1255 945 355 407 -1479 759 81 -31 -841 -956
4398i56J322j335J14J026j105J202O2K21o8n47M36m05O5o72J232o50k39P8o5L88
$$ -956 366 -969 -855 171 -934 268 330 551 483 -64 372 -33 32 -640 592 -58 -297 -219 -284 104
4418A04j49R2o27K78P61p84J653j796m78K75Q11O11o43o34J59o93K90R60L67l9
$$ 104 -45 47 -580 -302 459 -325 1328 -468 -946 -671 140 751 108 -526 -367 -1060 -770 190 557 518
4438E18R49k752K448j257j159O55O3J520r53j094J44J547K84l38j318O20p74k45
$$ 518 1467 -1285 1163 -94 -1253 -598 -535 985 32 -1062 -918 629 913 575 -743 -123 -897 -1142
4456a142J571r69R05N30n62n03m64O84N54q44J497L90j861O8K31K48n14R16j176
$$ -1142 429 -540 365 895 333 -170 -634 50 604 -240 1257 1647 -214 -146 85 333 -181 735 -441
4475d41P00p80o8R51l74Q95r60J08L35l66J226j810K204j478PP10o91m73L9K15
$$ -441 259 -521 -589 362 -12 883 -77 31 366 0 1226 -584 1620 142 149 859 168 -305 -266 -51
4495e1m22J12J519j074n68J296j555M04N79J62M2o78m96M56L47o71j57M48k27
$$ -51 -473 -361 1158 84 -484 812 -743 -339 240 402 444 -234 -730 -274 73 -598 -755 -307 -534
4514e34Q32j71q68M61m8m36M66P08q33q2Q66J13j156J648m56J429r99r23R57o55
$$ -534 298 127 -741 -280 -328 -764 -298 410 -423 -505 361 474 -682 966 510 1939 940 17 974 319
4534C19O98n71j119R53R43j168k15J046j004j229J318pj84l09L79M26j195J148
$$ 319 1017 446 -673 280 1223 55 -160 886 -118 -1347 -29 -36 -220 -529 -150 276 -919 229
4552B29j707K465j467n3P85m89K08j399N26R59j57QR53p12j76K2M55j092m5m62
$$ 229 -1478 987 -480 -533 252 -237 -29 -1428 -902 57 -100 -92 861 149 -27 -5 450 -642 -687 -1149
4572a149J326l01M4R62j730J091P8k98k38O6J85l71R14o76J386j374K50k55n19
$$ -1149 177 -124 -80 882 -848 243 321 23 -215 -149 36 -335 579 -97 1289 -85 165 -90 -609
4591f09J10M6o20L99M65m20n27J254M6J44O53j025J4o3m41P88j6J32m37L82m39
$$ -609 -499 -453 -1073 -674 -209 -629 -1156 98 144 288 941 -84 -70 -133 -574 214 198 330 -107 275 -164
4612a64L64q82K92nL85l76q1N24p3J36q38J269j105R67n40Q24q20O84q46J55l95
$$ -164 200 -682 -390 -395 -10 -386 -467 57 -16 120 -718 551 -554 413 -127 697 -123 561 -285 -130 -525
4633e25J195j183J27k19k93P99m33N21l01J034m12o2l05J080k074J201k39k85
$$ -525 670 -513 -386 -605 -898 -99 -532 -11 -312 722 310 248 -57 1023 -1051 150 -89 -374
4651c74o24Q29n32Q85m08M62m28ln4O00j008J054r05L12J047j991P18Q0J017j060
$$ -374 -998 -169 -701 184 -224 238 -190 -193 -247 353 -655 399 -506 -194 853 -1138 -420 -340 677 -383
4671c83m11J6K08J15J249n39L2o7n98J84L42q29r8Q60j144J034p54J532p26j16
$$ -383 -794 -778 -570 -455 794 255 287 220 -378 -194 148 -681 -779 81 -1063 -29 -783 749 23 -93
4691i3R11l99r1p45n51J029J670j280k84m13M89n17J551j515R87r22m68J83P03
$$ -93 818 419 328 -417 -968 61 1731 451 167 -246 243 -274 1277 -238 749 -173 -641 -458 245
4710B45O58p08n68J200j564Q80k49J129q29N33m23j103J353j381J338o20o61J315
$$ 245 903 195 -373 827 -737 143 -106 1023 194 727 304 -799 554 -827 511 -109 -770 545
4728E45k36j60n25o3P96K25j503J209K03r9r98J011m8m75k56P34L04k10K82m48
$$ 545 309 149 -376 -439 357 582 -921 288 491 392 -606 405 357 -118 -374 360 664 454 736 288
4748B88n45L19Q04k69j95l10m6K01j43j05m28O99O36r07P4k08L11K26N17p97o8
$$ 288 -257 62 866 597 402 92 46 247 104 -1 -429 270 906 -1 73 -135 176 402 919 122 54
4769E4j26j0J89M3rl79P27q94N04J13k7J88n59j20M15N51j280R78L67m31j059
$$ 54 -72 -82 107 150 141 -238 489 -405 99 212 185 373 -186 -306 109 660 -620 358 725 294 -765
4790g65J105R8K60r12J11j84Q68r2j213L07P10m35K62L17m3q85O86K09j007L91
$$ -765 340 438 698 -214 -103 -287 581 489 -724 -417 293 -142 120 437 394 -491 195 404 -603 -212
4810b12l28M08N29m87K3n83K9J18Q07l18Q61p47n85N54k67K43L79r05P44q60L55
$$ -212 -540 -132 397 -90 -67 -650 -621 -503 304 -14 847 100 -485 69 -198 45 424 -481 263 -597 -242
4831b42P31m03o3m70P01n17k14l45O89K07j11N75k77l35L2j53L92k81J74q4J97
$$ -242 489 86 23 -447 254 -263 -477 -822 -133 74 -37 538 261 -74 -42 -195 197 -84 90 6 203
4852B03n38l7O7K4O04l04l65N35K89k30J13o30M41m88J38L05j25L38p25L03k50
$$ 203 -335 -372 -305 -281 323 19 -346 189 478 248 361 -269 172 -316 -178 127 2 340 -385 -82 -332
4873c32J47L23j83o6j06l97O15k25J88J89l08L73l60J98k67L94J07l10j60L75
$$ -332 -185 138 -45 -111 -217 -614 1 -224 -36 153 -155 218 -142 56 -211 183 290 -20 -180 195
4893A95l57q5P67o88N39r39P37Jj15M64q26n4K64K02J85k98j43M26j86Kr14Q84
$$ 195 -162 -247 520 -168 371 -568 169 170 55 519 -307 -361 -97 105 290 -8 -151 275 89 91 -823 61
4915F1k42j2J21J00r3l08Q44j71j90R0j89j29J06J82m40k08L40j32J3L39k20L3
$$ 61 -181 -193 -72 28 -65 -373 471 300 110 200 11 -118 -12 170 -270 -478 -138 -270 -257 82 -138 -105
4937a05L7M68p56M66J33l07k57L66J01k47J93p87L28K92j62j51l3k71L71L42L0
$$ -105 -68 400 -356 110 243 -64 -321 45 146 -101 92 -695 -367 -75 -237 -388 -421 -692 -321 21 51
4958E1j58o7J78l29O11j51p7L4q25Q69L29r17O13k87PK68l15J15K21J76l32M61
$$ 51 -107 -174 4 -325 286 135 58 92 -733 136 465 -452 161 -126 -119 149 -166 -51 170 346 14 475
4980D75j28l49r1L42J56m62K8J1K85j02J91j35K16k99J46k58K12K63l52r8o5M62
$$ 475 347 -2 -93 249 405 -57 -29 -18 267 165 356 221 437 138 284 26 238 501 149 51 -14 448
5002D48m57K63J11l13N44p07O7L50j44n1L76k17l08Q8O47k21o6k27J06j49MJ76
$$ 448 -9 254 365 52 596 -111 -44 306 162 111 487 270 -38 50 697 476 410 183 289 140 144 320
5024C20n7l26L51J0k54l34K31Q4J7L50l07R4p9m02P00m29L08m29J9M66r8O0k02
$$ 320 263 -63 288 298 44 -290 -59 25 42 392 85 179 100 -302 398 -31 277 -152 -133 333 235 295 93
5047I3k50Q2J79q6r4J35j56j68o5L54L47j84K52m84k37K47K57k10j64L31O3k88
$$ 93 -157 -75 104 18 -76 59 -97 -265 -330 24 371 187 439 -45 -282 -35 222 12 -152 179 242 -46
5069d6l19P5N11j08j22R8l4o75J62K92K05r9k04M14m3l27O9J48j05m16J54M94
$$ -46 -365 -290 221 113 -9 89 55 -620 -458 -166 39 -60 -264 150 107 -220 -151 -3 -108 -524 -370 124
5091A24j06r9k7j50O40n46j69P06j0m76n4L06j16L04q0k8m9j62J9j00nJ13K74
$$ 124 18 -81 -108 -258 382 -164 -333 373 363 -113 -167 139 23 327 247 219 170 8 27 -73 -78 35 309
5114C09l12Q8l46M47l92M43k29n8N9m8k96N94K6m31j73m52M50M32q9j06q9J66
$$ 309 -3 85 -261 186 -206 237 8 -50 9 -39 -335 259 285 -146 -319 -771 -321 111 22 -84 -173 -7
5136gm07M41K75j44k04J43k84L80j02l31N03k7m40o2L85l75K07O4L12n09K53k3
$$ -7 -414 27 302 158 -46 97 -187 193 91 -240 263 236 -204 -266 119 -256 -49 15 327 -182 71 48
5158D8j4l36K88m6j21R5mN2m4Q4RJ47n0k40l08K23L08q6l26PK93N9k41N11l8l47
$$ 48 34 -302 -14 -60 -181 -86 -90 -38 -82 2 11 158 108 -132 -440 -217 91 5 -321 -314 -21 38 -203 308 270 -77
5184g7j27j06N14m27j6L20l5m20L38K26J6m72M62J07o39J07M18l69J37k81L00
$$ -77 -204 -310 204 -223 -239 81 46 -374 -36 190 206 -266 196 303 -336 -229 189 -180 -43 -324 -24
5205b4l77L15Q2j0K75n80L2K74j46K46j3j02P7j25K22k10m6M08k69O1p3Qmk30
$$ -24 -401 -86 -4 -14 261 -319 -287 -13 -159 87 74 -28 49 -76 146 -64 -110 298 29 90 17 25 21 -209
5229b09L8J05j6J77kj47O5K06J26m79L6K78k86J78j70N2j94K49R4P4j78J72K3
$$ -209 -171 -66 -82 95 93 -54 11 217 343 -136 -100 178 -108 70 -100 -48 -242 7 101 175 -3 169 192
5252A92N5k00m1J94J5Q9m64Q9J97L39m13j27L45Rl66K77J08m29M17o8l05K18K8
$$ 192 247 47 6 200 215 304 -160 -71 126 465 52 -75 270 279 -87 190 298 -131 286 218 -87 131 159
5275A59j16J45J56o7k68K57j08o4L7nk59O7o3J99j64j21P14k21j97R6J05k25K60
$$ 159 43 188 344 277 9 266 158 94 131 126 -133 -66 -129 70 -94 -215 499 278 81 177 282 57 317
5298C17k41j61K95q4j05J90k52O8N4j66J85m22N35j26l60J07N43n06J30K30l87
$$ 317 76 -85 210 126 21 211 -41 27 81 -85 100 -322 213 87 -273 -166 377 -129 1 231 -156
5319a56K41j08k21K19mK41l01J19L05m12k98M91q3N1O6m92K63l50L09j54J06J60
$$ -156 85 -23 -244 -25 -29 212 -89 30 335 -77 -375 116 33 84 150 -342 -79 -429 -120 -274 -168 -8
5341hp6j78p2N49Qm39P5J34k83m0K23Q9m9O2l24L11K47n74M08j74L88k13k23J46
$$ -8 -84 -262 -334 215 223 -216 -141 -7 -290 -330 -107 -18 -67 -5 -329 -18 229 -345 63 -111 277 64 -159 -13
5365a3L22l02P5j00r0K63l31M00k6k29k40N51m92K64j15L41l70K9N06l35J5j46
$$ -13 309 7 82 -18 -108 155 -176 224 198 -31 -271 280 -212 52 -63 278 -92 -63 443 108 123 -23
5387b3j12r0O6K30l4j61L63j51j76K40K69n48NJ1P5n4kk85L58M0j41J87j98l2
$$ -23 -135 -225 -159 71 37 -124 239 88 -88 152 421 -127 -122 -111 -36 -90 -92 -377 -19 21 -120 67 -131 -163
5411a63J13K10m2%j53J16j68j37j36J19L12j27NM3k04J06M08j63k17Q0J5o7M60
$$ -163 -50 160 118 118 -35 81 -87 -224 -360 -241 71 -56 -51 -8 -212 -106 302 139 -78 2 17 -50 410
5434D10q04M98k36j51K90R3k34J77J31l69J65J69q78P51L12n23k89N47m4K16l25
$$ 410 -394 104 -132 -283 7 100 -134 43 174 -195 -30 139 -739 12 324 -199 -488 59 15 231 -94
5455i4J3K99l28J82Q0K8k83J07J60n23N70j36q5q0PQ2r6L62n81L09%K51n6j05
$$ -94 -81 218 -110 72 152 180 -103 4 164 -359 211 75 -10 -90 -83 -1 -97 265 -316 -7 -7 244 188 83
5479H3k64L31Q1N7j34m43M10j97L23L1j87k0n9K7P5L4L08p32K70jl2O6K28l05
$$ 83 -181 150 231 288 154 -289 121 -76 247 278 91 71 12 39 114 148 456 -276 -6 -7 -39 27 255 -50
5503e0R3J64j21j14L81l85j08K66l67L28o9J51m3j02J45k48O0j64L82j42p89J098
$$ -50 43 207 86 -28 353 -32 -140 126 -241 87 18 169 126 24 169 -79 -19 -183 199 57 -732 366
5525C66p20K69K71l69j1J47j10l0K78j63J93l29K51L00k80j70P9m2k00J62L35
$$ 366 -354 -85 186 -183 -194 -47 -157 -187 91 -72 121 -208 43 343 63 -107 -28 -70 -270 -108 227
5546B27k91m21N94J56k37J5J84r2k00M62l87K78k59J01j28K7L75k12k5j59k48
$$ 227 -64 -485 109 265 28 43 227 135 -65 397 10 288 29 130 2 29 404 192 167 8 -240
5567b40k66J87j00L79L43ro7l66Qm12M25r6k35K61K22k49j65R44q61j36L45J05
$$ -240 -506 -319 -419 -40 303 294 227 -139 -131 -543 -118 -214 -449 -188 34 -215 -380 564 -297 -433 -88 17
5589A7R2j01r2M40j46n00M03%K10k18o5j51k0K75m91K49j10J78n16P26l64R8J54
$$ 17 109 8 -84 356 210 -290 113 113 323 105 40 -111 -131 144 -347 -98 -208 -30 -546 180 -184 -86 68
5612F8%J26k25N16o69K77k29k07p5J34k07M44K43o00Q03m34J42n17K80J70o89
$$ 68 68 194 -31 485 -184 93 -136 -343 -418 -284 -491 -47 196 -404 399 -35 107 -410 -130 40 -649
5633f49R69p92O49k97l66L16K72L19k61l18O7m3P24m58k10l14J32K14K93K00j003
$$ -649 320 -472 177 -120 -486 -170 102 421 160 -158 -91 -134 590 132 -78 -392 -260 -46 247 447 -556
5654e56R4J33L24P67q55k62N42J36l64j99J71J8J75j77k55O12l39K8K5N29k94
$$ -556 -462 -329 -5 762 -93 -355 187 323 -41 -240 -69 -51 124 -53 -308 304 -35 -7 18 547 253
5675B53m19q12R69o53K31J182p19j38m27J7M92J30j78J67m58K9Q94j81M40j39
$$ 253 -166 -978 -9 -662 -431 751 32 -106 -533 -516 -24 106 -72 95 -363 -334 560 379 819 680
5695F80n49m65M20M78k04n02KR7q5K09M11o24J57K6n49M49k10K30M80j373O29
$$ 680 131 -334 86 564 360 -142 -140 -43 -128 81 492 -132 25 51 -498 -49 -259 -29 451 -922 -293
5716b93M78M8j10l1o4m6J69o3M37j297N59P67K37j143P11l12k2O3k52J431j162
$$ -293 185 233 123 92 28 -18 151 88 525 -772 -213 554 791 -352 359 47 25 88 -164 1267 105
5737A05P60j006K39o03M17R8l4K2k88M42j012J478p32j39R6O78p34L67l03k01
$$ 105 865 -141 98 -505 -88 10 -24 -2 -290 152 -860 618 -114 -253 -157 521 -213 154 -149 -350
5757c50K30N84m95l93N09J01m63P77r66O41O74j64n33k39k35L41K56q95J031n98
$$ -350 -120 464 -31 -424 85 186 -277 500 -466 175 849 685 152 -87 -322 19 275 -620 411 -187
5777a87M68M16n27m04M58l55J110r03k27K3l60J876o21j784R95m61M58k03n7Q32
$$ -187 281 697 170 -234 224 -131 979 76 -151 -128 -488 1388 767 -1017 -22 -483 -25 -228 -285 547
5797E47r19K22L10m01M42K44k05m16J13KQ5K32j97J09M7l61o3R93q22K32n17r
$$ 547 -372 -150 160 -241 201 445 240 -176 -63 -61 24 256 59 168 215 -146 -209 784 -38 194 -323 -332
5819c32k2R53n31l07J10m14K69N41j051Q29m78N27n53P60j024N42K8M55l82j83
$$ -332 -354 599 68 -239 -129 -543 -274 267 -784 45 -433 94 -459 301 -723 -181 -153 302 -80 -263
5839b63m37J037J3o9n73Q5m41L68j14P28j97M13j365P98r1k55P21n57Q71j07q17
$$ -263 -700 337 350 281 -292 -207 -648 -280 -394 334 137 550 -815 -17 -108 -363 358 -199 672 565 -252
5860b52J48l97N09K24j81l46J27k81K8K38K45J88j066J450q36N97k3m81L28p1
$$ -252 -104 -501 8 232 51 -295 -168 -449 -421 -183 62 250 -816 634 -202 395 372 -109 219 148
5880A48j61l66K83p69N00L14j73m57J47J423j432k8L94l60P41L72m23m5k36k52
$$ 148 -13 -379 -96 -865 -365 -51 -224 -681 -534 889 -543 -571 -177 -537 204 576 153 108 -128 -380
5900c80O08l08j78L87k49N28mn36k54L28j94p35R68k18J095k94r16J07N23J82
$$ -380 228 -80 -258 129 -120 408 404 -132 -386 -58 -252 -987 -19 -237 858 564 -352 -245 278 460
5920D60n7q45J36k10K88k83Q2r4J137p45L31Q8P9o88K99o06M67K62O1j24J66o17
$$ 460 403 -442 -306 -516 -228 -511 -429 -523 614 -131 200 288 367 -321 -22 -628 -161 101 162 38 204 -413
5942d13p9J219j251M72K01l18J11P33p90L0K05l58JN66n4j28k35L14J29M26j168
$$ -413 -492 727 -524 -52 149 -169 -58 675 -115 -85 120 -238 -237 329 275 147 -88 226 355 781 -387
5963c87J89K30o53Q46l45j02O44k98M8J40L94k64M40j234R4P20j69m52L94N9p36
$$ -387 -198 32 -621 225 -120 -222 422 124 172 312 706 442 882 -352 -258 462 293 -159 235 294 -442
5984d42L57M52J21o29J97l62J43L31m58N20N08q46j58K25O26j154O92r5K60k2
$$ -442 -85 367 488 -141 56 -306 -163 168 -290 230 738 -108 -266 -41 585 -569 123 28 288 266
6004B66j46J97L3n76P17k24J9l00L91k6p67R26j049M68P91q05L08K50j79R8n12
$$ 266 120 317 350 -226 491 267 286 -14 377 351 -416 510 -539 -71 720 -85 223 473 294 392 -120
6025a20L56l91j00J23M72j77j93j56m9K02M98p21L2O22q06L38K31q0n1J06m56
$$ -120 236 -155 -255 -132 340 163 -30 -186 -235 -33 465 -256 -224 398 -408 -70 161 81 30 136 -320
6046c20J11K57K12o1l66R9o16M28K78p54O16J27j13L18j79J5l98J07L99l97O35
$$ -320 -209 48 260 199 -167 -68 -684 -256 22 -732 -116 11 -102 216 37 52 -346 -239 160 -237 398
6067C98p84P13m45K08j80j08J47k98M45k23j48J13Q3J28K52n8o70J28L06k53K17
$$ 398 -386 327 -118 90 -90 -198 -51 -349 96 -127 -275 -162 -79 49 301 243 -427 -299 7 -246 -29
6088b9R3K26j58r1l20Q6N2J68j0k6M8l62M95O3n42K80j93K64j53k65ML42j40K11
$$ -29 64 290 132 41 -279 -193 -141 27 17 -9 39 -323 172 235 -307 -27 -220 44 -109 -374 -370 -28 -168 43
6112D3j54m3J53p85N15k08j93R53k93p4J56l16N20k33j26r1j7L55m6j45j05M35
$$ 43 -111 -154 -1 -786 -271 -479 -672 281 -12 -86 70 -246 274 41 -85 -176 -193 162 116 -29 -134 301
6134C01l76K84l32K93m79R3L17L62k21m87R2m74P77j00LQ7k77K53n26O09J8M4
$$ 301 -75 209 -123 170 -309 -216 101 463 242 -245 -153 -627 150 50 53 140 -137 116 -410 199 217 261
6156B61o82O39j72n6p5O0l3m16P23k08M59l57J0k64J05j33J43l48K37J68oR1K
$$ 261 -421 218 46 -10 -85 -25 -58 -474 249 41 500 143 153 -111 -6 -139 4 -344 -107 61 55 146 148
6179A48kj54p9K30k34J70J37j26oj53K57n62N16k91J97j16L3N7J05P4k41O9J43
$$ 148 146 -8 -87 143 -91 79 216 90 84 -69 188 -374 142 -149 48 -68 -35 22 127 201 -40 29 172
6202A72k88j42J23L50Ql66J46j36L63j2l18q9j4j26M50k29R4J00Jj02m3J00Rr9
$$ 172 -116 -258 -135 215 223 -143 3 -133 230 218 -100 -189 -203 -329 121 -108 -14 86 87 -15 -58 42 51 -48
6226d8k58K88K69k86j42L30j43J11o54M68K89q8l44J94J51p4M00l62j72M54k49
$$ -48 -306 -18 251 -35 -177 153 10 121 -533 -65 224 136 -208 -14 137 63 463 101 -71 383 134
6247A34k36j0K19k98M6M39j74m3k61J38L52n09M73r4k64M8K4j64J43J29p8Om27
$$ 134 -102 -112 107 -191 -145 294 120 77 -184 -46 306 -203 270 176 -88 -40 -16 -180 -37 92 14 20 -407
6270d07M56nL56k36k1k4J86l34J17K10j90n3j08J48J45l73L5J83L1p0lJ68P3l65
$$ -407 49 44 400 164 143 119 305 -29 88 298 108 55 -53 95 240 -133 -98 85 116 46 43 211 284 -81
6294h1J63l1j11L82l61K73k15L97l85jj13rJ87J36l45J71o2K02N7j09m75N10k10
$$ -81 82 51 -60 322 -39 234 19 416 31 30 -83 -92 95 231 -114 57 -5 197 254 145 -330 180 -30
6317c0R7K8j06O5m1k29O7J20N6j79K03j60m6J58q0J77k53j29M22m9m45K83j9P0
$$ -30 67 95 -11 54 13 -216 -149 -29 27 -152 51 -109 -155 3 -77 100 -153 -282 140 91 -354 -71 -90 -20
6341b0R8m48K87K07j37j18N2n9p8O5J34J84k83K15O6n11lK73K4j19K02ll03M27
$$ -20 78 -370 -83 124 -13 -131 -79 -138 -216 -151 -17 167 -116 99 165 -346 -349 -76 -52 -171 31 28 -275 152
6365A52j13k04K69ol38L06J14n88Q1J4J0N78m89K36J41q4J3l95J17O6n4L9J2J70
$$ 152 39 -165 104 98 -240 66 180 -408 -327 -313 -303 275 -214 22 163 79 92 -303 -186 -120 -174 -135 -123 47
6389D7j05m6R7K50o08L10J42J57l94l6K82m47N15l2J63k92j34N4K60k19q1J09
$$ 47 -58 -104 -7 243 -365 -55 87 244 -150 -186 96 -351 164 132 295 3 -131 -77 183 -36 -117 -8
6411hN2J85l78M8J72J95m36L14p9J04k07R2j55J63k40K86q8Q7O2n6Kr6p1p4J85
$$ -8 44 229 -149 -101 71 266 -170 144 65 169 -38 54 -101 62 -178 108 20 107 169 113 115 19 -52 -126 59
6436E9k07J32j7p2J48M6K18j71r3l02j19L77j82O8k6M6n3M1J11j88J37n8m9J61
$$ 59 -148 -16 -33 -105 43 89 307 136 43 -259 -378 -1 -183 -115 -141 -95 -148 -107 4 -184 -47 -105 -154 7
6460Gj67J39k6j26L15k75L49l49O7j13M41k24j63m8K00k53J80m1J74m2r4j18K92
$$ 7 -160 -21 -47 -173 142 -133 216 -133 -66 -179 262 38 -125 -173 27 -226 -46 -87 87 45 -49 -167 125
6483A25pL3O7r7Q7k85J34l9j60L59k34r2qJ85j86L61k24K65m64J46Q8q5K58k78
$$ 125 118 151 218 121 208 -77 57 18 -142 217 -17 -109 -117 68 -118 243 19 284 -180 -34 54 -31 227 -51
6507e1L98l87J29lJ79k88j6N6J60j74j33K1J34j17J29J27K1j99K09j80Q8j55K02
$$ -51 347 -40 89 86 265 -23 -39 17 177 3 -130 -109 25 -92 37 164 185 -14 195 15 103 -52 150
6530A50P2jk76j43K31j91K34j25j3Q5r7R8j05J48J9j23K31j03r5l11K55l7K8k54
$$ 150 222 221 -55 -198 33 -158 76 -49 -62 23 -74 24 -81 67 86 -37 194 91 -4 -315 -60 -97 -69 -323
6554c23M51j22j31M74p09M61R7m22K5L33k97J93p3J64m16L73j57K63J8l89M22
$$ -323 128 6 -125 349 -360 101 198 -224 -199 134 -163 30 -43 121 -295 78 -79 184 202 -187 235
6575B35k31l7q6K20Nj7p3k10K19L7q3P0j08J73l36M3J20k03L14l67L62q2J31j12
$$ 235 4 -33 -119 101 106 89 16 -194 25 62 -21 49 -59 114 -222 -179 -59 -262 52 -315 47 -35 96 -16
6599a6J31n6J17k19M6J69m62M44J3k65J29mJ19l99J21j26K53j44q9M58om35K84
$$ -16 115 59 176 -43 3 172 -290 154 167 -98 31 27 146 -253 -132 -258 -5 -149 -238 220 214 -221 63
6622F3j99q1M18j94k72J27L30o06M71M6k06J84j79Q9j91J34l1N4J19J35l36J75
$$ 63 -136 -217 201 7 -265 -138 192 -414 57 103 -103 81 -98 -9 -200 -66 -97 -43 76 211 -125 50
6644E0o6jl2N4m21M51k1j36K85l91l5K32j37L28J48k07j96J03N8q0J38l43N9J8
$$ 50 -16 -17 -49 5 -416 35 14 -122 163 -228 -263 -31 -168 160 308 101 -95 8 66 -14 124 -219 -160 -142
6668a42K43n0j13R3MJ8r5O1J22j40o3J37l08R1L58q9l44K42j21J48k06K67j08
$$ -142 101 51 -62 31 35 53 -42 19 141 1 -62 75 -233 -142 216 127 -217 25 -96 52 -154 113 5
6691EJ45j68k3J46k33L44j41j85o0J60p9L99k94N8l01L86k34J49J25l13j43K49
$$ 5 150 -18 -41 105 -128 216 75 -110 -170 -10 -89 310 16 74 -227 159 -75 74 199 -114 -257 -8
6713hq1L7RK6j37%L06j44K5j51J39Q2k73K17j56J70k97M43l38j88K49J02j00M1
$$ -8 -89 -52 -43 -17 -154 -154 152 8 33 -118 21 103 -170 47 -109 61 -236 207 -131 -319 -70 32 -68 -27
6737b7m6K74n9m03M93k01P8m6Q1m1J78j94J40m1j91J20k50K29m9J34k54qm0K43
$$ -27 -73 201 142 -261 232 31 109 63 144 103 281 87 227 186 -5 115 -135 94 45 179 -75 -83 -123 120
6761A20k27K78n06O74j87j22N5j14n2K46k7J07n22J50K03k26K64o2J06o4kR5j51
$$ 120 -107 171 -335 339 152 30 85 -29 -81 165 138 245 -277 -127 76 -150 114 52 158 94 92 187 36
6784C6K16k43J77m31Q6j76M20j85K3K59L6m6k27K27j63j8k46J81J75J56j74R8
$$ 36 252 9 186 -245 -159 -335 85 -100 -77 182 218 172 -55 172 9 -9 -255 -74 101 257 83 181
6806A81j7p7k00K57q4n4K37m68K47l28J56K36O3k49J8j08J47j33L15J02m94R6
$$ 181 164 87 -113 144 60 6 243 -225 22 -306 -150 86 149 -100 -82 -190 -43 -176 139 241 -253 -157
6828a57L06n1N4m6m1j23j01J06J85j61k8J6L80l84J03K0l4K79l06r4J01r6NJ93
$$ -157 149 98 152 106 65 -58 -159 -53 132 -29 -57 -41 339 -45 58 78 44 323 17 -77 24 -72 -67 126
6852A26k64M32k25l47q5N95q4o9j32k67M12k05R6j75J94j02K41l71PJ45m8R0O1
$$ 126 -138 294 69 -278 -363 232 148 79 -53 -320 92 -113 -17 -192 2 -100 141 -230 -223 -78 -126 -36 25
6875B5k11J4L87k03k14J96P3O1j17k12J02J91J30l54J38Po8j18K32r5q9K50j20
$$ 25 -186 -172 215 12 -202 -6 67 128 11 -201 -99 92 222 -132 6 13 -55 -173 59 -36 -125 125 5
6898Ek5N5j11J0j6J6n5K04J91j68M7L59q26K17K77m85L87M6J85l65qK04j10n2
$$ 5 -20 35 -76 -66 -82 -66 -121 83 274 106 153 512 -314 -97 180 -305 82 128 313 -52 -60 144 34 -18
6922a8j85M05k69K95k2j06n4O1m4k82M63k45L9k23j21K73J57k31O6n2QR9q2oj84
$$ -18 -203 202 -67 228 206 100 46 107 63 -219 244 -1 38 -185 -306 -33 124 -107 -41 -93 -85 14 -68 -74 -258
6947b58K52j12J55J58o3Pj40j19K53k39Q2J10K2p7o5j7mL2j06O5L50k69J20m53
$$ -258 -6 -118 37 195 132 139 -1 -120 133 -106 -24 86 108 31 -34 -51 -55 -23 -129 -64 286 17 137 -316
6971c16K22J71k3q7k02N46n4j32l48J02k8nPJ21M06k15j80O2j70J33pj70L92k04
$$ -316 -94 77 54 -33 -235 311 257 125 -223 -121 -149 -154 -147 -26 380 165 -15 47 -123 10 3 -167 225 21
6995B1j71K02J18o40N48m6J77O5j95k45j46L69m7J24j32k43O2K01p8J06m5j99
$$ 21 -150 52 170 -470 78 32 209 274 79 -166 -312 57 10 134 2 -241 -179 22 -56 50 5 -194
7017a94J04K15k78N9J37k12oO3L41j65j76k5m2L11j98k75M71l43J27r1O7J94k10
$$ -194 -90 125 -153 -94 43 -169 -175 -112 229 64 -112 -137 -179 132 -66 -341 130 -213 -86 -177 -110 84 -126
7040a26L30J01k02k61j3M4K72q2K35l68j11O5J09L0j01J12j33L86j56j2j03k13
$$ -126 204 305 103 -158 -171 -127 145 63 298 -70 -181 -116 -7 23 -78 34 -99 287 131 119 16 -197
7062a97J11J49K86k19l6r7r4L33k01M28k99l20J14M4l10K51J49l90J16L83n2j40
$$ -197 -86 63 349 130 94 -3 -97 236 35 463 164 -156 -42 2 -308 -57 92 -298 -182 201 149 9
7084IJ11j47p1k47J48K99j60K7m7J26K5R4k4R6k7mp9p1j17m3J47O7l51K30q4K07
$$ 9 120 -27 -98 -345 -197 102 -58 -31 -78 48 73 167 143 239 212 208 129 58 -59 -102 45 112 -239 -9 -93 114
7110A14k3kJ84k76J08l85L02j6n2j13J70l08L19m3o0N7k45M96l94J5J86j8k6j34
$$ 114 91 89 273 -3 105 -280 22 6 -46 -159 11 -297 22 -21 -81 -24 -269 227 -167 -152 34 16 -10 -144
7134a44l58M68k5J7k46J75J79k66J74j98K27M17k03j04j38J60j83m2K0J02R4k13
$$ -144 -502 -34 -59 -42 -288 -113 66 -200 -26 -224 3 420 217 113 -25 135 -48 -90 -70 32 126 -87
7156h7J01n4k9k02N04k54J09j45K86k52M0j62K01l60K9J36J51j18J00J0k6M45
$$ -87 14 -40 -69 -271 233 -21 88 -57 229 -23 17 -145 56 -304 -275 -139 12 -106 -6 4 -22 423
7178D23m98O1k26N26l56K19m11L42k18J13J10l94J31k4J33J41M6j95K9J89j1j06
$$ 423 -75 -14 -240 286 -70 149 -262 80 -138 -25 85 -309 -178 -202 -69 72 118 -77 -48 141 130 24
7200B4j52J85J6L2j87L6L0Q7K00k86J02p5R7k21L09p2l25K9M12k87K39l97L19
$$ 24 -128 57 73 105 -82 -46 -16 71 271 -15 87 12 109 -112 197 125 -200 -171 241 -46 193 -204 115
7223A15k91J36K8J68p9m6j15p6K25l54L07n0J00O1l25M56n10R5K1J90K37m6m40
$$ 115 -176 -40 -12 156 77 31 -84 -160 65 -289 18 -32 68 129 -196 260 -250 -155 -134 56 293 247 -193
7246a93L19m37L76l39J93m03J20N89o7k78j83L45l47K03L0J2J52j64J66N8nm88
$$ -193 126 -311 65 -274 -81 -484 -364 225 158 -120 -303 42 -305 -102 -72 -60 92 -72 94 152 147 -341
7268c41M63J29k29J45j97OpK29k06J1J9L40m31pj58Q8J45K39j43O%k38O9J7j37
$$ -341 122 251 22 167 -30 -24 -31 198 -8 3 22 362 -69 -76 -234 -146 -1 238 95 101 101 -137 -68 -51 -188
7293a88K26k0J84l59n5M29l62ok08M81l07K69j80K95r8j17J58N8k89J03P1r3L
$$ -188 38 18 202 -157 -212 217 -145 -151 -359 122 -185 84 -96 199 101 -16 142 200 -89 14 85 -8 -5
7316eN8j24l4N6Q3O5q9M08l23k26J96l05j43L69N1j15J17j18m38N45o0K31k63
$$ -5 53 -71 -105 -49 34 99 10 418 95 -131 65 -240 -383 -14 37 -78 39 -79 -517 28 -32 199 -64
7339f4Lj71lN01l07K47j77m4q3M6j31M84k31j86K9K83k57j78L39k84n4J16N7M68
$$ -64 -61 -232 -235 266 -41 206 29 -15 -98 -52 -183 301 70 -116 -87 196 -61 -239 100 -184 -238 -122 -65 403
7363D03l82J36o3m60N14J72J7m1m80J93l12j59O27j65k85m8J99L14m35J43J24
$$ 403 21 157 94 -366 148 320 337 296 -184 9 -303 -462 165 0 -285 -333 -134 180 -255 -112 12
7384A2M95l78q5K94m64j23K15j05m8p7K33J94lj28K6Q3K2o2m84N14j88L9l13J27
$$ 12 507 129 44 338 -126 -249 -34 -139 -187 -264 -31 163 160 32 58 141 163 101 -383 131 -57 -18 -331 -204
7408b04M11k63K85q4k96K2K77j82K51o64M98N3L6l21k6k84M04M01k11j8k44L99
$$ -204 207 -56 229 145 -151 -129 148 -34 217 -447 51 104 140 -181 -207 -491 -87 314 103 85 -159 240
7430B40n63N93N7m65j72J55M23k62K12j0m24L00k23J34L82r03O97n03M23J77k55
$$ 240 -323 270 327 -138 -310 -155 268 6 218 208 -216 84 -139 -5 377 -526 171 -332 91 268 13
7451A3j84j29J033q80L75j16j03M26j98m51O66j07m03j62M57j91J63m9m69L30
$$ 13 -171 -300 733 -147 228 112 9 435 237 -214 452 345 -58 -220 237 46 209 160 -309 21
7471B1k4J79RK5m87L87O8m44M3M60K6n94M91k55j5K02k69K75m23L02J44l78M91
$$ 21 -3 176 185 210 -277 110 178 -266 -223 237 263 -331 160 -95 -110 92 -177 98 -325 -23 121 -257 234
7494B34p18M43J76m49M31J14o98N24k14N23l17j34l09O18Q9n52J17L7L13m57M00
$$ 234 -484 -41 135 -314 117 231 -467 57 -157 366 49 -85 -394 224 313 -239 -122 -85 228 -229 171
7515A71J00n25j20R8M01k1k9j13L48j20o46O89p6r9l40O45j46k02K49p10O23J53
$$ 171 271 -254 -374 -276 125 104 75 -38 310 190 -456 233 157 58 -282 363 217 15 264 -446 177 330
7537C30k17k02K19M9K81m13K37k52k48R7K96o13M81K89m63J8o6L83J43j86K30
$$ 330 113 -89 130 179 460 47 284 32 -216 -119 177 -436 45 334 -129 -111 -177 206 349 163 393
7558C93l77M21p25L85k82J14K35j20j39L54j15j8j77J45m97N45k71K82Q4l66J62
$$ 393 16 437 -288 97 -185 -71 164 44 -95 259 144 126 -51 94 -403 142 -129 153 237 -129 33
7579C3k73J23Q0J25j62J5RJ73K4k48J67l46N07j57k44J40J56k18K13j94k60J23
$$ 33 -240 -117 -37 88 -74 -59 -50 123 147 -101 66 -280 227 70 -174 -34 122 -96 117 -77 -337 -214
7601b14K65o6K22l4l46L97n5k09m73M77l97J15J01M57l22K05M71r85o5J29M51
$$ -214 51 -15 207 173 -173 224 169 -40 -513 -36 -433 -318 -217 240 -82 123 594 -391 -456 -327 124
7622A24l33J25l49J51MM66J66k52k9L4l33J044n60k84O61n42m28M1K17o0J21r0
$$ 124 -209 -84 -433 -282 -278 188 354 102 73 107 -226 818 258 -26 635 93 -335 -294 -77 -137 -16 -106
7644a06JP27m55R3o09l2r7M89k25J66P9pl19J96r1R7K51o21N93J2K83p39J98j7
$$ -106 -105 622 167 260 -349 -381 -478 11 -214 -48 31 24 -295 -99 -190 -93 158 -463 130 142 425 -314 -116 -133
7668a33P65m70n05K57N18m51K69k7j0l32n9L27j66K27M5k52J96p61Q51k50j78
$$ -133 632 162 -343 -86 432 -19 250 223 213 -119 -178 149 -17 210 255 3 199 -562 289 39 -139
7689a39j69K44K65m28l31J062p66L76n03M69l4K31j93p4K91j32J65n77L66rl16
$$ -139 -308 -64 201 -227 -558 504 -262 114 -389 80 46 277 84 10 301 169 334 -243 123 114 -202
7710b02K04J17Ln1m10M65k36J30K93j22l28K6M35j41p24K19Q03n70m7JO32m13
$$ -202 2 119 122 71 -339 126 -110 20 313 191 -137 -111 324 183 -541 -322 481 -89 -136 -135 497 84
7732H4j69K16K7l74L46L80j68m22K16n06L00k78O0L46J19m74K90J66j91K42m12
$$ 84 -85 131 158 -216 130 510 342 -80 136 -370 -70 -348 -288 58 177 -297 -7 159 -32 210 -202
7753b02M5L06n40qR88o49J25k3j29J1j92K16M19p84Q92J03p91j29O37j72K60m72
$$ -202 -157 149 -391 -399 589 -60 65 42 -87 -76 -268 -52 367 -417 475 578 -213 -342 295 123 383 -89
7775h9K74j03L30j59j67j71L70m71J00K2M17m42k6N63l72L23n60Q4M47m81K83
$$ -89 185 82 412 253 86 -85 285 -186 -86 -64 353 -89 -115 448 76 399 -161 -77 370 -111 172
7796A72l57m1O80k76l49L7M59l04L48n10L50l64j75M83j22K1r4k34O74m33k52
$$ 172 -185 -226 454 178 -171 -134 325 21 369 -141 209 -155 -330 153 31 52 -42 -276 398 -35 -287
7817b87L54j66o4M03r0l07q2k0L76k41OL26l14N0j06j92J44J72K7j23J31k23L17
$$ -287 67 -99 -163 240 150 -157 -239 -259 117 -124 -118 208 -106 -56 -162 -354 -210 -38 -11 -134 -3 -226 91
7840I1n63O55k74k3k69O7J35J28J76k05n7O5J03J68J64l62J81K74n35j54N2M5
$$ 91 -472 183 -91 -114 -383 -316 -181 -53 123 -82 -139 -74 29 197 361 -1 180 454 -81 -235 -183 -138
7862a38N08j19k91m7Q0l81K61M55p80N95m40r7q7P69k21K55k55l63J5M80l54K52
$$ -138 370 251 -40 -87 -7 -388 -127 328 -452 143 -297 -394 -481 288 67 322 67 -296 -281 199 -155 97
7884I7q7j13j82N30n81K64L70k68K68n83j70K78N55o99J09L5M86o5m53J40o2p
$$ 97 10 -103 -285 245 -336 -72 298 30 298 -285 -455 -177 378 -321 -212 -177 309 244 -209 -69 -131 -138
7906a38J11p9K87p65N40J8k6J08m05N14l89K65j00m47K26L70l91M55m68P43k70
$$ -138 -27 -106 181 -584 -44 -26 -52 56 -349 165 -224 41 -59 -506 -280 90 -301 154 -314 429 159
7927A59m82L23l5K79j24l09J97K67n49L07K16k2J3j62r7LJ11l48L4K27k03J0J40
$$ 159 -323 0 -35 244 120 -189 8 275 -274 33 249 227 240 78 -19 -16 95 -253 -219 8 -195 -185 -45
7950d5l02J22L52k21K15k36M7Q7K98Oo98L54L19p5l38k14N10k48j10o9J37QL85
$$ -45 -347 -225 127 -94 121 -115 -68 19 317 323 -375 -21 298 223 -115 -329 181 -67 -177 -246 -109 -101 284
7973B84o79N65j44L99k74j17j97K81K8k03L28k99K8K86j07j25l7J1m2J8N00p91
$$ 284 -395 170 26 425 151 34 -163 118 146 -57 271 -28 0 286 179 54 17 28 -14 4 504 -287
7995b87L75J19Q7k02J18j4m39M06k87N41l83J75J8m66K48K21l34K28n1p6J44L
$$ -287 88 207 294 92 210 196 -243 163 -124 417 34 209 227 -239 9 230 -104 124 73 -3 141 144
8017A44nj56M29L9m04J14o47M78k61M24J11o82Q41n97P44n31p8O8J35j05j23j73
$$ 144 139 -17 412 451 47 161 -486 -8 -269 155 266 -416 425 -172 572 41 -37 31 166 61 -62 -235
8039b35N98o55K22M51m45M62k79P5j05j10m55J73K58j56M35o97N57l03Q6k34M70
$$ -235 363 -292 -70 381 -64 398 119 194 89 -21 -476 -303 -45 -201 234 -463 94 -209 -123 -357 113
8060A13r1J21k50L1o9Q6j50L09J07l40j98K96PN1k42P32l77n36N96m67K80L45
$$ 113 22 143 -107 -76 -145 -59 -209 100 207 -133 -331 -35 -28 23 -219 513 136 -400 196 -271 9 354
8082C54j38m37j4J33P8O34o15lJ58o3L0k07L05m3L21ro29M6k02Q35l38J42m19
$$ 354 216 -221 -235 -102 -24 610 -5 -8 150 87 117 -90 215 172 493 484 -145 -99 -301 534 196 338 -81
8105h1J70m28O26j17J14j29k81M4K09J24m01O4j21L91m32O32l46K8n1l65O15K8
$$ -81 89 -339 287 170 284 155 -126 -82 127 251 -150 -86 -207 184 -248 384 38 66 15 -350 265 293
8127B93j29j71Q0M0l66m48M49N53l32r3J91k67K68k90K33m08L01J49p5J32l47
$$ 293 164 -7 73 113 -253 -701 -252 301 -31 -124 67 -200 68 -222 11 -397 -96 53 -22 110 -237
8148b37M6K31J19Pk98L1O0j10J25j2M95q00K03M37k75k78L50J45m77J83j9r4J38
$$ -237 -191 40 159 166 -132 -101 -41 -151 -26 -38 457 -343 -140 297 22 -256 94 239 -238 -55 -74 -168 -30
8171c0k44J01M7J47qK01n52mN88k30J44m76K21K82o4l43j57M60Q2J92
$$ -30 -274 -173 -126 21 13 214 -338 -342 246 16 160 -316 -95 187 123 -220 -377 83 165 357
8191C57
$$ Imaginary data points
##PAGE= N=2
##DATA TABLE= (X++(I..I)), XYDATA
0@%%%%JjOj4J6j6K4l2M0m9N7p2Q8j05J25j47J72k02K35k71L12l57M07m64N26n94
$$ 0 0 0 0 0 1 0 6 -8 8 -8 16 -16 24 -25 32 -40 48 -57 68 -79 93 -109 126 -145 167 -190 217 -247 279 -315
30c15O70p54Q46r46J057j179J312j460J621j796J990k206K442k702K995l323L691
$$ -315 355 -399 447 -499 558 -621 691 -769 852 -944 1046 -1160 1282 -1420 1575 -1748 1943
47A943m106M582n137N786o559P502q680J0201j2254J5194j9777K7983m7148J68691
$$ 1943 -2163 2419 -2718 3068 -3491 4011 -4669 5532 -6722 8472 -11305 16678 -30470 138221
61A38221J08263l53437n702K19484L1411k21794j796J92704J5579j99443l170
$$ 138221 246484 -106953 -112655 106829 138240 -83554 -85350 107354 122933 -76510 -79680
72g9680J78972K8114j67766k6789J19698J1519j15305O392J18422N769j07336
$$ -79680 99292 127406 -40360 -67149 52549 64068 -51237 -44845 73577 79346 -27990
83b7990j5551P1197Q523n3221J1354L9978j7178m0770K0051K3966k6364j0490
$$ -27990 -43541 27656 36179 -17042 -5688 34290 17112 -23658 -3607 20359 -6005 -16495
95a6495M2497R262m5109l786N5398O866n7323L162O3788n980p5999N814Q2158
$$ -16495 26002 35264 -9845 -13631 41767 48633 -8690 -5528 58260 52280 -23719 -17905 64253
108F4253l161r5476j4075P9564M496q3335O492J12161K3515j11833m7728Q4815
$$ 64253 61092 -34384 -48459 31105 35601 -47734 -41242 70919 94434 -17399 -65127 19688
120A9688M0181q2032m2011P4965M4301o5050m0510O0134L2990n4050k8831M9951
$$ 19688 59869 -22163 -64174 10791 55092 -9958 -50468 9666 42656 -11394 -40225 9726
132I726J2499o5846j6545Q3306M5279o5765n1608M2180M4677k9502k5558L4373
$$ 9726 22225 -43621 -60166 23140 68419 2654 -48954 -6774 37903 8401 -17157 17216
144A7216L1031l0701l6193R916K2456l483j1340l148r105k427J9124K0447p510
$$ 17216 48247 17546 -18647 -8731 13725 10242 -1098 -4246 -13351 -15778 3346 23793 16283
157A6283p845P776m641k8992o704L4291J4165l3551k2860K3304J9020j7208q247
$$ 16283 8438 16214 11573 -17419 -24123 10168 24333 -9218 -32078 -8774 10246 -6962 -15209
170a5209K7493Q097l7764k8568K0525L3805j970j1583L933J1102p460r600R376
$$ -15209 12284 20381 -17383 -45951 -25426 8379 6409 -5174 -1241 9861 2401 -7199 2177
183B177J9024N85j9575j8606Q75J3462N990J470K292l34j7116j7482J9427L3559
$$ 2177 21201 21786 2211 -16395 -15520 -2058 3932 5402 7694 7360 -9756 -27238 -7811 25748
197B5748l570k9034n090K7197P55k7194K26K7822p086m0445r450L4119J3629k1200
$$ 25748 22178 -6856 -11946 15251 16006 -11188 -10962 16860 9774 -30671 -40121 -6002 7627 -13573
211a3573O06L0386l291l6278o000K7651L233k8420L517K7326K397j6927J4176
$$ -13573 -12967 17419 14128 -22150 -28150 -499 2734 -25686 -22169 5157 7554 -9373 4803
224D803K9761j4010m1148m374K0038q225j4363K1548K8463j8964k6661J5696K7618
$$ 4803 34564 20554 -20594 -24968 -4930 -13155 -27518 -5970 22493 3529 -23132 -7436 20182
237B0182j3123k0426J8373J6353k7268k4950K5839K6234j9443k8279J4164J6597
$$ 20182 7059 -13367 5006 21359 -5909 -30859 -5020 21214 1771 -26508 -12344 4253
249D253k0852j4522K8764K1870k5754k2713J8406J5431k2923o178L7503J3084
$$ 4253 -16599 -31121 -2357 19513 -6241 -28954 -10548 4883 -18040 -24218 13285 26369
261B6369l8904k7331L1480K7993k1194j6512K7411J0545l9560k2508L8638K9005
$$ 26369 -12535 -39866 -8386 19607 -1587 -18099 9312 19857 -19703 -42211 -3573 25432
273B5432l3143k8260K6264K8748j6292j1326L2508J3517m3564l0343K7216K3242
$$ 25432 -7711 -35971 -9707 19041 2749 -8577 23931 37448 -6116 -36459 -9243 13999
285A3999k1048j1879K9112R109l8555j5584L7249K3707k9145k1197K4310J3078
$$ 13999 -7049 -18928 10184 19293 -19262 -34846 2403 26110 -3035 -24232 78 13156
297A3156k0801r213K9625J2773l0356j9821J8409J5647o852r70J6975p072k6359
$$ 13156 -7645 -16858 12767 25540 -4816 -24637 -6228 9419 2567 1597 18572 11500 -14859
310a4859p55J7416j48j4567J3270J9960j4642k4014K0055L4504p238l4159q9K1886
$$ -14859 -15614 1802 1654 -12913 357 20317 5675 -18339 1716 36220 28982 -5177 -5266 16620
324A6620j0068k8442J1289L2645q607l1941L968L3724P61k5159M478K2458j0720
$$ 16620 6552 -21890 -10601 22044 13437 -18504 -14536 19188 19949 -5210 -732 21726 11006
337A1006l1121N647L5905O87k6200N38K5040n550l4829L537L5599K272l6281j2470
$$ 11006 -20115 -14468 21437 22124 -4076 -3538 21502 15952 -18877 -15340 20259 22531 -13750 -26220
351b6220L0929J8214k0094j5378K0250J2119k1645j6428J7483K2693k732j2419
$$ -26220 4709 22923 2829 -12549 7701 19820 -1825 -18253 -770 21923 19191 6772
363F772k024M05q769o809P082K943m63k748k110j701O329J9102N117j6413j4659
$$ 6772 4748 5153 -3616 -10425 -3343 -400 -863 -3611 -5721 -7422 -1093 18009 23126 6713 -7946
378g946N234L873o766j164J4442N580j9705o704J7612J0864j5781j0425J4172
$$ -7946 -2712 1161 -5605 -6769 7673 13253 -6452 -13156 4456 15320 -461 -10886 3286
391C286p11k5185n082L3315J9814k3656k2623J9892K1609j8423k0311J9791K3086
$$ 3286 2575 -22610 -27692 5623 25437 1781 -20842 -950 20659 2236 -18075 1716 24802
404B4802k5921k8096J1285L0618n873k2574J870J9921k505j8574N341K4084L343
$$ 24802 -1119 -29215 -17930 12688 6815 -15759 -13889 6032 3527 -15047 -9706 14378 17721
417A7721j4497r160K200J599k19P400r0o915o288M415L638o94K971N395n289j4113
$$ 17721 3224 -5936 -3736 -2137 -2356 5044 4954 -1961 -8249 -3834 -196 -890 2081 7476 2187 -11926
433a1926p78R174J913l01P993N251j1453j4148R939K0307o044j8443j929R921
$$ -11926 -12704 -3530 -1617 -1918 6075 11326 -127 -14275 -4336 15971 9927 -8516 -10445 -524
447e24q809j1377J6270K1955j1055k7967M758K7151O330j8863l232K0801p86k6375
$$ -524 -9333 -20710 -4440 17515 6460 -21507 -16749 10402 16732 -2131 -5363 15438 14652 -11723
461a1723o176K3709J1305j8107j2454Q377Q977o214k962J3021O377j5103j1884
$$ -11723 -17899 5810 17115 -992 -13446 -5069 3908 -2306 -5268 7753 14130 -973 -12857
474a2857M093R155p87l175M111N03k523n20O17L784j540l719n425p429j945M215
$$ -12857 -8764 391 -396 -3571 540 1043 -1480 -2000 -1383 2401 861 -2858 -8283 -15712 -17657 -13442
490a3442O626O514J747j075p405l118Q533J2488k993j4490o914Q122M307l604
$$ -13442 -6816 -302 1445 370 -7035 -10153 -1620 10868 7875 -6615 -13529 -5407 -1100 -4704
504d704j92R540j671j4109n005J0155J2826n469p597L001K834n907m717O249J1526
$$ -4704 -4896 4644 2973 -11136 -16141 -5986 6840 1371 -6226 -3225 -391 -6298 -11015 -4766 6760
519F760j332j4431m222O597O979m59m867M92p69o953n879O560P027J733n228K054
$$ 6760 5428 -9003 -13225 -6628 351 -108 -4975 -4483 -5252 -12205 -18084 -11524 -4497 -2764 -7992 -5938
535e938O973o87l515L863R363m414j4086o984N669O557J171M288J020l387p763
$$ -5938 1035 348 -3167 696 10059 5645 -8441 -15425 -9756 -3199 -2028 2260 3280 -107 -7870
550g870K799J1253K239n630m571k815k00L639O495L014n127n166Q58m68m287L614
$$ -7870 -5071 6182 8421 2791 -1780 -4595 -4795 -1156 5339 8353 3226 -1940 -1082 -1550 -5837 -2223
566b223R633j676j7904m243J0894P437m653Q74Q906j199j3171K474J8606K908
$$ -2223 7410 5734 -12170 -16413 -5519 1918 -2735 -1861 7045 5846 -7325 -4851 13755 16663
580A6663j6366p322Q913L303j2860q07J5865N471j4807m304J0784M119q446K859
$$ 16663 297 -7025 1888 5191 -7669 -8476 7389 12860 -1947 -6251 4533 8652 206 3065
594C065J1545n301j2909l61R901J890p161N354L411j0061q574P545J2334p080
$$ 3065 14610 9309 -3600 -3961 5940 7830 669 6023 9434 -627 -9201 -1656 10678 3598
608C598j2318O428L352r162m461J5710J2674j2704j3412J1303R765j0560m495
$$ 3598 -8720 -2292 1060 -8102 -12563 3147 15821 3117 -10295 1008 10773 213 -4282
621d282J3919M879k2012j5130J6995J7926j0710j1330J3599P511j5902n565J9268
$$ -4282 9637 14516 -7496 -22626 -5631 12295 1585 -9745 3854 11365 -4537 -10102 9166
634I166J4105j8060j6390Q583R470q958n564J5242O697j4844j2153J1503P288
$$ 9166 23271 5211 -11179 -2596 6874 -2084 -7648 7594 14291 -553 -12706 -1203 6085
647F085q780l017P911m026j3436K007J7376N839j4345k338J2828o16j3988K91
$$ 6085 -2695 -5712 2199 -1827 -15263 -13256 4120 9959 -4386 -6724 6104 5488 -8500 -8209
661h209J8127j742k0608o65J6137j125j6053P310K0109l997j9109J494K0239j428
$$ -8209 9918 8176 -12432 -13097 3040 1915 -14138 -6828 13281 9284 -9825 -8331 11908 10480
675A0480j4221L493J5308r921k0659P827K2319l815j8902K760J3160o058j4306
$$ 10480 -3741 -248 15060 5139 -15520 -7693 14626 10811 -8091 -5331 7829 1771 -12535
688a2535J1955J4371p291j8084K200J2836m004m088J0249P609j3001j0365J0541
$$ -12535 -580 13791 6500 -11584 -9384 3452 -552 -4640 5609 13218 217 -10148 393
701C93Q271p698n325O935k215j6430J711K0908R171j6974n869J5969R63j1466
$$ 393 8664 966 -4359 2576 361 -16069 -14358 6550 15721 -1253 -7122 8847 9810 -1656
715a656K649J6482k264k0449m560J5761L020j1171J668J3522n210j6240k80J8425
$$ -1656 993 17475 15211 -5238 -9798 5963 8983 -2188 -520 13002 7792 -8448 -8728 9697
729I697K901j5802l298R630j917p486K093J3971q87j1566j511O429J33l051m54
$$ 9697 12598 -3204 -6502 3128 1211 -6275 -4182 9789 8902 -2664 -4175 2254 2387 -664 -1118
744a118J555k023l944R03J834m7L042N300j760n451l70P039K608n168R12J080
$$ -1118 437 -1586 -5530 -4627 -2793 -2840 202 5502 3742 -1709 -2079 4960 7568 2400 3312 4392
760D392n403q655M956J0492J003p465q76L323k178l452M330P273k658r981m453
$$ 4392 -1011 -9666 -4710 5782 6785 -680 -1556 1767 -411 -3863 467 7740 5082 -4899 -9352
775i352M434N258P82K964L94o758m991J546O897K285m196m445m252K645M035N122
$$ -9352 -4918 340 1122 4086 4480 -2278 -7269 -5723 1174 3459 -737 -5182 -9434 -6789 -2754 2368
791B368R33j543L63j27k524l91P647K222p815o124L120L595l105k651P430M613
$$ 2368 3301 1758 2121 1994 -530 -921 6726 8948 1133 -4991 -1871 1724 -1381 -4032 3398 8011
807H011q725o615O161J0184j754q611K682L589p167l996Q406P435m611p274L705
$$ 8011 -714 -7329 -1168 9016 7262 -1349 1333 4922 -2245 -6241 2165 9600 4989 -2285 1420
822A420K651n417k562N797N029q383n774M410M232k328M734Q236K72j5542j927
$$ 1420 4071 -1346 -3908 1889 6918 -1465 -7239 -2829 1403 -925 3809 12045 12317 -3225 -5152
837e152J1752K147q685k86Q352n927j0521O052J4257k023j4958L782J3331p350
$$ -5152 6600 8747 62 -224 8128 2201 -8320 -2268 11989 9966 -4992 -1210 12121 4771
851D771j2374Q656J6933q051j8541J059J7618k729j3595O732J0793r519j4677
$$ 4771 -7603 1053 17986 9935 -8606 -7547 10071 7342 -6253 479 11272 1753 -12924
864a2924J1318J5940n882j7051L635J0132o432j0616J3109J3015r294j0540O477
$$ -12924 -1606 14334 8452 -8599 -4964 5168 -1264 -11880 1229 14244 4950 -5590 887
877H87Q804q651p181J1245N012j5596r534J2855J1086r600l901J0308K048j3335
$$ 887 9691 1040 -6141 5104 10116 -5480 -15014 -2159 8927 -673 -4574 5734 7782 -5553
891e553m755J6772L417j3520m443J3178L344j6112k847J5618N220j5069o747J2759
$$ -5553 -10308 6464 9881 -3639 -8082 5096 8440 -7672 -10519 5099 10319 -4750 -11497 1262
905A262K855j3084r55J6123K139j6723o141J5775P337j2881l093J2711K055j3995
$$ 1262 4117 -8967 -9922 6201 8340 -8383 -14524 1251 8588 -4293 -7386 5325 7380 -6615
919f615k72J0810L437j2825l862O172J537p865N716J1688j318j1123j561Q480
$$ -6615 -6887 3923 7360 -5465 -9327 -3155 -1618 -9483 -3767 7921 6603 -4520 -6081 2399
933B399O57o668K843O114p256r929O923J2085j190j0584L550L819p627p037P036
$$ 2399 3056 -3612 -769 5345 -1911 -11840 -4917 7168 5978 -4606 -1056 2763 -4864 -11901 -4865
948d865J4682p433j1892M149R484l102o588P165Q716q766j3287O743J2610l039
$$ -4865 9817 2384 -9508 -5359 4125 1023 -5565 1600 10316 1550 -11737 -4994 7616 4577
962D577j0581L787P478o614r489O900J1701l518r465L705Q975l125o931L120N781
$$ 4577 -6004 -2217 5261 -1353 -10842 -3942 7759 4241 -5224 -1519 7456 4331 -2600 520 6301
977F301n504r269K558O371n97k326O214J316m630n259N614J565l427k895L714
$$ 6301 797 -8472 -5914 457 -140 -2466 3748 5064 434 -4825 789 2354 -1073 -3968 -254
992b54N89m564J168O569O700r251m672K093K398m901k35O865L130q729p539P136
$$ -254 335 -4229 -3061 3508 10208 957 -3715 -1622 776 -4125 -4360 2505 5635 -3094 -10633 -3497
1008c497P941k544l820K537J936n279l707O467Q067m852j0031K661L810k739l548
$$ -3497 4444 1900 -1920 617 2553 -2726 -6433 34 8101 3249 -6782 -4121 -311 -3050 -6598
1023f598M365P729m545o888O28Q434q83n451J038M093k627o132L322O945J373
$$ -6598 -2233 5496 951 -5937 -5309 3125 2242 -3209 -2171 1922 -705 -6837 -3515 3430 4803
1038D803l901k710K322l794k406N789K133l781l252J865L911j045q73N956O73
$$ 4803 902 -1808 514 -3280 -5686 103 2236 -1545 -4797 -2932 979 -66 -939 5017 5690
1053E690q153m554O972L277k753m106N306L57p925k076J0265O021r808m801P584
$$ 5690 -2463 -7017 -45 3232 479 -3627 1679 2036 -5889 -7965 2300 8321 -1487 -6288 1296
1068A296L683n853k157Q308N083j0239q993P960P548m630m687P017L340p988n584
$$ 1296 4979 -874 -3031 5277 10360 121 -8872 -912 6636 2006 -2681 4336 7676 -312 -5896
1083e896O055Q016o072o235J463O005l232P8M609M754l513p023j539M560j266
$$ -5896 159 8175 2103 -4132 -2669 3336 104 182 4791 9545 6032 -991 -2530 2030 764
1098G64j429R79J44k993J284K813K273k71q07P13k339k922K385M686L31l797Q6
$$ 764 -665 314 458 -2535 -1251 1562 3835 3564 2757 3470 1131 -1791 594 5280 5611 1814 1900
1115A900J043j583j027J521M315k489n133j304O700m14k477J46M535m247p200
$$ 1900 2943 1360 333 1854 6169 3680 -1453 -2757 3943 3529 1052 1198 5733 1486 -5714
1130e714J98R160L394o402r85L946p96n224p21N485J096n219m124L640M540J52
$$ -5714 -5516 3644 7038 636 -349 3597 2801 -2423 -3144 2341 3437 -1782 -5906 -2266 2274 2426
1146B426k296K812L65l794m586J945N512o45k276j719P21N50K433j031K460q66
$$ 2426 130 2942 3307 -487 -5073 -3128 2384 1739 -537 -2256 -1535 -985 1448 417 2877 2011
1162B011k690l284J162K247J635K5k071o35k554j05L151N20J09j310L47l936J942
$$ 2011 -679 -3963 -2801 -554 1081 1106 -965 -1600 -4154 -4259 -1108 -588 -479 -1789 -1442 -5378 -3436
1179c436K959O31j068m936K876j057j780K525M705L891o780l646K318L727k673
$$ -3436 -477 154 -914 -5850 -2974 -4031 -5811 -3286 1419 5310 -1470 -5116 -2798 929 -1744
1194a744k580L459K470o768l150Q330N792m695m578J719K877l192l259M178O474
$$ -1744 -4324 -865 1605 -5163 -8313 17 5809 1114 -3464 -1745 1132 -2060 -5319 -1141 5333
1209E333m577m568J723M528j990l898M216K580n616m012K701O244K13k083r71
$$ 5333 756 -3812 -2089 2439 449 -3449 767 3347 -2269 -6281 -3580 2664 2877 794 -177
1224a77l1n039N6P200J067l968L62L193r27m608R21O520k844n875m96N066J470
$$ -177 -208 -5247 -5191 2009 3076 -892 -530 2663 1736 -2872 -1951 4569 1725 -4150 -4646 420 1890
1241A890l115K977L570k854n518l37N751K40m491n12M022l7n383L370O481k554
$$ 1890 -1225 1752 5322 2468 -3050 -3387 2364 2604 -1887 -2399 1623 1586 -3797 -427 6054 3500
1257C500n770k791N353j761m588L393N517j226m700j054N602M56j528j568Q39
$$ 3500 -2270 -5061 292 -1469 -6057 -2664 2853 1627 -3073 -4127 1475 1931 403 -1165 -326
1272c26k303k881M409K780l71k861J52J711l300j546N371K428m933k612L250K796
$$ -326 -2629 -5510 -1101 1679 1308 -1553 -1401 310 -2990 -4536 835 3263 -1670 -4282 -1032 1764
1288A764k699k382N626J361q040k302O394L417m030j178M715J173o848k842O663
$$ 1764 -935 -3317 2309 3670 -4370 -6672 -278 3139 -891 -2069 2646 3819 -3029 -5871 792
1303G92J213n328j129L819J82j777O97O221r33p570K47K300J41j213K513L544
$$ 792 2005 -3323 -4452 -633 -451 -2228 -1531 4690 3757 -3813 -3566 -1266 -1125 -2338 175 3719
1319C719k493m917K616M457q59l569K211J772l559p87M285L95k112n95J829r23
$$ 3719 1226 -3691 -1075 3382 2523 -1046 1165 2937 -622 -1409 2876 3271 1159 564 2393 1470
1335A470m957J635O930J025n890j645L889o37l284K859L631k299m246j481N526
$$ 1470 -3487 -1852 5078 6103 213 -1432 2457 1820 -1464 1395 5026 2727 -1519 -3000 2526
1350B526L140j879l58Q16m809k763M075M381j638j128j29J843m153J938L914J693
$$ 2526 5666 3787 3429 4245 -564 -3327 748 5129 3491 2363 2234 4077 -76 1862 5776 7469
1366G469o448k982L241J436M16k408K597J659l702k036M734N54l662j680L759
$$ 7469 1021 -1961 1280 2716 3132 724 3321 4980 1278 -758 3976 4530 868 -812 2947
1381B947K38k377j151K843L016l725k319R15M81k777m91N833K99j730l290O04
$$ 2947 3185 808 -343 2500 5516 1791 -528 387 868 -1909 -2400 3433 3732 2002 -1288 -684
1397f84L423j184k192J50L77J485j749P59J484J749q81k518k297j946L736J808
$$ -684 2739 1555 -637 -487 -110 1375 -374 385 1869 3618 2737 219 -2078 -4024 -288 1520
1413A520j857r74K257L88l673J861L859J98n096l159K947J328K3l71K754km860
$$ 1520 -337 -1311 946 1334 -2339 -478 3381 3579 -1517 -4676 -1729 -401 -378 -749 2005 2003 -2857
1430b857j111K434L316l398j671L629j228l770P45N152K393l850l518J365J708
$$ -2857 -3968 -1534 1782 -1616 -3287 342 -886 -4656 -3911 1241 3634 -216 -3734 -2369 -661
1445f61P30J46Oj503j8j64m14J499J451R5k885l495K121N361r6n046K337L939
$$ -661 69 215 221 -1282 -1300 -1464 -1878 -379 1072 1167 -1718 -5213 -3092 2269 2173 -2873 -536 3403
1463C403k887n780R89O826p19n695J940N599k546m273J307M000j039n234n0O065
$$ 3403 516 -5264 -4275 2551 1832 -3863 -1923 3676 1130 -3143 -1836 2164 1125 -4109 -4159 1906
1479A906j71m303L601K909k147p539K022N081P83j891N68K483k615m000J660M237
$$ 1906 1735 -2568 1033 3942 1795 -5744 -3722 1359 2142 251 819 3302 687 -3313 -1653 2584
1495B584k046j387J055j012k178M718K752j914n385o75N000j539m335M342O280
$$ 2584 538 -849 206 -806 -2984 1734 4486 2572 -2813 -3488 1512 -27 -4362 -20 6260
1510F260m828q165K428J0614k042p944P28O629k301p023K585Q898k351p850q34
$$ 6260 1432 -6733 -4305 6309 4267 -3677 -2949 3680 1379 -5644 -3059 5839 3488 -4362 -5196
1525e196Q716K39p614K402M894k335r694K620R340j406m850L086M651k978o920
$$ -5196 3520 3759 -3855 -1453 3441 1106 -8588 -5968 3372 1966 -2884 202 4853 1875 -5045
1540e045R97N371m31n505K905L302o89m172J744M208k968m304K302L230k797o29
$$ -5045 -4048 1323 892 -4613 -1708 1594 905 -3267 -1523 2685 -283 -4587 -2285 945 -1852 -2481
1556b481O704J424q141k395M719K316m288j573O847J686p694l502Q131L043o311
$$ -2481 4223 5647 -2494 -4889 -170 2146 -2142 -3715 3132 4818 -2876 -6378 1753 4796 -1515
1571a515l361N219L419p267j260Q002L877q337l663M231M254l552r52M040m66
$$ -1515 -4876 343 3762 -3505 -4765 3237 7114 -1223 -4886 -655 3599 47 -905 3135 2669
1586B669n335j412P001J184m240p62L603p54k537Q09L760j364l403M35L511q17
$$ 2669 -2666 -4078 2923 4107 -133 -895 2708 1954 -583 226 3986 2622 -781 -346 3165 2348
1602B348j969J886K218j297n449P92L888q30r93K190J327l052k522J280M285k273
$$ 2348 379 2265 4483 3186 -2263 -1471 2417 1587 594 2784 4111 1059 -1463 -183 4102 1829
1618A829k962K852K856k689n850M945L707j817n283J237L735n13j592K150K812
$$ 1829 -1133 1719 4575 1886 -3964 981 4688 2871 -2412 -1175 2560 2047 455 2605 5417
1633E417j362o436k40N747P89l117k77J673l02j577P1K229J021l643k128L086
$$ 5417 4055 -2381 -2621 3126 3915 798 521 2194 1892 315 386 2615 3636 -7 -2135 951
1649I51m93p56K275K436j745m763L67K175J914p59j866Q74j367j232M73K274J167
$$ 951 458 -298 1977 4413 2668 -2095 -1728 447 2361 1602 -264 610 -757 -1989 -1516 758 1925
1666A925j358l275R79J604j61N8Q62k18k078J91J517R0r12J907M99j433k500o80
$$ 1925 567 -2708 -1729 -125 -286 -228 634 416 -1662 -1471 46 136 -776 1131 1630 197 -2303 -2983
1684b983M585J022m817r16L316j90j455o62K965K41k720j503J879K260n94j150
$$ -2983 1602 2624 -2193 -3109 207 17 -1438 -2100 865 1106 -1614 -3117 -1238 1022 428 -722
1700g22P43l21l470K81J797J094j201Q31K200k404j801P72K841j143l485J120
$$ -722 21 -300 -3770 -3489 -1692 -598 -1799 -968 1232 -1172 -2973 -2201 640 -503 -3988 -2868
1716b868L961j843j849P56M035o76n561J228K188R91k39K16K95k350l245K496
$$ -2868 1093 -750 -2599 -1843 2192 1516 -4045 -2817 -629 362 123 339 634 -1716 -4961 -2465
1732b465L061l37k543K875R43k245l313L654K894j167m630j68K462J534k674j227
$$ -2465 596 259 -2284 591 1534 -711 -4024 -370 2524 1357 -3273 -3441 -979 555 -2119 -3346
1748c346J897k16j281q12K446K720o50j921l20M26J21n84R12k32M21J682k334
$$ -3346 -1449 -1665 -2946 -3758 -1312 1408 758 -1163 -1483 -1057 -936 -1520 -608 -840 -419 1263 -1071
1765a071L42j60R88J128k235j241J266J190Q0p9l74M5p57o42J955L72l05r10m34
$$ -1071 -729 -889 99 1227 -1008 -2249 -983 207 287 208 -166 -121 -878 -1520 435 807 502 -408 -842
1784h42j121j495r94L566J448k261j697O33K209O82j988P1K879j666l440o54N893
$$ -842 -1963 -3458 -4452 -886 562 -1699 -3396 -2763 -554 128 -1860 -1789 1090 -576 -4016 -4670 1223
1801A223J675l937k955L125K185l002k160L029L242l436k614J429K891M54k847
$$ 1223 2898 -1039 -3994 -869 1316 -1686 -3846 -817 2425 -1011 -3625 -2196 695 1149 -1698
1816a698J344K450k126l136K072L471j711m228N67M006k013j361J012L066l206
$$ -1698 -354 2096 -30 -3166 -1094 2377 666 -3562 -2995 1011 -1002 -2363 -1351 1715 -1491
1831a491j559K234K280q28k272K096J428k640j537K017M98k056J914Q10j287j302
$$ -1491 -3050 -816 1464 636 -1636 460 1888 -752 -2289 -272 226 -1830 84 894 -393 -1695
1847a695J488K871L65n382J076L891q77l663K161M820k035n467J096N019l52n466
$$ -1695 -207 2664 3029 -2353 -1277 2614 1737 -1926 235 5055 3020 -2447 -1351 3668 3316 -2150
1863b150J398M906j351n809M42N182j65n082J399N574k120m339J992M842j131
$$ -2150 -752 4154 2803 -3006 -2564 2618 2453 -2629 -1230 4344 2224 -2115 -123 4719 3588
1878C588o033J605L771j73m924J369M886l023k606J236L025L82l109J054K864
$$ 3588 -2445 -840 2931 2758 -2166 -797 4089 1066 -1540 -304 2721 3103 -6 1048 3912
1893C912j982k398K501K796k575l468M145n1m415J81M008J026l750k817M059J238
$$ 3912 1930 -468 2033 4829 2254 -1214 2931 2880 -1535 -1354 2654 3680 -70 -2887 1172 2410
1909B410k719j886N812J032o117k113O014K253n979j273L895J707m636k768L387
$$ 2410 -309 -2195 3617 4649 -1468 -3581 2433 4686 -1293 -2566 1329 3036 -1600 -4368 -981
1924i81M101l746k419L965R52k675j252N712j342l250p27M646r39k592J452J425
$$ -981 3120 -626 -3045 920 1872 -803 -2055 3657 2315 -935 -1662 2984 2045 -547 905 2330
1940B330k27m741J574K140N59m431J663J319j367j384K696L682k326l992L133
$$ 2330 2103 -2638 -1064 1076 1635 -2796 -1133 186 -1181 -2565 131 3813 1487 -2505 628
1955F28K372k952j957K206J460l009j781K612K601l603k021K794K888l607k371
$$ 628 3000 48 -1909 297 1757 -1252 -3033 -421 2180 -1423 -3444 -650 2238 -1369 -3740
1970c740L521J812j663k200K039M52j414j111K596O00J027l321j49K646j643J117
$$ -3740 -219 1593 -70 -2270 -231 221 -1193 -2304 292 892 1919 -1402 -1551 1095 -548 569
1986E69o18o4K8p02P78j066J010J543J700k316j522J015Q74k48j404p29M59o53
$$ 569 -49 -113 -85 -787 -9 -1075 -65 1478 3178 862 -660 355 1229 981 -423 -1152 -693 -1346
2004a346J72J817l67m86j030O87J054p83J023J249j100j444k73M38J937j354o55
$$ -1346 -1174 643 276 -210 -1240 -553 501 -282 741 1990 890 -554 -827 -389 1548 194 -461
2021d61l69O08m42M46r30J319Q56r74k424Q08K136J387j770j409J788R10r97j710
$$ -461 -830 -222 -664 -218 -1148 171 1027 53 -2371 -1563 573 1960 190 -1219 569 1479 482 -1228
2039a228J651J166j537k016J008N36k11j559Q27J439J74j068k77J477Q92j441
$$ -1228 423 1589 52 -1964 -956 -420 -631 -2190 -1363 76 250 -818 -1095 382 1274 -167
$$ [...]
8191c89
##END NTUPLES=NMR FID
##END=
