##TITLE=1H_SAV-68-f4(2M)
 CDCl3, 8 sc, 
 5.6.2020
##JCAMPDX= 6.0         $$ Bruker NMR JCAMP-DX V2.0
##DATA TYPE= NMR FID
##DATA CLASS= NTUPLES
##ORIGIN= UXNMR, Bruker Analytische Messtechnik GmbH
##OWNER= root
$$ XWIN-NMR		Version 3.5
$$ Fri Jun  5 11:12:37 2020 Russian Standard Time (UT+4h)  she@DPX200
##.OBSERVE FREQUENCY= 200.1315
##.OBSERVE NUCLEUS= ^1H
##.DELAY= (6, 6)
##.ACQUISITION MODE= SIMULTANEOUS
##.ACQUISITION SCHEME= undefined
##.AVERAGES= 8
##.DIGITISER RES= 18
##SPECTROMETER/DATA SYSTEM= spect
##.PULSE SEQUENCE= zg30
##.SOLVENT NAME= D2O
##.SHIFT REFERENCE= (INTERNAL, D2O, 0, 15.7039)
##AUDIT TRAIL= $$ (NUMBER, WHEN, WHO, WHERE, WHAT)
$$ ##TITLE= Audit trail, XWIN-NMR		Version 3.5
$$ ##JCAMPDX= 5.01
$$ ##ORIGIN= Bruker BioSpin GmbH
$$ ##OWNER= she
$$ F:/spectra/data/she/nmr/H-F/1/audita.txt
$$ ##AUDIT TRAIL=  $$ (NUMBER, WHEN, WHO, WHERE, WHAT)
(   1,<2020-06-05 11:10:57.90 +0400>,<she>,<DPX200>,
      <created by zg, POWCHK disabled, PULCHK disabled
       configuration hash MD5:
       00 E9 B6 7A A2 85 ED C7 34 08 36 98 17 FE 4E 26
       data hash MD5: 16K
       54 73 36 35 53 C5 BA 3B 52 27 AE 9D C2 D2 09 BC>)
$$ ##END=
$$ 
$$ hash MD5
$$ 5C 43 5C 21 8D 75 99 E9 C9 AD 7E 14 9A 9A 1A 81
##$RELAX= 
##$RELAX= 
##$RELAX= 
##$RELAX= 
##$RELAX= 
##$RELAX= 
$$ Bruker specific parameters
$$ --------------------------
##$DU= <F:/spectra>
##$EXPNO= 1
##$NAME= <H-F>
##$PROCNO= 1
##$TYPE= <nmr>
##$USER= <she>
##$AMP= (0..31)
100 100 100 100 100 100 100 100 100 100 100 100 100 100 100 100 100 100 
100 100 100 100 100 100 100 100 100 100 100 100 100 100 
##$AQSEQ= 0
##$AQ_mod= 1
##$AUNM= <au_zg>
##$AUTOPOS= <>
##$BF1= 200.13
##$BF2= 200.13
##$BF3= 200.13
##$BF4= 200.13
##$BF5= 200.13
##$BF6= 200.13
##$BF7= 200.13
##$BF8= 200.13
##$BYTORDA= 1
##$CFDGTYP= 0
##$CFRGTYP= 5
##$CHEMSTR= <none>
##$CNST= (0..31)
1 1 145 1 1 1 1 1 1 1 1 1 1 1 1 1 1 1 1 1 1 1 1 1 1 1 1 1 1 1 1 1 
##$CPDPRG= <>
##$CPDPRG1= <>
##$CPDPRG2= <>
##$CPDPRG3= <>
##$CPDPRG4= <mlev>
##$CPDPRG5= <mlev>
##$CPDPRG6= <mlev>
##$CPDPRG7= <mlev>
##$CPDPRG8= <mlev>
##$CPDPRGB= <>
##$CPDPRGT= <>
##$D= (0..31)
0 1.2 0 0 0 0 0 0 0 0.06 0 0.03 0 0 0 0 0.0002 0 0 0 0 0 0 0 0 0 0 0 0 
0 0 0 
##$DATE= 1591341057
##$DBL= (0..7)
120 120 120 120 120 120 120 120 
##$DBP= (0..7)
150 150 150 150 150 150 150 150 
##$DBP07= 0
##$DBPNAM0= <>
##$DBPNAM1= <>
##$DBPNAM2= <>
##$DBPNAM3= <>
##$DBPNAM4= <>
##$DBPNAM5= <>
##$DBPNAM6= <>
##$DBPNAM7= <>
##$DBPOAL= (0..7)
0.5 0.5 0.5 0.5 0.5 0.5 0.5 0.5 
##$DBPOFFS= (0..7)
0 0 0 0 0 0 0 0 
##$DE= 6
##$DECBNUC= <off>
##$DECIM= 24
##$DECNUC= <off>
##$DECSTAT= 4
##$DIGMOD= 1
##$DIGTYP= 9
##$DL= (0..7)
0 120 120 120 120 120 120 120 
##$DP= (0..7)
150 150 150 150 150 150 150 150 
##$DP07= 0
##$DPNAME0= <>
##$DPNAME1= <>
##$DPNAME2= <>
##$DPNAME3= <>
##$DPNAME4= <>
##$DPNAME5= <>
##$DPNAME6= <>
##$DPNAME7= <>
##$DPOAL= (0..7)
0.5 0.5 0.5 0.5 0.5 0.5 0.5 0.5 
##$DPOFFS= (0..7)
0 0 0 0 0 0 0 0 
##$DQDMODE= 0
##$DR= 18
##$DS= 0
##$DSLIST= <SSSSSSSSSSSSSSS>
$$ [...]
##$SUBNAM2= <"">
##$SUBNAM3= <"">
##$SUBNAM4= <"">
##$SUBNAM5= <"">
##$SUBNAM6= <"">
##$SUBNAM7= <"">
##$SUBNAM8= <"">
##$SUBNAM9= <"">
##$SW= 24.9337058887773
##$SWIBOX= (0..15)
0 0 2 0 0 0 0 0 0 0 0 0 0 0 0 0 
##$SW_h= 4990.01996007984
##$TD= 16384
##$TD0= 1
##$TE= 0
##$TE2= 300
##$TE3= 300
##$TEG= 300
##$TL= (0..7)
0 120 120 120 120 120 120 120 
##$TP= (0..7)
150 150 150 150 150 150 150 150 
##$TP07= 0
##$TPNAME0= <>
##$TPNAME1= <>
##$TPNAME2= <>
##$TPNAME3= <>
##$TPNAME4= <>
##$TPNAME5= <>
##$TPNAME6= <>
##$TPNAME7= <>
##$TPOAL= (0..7)
0.5 0.5 0.5 0.5 0.5 0.5 0.5 0.5 
##$TPOFFS= (0..7)
0 0 0 0 0 0 0 0 
##$TUNHIN= 0
##$TUNHOUT= 0
##$TUNXOUT= 0
##$USERA1= <user>
##$USERA2= <user>
##$USERA3= <user>
##$USERA4= <user>
##$USERA5= <user>
##$V9= 5
##$VALIST= <valist>
##$VCLIST= <CCCCCCCCCCCCCCC>
##$VD= 0
##$VDLIST= <DDDDDDDDDDDDDDD>
##$VPLIST= <PPPPPPPPPPPPPPP>
##$VTLIST= <TTTTTTTTTTTTTTT>
##$WBST= 1024
##$WBSW= 4
##$XGAIN= (0..3)
0 0 0 0 
##$XL= 0
##$YL= 0
##$YMAX_a= 139270
##$YMIN_a= -68057
##$ZGOPTNS= <>
##$ZL1= 120
##$ZL2= 120
##$ZL3= 120
##$ZL4= 120
##$ABSF1= 10
##$ABSF2= 0
##$ABSG= 5
##$ABSL= 3
##$ALPHA= 0
##$AQORDER= 0
##$ASSFAC= 0
##$ASSFACI= 0
##$ASSFACX= 0
##$ASSWID= 0
##$AUNMP= <proc_1d>
##$AZFE= 0.1
##$AZFW= 0.1
##$BCFW= 1
##$BC_mod= 2
##$BYTORDP= 1
##$COROFFS= 0
##$CY= 11.3945322036743
##$DATMOD= 1
##$DC= 2
##$DFILT= <>
##$DTYPP= 0
##$F1P= 16.9975609425685
##$F2P= -3.02152046262296
##$FCOR= 0.5
##$FTSIZE= 0
##$FT_mod= 4
##$GAMMA= 1
##$GB= 0.15
##$INTBC= 1
##$INTSCL= 1
##$ISEN= 128
##$LB= 0.24
##$LEV0= 0
##$LPBIN= 0
##$MAXI= 10000
##$MC2= 0
##$MEAN= 0
##$ME_mod= 0
##$MI= 1.114404
##$NCOEF= 0
##$NC_proc= 0
##$NLEV= 6
##$NOISF1= 3.799351
##$NOISF2= 2.8
##$NSP= 1
##$NTH_PI= 0
##$NZP= 0
##$OFFSET= 15.70392
##$PC= 1
##$PHC0= -9800.201
##$PHC1= 25.80082
##$PH_mod= 1
##$PKNL= yes
##$PPARMOD= 0
##$PSCAL= 0
##$PSIGN= 0
##$REVERSE= no
##$SF= 200.130013532006
##$SI= 16384
##$SIGF1= 3
##$SIGF2= 2
##$SINO= 400
##$SIOLD= 16384
##$SREGLST= <1H.CDCl3>
##$SSB= 0
##$STSI= 0
##$STSR= 0
##$SW_p= 3612.71676300578
##$SYMM= 0
##$S_DEV= 0
##$TDeff= 0
##$TDoff= 0
##$TI= <>
##$TILT= no
##$TM1= 0
##$TM2= 0
##$TOPLEV= 0
##$USERP1= <user>
##$USERP2= <user>
##$USERP3= <user>
##$USERP4= <user>
##$USERP5= <user>
##$WDW= 1
##$XDIM= 8192
##$YMAX_p= 0
##$YMIN_p= 0
$$ End of Bruker specific parameters
$$ ---------------------------------
##NTUPLES= NMR FID
##VAR_NAME=  TIME,          FID/REAL,        FID/IMAG
##SYMBOL=    X,             R,               I
##VAR_TYPE=  INDEPENDENT,   DEPENDENT,       DEPENDENT
##VAR_FORM=  AFFN,          ASDF,            ASDF
##VAR_DIM=   8192,          8192,            8192
##UNITS=     SECONDS,       ARBITRARY UNITS, ARBITRARY UNITS
##FACTOR=    0.0002004,     1,               1
##FIRST=     0,             0,               0
##LAST=      1.6414764,     0,               0
##MIN=       0,             -68057,          0
##MAX=       1.6414764,     139270,          0
$$ Real data points
##PAGE= N=1
##DATA TABLE= (X++(R..R)), XYDATA
0@%%%%%%%%%%mJ2j6J6j6K3l1L2l9M7n5O6p4Q6j02J18j34J52j73J97k21K47k78
$$ 0 0 0 0 0 0 0 0 0 0 0 -4 8 -8 8 -8 15 -16 16 -23 24 -31 35 -39 47 -55 63 -71 81 -92 105 -116 131 -147
33a47L12l50L90m33M82n36N93o58P31q08Q93r91J101j221J356j507J683j890K132
$$ -147 165 -185 205 -228 254 -282 311 -347 384 -424 469 -522 579 -642 714 -793 890 -1000 1132
52A132k423K780l230L820m629N815p747J1567l3653J08831K2201j63574m215J26010
$$ 1132 -1291 1489 -1741 2079 -2550 3265 -4482 7085 -26568 82263 104464 -59110 -63325 62685
66F2685J3472j31028j3186J09690J8645j06282j5080R3361K6162p6827j7479O0002
$$ 62685 76157 -54871 -68057 41633 60278 -46004 -61084 32277 58439 -18388 -35867 24135
78B4135N474o3441j657O2096J4907m6582j3516K9048N370k1135M473J5799p935
$$ 24135 29609 -33832 -35489 26607 41514 -5068 -18584 10464 15834 -5301 -828 14971 7036
91G036r821J2326J256j9975M08K4292r212l3850Q236M2315k336m0822Q723M7364
$$ 7036 -2785 9541 10797 -9178 -8770 15522 6310 -27540 -19304 23011 20675 -20147 -11424 35940
105C5940o811m8587J0491N8212q412o4486k088N7663k306o8639m890P5043K0526
$$ 35940 29129 -19458 -8967 49245 40833 -23653 -25741 31922 29616 -39023 -43913 31130 51656
118E1656n9969k0408N7364K1713n8783l0108M4861K6676l6774j7841L8529J7265
$$ 51656 -8313 -28721 28643 50356 -8427 -38535 6326 33002 -3772 -21613 16916 34181
130C4181l7563j3622L5268Q105m7876k1746L9793K8953k6285k4132K1131J9717
$$ 34181 -3382 -17004 18264 26369 -21507 -43253 -3460 25493 -792 -24924 -3793 15924
142A5924j9761j9060J4002K4462K17j1917m808J824L245K190p437j7635k078J3277
$$ 15924 -3837 -22897 -8895 15567 15784 3867 -941 883 4128 6318 -1119 -18754 -20832 -7555
156g555M485r934P653K3345K3k9020q412K3721R701k2393j0058J9864P853k0410
$$ -7555 -3070 -13004 -5351 17994 18017 -11003 -19415 4306 14007 -8386 -18444 1420 9273 -11137
170a1137q221K6705J4684k3105k4122R189J8482o397j4145N623J2924m286j1854
$$ -11137 -19358 7347 22031 -1074 -25196 -16007 2475 -3922 -18067 -12444 480 -3806 -15660
183a5660N655J9506P351j0768j1909K699N707l892p340Q519P938j1242j4499Q232
$$ -15660 -10005 9501 16852 6084 -5825 -3126 2581 -1311 -8651 -132 7806 -3436 -17935 -9703
197i703K1796k465k1809j048K4056P879j7224m049K1856M724k6941j3729J7185
$$ -9703 12093 9628 -12181 -13229 10827 18706 1482 -2567 19289 24013 -2928 -16657 528
210E28J0556j3140o473J7752R720j2182q408Q574J30j5349m731J1662O554m164
$$ 528 11084 -2056 -8529 9223 18943 6761 -1647 6927 7057 -8292 -13023 -1361 5193 1029
224A029N383J1929L20j0045K11K919r609r660Q570Q380j0159o184J3361P900j5703
$$ 1029 6412 18341 18661 8616 8827 11746 2137 -7523 1047 9427 -732 -6916 6445 14345 -1358
239a358q196J9260J4107j7174j3511J7463J2856j8564j3143J6716J1858k1901
$$ -1358 -9554 9706 23813 6639 -6872 10591 23447 4883 -8260 8456 20314 -1587
251a587j5388K0016J6634j8212j5020J8276J1624k2302j4236K3559J9033k1169
$$ -1587 -16975 3041 19675 1463 -13557 4719 16343 -5959 -20195 3364 22397 1228
263A228k1653J7190J8338j3326j2796J9001J4714j9447k0164J2429J3592j5473
$$ 1228 -20425 -3235 15103 1777 -11019 7982 22696 3249 -16915 -4486 9106 -6367
275f367j4442R553J0451r264J3J9217P970j6766q269J0941N16j4652O92J8636
$$ -6367 -20809 -11256 -805 -10069 -10056 9161 17131 365 -7904 3037 3553 -11099 -10407 8229
289H229q76k1907m48K0587J076j9805k543J8570j419j9030M190K3611p33k2032
$$ 8229 7353 -14554 -15002 5585 6661 -13144 -15687 2883 1464 -17566 -13376 10235 9502 -12530
303a2530j093J6703k361j5533P856K1132n220k1850L969J9249p320k4080M247
$$ -12530 -13623 3080 719 -14814 -6958 14174 8954 -12896 -8927 10322 3002 -21078 -16831
316a6831K2783o381k1218O686K7966J795k0205k90J9678j354k0601q99J6067j099
$$ -16831 5952 -429 -21647 -14961 13005 14800 -5405 -5695 13983 12629 -7972 -8871 7196 6097
330F097j7029Q56J4200K99j0713N271J2727o059j4933M331J2883l709j2694Q944
$$ 6097 -10932 -10076 4124 4423 -6290 -1019 11708 5649 -9284 -4953 7930 4221 -8473 471
344D71J5256n769j6120N160J7003m007j7131M75J2080j179j1420L123R512k373
$$ 471 15727 9958 -6162 -1002 16001 11994 -5137 -4662 7418 6239 -5181 -2058 7454 5081
358E081j0716J247Q665o33k752Q516Q253p718r434N975N872q987j1062O338P109
$$ 5081 -5635 -4388 4277 3644 892 9408 17661 9943 509 6484 12356 3369 -7693 -1355 5754
373E754r542p587J1842J5332o294j2208M690O476n765q707O765Q589p655p101
$$ 5754 -3788 -11375 467 15799 9505 -2703 1987 8463 2698 -6009 756 9345 1690 -5411
387e411R261Q302r136n719R918K960j8104r681J5681J1826j3596j0959J3039J2006
$$ -5411 3850 12152 3016 -2703 7215 10175 -7929 -17610 -1929 9897 -3699 -14658 -1619 10387
401A0387j1557j0543J3999J4293j2322j6836Q583J2930q049j2489O449Q370q638
$$ 10387 -1170 -11713 2286 16579 4257 -12579 -3996 8934 885 -11604 -5155 3215 -5423
414e423j0815R103R301m601m561J0254M062j4056m715J2770P247j4045q165J1105
$$ -5423 -16238 -7135 2166 -2435 -6996 3258 7320 -6736 -11451 1319 8566 -5479 -13644 -2539
428b539P645r821m806J2900N741j2651r161P005M316p728m10R986J419r772K054
$$ -2539 5106 -4715 -9521 3379 9120 -3531 -12692 -5687 -1371 -9099 -9509 477 1896 -7876 -5822
443e822J2954J280j0132K6R932o085j4898L389J6528j712j9102M30J6368J972
$$ -5822 7132 8412 -1720 -1694 8238 2153 -12745 -9356 7172 5460 -13642 -13212 3156 5128
457E128j3808J649J7075J239j6953j273J6462P65j3452q89J2054k806j3593L717
$$ 5128 -8680 -7031 10044 11283 -5670 -6943 9519 10284 -3168 -4057 7997 5191 -8402 -4685
471d685J5465J000j4319j508J3734k559j3382L88J2663R44j1612P92J4571J858
$$ -4685 10780 11780 -2539 -4047 9687 7128 -6254 -5866 6797 7741 -3871 -3079 11492 13350
485A3350p631o82O622j789j1289l463M643K274k191J080J006j676j379O983L189
$$ 13350 5719 5037 11659 9870 -1419 -4882 -239 2035 -156 924 1930 254 -1125 5858 9047
500I047n184k648M415J050n956j678P522K089r752l315P327K441n904j148P279
$$ 9047 3863 1215 5630 6680 724 -954 6568 8657 -1095 -4410 2917 5358 -546 -1694 5585
515E585J523r409l851Q626L832o345m021O518L524o423k972R107M198p076q227
$$ 5585 7108 -2301 -6152 2474 6306 -39 -4060 2458 5982 -441 -3413 5694 9892 2816 -5411
530e411M177L832o893o757M111O729k262n625J274Q553L408m391k162K172o73
$$ -5411 -1234 2598 -4295 -11052 -6941 -212 -2474 -8099 -6825 1728 5136 745 -1417 755 82
545H2o866k093O098M003m204n489K902N498j137m150J022L350k386n093K229N900
$$ 82 -6784 -8877 -2779 1224 -2980 -8469 -5567 -69 -1206 -5356 -4334 -984 -3370 -8463 -6234 -334
561c34J163m018m82L365j035j945L566L731l018n676j250J630j151q10K222M31
$$ -334 829 -3189 -3671 -306 -1341 -3286 280 4011 993 -4683 -5933 -4303 -5454 -6264 -4042 -3611
577c611l179R17O343L443l301j074M056j042o939j024P514r10q034J010R075j269
$$ -3611 -6790 -5873 470 3913 612 -462 3594 2552 -4387 -5411 2103 1193 -6841 -5831 3244 1975
593A975r321K706J2846j460j2412K45J2522k60j2989J931J4390n72j4552J168
$$ 1975 -7346 -4640 8206 6746 -5666 -5421 7101 6841 -6148 -4217 10173 9601 -4951 -3783
607c783J4818R04j4443j746J2304r18j4947p12J4061J361j1408R6J1867l64q937
$$ -3783 11035 11939 -2504 -4250 8054 7136 -7811 -8523 5538 6899 -4509 -4413 7454 7090 -1847
622a847L651J0864m075j2646K417R181m384j0092M431R364o337r051Q584J1026
$$ -1847 1804 12668 8593 -4053 -1636 7545 3161 -6931 -2500 6864 527 -8524 60 11086
636A1086o379r870P635P206j0193p925J0379R228j0955p842J1535Q392j2946p094
$$ 11086 4707 -5163 2472 9678 -515 -8440 1939 11167 212 -7630 3905 12297 -649 -7743
650g743J2778P024j7155j0951J6091J0108j5447j0136J6357J1195j5665q925J6274
$$ -7743 5035 12059 -5096 -16047 44 10152 -5295 -15431 926 12121 -3544 -12469 3805
663C805J0325j5020j1009J2477P698j5355q947J4233P115j3737n779J3559O594
$$ 3805 14130 -890 -11899 578 8276 -7079 -16026 -1793 5322 -8415 -14194 -635 5959
676E959j2063l235J2910K671j4649k906J4596J869j2489j029J2348j225j2974
$$ 5959 -6104 -9339 3571 6242 -8407 -11313 3283 5152 -7337 -8366 3982 2757 -10217
689a0217K925J3394k809j3441K570J0549n259j1117P712J3069p495j3069R265
$$ -10217 -7292 6102 3293 -10148 -7578 2971 -2288 -13405 -5693 7376 -119 -13188 -3923
702c923J4480p948j2104R296J1699j2945j5233J0105J4953r038j3792Q373J3818
$$ -3923 10557 2609 -9495 -199 11500 -1445 -16678 -6573 8380 -658 -14450 -6077 7741
715G741p447j1013R388J3074p500j2140P030Q426o854p732Q509P395q184p589
$$ 7741 294 -10719 -1331 11743 4243 -7897 -867 7559 705 -7027 1482 8877 693 -6896
729f896Q844P913p195o525N750L979p889l740P909N258n738l126O461J891m468
$$ -6896 1948 9861 2666 -3859 1891 5870 -2019 -5759 2150 7408 1670 -1456 5005 6896 2428
744B428o89N869r37p178n21N152j945n825K316O783k457p246K832Q832r1o019
$$ 2428 1739 7608 6671 -507 -1028 4124 2179 -3646 -1330 5453 2996 -4250 -1418 7414 7323 1304
760A304P46N461k729p374J248P149o57o491L7N351j3l897L19M595o86n658j469
$$ 1304 2050 7511 4782 -2592 -1344 5805 5148 -1343 -1306 4045 4032 135 454 5049 4363 -1295 -2764
777b764K632J066o39J114J411m18j932P43J505L00j820k566k020K62P49j07j098
$$ -2764 -132 934 295 1409 2820 2402 470 1213 2718 3018 1198 -1368 -3388 -3126 -2377 -2484 -3582
794c582J081K178o20k805J456M598K86l694j153K515p03l679l3M154lm353o75
$$ -3582 -2501 -323 -943 -3748 -2292 2306 2592 -1102 -2255 260 -443 -4122 -4155 -1 -4 -4357 -5032
811e032L025J608j291J008J432l316k638J710L004j744j163L824J873n141j322
$$ -5032 -2007 -399 -1690 -682 750 -2566 -5204 -3494 -490 -2234 -3397 427 2300 -2841 -4163
826d163O117K204n961l795L957R7o865K50J0322K101q992j646R143K539p835q60
$$ -4163 1954 4158 -1803 -5598 -1641 -1544 -8409 -8159 2163 4264 -4728 -6374 2769 5308 -2527 -3387
842c387Q724j88j1291j039J1018J772r986j014J0153j06j0792O03J2384J223j1147
$$ -3387 5337 5149 -6142 -7181 3837 5609 -4377 -5391 4762 4656 -6136 -5533 6851 8074 -3073
857c073j331J0394k93r242J743R728k002j0040K213J0962k452q932K807P457n518
$$ -3073 -4404 5990 5697 -3545 -1802 7926 5924 -4116 -1903 9059 6607 -2325 482 7939 2421
872B421r561M755R103m334p253O722Q509o534p689Q543Q177r222r905O998P417
$$ 2421 -7140 -2385 6718 2384 -4869 1853 10362 3828 -3861 4682 12859 3637 -6268 730 8147
887H147q164p199J0026Q300r899q433R587P889r432p619J0163P350j0611q307
$$ 8147 -17 -7216 2810 11110 1211 -7222 2365 10254 822 -6797 3366 10716 105 -8202
901h202J0846Q331r073q212R054O056j0308n967R987P081j0483p699Q276N859
$$ -8202 2644 10975 1902 -6310 2744 8800 -1508 -7475 2512 9593 -890 -8589 -313 5546
915E546q612m775R014N016q441m066R278M460p971l759O374M76r749j764R340
$$ 5546 -3066 -7841 1173 6189 -2252 -6318 2960 7420 -551 -4310 2064 2540 -7209 -8973 367
930C67K568q322q20Q382N70q183J276Q053j127j0850K91R759P0p903J709Q756
$$ 367 2935 -5387 -6207 2175 2745 -5438 -4162 3891 2764 -8086 -7795 1964 2034 -5869 -4160 4596
946D596k064j0169J109R758j516r402J259Q243j567q306K780R958j677r525J224
$$ 4596 2532 -7637 -6528 3230 1714 -7688 -6429 1814 247 -8059 -5279 4679 3002 -6523 -5299
961e299Q425k61p279J311P825j925q885N90P063q61o607J630O817n76n252K401
$$ -5299 3126 2865 -4414 -3103 4722 2797 -6088 -5498 1565 704 -5903 -4273 2544 1968 -3284 -883
977h83O191j227o063J91M193k002m051K752N314j643m031J691M372k101m507J545
$$ -883 5308 4081 -1982 -1791 2402 400 -3651 -899 4415 2772 -1259 432 4804 2703 -1804 -259
993b59L455l071m064L606N446j207l738K154L543k713m694K728N363k900n689
$$ -259 3196 125 -3939 -333 5113 3906 168 2322 5865 3152 -1542 1186 6549 3649 -2040
1008b040J565M773j284m658J971M844k190m953J626O330k02m936K96M182j581
$$ -2040 -475 4298 3014 -1644 327 5171 2981 -1972 -346 5984 5782 846 1142 5324 3743
1023C743o038P73M759J89m903L98M506J14l960L18L743j216n268k50M541o0k456
$$ 3743 -2295 -1522 3237 3426 -1477 -1079 3427 3541 -419 -101 3642 2426 -2842 -3092 1449 1389 -1067
1040a067J874L449j880l450P39L480k481l826P17K663k259k325L912L783k936
$$ -1067 807 4256 2376 -1074 -335 3145 664 -3162 -2445 218 -2041 -4366 -454 3329 393
1055C93m785K825L469l189l131M561L638n247m879M176N096l977n272L061M593
$$ 393 -4392 -1567 1902 -1287 -4418 143 3781 -1466 -6345 -2169 2927 -1050 -6322 -3261 1332
1070A332m081m019N019O070l556o463J861M845k673m861L745N810k817n042L273
$$ 1332 -2749 -6768 -1749 4321 765 -5698 -3837 1008 -1665 -6526 -2781 3029 212 -4830 -1557
1085a557N290k254n406P50L593k476l678K249N132l21l346P68L411q33k667N22
$$ -1557 3733 1479 -3927 -3177 416 -2060 -5738 -3489 1643 1322 -2024 -1256 2155 1322 -1345 -823
1101h23J860j584j408Q68J255j18M3J500n96k555J95J862N67j726Q70L026j099
$$ -823 1037 -547 -1955 -1087 168 50 93 1593 997 -1558 -1363 499 1066 -660 210 3236 2137
1118B137l033M47L594M88l852p41L781M80k876N19M480m56n477j959L684J831
$$ 2137 -896 -449 3145 3633 -219 -960 2821 3301 425 944 5424 4968 -509 -2468 1216 3047
1134C047k986m73L969J942l666j664L392K938l991l992J438K544j766k096K483
$$ 3047 61 -412 3557 5499 1833 169 3561 6499 2508 -1484 -46 2498 732 -1364 1119
1149A119L980j690m083Q6L113K37k841k01J854L98k224n30K962J624k482k058
$$ 1119 5099 3409 -674 -588 2525 2762 -79 -280 1574 1972 -252 -782 2180 3804 1322 -736
1165g36Q92M13q88l68J873N46j717j371R60L08o84J70J041p24j304J095K006n63
$$ -736 156 569 -319 -687 1186 1732 15 -1356 -396 -88 -772 -602 439 -285 -1589 -494 1512 949
1183I49j542L03N9k970j772K885K757j776j946K192K371l354k582L406K964m594
$$ 949 -593 -290 -231 -3201 -4973 -2088 669 -1107 -3053 -861 1510 -1844 -4426 -1020 1944 -2650
1199b650m884M490M877k499l559L843L935n049n814M223N588l199n310L387N345
$$ -2650 -7534 -3044 1833 -666 -4225 -382 3553 -1496 -7310 -3087 2501 -698 -6008 -2621 2724
1214B724l717m532M172N485l744n847K529M866k075l279L020L214l813l492K848
$$ 2724 -993 -5525 -1353 4132 388 -5459 -2930 1936 -139 -3418 -398 2816 -997 -4489 -1641
1229a641L110k684k459L392J990l161r97M379J637m526j838L627k86m431J584
$$ -1641 1469 -1215 -3674 -282 1708 -1453 -2450 1929 3566 -960 -2798 829 543 -3888 -2304
1244b304O042j62n031N09N157m55o697J032N795j022o713J472P890j94o780J331
$$ -2304 3738 3576 -1455 -946 4211 3756 -2941 -1909 3886 2864 -3849 -2377 5513 5319 -1461 -130
1260a30O815k285q310J202Q391K8p820KP247p53p471J023P301r41o728q42P357
$$ -130 6685 4400 -3910 -2708 5683 5711 -2109 -2107 5140 4387 -3084 -2061 5240 4299 -2429 -3271 4086
1277D086M57n338l3M978j790n005J520L937r94l472J697L185k150l574L505L209
$$ 4086 4543 -795 -828 4150 2360 -2645 -1125 2812 1818 -1654 43 3228 1078 -2496 1009 4218
1293D218l046m261K630K567l133j505M523K530n263k164M768J754n833j813N653
$$ 4218 1172 -3089 -459 2108 -1025 -2530 1993 4523 -740 -2904 1864 3618 -2215 -4028 1625
1308A625R13o727q00O836K963p055k298N402J335n936k798P439K695o983j752
$$ 1625 2538 -4189 -4989 1847 4810 -2245 -4543 859 2194 -3742 -6540 899 3594 -3389 -5141
1323e141N599K087n566k089M369K141n294j225M428J777k375j90J333j391k820
$$ -5141 458 2545 -3021 -5110 -741 1400 -3894 -5119 -691 1086 -1289 -1479 -146 -1537 -4357
1338d357J257K565L72j979J477J551j932j441J815Q56k063j293J395J499j325
$$ -4357 -3100 -535 -163 -2142 -665 886 -1046 -2487 -672 184 -1879 -3172 -1777 -278 -1603
1353a603J45K766J30l972j60L061N52l081K78L959p33m042p86N542J425m097k215
$$ -1603 -1458 1308 1438 -2534 -2694 367 919 -2162 -1884 2075 1342 -2700 -3486 2056 3481 -616 -2831
1370b831L597J640k477j887K701K375k529j106J577R31n52q95L9O49r61J07Q95
$$ -2831 766 2406 -71 -1958 743 3118 589 -517 1060 1991 1439 544 583 1232 271 378 1273
1387A273J200j83J72j121m23n82M00P7K91O10J034q22l93J091l96j883j360J906
$$ 1273 2473 2290 2462 1341 918 336 736 813 1104 1714 2748 1926 1533 2624 2228 345 -1015 891
1405H91J035j458m61L183J661l636k638J533K333k158k013K241K717j911k273
$$ 891 1926 468 7 3190 4851 1215 -1423 110 2443 285 -1728 513 3230 1319 -954
1420i54J763J751j258k252O40J270p92j65J549L42k387o16J928n07k134Q00K766
$$ -954 809 2560 1302 -950 -310 960 168 3 1552 1894 -493 -1109 819 312 -1822 -1022 1744
1437A744o88l306J10K898l08k246O34K458j875k449J804K285j872k392K463K380
$$ 1744 1056 -2250 -2140 758 450 -1796 -1162 1296 -579 -3028 -1224 1061 -811 -3203 -740 1640
1453A640l318k032L698K594m529l684L751L224l555k439M419L673m305m153L472
$$ 1640 -1678 -3710 -12 2582 -1947 -5631 -1880 1344 -2211 -4650 -231 3442 -863 -5016 -1544
1468a544L660l767l153L898K862l605j802L830K216m089k691L530J539l456m88
$$ -1544 2116 -1651 -4804 -906 1956 -1649 -3451 379 2595 -1494 -4185 -655 884 -2572 -3060
1483c060M984J485m875j819L821R87m070m43M764R02m107l17L704L21l630q1K879
$$ -3060 1924 3409 -1466 -3285 536 1523 -2547 -2990 1774 2676 -1431 -1748 1956 2277 -1353 -1434 1445
1500A445r47k932K458M059j783m117J759L196k698l098K925M213k864m492L061
$$ 1445 498 -2434 24 4083 2300 -1817 -58 3138 440 -2658 267 4480 1616 -2876 185
1515A85M022k931l869L276L416k816l639L424L379k966l549L056L167l464k612
$$ 185 4207 1276 -2593 683 4099 1283 -2356 1068 4447 1481 -2068 988 4155 691 -1921
1530a921M177L249m387l699L219K796l419k255M215K716l600l098K961K498l914
$$ -1921 2256 5505 1118 -2581 638 3434 15 -2240 1975 4691 1091 -2007 954 3452 -462
1545d62j961L411K033l359j435L520K060l822k518K337R08k847l83M540R20l662
$$ -462 -2423 988 3021 -338 -1773 1747 3807 -15 -2533 -196 712 -2135 -2518 2022 2942 -720
1561g20j031K281N65l395L50L231o35k460K33L005q0k964J33J763j243k567J558
$$ -720 -1751 530 1095 -2300 -1950 1281 646 -1814 -1581 1424 1344 -1620 -1487 276 -967 -3534 -1976
1578a976L070n36k572kJ738n38k237J545K749j612l067J438K442j146k025J143
$$ -1976 1094 558 -2014 -2016 -278 -816 -3053 -1508 1241 -371 -3438 -2000 442 -704 -2729 -1586
1594a586K236k030j840J311K458j120k470J161J494n50j394J197K462o71j855
$$ -1586 650 -1380 -3220 -1909 549 -571 -3041 -1880 -386 -936 -2330 -1133 1329 658 -1197
1609a197n51J173j66m80N35R39j76p68J90M29o77K72N91M50j465L07J677R76j349
$$ -1197 -1748 -575 -741 -1221 -686 253 77 -691 -501 -72 -749 -477 114 564 -901 -594 1083 2059 710
1628G10r11K07L69j037J4J584J118r24j404L02O99j37p23L76R23n42j03J155N51
$$ 710 -201 6 375 -662 -648 936 2054 1130 -274 28 727 590 -133 243 1166 624 521 1676 2227
1647B227m10j138L38Q05j398q01J549J839o71k628L20J829J11k184O72K157n0
$$ 2227 1817 679 1017 1822 424 -377 1172 3011 2340 -288 32 1861 1972 -212 460 2617 2567
1664B567k023n93K092J147k269j260J309Q23j152q43J358M95j084j351P95O03
$$ 2567 544 -49 2043 3190 921 -339 970 1793 641 -202 1156 1651 567 -784 11 614
1680F14n79N26R20m28j350p85J646P97j361l34J418J26j463q54Q32O08j074k91
$$ 614 35 561 1481 1053 -297 -1082 564 1361 0 -334 1084 1210 -253 -1107 -275 333 -741 -1032
1698a032K64M29k11R20P84j224m96L41R3j213j31J850Q02k012j716J706J750k091
$$ -1032 -768 -339 -550 370 1154 -70 -566 -225 -132 -1345 -1476 374 1176 -836 -2552 -846 904 -1187
1716a187j859J600J922j332j850J489K224j095j702M38J024n01o87J535J033j582
$$ -1187 -3046 -1446 476 -856 -2706 -1217 1007 -88 -1790 -1352 -328 -829 -1516 19 1052 -530
1732e30j646J033J153j049q37R09J577q89j402P89K333k92k052K74J440L56j220
$$ -530 -2176 -1143 10 -1039 -1876 -967 610 -279 -1681 -892 1441 1149 -903 -629 811 1167 -53
1749e3o42J110P85r45j543P53P97M76j27n65J90O12r5q14m9J033Q27m15j082j4
$$ -53 -695 415 1200 255 -1288 -535 262 738 611 46 236 848 753 -61 -110 923 1750 1335 253 239
1769B39J447L30j340m33K90M94m14l78Q01O25r53m98O60N15J07J44M68J66j267
$$ 239 1686 2016 676 243 533 1027 613 235 1036 1661 708 210 870 1385 1492 1636 2104 2270 1003
1788A003o29J255P29j150j848J270J188q07j843J685K180j259k988K11L174J48
$$ 1003 374 1629 2358 1208 -640 630 1818 1011 -832 853 3033 1774 -1214 -1003 2171 2319
1804B319k374q84K807K98k494q68K561M61j957r94J274N97j785k76J856K33j596
$$ 2319 -55 -939 1868 2166 -328 -1196 1365 1826 -131 -1125 149 746 -1039 -1315 541 774 -822
1821h22l60J807N46j589m9J627o1k612J07J874p9j850p4J340m94j538R60J516
$$ -822 -1182 625 1171 -418 -467 1160 1099 -1513 -1406 468 389 -1461 -1535 -195 -689 -2227 -1267 249
1839B49l95j276M19J060j137j398K190J270k740j257K105K048k627j422K483J599
$$ 249 -146 -1422 -1003 57 -1080 -2478 -288 982 -1758 -3015 -910 1138 -1489 -2911 -428 1171
1855A171l439j860L348K134k757k000K824K163k608j456K980K058l048k126K672
$$ 1171 -2268 -4128 -780 1354 -1403 -3403 -579 1584 -1024 -2480 500 2558 -490 -2616 56
1870E6J404k556j898K925J751l411j217L172J972k604j287K556Q81k714p51K856
$$ 56 1460 -1096 -2994 -69 1682 -1729 -2946 226 2198 -406 -1693 863 1744 -970 -1721 1135
1886A135P56k617n02K308K88k517J90K689j97k725j46L021o99k503J123L313j549
$$ 1135 1891 -726 -1228 1080 1368 -1149 -959 1730 1533 -1192 -1338 1683 984 -1519 -396 2917 1368
1903A368k615J031L445r36l130J062K416j684k660J365K940j019l215J193K743
$$ 1368 -1247 -216 3229 2293 -837 225 2641 957 -1703 -338 2602 1583 -1632 -439 2304
1918B304j317k184K031K689j614l146J528K430j332k370J510J910k265j684J916
$$ 2304 987 -1197 834 3523 1909 -1237 291 2721 1389 -981 529 2439 174 -1510 406
1933D06J622j733j637J795N99j878p78K535J015j980j585K452Q52j753p03J996
$$ 406 2028 295 -1342 453 1052 -826 -1604 931 1946 -34 -1619 833 1685 -68 -771 1225
1949A225k4k630q0J755N7j672j40J627l28j960Q80K610n55k053N57J768j016k302
$$ 1225 1201 -1429 -1509 246 303 -1369 -1509 118 -210 -2170 -1290 1320 765 -1288 -731 1037 21 -2281
1967b281R21K007r06j913R5J984l29j313L82J191m54j340N91R11j76k35Q55q3
$$ -2281 -1360 647 -259 -2172 -2077 -93 -422 -1735 -1353 -162 -616 -1956 -1365 -454 -630 -865 -10 -93
1985i3j173m9J329L16j012j68J98l89j177K89J668k82o14K18O37J5j4J130j5r97
$$ -93 -1266 -1315 14 330 -682 -850 -652 -1041 -2218 -1929 -261 -543 -1157 -939 -302 -287 -301 829 814 -183
2005a83p81R42O08r52q03J458O38j864q22J488J594q90j123M81J252l01q30O94
$$ -183 -964 -22 586 -366 -1169 289 927 -937 -1759 -271 1323 433 -690 -209 1043 742 -88 606
2023F06M25o59j8M86N0n0M96M85j217j258P36P05q19m95J058J221r06p12Q91J607
$$ 606 1031 372 354 840 890 840 1336 1821 604 -654 82 787 -32 -527 531 1752 846 134 1025 2632
2043B632j204r67Q18N46j263q80J192O46j357q52K058K09k046R6K179Q24k794
$$ 2632 1428 461 1279 1825 562 -318 874 1520 163 -689 1369 1578 -468 -372 1807 2631 -163
2060a63q49J927Q59j951k35J835P03k113j066K026N29j483r99J162J10j768N79
$$ -163 -1012 915 1774 -177 -412 1423 2126 13 -1053 973 1502 19 -980 182 292 -1476 -897
2077h97J479j97j609L56K021o34j761J757J427j130k847M42K122o98k355R25J798
$$ -897 582 385 -1224 -868 1153 519 -1242 515 1942 812 -2035 -1593 529 -169 -2524 -1599 199
2094A99r59j357J610J628j596j506J607J171k025p73K198J262k600j075J997R70
$$ 199 -760 -2117 -507 1121 -475 -1981 -374 797 -1228 -2001 197 1459 -1141 -2216 -219 751
2110G51j967j387K569J054k442j901K042J826j676j007J861O83j531j29K048M6
$$ 751 -1216 -2603 -34 1020 -1422 -3323 -1281 545 -1131 -2138 -277 406 -1125 -1254 794 840
2126H40j734j88J117j60j965K13K441n66k080M11K733j17k008P06J893o96j976
$$ 840 -894 -1082 35 -125 -2090 -1877 564 -2 -2082 -1671 1062 945 -1063 -357 1536 840 -1136
2143a136M57J880k24k022J224J197q28j135Q81P84q52j224J119R65j382j070J835
$$ -1136 -679 1201 977 -1045 179 1376 548 -587 294 1078 226 -998 121 1086 -296 -1366 469
2160D69K089j718j538J361J654j286j145Q35J187j641j294J115N95q74j41Q19
$$ 469 2558 840 -698 663 2317 1031 -114 721 1908 267 -1027 88 683 -191 -332 487
2176D87N59r38j2J353L08j128m41J291m25j507K57J438l9j611M4J396j10o97k99
$$ 487 1046 108 96 1449 1757 629 188 1479 1054 -453 -196 1242 1203 -408 -364 1032 922 225 -74
2195g4Q55o91j079K83J296K81r96M68P24p08p91R35K91n13j080l18N96l81n15
$$ -74 781 90 -989 -706 590 871 -125 343 1067 359 -432 503 794 281 -799 -1117 -521 -902 -1417
2214a417O68O58p25n25O95J218l57o44L74k65o09k07P50M93o32q36Q8O84k04N57
$$ -1417 -749 -91 -816 -1341 -646 572 215 -429 -55 -320 -929 -1136 -386 107 -525 -1361 -1273 -589 -793 -236
2234b36N2p72n35L98Q20o74k35N71O94o28K5M84O01o71o37kk4n98m45M24M34M89
$$ -236 -184 -956 -1491 -1093 -273 -947 -1182 -611 83 -545 -520 -36 565 -106 -743 -745 -769 -1367 -1812 -1388 -954 -465
2256d65p84Q17M49J18j58M92j67l40o9K47k75k28L51R1k03j03J18L32l90Q4P37
$$ -465 -1249 -432 17 135 -23 469 302 -38 -107 140 -135 -363 -12 79 -124 -227 -109 223 -167 -83 654
2277F54J52q38J81K94L01m54M2O40K74p13l65J342k68j341l49Q65l81q31M16J183
$$ 654 806 -32 149 443 744 290 332 972 1246 533 168 1510 1242 -99 -448 417 36 -795 -379 804
2297H04N25q61K95M52J05r2K96N11j153q06J36P65o3m95k06L69o9j86N43Q09m55
$$ 804 1329 468 763 1215 1320 1228 1524 2035 882 76 212 977 914 419 213 582 513 327 870 1679 1224
2318A224j033j9K92J54J36p3O71q05j13l72Q9L85q92M47j21q80l97Q39Q77n23
$$ 1224 191 172 464 618 754 681 1352 547 434 62 151 536 -356 91 -30 -910 -1307 -468 409 -114
2338a14m02O23O38n28j68R39K15j366q16J69J77r2m20O81k6m93K45P68k14K87
$$ -114 -516 107 745 217 49 988 1203 -163 -979 -810 -633 -725 -1145 -464 -490 -983 -738 30 -184 103
2358A03l04M26r41q1L14P13L84j059J23R9J34r13K98L53j13o48J89k92O42J3N
$$ 103 -201 225 -716 -797 -483 230 614 -445 -322 -223 -89 -1002 -704 -351 -464 -1112 -923 -1215 -573 -560 -555
2379e55J063o57l71R20j37j17m44P4K16p50r11K83Q26M46o24M59O77K33k47m79
$$ -555 508 -149 -520 400 263 146 -298 -224 -8 -758 -1669 -1386 -560 -114 -738 -279 398 631 384 -95
2399i5J012J05r33j134Q74J073j54n35M42k82J42n05P6N82p94Q8j76M86J94L24
$$ -95 917 1022 89 -1045 -171 902 748 213 655 373 515 10 86 668 -126 -38 -214 272 466 790
2419G90n1R07k70o04K99M8m28m06L51K30j369l00R54N12O6k52J21M52n21O78P88
$$ 790 739 1646 1376 772 1071 1119 691 285 636 866 -503 -803 151 663 729 477 598 1050 529 1207 1995
2440A995r64m40l63R89p10l15o2O88p65r6m84J137O3n26k08K40R6p58L67R82p82
$$ 1995 1031 591 228 1217 507 192 130 818 53 -43 -527 610 673 147 -61 179 275 -483 -116 866 84
2461H4K67O3O51n15n50l01J098j032j269M73R8P79r50L65J207l04n47N18R48q96
$$ 84 351 414 1065 550 0 -301 797 -235 -1504 -1031 -933 -154 -1104 -739 468 164 -383 135 1083 187
2481A87o13L99M52n52r22R20K76r79l41N39K13l19j60L33O81j47j495J385M6j262
$$ 187 -426 -27 425 -127 -1049 -129 147 -832 -1173 -634 -421 -740 -900 -567 114 -33 -1528 -143 -97 -1359
2501a359P28J710l56j186p36K090p7k392O6R67l14j155N58J338j29n39j66J301
$$ -1359 -631 1079 723 -463 -1199 891 814 -1578 -1512 -545 -859 -2014 -1456 -118 -247 -786 -952 349
2519C49P0q05O37M45o08j533O01J599m23j123O52N42o93M20j83J337m55j173O06
$$ 349 419 -386 251 696 88 -1445 -844 755 332 -791 -139 403 -290 130 -53 1284 829 -344 262
2538B62l5k63r06J720O50l36o17K41N97j253o14J051O75j484m89L95M52m44O81
$$ 262 227 -36 -942 778 1428 1092 475 716 1313 60 -554 497 1172 -312 -801 -406 46 -398 283
2557B83J092K07o78l17J065J028k716n04J474m91q93p7J676K33j920Q08P15l39
$$ 283 1375 1582 904 587 1652 2680 -36 -540 934 443 -450 -527 1149 1382 -538 270 985 646
2575F46n93L19O27K57k171J317M22M45j553P00Q83j227j000J106K70o97j352M86
$$ 646 53 372 999 1256 -915 402 824 1269 -284 416 1299 72 -928 178 448 -249 -1601 -1115
2593a115N24j39j85J045O71j155j7J037L81j698M14M73k84q09o93M00Q82j375
$$ -1115 -591 -730 -915 130 801 -354 -371 666 1047 -651 -237 236 -48 -857 -1550 -1150 -268 -1643
2611a643N13J129R74j912K45M26O05j646K63R02J35q14L91J403j479n54m16J653
$$ -1643 -1130 -1 973 -939 -694 -268 337 -1309 -1046 -144 -9 -823 -432 971 -508 -1062 -1478 175
2629A75r73p99P20R39j092p51J310R08J84j132P2J759j659l98O68N55o01p38j78
$$ 175 -798 -1597 -877 62 -1030 -1781 -471 437 621 -511 -439 1320 -339 -737 -69 486 -115 -853 -1031
2648a031P13j427J862K14k35p71m49K646r59r12O74J71P05j598j84J056M35n39
$$ -1031 -318 -1745 117 331 96 -675 -1124 1522 563 -349 325 496 1201 -397 -581 475 910 371
2666C71P09k72r21o69M11J111j51j664J199N52q16J48N38J489j308k41K49Q19
$$ 371 1080 808 -113 -782 -371 740 589 -1075 124 676 -140 8 546 2035 727 486 735 1554
2684A554j946K26J611J04k656N12J096OP83j796J962K99j167k83R33j82l11o74
$$ 1554 -392 -166 1445 1549 -1107 -595 501 507 1290 -506 1456 1755 588 305 1238 1056 745 71
2702G1J360j44j690M64J810p40j803k20J418Rr51M77L46r46m60N18J472m91l90
$$ 71 1431 1287 -403 61 1871 1131 -672 -892 526 535 -416 61 407 -539 -999 -481 991 500 110
2721A10J221o35j26j454J037J085n47k342O08Q55j453R12K018j065n55O4M52J763
$$ 110 1331 696 570 -884 153 1238 691 -1651 -1043 -188 -1641 -729 1289 224 -331 -267 185 1948
2739A948l318P28q59J693j464O28O28K91p74p38Q07O30j045j197J687M17j162
$$ 1948 -1370 -642 -1501 192 -1272 -644 -16 275 -499 -1237 -430 200 -845 -2042 -355 62 -1100
2756a100j134K743kr46J05J540o98r99O72O3J357k626m10J595j202j3Q9J184L39
$$ -1100 -2234 509 507 -439 -334 1206 508 -491 181 244 1601 -1025 -1435 160 -1042 -1055 -966 218 557
2775E57o32M65Q84j122LOM20k08j252O3O06J07o03J528N48r43j551J484M9J37
$$ 557 -75 390 1274 152 155 161 581 373 -879 -816 -210 -103 -706 822 1370 427 -1124 360 409 546
2795E46p87P74K13m95m6R73Q62j485J7j13O5j065J58J059Q0j350JJ664q58K03
$$ 546 -241 533 746 251 205 1178 2040 555 572 459 524 -541 -383 676 756 -594 -593 1071 213 416
2815D16Q8J84O06j307K11Q83L25q93l93J89k59n89M23P47k91k50P24J36m60j273
$$ 416 504 688 1294 -13 198 1081 1406 513 120 309 50 -539 -116 631 340 90 814 950 490 -783
2835g83J796l73p05L0L38O53q04K2R42k50q64p18Q68l48j4j7K63j02J45o44r1
$$ -783 1013 640 -65 -35 303 956 152 174 1116 866 2 -716 152 -196 -210 -227 36 -66 79 -565 -656
2856f56J881o62J78l35L35p54m62J36K96j234j24P14j98L09L68p6m88r5N83N26
$$ -656 1225 563 741 406 741 -13 -475 -339 -43 -1277 -1401 -687 -885 -576 -208 -284 -772 -867 -284 242
2876B42p97K66L42L70k57m40L0O55k96o52l97M92j332P61J046K5o38j26N98m37
$$ 242 -555 -289 53 423 166 -274 -244 411 115 -537 -934 -442 -1774 -1013 33 58 -580 -706 -108 -545
2896e45P01l51L99k78P35n79K61m79j34j55J91L84j530J492p15J566q5k24j02
$$ -545 156 -195 204 -74 661 82 343 -136 -270 -425 -234 150 -1380 112 -603 963 878 654 552
2915E52o51q83J087K02j312L35J712L2j114j80K43N34p18l66J508p01m88Q86M7
$$ 552 -99 -982 105 307 -1005 -670 1042 1074 -40 -220 23 557 -161 -527 981 280 -208 678 725
2934G25r60J04P72Q05K93n61j478N94R76k36j583R51K41j215N72R89n20k08%J084
$$ 725 -235 -131 641 1446 1739 1178 -300 294 1270 1034 -549 402 643 -572 0 989 469 261 261 1345
2954A345k05p50L67Q47r34r8k97n03P90m58K33k59q7k52O39k9N33q15N12Q38j807
$$ 1345 1140 390 757 1604 670 572 275 -228 562 104 337 78 -9 -261 378 349 882 67 579 1417 -390
2975c90j12R42L32L56n26K6k80j269L12J26j6K16m5j40o2J86M0O48n98j83O52
$$ -390 -502 440 772 1128 602 628 348 -921 -609 -483 -499 -283 -328 -468 -530 -344 -304 344 -254 -437 215
2996B15J34j06o02l60M96K79l26n22L07M78k73J70q59M44j88rK57K72l38J77p41
$$ 215 349 243 -359 -719 -223 56 -270 -792 -485 -7 -280 -110 -969 -525 -713 -722 -465 -193 -531 -354 -1095
3017a095R67j43R5P53k81m28j44J35j84n39N00n22M6nJ250r80O45K25N6m01K21
$$ -1095 -128 -271 -176 577 296 -132 -276 -141 -325 -864 -364 -886 -840 -845 405 -575 70 295 351 -50 171
3038A71P4l89k69l68J240m53j019J184p42Q91O7J094j658j79R56J65l93p04J103
$$ 171 245 -144 -413 -781 459 6 -1013 171 -571 320 387 1481 -177 -356 600 765 372 -332 771
3057G71k14L2l25Q50l95q74M21o38K08M84l95L94j64J92K9K48K83O46j037J06
$$ 771 557 589 264 1114 719 -155 266 -372 -164 320 -75 319 155 347 376 624 907 1553 516 622
3077F22n41K24m3K17k50k09L7K49Ln75O62K98N8l07k50K32j73l20K82N05m22p74
$$ 622 81 305 262 479 229 20 57 306 309 -266 396 694 752 445 195 427 254 -66 216 721 299 -475
3099d75P95K34k40J38L4j65m38l71P6L18m78J48Q2M96o1k93K96O49r58j65j7J98
$$ -475 320 554 314 452 486 321 -117 -488 -412 -94 -572 -424 -342 154 93 -200 96 745 -213 -378 -395 -197
3121a97k81j28O1K19k86j02L77K77l62L05K11l22l51q8N38L57p53l6M21J52l77
$$ -197 -478 -606 -545 -326 -612 -714 -337 -60 -422 -117 94 -228 -579 -667 -129 228 -525 -561 -140 12 -365
3142c65O8L98k3q13m2K27lN8N9L32n74l58N42J075o48K4M39k36p04k97P46j6l34
$$ -365 -297 101 78 -735 -777 -550 -553 -495 -436 -104 -678 -1036 -494 581 -67 -43 396 160 -544 -841 -95 -111 -445
3165d45o35M87N25l38j62R56P2l62l41L71L5q7k11J34L01m72j12P81J95m15n28
$$ -445 -1080 -593 -68 -406 -568 388 460 98 -243 128 163 76 -135 -1 300 -172 -284 497 692 277 -251
3186b51P44m93l99M77R9L71n07k8P71l72k61N11M53k51o07n7K44n02k52O11J66
$$ -251 493 0 -399 78 177 548 41 13 784 412 151 662 1115 864 257 200 444 -58 -310 301 467
3207D67m03k59Q37O81j061K35M21Q2r01LL99K26o50p2L10M3m06k1P85k96n78j20
$$ 467 64 -195 642 1323 262 497 918 1000 99 102 501 727 77 5 315 358 -48 -69 716 420 -158 -278
3229b78N76N4n78P1P17j66o93K79Q00m08n73K19J93m01o78O02N98o82p26P54L42
$$ -278 298 352 -226 -155 562 396 -297 -18 782 374 -199 20 213 -188 -866 -264 334 -348 -1074 -320 22
3250B2l8m25O49N37j017j85J52N76q20j75K84N14r12mQ87J78q85m5K92J54l93
$$ 22 -16 -441 208 745 -272 -457 -305 271 -549 -724 -440 74 -838 -842 45 223 -662 -707 -415 -261 -654
3271f54J87NO35p69J53K79N34m68j01O17n25n56l6M38k33k27K33P77m67m38N31
$$ -654 -467 -462 173 -596 -443 -164 370 -98 -199 418 -107 -663 -699 -261 -494 -721 -488 289 -178 -616 -85
3292h5P83l38m46J2M94m85q12N45N45m65p6J67N39j94p31P93L82q62kM04L49p37
$$ -85 698 360 -86 -74 420 -65 -877 -332 213 -252 -328 -161 378 184 -547 246 628 -234 -236 168 517 -220
3314b20J36R37k34n34k34J183K1r08k43N88J04p31m32R38M42q85j00Q77K64o88
$$ -220 -84 853 619 85 -149 1034 1055 147 -96 492 596 -135 -567 371 813 -72 -172 705 969 281
3334B81N98J25l68m87k61O25m58o48Q50N24m92m47K32O43k45m19J77M17r95j01
$$ 281 879 1004 636 149 -112 513 55 -593 257 781 289 -158 74 717 472 53 230 647 -348 -449
3354d49O23N64l80m23M53M46q94m00O95O3p79l55R15J0j42k94P93j48o58l2P42
$$ -449 174 738 358 -65 388 834 -60 -460 235 298 -481 -836 79 89 -53 -347 446 298 -360 -392 350
3375C50M11n75n97L79J73n58k46M02J65q06K87M70O5r42Q46N95j055j60L13M17
$$ 350 761 186 -411 -32 141 -417 -663 -261 -96 -902 -615 -145 -80 -1022 -176 419 -636 -796 -483 -66
3395f6k88j01q8O68l59l38K66M80l88l62M68k15l05j99Q44J53q44J15Q95m2j67
$$ -66 -354 -455 -543 125 -234 -572 -306 174 -214 -576 -108 -323 -628 -827 17 170 -674 -559 336 294 127
3416A27l18M08J79m17o11L76N91n18k57M33N4m59M5O25K11p95P8N09k09o65P18
$$ 127 -191 217 396 -21 -632 -256 335 -183 -440 -7 47 -412 -367 258 469 -326 -248 261 52 -613 105
3437A05M24k35l26l05O36K42n22J92O7J24r44M08O09k63J18o1K90N00j044N36
$$ 105 529 294 -32 -337 299 541 19 211 278 402 -542 -134 475 212 330 269 559 1059 15 551
3457E51O78q35m06K68Ll09J75k83R37r48l01M94P73l05l25K89j22n75O00J07m6
$$ 551 1229 394 -12 256 259 -50 125 -158 779 -169 -470 24 797 492 167 456 334 -241 359 466 420
3478D20q02O44j69K94q00N95K26j64m41j26J13j74L12k06O93r9r98J073J15j88
$$ 420 -382 262 93 387 -413 182 408 244 -197 -323 -210 -384 -72 -278 415 316 -682 391 506 318
3498C18j76R6M4p30k58J09O90j73j89L33O0r3n3L98j58m70n25Q58J02j077k9Q03
$$ 318 142 238 282 -448 -706 -597 93 -80 -269 64 124 31 -22 376 218 -252 -777 81 183 -894 -923 -120
3520a20Kn16k26N32K23m80J59q9J73p05L05J160k39n98L36J83l55j17M03L08p7
$$ -120 -118 -634 -860 -328 -105 -585 -426 -515 -342 -1047 -742 418 179 -419 -83 100 -255 -372 31 339 262
3541B62m31k19K94n24K2P81k23l37O1K01J66k05O15k22k40l29L57k33J54J10K30
$$ 262 -169 -388 -94 -618 -596 185 -38 -375 -314 -113 53 -152 463 241 1 -328 29 -204 -50 60 290
3562B90n05P9M03o9K40j2l86m89M12L02n57J75N47n9M00r00L15K01m63J96k47
$$ 290 -215 -136 267 198 438 426 40 -449 -37 265 -292 -117 430 371 771 -129 186 387 -76 120 -127
3583a27K33o67J074K38n07J08j17k38K26M4J49M70l61o95J32O90l61l20M7O39
$$ -127 106 -561 513 751 244 352 235 -3 223 267 416 886 525 -170 -38 652 291 -29 18 657
3603F57p34O57j1m09L99j063Q75j06j92l57K34N63m19l25M51k21K68J80l30o2
$$ 657 -77 580 569 160 559 -504 371 265 73 -284 -50 513 94 -231 220 -1 267 447 117 55
3623E5l75K18K78n83N7M27L4j96k23L34J08j18k12p8J11o31J96l7Q38p83N24j49
$$ 55 -320 -102 176 -407 -350 77 111 -85 -308 26 134 16 -196 -274 -163 -794 -598 -635 203 -580 -56 -205
3645b05l0k81M24n39M98m24L4M6M94q1J08p91P14Q6l47n59O29M74o19J83r1L26
$$ -205 -235 -516 -92 -631 -133 -557 -523 -477 17 -64 44 -747 -33 53 -294 -853 -224 250 -369 -186 -277 49
3667D9l24K13k4n28N89k0J06n18K24L53n46J84m07J42M10K84o22P51J88o09jJ24
$$ 49 -275 -62 -86 -614 -25 -45 61 -457 -233 120 -426 -242 -649 -507 -97 187 -435 316 504 -105 -106 18
3689A8k75J9K33J45m41K19M6M65m73L06r8L54J88J54r21J22j00J53o40R64O63
$$ 18 -257 -238 -5 140 -301 -82 -36 429 -44 262 164 518 706 860 -61 61 -39 114 -526 438 1101
3710A101o85l26p6L02L45l60l1L61l52j83Q5j69N6Kk34L49l06O60k90k04P67l49
$$ 1101 416 90 14 316 661 301 270 631 279 96 181 12 68 70 -164 185 -121 539 249 45 812 463
3732D63n65L99n02l17M62Q74r28L08O2k04K18k05j8L61q31L47j21l29J004m0J1
$$ 463 -102 297 -205 -522 -60 814 -114 194 256 52 270 65 47 408 -423 -76 -197 -526 478 438 449
3753D49k19n58k69J281j094L10l23M08K12k22M69q03L13J46p34Q04n54k08P80
$$ 449 230 -328 -597 684 -410 -100 -423 -15 197 -25 444 -359 -46 100 -634 170 -384 -592 188
3772A88Qj317N44L76n72J04M67m48N30J24k95P14p79P56j39q36l22O95k99l46
$$ 188 196 -1121 -577 -201 -773 -669 -202 -650 -120 4 -291 423 -356 400 261 -575 -897 -202 -501 -847
3792h47L29M26m16R82q90O58n59p5N56r20l48Q05N01l87J77L24l68l21k66L79
$$ -847 -518 -92 -508 474 -416 242 -317 -392 164 -756 -1104 -299 202 -185 -8 316 -52 -373 -639 -260
3812b60O97m67N03o51J38l05O57r9q09P91O1o22Q26q41L38R15l43O3m8K36p42
$$ -260 437 -30 473 -178 -40 -345 312 213 -596 195 256 -366 460 -381 -43 872 529 592 544 780 38
3833C8k05m14L06P64n51m49j53M30N99J74l4N5l44N23Q72j357m01J577o50q00
$$ 38 -167 -581 -275 489 -62 -511 -664 -234 365 539 505 560 216 739 1611 254 -147 1430 780 -20
3853b0O90K49j192P49K72m91K07m49J30N29p00K77p8Q8k31P6l35M25J00r4O87
$$ -20 670 919 -273 476 748 257 464 15 145 674 -26 251 173 261 30 106 -229 196 296 202 889
3874H89p03j60l08J97K00N22q69P37p19K68o62O27k70M24P1Q5L36L5m16J64j076
$$ 889 186 26 -282 -85 115 637 -232 505 -214 54 -608 19 -251 173 244 329 665 700 284 448 -628
3895f28M12N7k45P27n62L19K21l05j15l56J004q52J32m86J045m12n42k57R27j93
$$ -628 -216 -159 -404 323 -239 80 301 -4 -119 -475 529 -323 -191 -677 368 -44 -586 -843 84 -109
3915a09m54O25m50O2J27L79n57J44o80k21J129j66l39P16k41M89m47p85K70K96
$$ -109 -563 62 -388 -326 -199 180 -377 -233 -913 -1134 -5 -171 -510 206 -35 454 7 -778 -508 -212
3935b12K74P18r47m92J17J267k94l10j69k32N47q8K5M21L30j017p59O58O1q31
$$ -212 62 780 -167 -659 -542 725 431 121 -48 -280 267 179 204 625 955 -62 -821 -163 -102 -933
3955i33J300J64n73M13n32J02ln7p5M7N31j077J00J169p50K40r5N9O32k63L42
$$ -933 367 531 -42 371 -161 -59 -62 -119 -194 -147 384 -693 -593 576 -174 66 -29 30 662 399 741
3976G41k25j23l08K49J48o96J96L53J8j98m29J057l80P3j007J269R3n76m77M98
$$ 741 516 393 85 334 482 -214 -18 335 353 155 -274 783 403 476 -531 738 831 255 -222 276
3996B76K70n26l36J72L26k50r9L74J07r45L27O70j58r79N37P03o14M5l7M5Q8l40
$$ 276 546 20 -316 -144 182 -68 -167 207 314 -631 -304 366 208 -771 -234 469 -145 -100 -137 -92 -4 -344
4018c44j57M59o19N72m12L73N80q81K85N66j196L90K74o74J016p19K91K32l42
$$ -344 -501 -42 -661 -89 -501 -128 452 -429 -144 422 -774 -384 -110 -784 232 -487 -196 36 -306
4037c06j82O35n87P36j179J94J137r64N22k21n42O78nN52m72j03p59J171j266
$$ -306 -488 147 -440 296 -883 -689 448 -516 6 -215 -757 -79 -84 468 -4 -107 -866 305 -961
4056i61L65J16J0Q78p48M11O16l08n80L41l05P51j141M90l44J106r58M27o71Q34
$$ -961 -596 -480 -470 408 -340 71 687 379 -201 140 -165 586 -555 -65 -409 697 -261 166 -505 329
4076C29L57j80P6n50J35M35o1m27j6M68o49j32O85k40j41l99J009j77m31N07j139
$$ 329 686 506 582 32 167 602 541 114 98 566 -83 -215 470 230 89 -310 699 522 91 598 -541
4097e41O22m37L49M67O78k036Q82Q85l68N72q26r74O81k49M93Q34n54j54o31J025
$$ -541 81 -356 -7 460 1138 -898 -16 869 501 1073 247 -727 -46 -295 198 1032 478 324 -307 718
4117G18n51L34j028O11M36o44L8M11k37o23L11L85j63M1k8k33L39m09K68L35o01
$$ 718 167 501 -527 84 520 -124 -86 325 88 -535 -224 161 -2 39 11 -222 117 -292 -24 311 -290
4138b90L15O9j74O54l28l26k01J189q04J81n59K99k11L62k48j10O11m25Q06j279
$$ -290 25 94 -80 574 246 -80 -281 908 104 285 -274 25 -186 176 -72 -182 429 4 810 -469
4158d69k01J034k51P03j036m64J016J86j618J009K71o17nn81J206l33q7L28q45
$$ -469 -670 364 113 816 -220 -684 332 518 -1100 -91 180 -437 -442 -1023 183 -150 -237 91 -754
4177g54P60K28l44k48O87j300J480p29N12n50J80K2K17o06j97L43j17On9J318
$$ -754 6 234 -110 -358 329 -971 509 -220 292 -258 -78 -56 161 -445 -642 -299 -416 -410 -469 849
4197H49q00L42j012N73J6N79j3k20p34K11L65N59n97L33P4k88o24K93N97m44L96
$$ 849 49 391 -621 -48 -32 547 534 314 -420 -209 156 715 118 451 525 237 -387 -94 503 59 455
4218D55m86j09J020p52n51N61o61j38K37M16J64q90O52K99j71k76j68N13R8K42
$$ 455 -31 -140 880 128 -423 138 -523 -661 -424 -8 156 -734 -82 217 46 -230 -398 115 213 455
4238D55n51N51j374J382o34J675k333R86l31j65l00P01K75k61K39j175P74J99
$$ 455 -96 455 -919 463 -171 1504 -829 157 -174 -339 -639 62 337 76 315 -860 -86 113
4256A13P11n87R75j011J29j333Q37O75o53r53P07M03P8o13P17l93j0O54j14j50
$$ 113 824 237 1212 201 330 -1003 -166 509 -144 -1097 -390 13 91 -522 195 -198 -208 446 332 182
4276A82m13Q5N46j237O08k83l80J270O3J07P0j149l39N62L10n35P29j42nJ32j455
$$ 182 -231 -146 400 -837 -229 -512 -892 378 441 548 618 -531 -870 -308 2 -533 196 54 49 181 -1274
4297a274J598O92j309lN93j714J714j364N68J43K22P56p77p09J32O01k48n2K41
$$ -1274 324 1016 -293 -296 297 -1417 297 -1067 -499 -356 -134 622 -155 -864 -732 -131 -379 -431 -190
4316a90N70n46K56j88L7k70K92j520K176j00m54n21p62J625l46k21j46k83J19
$$ -190 380 -166 90 -98 -61 -331 -39 -1559 617 517 63 -458 -1220 405 59 -162 -308 -591 -472
4335d72O40j820J123J214l7p5j065n71L38M88R7r3O78o25q85J792J28j663L95
$$ -472 168 -1652 -529 685 648 573 -492 -1063 -725 -237 -140 -233 445 -180 -1065 727 855 -808 -413
4354d13N11K49J22m27O4m73J94m4J28J7j67K28N86n43O03r2k91l51N19M41l99
$$ -413 98 347 469 42 106 -367 -173 -217 -89 -72 -239 -11 575 32 635 543 252 -99 420 861 462
4375D62j59l22K27M20m06l85K98K01k17J34J26q1r87J169m72p27J31j64K54M63
$$ 462 303 -19 208 628 222 -163 135 336 119 253 379 298 -689 480 8 -719 -588 -752 -498 -35
4395c5J00L08M6k27j063J761j180M86n69O60o16n44J147l28p97K08m53J762o59
$$ -35 65 373 419 192 -871 890 -290 196 -373 287 -329 -873 274 -54 -851 -643 -1096 666 7
4414Gj71m85K61Q46m3p96M64m22O93o27l39J112n98q13J149k91k8j22k59P67l07
$$ 7 -164 -649 -388 458 415 -381 83 -339 354 -273 -612 500 -98 -911 238 -53 -81 -203 -462 305 -2
4435bj51k85M91r77J053K14j20q16J89p77P56j6N72o93O03k17m96L61L36l0n9
$$ -2 -153 -438 53 -924 129 343 223 -593 -404 -1181 -425 -441 131 -562 41 -176 -672 -311 25 -5 -64
4456f4jJ29O84p26N94l4n77j25O09j347R37K69o43N41r06J349r24J62L50J51m15
$$ -64 -65 64 748 22 616 582 5 -120 489 -858 79 348 -295 246 -660 689 -235 -73 277 428 13
4477A3N91n09p52N94N00O6m53M68k59J30j42l70K77o90q1P41J65K79K63j352Q19
$$ 13 604 95 -657 -63 437 503 50 518 259 389 247 -123 154 -536 -617 124 289 568 831 -521 298
4498B98j57j04K36J52j44o52M67j22R92p51l47L23n10J201n35m37J221r39m55
$$ 298 141 37 273 425 281 -371 96 -26 966 215 -132 191 -319 882 347 -90 1131 192 -263
4517b63M79L32k95n81L08J06J32J86p23P79q5m33j86N59j5l82PO72j43j074O13
$$ -263 216 548 253 -328 -20 86 218 404 -319 460 375 -58 -244 315 300 -82 -75 597 454 -620 -7
4538gN24j238L22N28N2l1k88j12P8J90k11j70M35j36l46m3L94j64N94m80K37J94
$$ -7 517 -721 -399 129 181 150 -138 -250 -172 18 -193 -363 72 -64 -410 -453 -59 -223 371 -109 128 322
4560C22n82j13M56n04r1L06m05L02JN20n85N11j29L60p97Q0N48J51j62j39m39
$$ 322 -260 -373 83 -421 -512 -206 -611 -309 -308 212 -373 138 9 369 -428 -348 200 351 189 50 -389
4581c89M44J97o86Q31l85J3o63N55M96m66n79N38O07j199M29N68l50J04K01J66
$$ -389 55 252 -434 397 12 25 -638 -83 413 -53 -632 -94 513 -686 -257 311 -39 65 266 432
4601D32j9o98N04M05O7o74K33Q4p8L40n32mj2O37q57r6N34l33m55J074j55j62
$$ 432 413 -285 219 624 691 17 250 334 256 596 64 60 48 685 -172 -268 266 -67 -522 552 397 235
4623B35j88O90k75m62O9m91Q76p85P79o8k27J82N21n46L31p61N9Q70n76j51k06
$$ 235 47 737 462 0 69 -422 454 -331 448 380 153 335 856 310 641 -120 -61 809 233 82 -124
4644a24N16J9p53K84N3L87m61K59m51r8O06n55M6J18m05P72k11m90L63j80Q52
$$ -124 392 411 -342 -58 -5 382 -79 180 -271 -369 237 -318 -272 -154 -559 213 2 -488 -125 -305 547
4665E47j167M59M90R6m67K02o81L05L40k36K35j42n86k03M10m09N30L78m7R8l18
$$ 547 -620 -161 329 425 -42 160 -521 -216 124 -112 123 -19 -605 -808 -398 -807 -277 101 54 152 -166
4686a66n63O85r7l04P85j60m47k14N61n49J44j62J367n99J86p12K43k65m51J9
$$ -166 -729 -44 -141 -445 340 180 -267 -481 80 -469 -325 -487 880 281 467 -245 -2 -267 -718 -699
4706f99K10J42K59%J84k46r0l25N70L98l63r20L46N93l0l58P44m7m44k87m81Q40
$$ -699 -489 -347 -88 -88 96 -150 -240 -565 5 403 40 -880 -534 59 29 -329 415 368 -76 -363 -844 -4
4728dn57J004o27J291j159j43M76M5q55J494j204l74J277j87j60k52Q30l85n80
$$ -4 -561 443 -184 1107 -52 -195 281 326 -529 965 -239 -613 664 477 317 65 895 510 -70
4747g0l23L06K79J071j461Q93K41j590J202j94k36j207J178k21o21J357j04r6
$$ -70 -393 -87 192 1263 -198 695 936 -654 548 354 118 -1089 89 -132 -753 604 500 404
4765D04m5m64l0J34J57n0j60j43J27P30l92K06J31j114m82N23j29M06K96k79k20
$$ 404 359 -105 -135 -1 156 106 -54 -197 -70 660 268 474 605 -509 -991 -468 -597 -191 105 -174 -394
4786c94n88M74J426j086o40k65O69J20M02q91L84J89o3J23K30n44O41l99K73k53
$$ -394 -982 -508 918 -168 -808 -1073 -404 -284 118 -773 -389 -200 -263 -140 90 -454 187 -212 61 -192
4806a92N7k53N4K28Q93p56q8P86j035J76n03j37O59J39L80o77K57m50P21l45K90
$$ -192 -135 -388 -334 -106 787 31 -57 729 -306 -130 -633 -770 -111 28 408 -269 -12 -462 259 -86 204
4827B04j46n2O96q49j27N03r70R73J07m40M84m65k12L83k80o2Q72j427Q80n20
$$ 204 58 6 702 -147 -274 229 -741 232 339 -101 383 -82 -294 89 -191 -253 619 -808 72 -448
4847d48O92l44L10J42m14Q04j141P31m84N84q77J043l86l48L7L19j21L73m74q27
$$ -448 244 -100 210 352 -62 742 -399 332 -152 432 -445 598 212 -136 -99 220 99 472 -2 -829
4867h29R62O69o11J36K46K26n55o33Q53j119M45k47M72L02o34P69k76o6l39K77
$$ -829 133 802 191 327 573 799 244 -389 464 -655 -210 -457 15 317 -317 452 176 110 -229 48
4887D8k37n90O05k30P38k75L98j078q4Q74K98n7q27M43Q7L80j55J42o27kJ3R3
$$ 48 -189 -779 -174 -404 334 59 457 -621 -705 169 467 410 -417 26 113 493 338 480 -147 -149 -136 -43
4909d3L55l66J20M48m86N97m56J95k50p36J026j120O97M89m85J71j53M72n78O27
$$ -43 312 -54 66 514 28 625 169 364 114 -622 404 -716 -19 470 -15 156 3 475 -103 524
4929E24J55q75J63k3J46J2p62O81n32J052n86r7K52q69L07N61k77m71j67O07r11
$$ 524 679 -196 -33 -56 90 102 -660 21 -511 541 -45 -142 110 -759 -452 109 -168 -639 -806 -199 -1110
4950a110R44p1Q95J73q72l84k70R27j32j34J58r4Q6p79O90L79k58j61rP0k08K87
$$ -1110 -166 -237 658 831 -41 -425 -695 232 100 -34 124 30 116 -663 27 406 148 -13 -22 48 -160 127
4972A27n29L71L68l69O20j620J280K5J88n11q3Q8q1J173j188M91N4k06l02j75
$$ 127 -402 -31 337 -32 588 -1032 248 273 461 -50 -133 -45 -126 1047 -141 350 404 198 -104 -279
4992b79K81P9o12N34L02O30j377J008k40m52N83j038N86k56L2K66m91J661k38
$$ -279 2 81 -531 3 305 935 -442 566 326 -126 457 -581 5 -251 -219 47 -444 1217 979
5011I79j131q4R23p84N95M17j180l15J079j1r8n73P96o64p97J151k89L95l37N71
$$ 979 -152 -236 687 -97 498 915 -265 -580 499 488 390 -183 613 -51 -848 303 14 409 72 643
5031F43o46O57k82qP29o09m26o00O81k31k22M15Q3m50J70Jp8P2r7p07O70P70m05
$$ 643 -3 654 372 364 1093 484 58 -542 139 -92 -314 101 184 -266 -96 -95 -173 -101 -198 -905 -235 535 130
5054A30J52l41K41k52j16P0M21O46j183L33k25K42j33l51k61M07N74L0l94j95
$$ 130 282 -59 182 -70 -186 -116 305 951 -232 101 -124 118 -15 -366 -627 -220 354 384 -10 -205
5074b05K00j2N47k13J49j050J146m75q2P2l74R8N55j09L9K2r36J363j387L87N27
$$ -205 -5 -17 530 317 466 -584 562 87 5 77 -297 -199 356 247 286 308 -628 735 -652 -265 262
5095B62p9K10l88m79P87k48J54j58J61j131J080k49l02Q87j581O53P42K72j046
$$ 262 183 393 5 -474 313 65 219 61 222 -909 171 -78 -380 507 -1074 -421 321 593 -453
5114d53K30J14O72o34pJ06J90o77l9M66p2K8p8O54r5o66J203r14O53l44n41N12
$$ -453 -223 -109 563 -71 -78 28 218 -459 -498 -32 -104 -76 -154 500 405 -261 942 28 681 337 -204 308
5136C08l06P5M62n37n8J00j36J54L35L12No73M26m04oJ90n02J03L79l8L6m31K51
$$ 308 2 77 539 2 -56 44 -92 62 397 709 714 41 467 63 57 247 -255 -152 227 189 225 -206 45
5159D5m29L73J15J95o36j90P8J15N3O1N47l34R2K14L6r39N47N35j26m39J4j29
$$ 45 -384 -11 104 299 -337 -527 -449 -334 -281 -220 327 -7 85 299 335 -604 -57 478 352 -87 -73 -202
5181b02K1P76n54L36p0n0l03p56O27J017q45k0L82o65M95l24M76j25k21l42o9
$$ -202 -181 595 41 377 307 257 -46 -802 -175 842 -3 -23 359 -306 189 -135 341 216 -5 -347 -416
5202d16m01O06o6L88j00n75K87N32o97Q84m06L26j77Q9L2p97R1O1k06O80j50k70
$$ -416 -817 -211 -277 111 11 -564 -277 255 -442 442 36 362 185 274 306 -491 -400 -339 -545 135 -15 -285
5224b85L84j2j97n34L08J4k46M67LN2l79L28j61j65N99j04J92J0o20O21o21O31
$$ -285 99 87 -110 -644 -336 -322 -568 -101 -98 -46 -425 -97 -258 -423 176 72 264 274 -346 275 -346 285
5246B85l88L94j74m36k61J048j6m57M57J98j066N14J72k46j19J26J294j119M98
$$ 285 -103 291 117 -319 -580 468 452 -5 452 650 -416 98 270 24 -95 31 1325 206 704
5265G04n27L2O68Q3l13Q5n55k46q0k7N23m25K45q6O12n34j05L39l73N4m82J19
$$ 704 177 209 877 960 647 732 177 -69 -149 -176 347 -78 167 81 693 159 54 393 20 74 -408 -289
5287b89J139n46R0k93L15J32p62j00L10M48j125N68K74p59J027m38O4j001P52
$$ -289 850 304 394 101 416 548 -214 -314 -4 444 -681 -113 161 -598 429 -9 55 -946 -194
5306a94K99L83q24m10L56P27o56Q31o3q45k12O17k35R54o24m65P03l47m99N60
$$ -194 105 488 -336 -746 -390 337 -319 512 449 -396 -608 9 -226 728 104 -361 342 -5 -504 56
5326E6m00P28j045P3N02N8nn01o1R10m33l21N40q1K53P1k81O6M52k41j99k09L1
$$ 56 -344 384 -661 -588 -86 -28 -33 -534 -595 315 -118 -439 101 20 273 344 63 129 581 340 141 -68 -37
5349c7n06O01o6k82p6O81r72J40P14j26J48p81J85J338r48n2P10o19K56q37P7
$$ -37 -543 58 -8 -290 -366 315 -657 -517 197 71 219 -562 -377 961 13 -39 671 52 308 -529 -452
5370d52N36m08k26j5J08P55k7Q05j836M60L32N34l97m77K34R19j081M09M51l87
$$ -452 84 -324 -550 -565 -457 298 271 1076 -760 -300 32 566 169 -308 -74 845 -236 173 624 237
5390B37o51O90k62n62Q15n66O71l48M30q98K5N25k66J54p7K51p21M79R70j121
$$ 237 -414 276 14 -548 267 -299 372 24 454 -444 -419 106 -160 -6 -83 168 -553 -74 896 -225
5410b25J15k19j80J007l34n46L03q49J200P47j447O20k08M36J70o60J541j356
$$ -225 -110 -329 -509 498 164 -382 -79 -928 272 1019 -428 192 -16 420 590 -70 1471 115
5428A15l58Q89r66K11l23L9O44o52k13J00O1K80P91o35m75j31l66J224q46L13
$$ 115 -243 646 -320 -109 -432 -393 251 -401 -614 -514 -453 -173 618 -17 -492 -623 -989 235 -611 -298
5448b98J2K94R9K60k25K33P5m36J39l16J310q46n29k69O68j011O12K73Rn53j7
$$ -298 -286 8 107 367 142 375 450 14 153 -163 1147 301 -228 -497 171 -840 -228 45 54 -499 -516
5469e16R3l66L45Q85j129R09o1K33j25k93k73N61K09n74R23m55p55J2o34P12N53
$$ -516 -423 -789 -444 441 -688 221 160 393 268 -25 -298 263 472 -102 821 366 -389 -377 -1011 -299 254
5490B54R7q47Q33K29m94j12p8O85n33p62R23L7K93R3j05q89M36Q87j082M30K1
$$ 254 351 -496 337 566 72 -40 -118 567 34 -728 195 232 525 618 513 -376 60 947 -135 295 316
5511C16j2j021J277N72j344K02L21n18N16j2m06L48q46K30J72J537j243P26p33
$$ 316 304 -717 560 1132 -212 -10 311 -207 309 297 -109 239 -607 -377 -205 1332 89 815 82
5530H2O0J09K38n34N33n13K0R07p65l64L14o13N32o9N35n79o83Q40M76j32j68
$$ 82 142 251 489 -45 488 -25 -5 902 137 -227 87 -526 6 -63 472 -107 -790 50 526 394 226
5551B26m34L04k2o13N49j15P36q59n3K18o4M90o95N01p92P64J28k69N06m54K71
$$ 226 -208 96 74 -539 10 -105 631 -228 -281 -63 -127 363 -332 169 -623 141 269 0 506 52 323
5572C23o74L16k24L35m97M52J33L70j093O43M1J42l02M34j434Q21L23m8n33J91
$$ 323 -351 -35 -259 76 -421 31 164 534 -559 84 125 267 -35 399 -1035 -214 109 61 -472 -281
5592b81M4K47O32p96K94n40K69j29j81J000m83l87P63k48Q43j333P04j57k53k71
$$ -281 -237 10 642 -154 140 -400 -131 -260 -441 559 76 -311 452 204 1047 -286 418 261 8 -263
5612b63N75q10J37M31Mj122L21N94m54N50k01Q46o07k07k61O36K64k59k0l87n2
$$ -263 312 -498 -361 70 74 -1048 -727 -133 -587 -37 -238 608 1 -206 -467 169 433 174 154 -233 -285
5633b85N07J11j81K57q98J55P08J88o23J06m28o09J527q98N57k35JN8q7O0L17
$$ -285 222 333 152 409 -489 -334 374 562 -61 45 -383 -992 535 -363 194 -41 -40 18 -69 -9 308
5654C08n87l3N35n94Q08n37J20k03J60p13O68K60L8K66j187L45Q52q06L1J21K21
$$ 308 -279 -312 223 -371 437 -100 20 -183 -23 -736 -68 192 230 496 -691 -346 506 -300 -269 -148 73
5675G3k62k85M92M03r86j17O39r9j71N27j79j85N31r88P49k99r4P48j18l72K76
$$ 73 -189 -474 18 421 -565 -682 -43 -142 -313 214 35 -150 381 -607 142 -157 -251 497 379 7 283
5696B83j62r11P35Jn57J21P77o66j7M12J22j54J70l73k56L28K45K0K18o76R9L23
$$ 283 121 -790 -55 -54 -611 -490 287 -379 -396 16 138 -16 154 -219 -475 -147 98 118 336 -340 -241 82
5718H2j42K01k29J2p54L36N46j96L52m49K86N16j223R89l97J46o75j4P58o29J77
$$ 82 -60 141 -88 -76 -830 -494 52 -144 208 -241 45 561 -662 327 -70 76 -599 -613 145 -484 -307
5739c07l76N09j2l05L58N0J34K48L29p21J03K13k29m84N63K89l08l99L16k24L59
$$ -307 -683 -174 -186 -491 -133 -83 51 299 628 -93 10 223 -6 -490 73 362 54 -345 -29 -253 106
5760A06l73M0l75N29J80j0L68m22k30j73K92j5pq3L94m21K90K46m72J01L77J34
$$ 106 -267 -227 -602 -73 107 97 465 43 -187 -360 -68 -83 -90 -173 221 -200 90 336 -136 -35 342 476
5782D76m21k05P7K73p41L99o9j06N22l11K81r3J23P3o4j44k03K81j00n9N7lj09
$$ 476 55 -150 -73 200 -541 -142 -211 -317 205 -106 175 82 205 278 214 70 -133 148 48 -11 46 43 -66
5805f6J89l80L91o70N20J52m46N6R4K32p8K03M0J78n39K89l50L03J28K9J10p19
$$ -66 123 -257 134 -536 -16 136 -310 -254 -160 72 -6 197 237 415 -124 165 -185 118 246 275 385 -334
5827c34P46j78n05j32N62n74M23K40n75O37J93r22L07m0L02Q5m11j05J89J40Q2
$$ -334 412 234 -271 -403 159 -415 8 248 -327 310 503 -419 -112 -152 150 235 -176 -281 -92 48 130
5848A30j82l10L50k50J34l74O5P28m83J40j93rK14l7J82n07N81j31j00Q24n24
$$ 130 -52 -362 -12 -262 -128 -502 -437 291 -192 -52 -245 -254 -40 -77 105 -402 179 48 -52 772 248
5869B48m7L1k5O3p61N00L21j68l99M65n8L78n05j0k27N50n46l4n48J132k09K94
$$ 248 201 232 207 270 -491 9 330 162 -237 228 170 548 43 33 -194 356 -190 -224 -772 360 151 445
5891D45k14j01j07J01k65k39P77j057P73J050j461j25R04j091P21k88N22j06N44
$$ 445 231 130 23 124 -141 -380 397 -660 113 1163 -298 -423 481 -610 111 -177 345 239 783
5910G83k37j705N42M22Q65j763Q39L17R7L06n37j94L3L44m26P6j7m53N98Q9k1
$$ 783 546 -1159 -617 -195 670 -1093 -254 63 160 466 -71 -265 -232 112 -314 -238 -255 -708 -110 -21 -42
5931d2j1L49o00q3k09Q55j38j07l5k05J71K01o21M07O6q7m0L16nl18k33K76j2
$$ -42 -53 296 -304 -387 -596 259 121 14 -21 -226 -55 146 -475 -68 -2 -89 -129 187 182 -136 -369 -93 -105
5954a05J2p1J23j81L59l10M48p9k83J06K54l79P3j0K81l00N62o05L14n46M56k01
$$ -105 -93 -164 -41 -222 137 -173 275 196 -87 19 273 -106 -33 -43 238 -62 500 -105 209 -337 119 -82
5976h2K88kr3m05K70j56L42j02Q2j14n5K81n6n08J42K80J27r4l31L07m8k52L01
$$ -82 206 204 111 -294 -24 -180 162 60 142 28 -27 254 198 -310 -168 112 239 145 -186 121 73 -179 122
5999A22k45L41k54m1Nn3K93k86J18m04L16M21o87L46J37m1K7J07j30k25L22o2
$$ 122 -123 218 -36 -77 -72 -125 168 -118 0 -404 -88 333 -354 -8 129 88 115 222 92 -133 189 127
6021A27P4j97N37n72l7N47l37k44J89J94l95K42o6k8N3J97K04n70P5p2P3M88m19
$$ 127 201 4 541 -31 -68 479 142 -102 87 281 -114 128 62 34 87 284 488 -82 -7 -79 -6 482 63
6044F3j67J29K1K41l85J49K28j67j83k68P63l10l80L37J67L2o91M13j28L15m57
$$ 63 -104 25 46 287 -98 51 279 112 -71 -339 424 114 -266 71 238 270 -421 -8 -136 179 -278
6065b78M88nn26M00m0l6J65o08O59j19l20K55K55p02J3N77r0K20n30K42j10J4
$$ -278 210 205 -321 79 39 3 168 -440 219 100 -220 35 290 -412 -399 178 88 308 -222 20 -90 -76
6087g6j35J49L80o67L29l64K41J55m61j4K03lL20K57n95O4M88k18n10O60k46m
$$ -76 -211 -62 318 -349 -20 -384 -143 12 -449 -463 -260 -263 57 314 -281 -217 271 53 -457 203 -43 -47
6109d7J06M76l01p8p00N09j6j15M50l29J53j93J18m04M91j9M9J94L3k57R6j48
$$ -47 59 535 234 156 -544 -35 -51 -166 284 -45 108 -85 33 -371 120 101 150 344 377 120 216 68
6131F8M17J7p94K84k19O74m22oN87p58J29N05l56m8J97n3k11k15P2p4J09K64k97
$$ 68 485 502 -292 -8 -227 447 25 19 606 -152 -23 482 126 78 275 222 11 -204 -132 -206 -97 167 -130
6154a30M82m57J087o56m80L98Q9N8p06N00r6L2j25qM6m88O80k05K62j01n55J1
$$ -130 352 -105 982 326 -154 244 333 391 -315 185 89 121 -4 -12 34 -454 226 21 283 182 -373 -362
6176c62O36l58K5o14J136n32L41n28K12L20k92J96k41j89N58l22k67M51k47N3
$$ -362 274 -84 -59 -673 463 -69 272 -256 -44 276 -16 180 -61 -250 308 -14 -281 170 -77 -24
6196b4K0j52P6K64R8j06L72q60M07m75M2J192q48p03N75O70j72m47K04n0k8L8
$$ -24 -4 -156 -80 184 282 176 548 -312 95 -380 -338 854 6 -697 -122 548 376 -71 133 83 55 93
6218I3K67l63k28Q4L23Qj79j96O54q59J95N70j38m48l40o0M01j38K83J51LL22
$$ 93 360 -3 -231 -147 176 184 5 -191 463 -396 -201 369 231 -217 -557 -617 -216 -354 -71 80 83 405
6240D05l11p67J079J1n60L91k45n98J033k45j35j61m9j80J000j216N51K27L18
$$ 405 94 -673 406 417 -143 248 3 -595 438 193 58 -103 -152 -332 668 -548 3 230 548
6259E48m25m73M26j35j41n45R30k07m82K53N15L12N0l43j09m76M93k94O3Q01r69
$$ 548 123 -350 76 -59 -200 -745 185 -22 -504 -251 264 576 626 283 174 -302 191 -103 -40 761 -208
6280b08q3J175m08P8m07n87O00k96k57Q7%J315p61k86N0M17O8q87l0O17j96j52
$$ -208 -291 884 476 554 147 -440 160 -136 -393 -306 -306 1009 248 -38 12 429 497 -390 -420 197 1 -151
6302a51L24L07l53n57K15L38J56j065J204l69L02L98p23M99l53K03K6n29M36p99
$$ -151 173 480 127 -430 -215 123 279 -786 418 49 351 749 26 525 172 375 401 -128 308 -491
6322d91L30j88k60O46k74P29r26L30N72o94M65J43k83L37n35M16k43l35J87P8
$$ -491 -161 -349 -609 37 -237 492 -434 -104 468 -226 239 382 99 436 -99 317 74 -261 -74 4
6342DJ39L01j89J21p31K89m2L11l89N48M12p30J16j41J91Q3j59P3l75J27n99Q80
$$ 4 143 444 255 376 -355 -66 -108 203 -186 362 774 44 160 19 210 293 134 207 -168 -41 -640 240
6364B40J78j99k59J68L01K5j75k69Q3J37P85j165k56m90J693j374J325r46N61
$$ 240 418 219 -40 128 429 454 279 10 93 230 1015 -150 -406 -896 797 -577 748 -198 363
6383C63k60L24l87k66O55n44K56o81M77K75NJ22r6j37R1l03l16M61k23M06N94
$$ 363 103 427 40 -226 429 -115 141 -540 -63 212 217 339 243 106 197 -106 -422 39 -184 222 816
6404H16n91M90o90K61M71o62j332J305J45Q56j033m48P28j62J7O23m84o47O87
$$ 816 225 715 25 286 757 95 -1237 68 213 1069 36 -412 316 154 171 794 310 -337 350
6423C50N57j205N11j42L95l44J19q5l35k85K75J169J53l36j41q89p0L05n24L08
$$ 350 907 -298 213 71 466 122 241 156 -179 -464 -189 980 1133 797 656 -233 -303 2 -522 -214
6443b14O41r07K13M92j28l64J022q49J04r9J87k8J01k39J55O03k90r28K03J036
$$ -214 427 -480 -267 225 97 -267 755 -94 10 -89 98 70 171 -68 87 690 400 -528 -325 711
6463G11n46K22p3o97j19L75M63l93l58N21J08m62j45P80K81o04J58K36o35Q0l
$$ 711 165 387 314 -383 -502 -127 336 -57 -415 106 214 -248 -393 387 668 64 222 458 -177 -97 -100
6484a00P09q29O50l64l15n1N06Np11M98j23N74j058O54m93k60N90l0Q37o42n48
$$ -100 609 -220 430 66 -249 -300 206 211 -500 -2 -125 449 -609 45 -448 -708 -118 -148 689 47 -501
6505e01pL53K69m09J97M18p57J75K38O8K04P0q7n12j64j54R68n03rj9L03m23J45
$$ -501 -508 -155 114 -295 -98 320 -437 -262 -24 44 248 318 231 -281 -445 -599 369 -134 -143 -162 141 -282 -137
6528a37j73L34k9J15N97m35R0n46K92p18L29J352j599Q46p95k31P55J1m60J88
$$ -137 -310 24 -5 110 707 272 362 -184 108 -610 -281 1071 -528 318 -477 -708 47 58 -402 -214
6548b14K56P3K25K37n41K00l21M42k1j30l74J62l89j24Q74n44j76L1r1L48J02
$$ -214 42 115 340 577 36 236 -85 357 336 206 -168 -6 -395 -519 355 -189 -365 -334 -425 -77 25
6569B5K69j50J00j46L44j99k52K45q32L25K73K58n20m6k11K17L22o08M65n3J23
$$ 25 294 144 244 98 442 243 -9 236 -596 -271 2 260 -260 -306 -517 -300 22 -586 -121 -174 -51
6590e1K32l54j49O07k51J76J25m95n5P1L37M56n74mm02L63n9m1P6J47m79J23L40
$$ -51 181 -173 -322 285 34 210 335 -160 -215 -144 193 649 75 71 -331 32 -27 -68 8 155 -324 -201 139
6613A39k11Rl15M79m6N7j62L67n34K69l31J95J4j52K37nn5j82Q4K75p6j20n7k93
$$ 139 -72 -63 -378 101 55 112 -50 317 -217 52 -279 -84 -70 -222 15 10 -45 -227 -143 132 56 -64 -121 -414
6637d14O42j32l6j86N2L7J64J9n4j89p9N26k61O1M1m6k19j48L39j16O9j48K00
$$ -414 228 96 60 -126 -74 -37 127 146 92 -97 -176 350 89 150 191 145 -74 -222 117 1 70 -78 122
6660A22n5M7J36m0l78k87O63j56l80M35k7Q8L22k47l57n5N45p66M14M51j98m52
$$ 122 67 114 250 210 -168 -455 208 52 -328 107 80 168 490 243 -114 -169 376 -390 24 475 277 -175
6682a75R0J27l87M63J9k86L2M38K57p30M05l74r8L84l68K62k15K47o3q5M8j71
$$ -175 -85 42 -345 118 137 -149 -117 321 578 -152 253 -121 -219 165 -203 59 -156 91 28 -57 -9 -180
6704a80L88k36k36N58n33L95m54M8N6K03k01J87k65K07o8K35j39N3l31M42j2j20
$$ -180 208 -28 -264 294 -239 156 -298 -250 -194 9 -192 -5 -270 -63 -131 104 -35 18 -313 129 117 -3
6726ck8J71k92K2K28k15J38l18L30l07K91l52L63l05M54k68R1p6K58K92q00J62
$$ -3 -31 140 -152 -130 98 -117 21 -297 33 -274 17 -335 28 -277 177 -91 0 -76 182 474 -326 -164
6748a64M51m24j09J7M07k69k0P1j82n0M94Qn64K96j67L70l32L02k87M74k63l82
$$ -164 287 -137 -246 -229 178 -91 -111 -40 -222 -272 222 230 -334 -38 -205 165 -167 135 -152 322 59 -323
6770c23M77K16j18l63P3o66P38j19Q5j98N45l23j82J0j22J92j7K27j63j15J83
$$ -323 154 370 252 -111 -38 -704 34 -85 0 -198 347 24 -158 -148 -270 -78 -95 132 -31 -146 37
6791C7k38k64O91j47K48m44P4L41n88J48q3K54K92j09k88J00J63j98qJ13K3p42
$$ 37 -201 -465 226 79 327 -117 -43 298 -290 -142 -225 29 321 212 -76 24 187 -11 -19 94 117 -625
6813f25Q35m44K89l38J6L01K9L1k74J11M46q8n78L35J06k46M84m75PJ95n2K63
$$ -625 210 -234 55 -283 -267 34 63 94 -180 -69 377 289 -289 46 152 -94 390 -85 -78 117 65 328
6835C28n05l51M78k45K70j17O42l65M33k34l01M3J89j28k32J13j63P0K69j07p
$$ 328 -177 -528 -50 -295 -25 -142 500 135 568 334 33 76 265 137 -95 18 -145 -75 194 87 80
6856H0k81M51k7l73j37P97k45o9m23r2N73p12J5M13m77N11j6N52r19K55K95j49
$$ 80 -201 250 223 -150 -287 510 265 196 -227 -319 254 -458 -443 -30 -507 4 -12 540 -379 -124 171 22
6878B2qJ77l93Q2K37J6j94K87k76K71l47j28lM92n79J012o13j14Q8l69O21J51
$$ 22 14 191 -202 -120 117 133 -61 226 -50 221 -126 -254 -257 235 -344 668 55 -59 29 -340 281 432
6900D32q1q01P55n37J95m8n8j9kl5j22P84o32Q2n7N30k02J53k32k31J98J3L55
$$ 432 351 -450 305 -232 -37 -85 -143 -162 -164 -199 -321 463 -169 -87 -144 386 184 337 105 -126 72 85 440
6923D40k75O07m65l51J05N79o65L02l78N1O8j77L27k14m0J89J13j50k96n5J76
$$ 440 165 772 307 -44 61 640 -25 277 -101 -50 18 -159 168 -46 -86 103 216 66 -230 -285 -109
6944a09J55j16j21K1Q9O24o41J19k02o0L51J89k82M01o10L39k04Q29o65j85J19
$$ -109 46 -70 -191 -170 -81 543 -98 21 -181 -241 110 299 17 418 -192 147 -57 772 107 -78 41
6965D1K22j72l26k01M87j57r2l19M41p1j2K60m50K42K9j8J82l89N87l12M72j30
$$ 41 263 91 -235 -436 51 -106 -198 -517 -76 -147 -159 101 -349 -107 -78 -96 86 -303 284 -28 444 314
6987C14j0J02m13j35K61m07J11L42J11k78J45j08P4j59L24m7l12n91o8O96N47
$$ 314 304 406 -7 -142 119 -288 -177 165 276 -2 143 35 109 -50 274 227 -85 -676 -744 -48 499
7008D99n19L12l20M00n94O17p51L83L94q08P14K39p02l74M15N9O42p49l33J80
$$ 499 -20 292 -28 372 -222 395 -356 27 421 -387 327 566 -136 -510 -95 -36 606 -143 -476 -296
7028b96M87K5k43k60O71l5l64l32M76J54k75l67j75O94L75m10m08O38R0k69m85
$$ -296 191 216 -27 -287 384 349 -15 -347 129 283 8 -359 -534 160 535 125 -283 355 445 176 -309
7049c09J13K60p3L61k22m21J77NK62l52Q06o39K1J25k23J5L21q13J33k77O11R9
$$ -309 -196 64 -9 352 130 -291 -114 -109 153 -199 607 -32 -11 114 -109 -94 227 -586 -453 -730 -119 -20
7071b0M16j14j69l40K70m11M8k9R33n57K46p30N51j98L74j85n03k69N24j53L34
$$ -20 396 282 113 -227 43 -368 -320 -349 584 27 273 -457 94 -104 270 85 -418 -687 -163 -316 18
7092A8n20j16Q62n45N35m83J11r9O71n00R8k58J4j28m63J019j70M93j49j243J105
$$ 18 -502 -618 244 -301 234 -249 -138 -237 434 -66 32 -226 -212 -340 -803 216 46 539 390 -853 252
7113B52m80O14n17m8M59N00q06j53M86J57k98O5j71o46p2P33k75P44q88O81j79
$$ 252 -228 386 -131 -179 280 780 -26 -179 307 464 166 231 60 -586 -658 75 -200 544 -344 337 158
7134A58k10J44j28L61Q1J02K77r39R05m93r50J399l98K52p88N64m19N51q25J193
$$ 158 -52 92 -36 325 406 508 785 -154 751 258 -692 707 309 561 -227 337 -82 469 -356 837
7154H37n76k3K54n56J5j65P06n25l47K16K42K96n19j91O61o00J196j295O82q91
$$ 837 261 238 492 -64 -49 -214 492 -33 -380 -164 78 374 -145 -336 325 -275 921 -374 308 -583
7174e83J203l43p99K14O1j56q4J020l68k11k80L46k21q3o92J348M3o10n73R21
$$ -583 620 277 -522 -308 -247 -403 -487 533 165 -46 -326 20 -201 -284 -976 372 415 -195 -768 153
7194A53j00q7L44J90l15o0p88J78L06k5K33n91O58k48Q0n41J198o79k90l49K06
$$ 153 53 -34 310 500 185 125 -663 -485 -179 -204 29 -562 96 -152 -72 -613 585 -94 -384 -733 -527
7215e27K97L5J75l94K50N43p65L17j37R7O12o65P54n09P4k28l7p79O23M60l2j0
$$ -527 -230 -195 -20 -414 -164 379 -386 -69 -206 -109 503 -162 592 83 157 -71 -108 -887 -264 196 164 154
7237A54M19q97O95j321Q21%j63k94N94p1J87k60m87J017l03q0K32l8k0m49k42
$$ 154 573 -324 371 -950 -129 -129 -292 -586 8 -63 124 -136 -623 394 91 11 243 205 185 -264 -506
7258e06L92j40l43J011J37M0J94p16m02O34j654J202J65j27L69K27m88l44N05
$$ -506 -114 -254 -597 414 551 591 785 69 -333 301 -1353 -151 14 -113 256 483 -5 -349 156
7277A56M5j038J377j001j46m05J166K58o44j29L01J09M26n21j91M53r29M11L1
$$ 156 201 -837 540 -461 -607 -1012 154 412 -232 -361 -60 49 475 -46 -237 216 -713 -302 -271
7296b71M23J036j109k87O05n60K08m15J135m77P2j37o68R23J45j097L69K21r5
$$ -271 152 1188 79 -208 397 -163 45 -370 765 288 360 223 -445 478 623 -474 -105 116 21
7315B1J65n02M39J32m13O45o96J041r41N43r57M68l45O96p66J115j264j9N04J046
$$ 21 186 -316 123 255 -158 487 -209 832 -109 434 -523 -55 -400 296 -470 645 -619 -638 -134 912
7335I12j464P61K21N4L64L19j207K12L70O3j429M22m20J15N44q10N35J174m20
$$ 912 -552 209 430 484 848 1167 -40 172 542 605 -824 -402 -822 -707 -163 -973 -438 736 316
7354C16l64M44k08L95j56j043L3N78k96J46l52N78o89J291j306L90J611j621m58
$$ 316 -48 396 188 583 427 -616 -583 -5 -301 -155 -507 71 -618 673 -633 -243 1368 -253 -711
7373g11J164m25j9r51o13J624J82p93L3m53J499o80m52Q74p42n22J386k45l32
$$ -711 453 28 9 -942 -1555 69 251 -542 -509 -962 537 -143 -595 279 -463 -985 401 156 -176
7392a76P67k026P23Q6Q16n03l95J273p48ll67N07l43J50%l0J10L62P70j064L63
$$ -176 591 -1435 -712 -626 190 -313 -708 565 -183 -186 -553 -46 -389 -239 -239 -269 -159 203 973 -91 272
7413B72n55o67J054J17o40m7k8J384q41j025J987p23n14j88R7P73m00p52N04J530
$$ 272 -283 -950 104 221 -419 -466 -494 890 49 -976 1011 288 -226 -414 -317 456 56 -696 -192 1338
7433A338n98j386P89o17Q38m31K16N48m12l28l76Q54J3k02j60l57N39r41R10L64
$$ 1338 740 -646 143 -474 364 -67 149 697 285 -43 -419 435 448 246 86 -271 268 -673 237 601
7453F01m18q30P17O65j010j53N26J95Q64j145L66j62r56M65P92j348J819j657
$$ 601 183 -647 70 735 -275 -428 98 293 1157 12 378 216 -740 -275 517 -831 988 -669
7471f69P53p7q1p62J192o76J324j162j16J22lk57k15R75m64j00J82P3Q13j865
$$ -669 84 7 -74 -836 356 -320 1004 -158 -274 -152 -155 -412 -627 348 -116 -216 -34 39 852 -1013
7491a013P88M17k51r23N36N64J24l61Q98j280O9k29N15J030r22m76L04q22J422
$$ -1013 -225 192 -59 -982 -446 118 242 -119 779 -501 -432 -661 -146 884 -38 -514 -210 -1032 390
7510C90k49j201J558K82j41j072J83O95j354K05J018K05k75l12L82k07m24K56
$$ 390 141 -1060 498 780 639 -433 -250 445 -909 -704 314 519 244 -68 314 107 -317 -61
7528f1N1O34o57Q75L6p67Q5j65n67J127j183J188p96J3J371j274M29p14l1J155
$$ -61 -10 624 -33 842 878 111 196 31 -536 591 -592 596 -200 -187 1184 -90 339 -375 -406 749
7548G49r42j85K64L46K77q32K99j21j67O76K77J08j451Q50K93j146O92n52K68
$$ 749 -193 -378 -114 232 509 -323 -24 -145 -312 364 641 749 -702 148 441 -705 -13 -565 -297
7567b97R43l96J86n26p60Q32L95o0j104N39L47l49k84L06J043j221N30m43j44
$$ -297 646 250 436 -90 -850 -18 377 317 -787 -248 99 -250 -534 -228 815 -406 124 -319 -463
7586d63p42J074o9R89q85m87O59k34n54O74J377k045K02O81n77J715j312l92n20
$$ -463 -1205 -131 -200 789 -96 -583 76 -158 -712 -38 1339 -706 -504 177 -400 1315 3 -389 -909
7605i09O40P98K2L97j220o60P67M63r13l82L19O96n6M56l8m93N6R6L42p06O26
$$ -909 -269 529 551 948 -272 -932 -165 298 -615 -997 -678 18 -38 418 380 -113 -57 39 381 -325 301
7626C01k65l52j9r92P62J001l39r9N05J62j396N76j73O04J20r26R14p83j43j81
$$ 301 36 -316 -335 -1327 -565 436 97 -2 503 665 -731 -155 -328 276 396 -530 384 -399 -542 -723
7646g23J64O11M2N71k64j296J95P28j52K54n40J207j424Q62j412J226K48q65K81
$$ -723 -559 52 94 665 401 -895 -700 28 -124 130 -410 797 -627 235 -1177 49 297 -568 -287
7665b87l65j1J051o62N86j005K17N27j12M1L60p7l85L33M62j75m82j72k97j24
$$ -287 -652 -663 388 -274 312 -693 -476 51 -61 -20 340 263 -122 211 673 498 16 -156 -453 -577
7685e77Q71n41N5N74r58P76l07J02k83k19M61Q49r89kL7K2R71j267l07N25q65
$$ -577 294 -247 -192 382 -576 200 -107 -5 -288 -507 -46 803 -186 -188 -151 -129 842 -425 -732 -207 -1072
7706a072J268j39n01Q64m79n99p10J191L23o61P27k75N89j01p24K32n26N83J87
$$ -1072 196 57 -444 420 -59 -658 -1368 -177 146 -515 212 -63 526 425 -299 -67 -593 -10 177
7725A77m18M01J04j3q94L54j80O96m3M21n49n85P94n9L04n40J41N3L57O2l37K46
$$ 177 -241 160 264 251 -643 -289 -469 227 184 605 56 -529 265 206 510 -30 111 164 521 583 246 492
7747D92m66L53j8k34r7K31j85K21r11J023n48j2N26j87K18l72m4j22L45rK5j21
$$ 492 26 379 361 127 30 261 76 297 -614 409 -139 -151 375 188 406 34 -10 -132 213 204 229 108
7769A08j63M17l77L6R0Q1K5p74N45L34k41M67j58m14n51N86K91k68J68n45K66
$$ 108 -55 362 -15 21 111 192 217 -557 -12 322 81 548 390 -24 -575 11 302 34 202 -343 -77
7790g7O38j49n57l27N90k16J12J55k25L86r91P7J363q91%J32J08K46j09n72K32
$$ -77 561 412 -145 -472 118 -98 14 169 -56 330 -661 -584 779 -112 -112 20 128 374 265 -307 -75
7811g5O39o32J60O7l85J10M6J48o70Q57r63O59O73m17o60O13j99k62M03j40K63
$$ -75 564 -68 92 159 -226 -116 -70 78 -592 265 -698 -39 634 217 -443 170 -29 -291 112 -28 235
7832B35m8l65O80o8l99M65k53o2m77O59j74o94n27R81K47n67Mq0N32K26k15q4
$$ 235 187 -178 502 434 35 500 247 185 -292 367 193 -501 -1028 -47 200 -367 -363 -443 89 315 100 16
7854A6K13K83o83j94N17k37P69j360O7J049j46J19J82j249N94O51o72J71K35j085
$$ 16 229 512 -171 -365 152 -85 684 -676 -609 440 294 413 595 -654 -60 591 -81 90 325 -760
7874g60Q79k20M9n8j89O44p3p73M28k54L07M20N1l05m43N21m87J063j078K91L61
$$ -760 119 -101 -52 -110 -299 345 272 -501 -73 -327 -20 400 451 146 -297 224 -263 800 -278 13 374
7895C74l08o08N94m6L78p73J011j159j02N41J83j6M32k41j61j37L66m95q98R33
$$ 374 66 -542 52 6 384 -389 622 -537 -639 -98 85 69 501 260 99 -38 328 -167 -1065 -132
7915a32N18j46J8m33n8N36p1r74O22j12K53K21j40k51L15J08k34k36r89J224J71
$$ -132 386 240 258 -175 -233 303 232 -742 -120 -232 21 242 102 -149 166 274 40 -196 -1185 39 210
7936B10p18N66M0R18q14N3L8k92q3N71j47n03O04q00R18l96o8R9k97K05Q5k35
$$ 210 -508 58 98 1016 202 255 293 1 -82 489 342 -161 443 -357 561 165 97 196 -101 104 189 -46
7958d6L58m74L04q95R68N02n58K92q48M18K24j044M71q4O9J5N17j38J74J43o17
$$ -46 312 -162 142 -753 215 717 159 451 -397 21 245 -799 -328 -412 -343 -328 189 51 225 368 -249
7979b49L6m49R81j33Q0o71L20l8K5j86p30J290p52M44M06k19l39P19o55k27N92
$$ -249 -213 -662 319 186 266 -405 -85 -123 -98 -284 -1014 276 -476 -32 374 155 -184 535 -120 -347 245
8000B45k57j58l90P28k23m91N38j21J40p13Q83M30J46o42o29O35J31n99J07L27
$$ 245 -12 -170 -560 168 -55 -546 -8 -129 11 -702 181 611 757 115 -514 121 252 -347 -240 87
8020H7K57J64l30q64L71L09M83o32m90O52m27K56K39l14M78n79L83J46j15r27
$$ 87 344 508 178 -686 -315 -6 477 -155 -645 7 -420 -164 75 -239 239 -340 43 189 74 -853
8040h53Q69q63Q43N46p41J04qL65k52j27r14M13P46L02n04j37j22M12o90P95m27
$$ -853 16 -847 -4 542 -199 -95 -103 262 10 -117 -1031 -618 128 430 -74 -211 -333 79 -611 184 -243
8061b43Q9L8N09l59N36m59m32M97J24n13P6j83P98k26j34P17M48j089l5k35n59
$$ -243 -154 -116 393 34 570 111 -321 176 300 -213 -137 -320 478 252 118 835 1283 194 159 -76 -635
8082f35P20P6j44j50M52l17M24n35l58J58Q27m13m11K73M21K87p81K00J50j56
$$ -635 85 161 17 -133 319 2 426 -109 -467 -309 518 105 -306 -33 388 675 -106 94 244 88
8102H8j32l37L98L29p17P00o73L46l23n40J171k74q7q4N77j82L9m21n87J028p25
$$ 88 -44 -381 17 346 -371 329 -344 2 -321 -861 310 36 -51 -135 442 260 299 -122 -709 319 -406
8123d06M31p1j42R3M91m65q2Q69k77m41L5l86L19j12j04L94o22O2M05j30J10N64
$$ -406 25 -46 -188 -95 396 -69 -151 718 441 0 35 -351 -32 -144 -248 146 -476 -414 -9 -139 -29 535
8145E35q08j15O35j31j34j83j38Q24j41l23k3o67P10n89L81L81n52M35q5k26M12
$$ 535 -273 -388 247 116 -18 -201 -339 485 344 21 -2 -669 41 -548 -167 214 -338 97 12 -214 198
8166A98q24M62N23K86l23m37m80K61K23K94n84n7N80k24J50k04J57O2j64P8k42
$$ 198 -626 -164 359 645 322 -115 -595 -334 -111 183 -401 -458 122 -102 48 -156 1 63 -101 -23 -265
8187b65M43K46l1o13
$$ -265 178 424 393 -220
8191b20
$$ Imaginary data points
##PAGE= N=2
##DATA TABLE= (X++(I..I)), XYDATA
0@%%%%%%%oJ4j6J6j6K3l1L2m0N2o0P1q6J01j16J33j54J77k02K32k64K98l39L84
$$ 0 0 0 0 0 0 0 0 -6 8 -8 8 -8 15 -16 16 -24 28 -32 39 -47 54 -62 71 -83 94 -108 124 -140 158 -181 203
31B03m31M82n37O02o72P47q30R21j021J130j251J385j534J699j884K092k328K597
$$ 203 -228 254 -283 319 -353 394 -436 485 -536 594 -657 728 -806 893 -991 1101 -1227 1370
49A370k911L281l719M255m928N796o969Q652j1280J5995k7040R8541N8227j99609
$$ 1370 -1541 1740 -1979 2276 -2652 3144 -3825 4827 -6453 9542 -17498 81043 139270 -60339
63f0339m25J26660J6251j37479p477J15922K0462j10497j2169R7164K3508q8963
$$ -60339 -60764 65896 82147 -55332 -62809 53113 73575 -36922 -49091 48073 71581 -17382
75a7382k0993O3906J2543o1465K18O2626R896n6906j6031L5179J0689k5958J042
$$ -17382 -38375 25531 38074 -23391 -23173 39453 49349 -7557 -23588 11591 22280 -3678 -2636
88b636J7417p046j4318R492M458j7183m5K0882k547k7624J0480M0569m194m0747
$$ -2636 14781 7735 -6583 2909 7367 -9816 -9861 11021 8474 -19150 -8670 31899 27705 -13042
102a3042N249M2674p731m9357P850M9847j1500o4215J065O1413o94o0441K252
$$ -13042 -7793 34881 27150 -22207 -14357 35490 23990 -40225 -39160 22253 21559 -38882 -36630
115c6630P3867J4977p0160k1708N7554J7788n9508k7115N2626L0467l9479k1532
$$ -36630 37237 52214 -17946 -39654 17900 35688 -23820 -50935 1691 32158 -7321 -28853
127b8853L6035J6832l9382j6006L3228R468m1321j4318M7412K7750l1132k6025
$$ -28853 7182 24014 -15368 -31374 1854 11322 -29999 -44317 3095 30845 -287 -26312
139b6312K2842K1602j9613j6945J7748K2017o728j9880m757M616K895J35q784
$$ -26312 -3470 18132 -1481 -18426 -678 21339 14611 -5269 -10026 -5410 -2515 -2380 -11164
152a1164q607L575J8994O807q712K591J5508n701k8357n135K5772J0113k3327
$$ -11164 -19771 -16196 2798 9605 893 3484 18992 13291 -15066 -20201 5571 15684 -7643
165g643r666K0106J0681k0367o443K3142J0478k6906k0376J5898K3362o124j4007
$$ -7643 -17309 2797 13478 -6889 -13332 9810 20288 -6618 -26994 -11096 12266 6142 -7865
178g865P337J3254l570r886N675J6308R42j7315j3768N758Q733l233m566N689
$$ -7865 -528 12726 9156 -730 4945 21253 22195 4880 -8888 -3130 5603 2370 -2196 3493
192C493O464q309j1172J0928K0001n450k1368J763K3386L626k1452o188J7067
$$ 3493 9957 1648 -9524 1404 21405 15955 -5413 -3650 19736 23362 1910 -4278 12789
205A2789J768k6815q827K2416J3107j3649p060J6347O525j5177j1642R476K958
$$ 12789 14557 -12258 -21085 1331 14438 789 -6271 10076 16601 1424 -10218 -742 2216
218B216j1333j147J6473Q322p633R83P175n072j4085k840M787n253o409J0189
$$ 2216 -9117 -10264 6209 14531 6898 7881 15056 9984 -4101 -6941 -2154 -7407 -13816 -3627
232c627R019p467n957J2515O943j3813p926J8228J0084j9393j4450J5913J2073
$$ -3627 5392 -2075 -8032 4483 11426 -2387 -10313 7915 17999 -1394 -15844 69 12142
245A2142j8510j3877J6203J2779j9113j3279K0511J6185j7932j6241J7080J2857
$$ 12142 -6368 -20245 -4042 8737 -10376 -23655 -3144 13041 -4891 -21132 -4052 8805
257H805j8657j3084K3870J6831k2947k0426J9798K0006j3785j4939J4947J2390
$$ 8805 -9852 -22936 934 17765 -5182 -25608 -5810 14196 411 -14528 419 12809
269A2809k1621j8584J5479J6880j3352j2767J3905J5037o777l821J4462K890j9454
$$ 12809 -8812 -27396 -11917 4963 -8389 -21156 -7251 7786 1009 -2812 11650 14540 -4914
282d914j0319J2188M256j2109J155J6993j830k0006M3K1209J750j9527j681J8913
$$ -4914 -15233 -3045 1211 -10898 -9743 7250 5420 -14586 -14543 6666 8416 -11111 -12792 6121
296F121J526j6746K589K1753k487k3585p52K0152j22j5390O357J8703p973k3581
$$ 6121 7647 -9099 -6510 15243 12756 -10829 -11581 8571 8449 -6941 -584 18119 10146 -13435
310a3435L470K0019n842k1266O417K4702k938k0714Q525K6968l232k4860k268
$$ -13435 -9965 10054 4212 -17054 -10637 14065 11127 -9587 -1062 25906 22674 -2186 -4454
323d454J8494k097k1930m25J7747J792j5607P34J5498K537j2933J559J1781o155
$$ -4454 14040 11943 -9987 -10412 7335 9127 -6480 -5746 9752 12289 -644 915 12696 6541
337F541j3276M021J5054m037j1463N941J3371p897j5943N499J4738n013j7907
$$ 6541 -6735 -2714 12340 8303 -3160 2781 16152 8255 -7688 -2189 12549 7536 -10371
350a0371J251J4342P40j2027J783J1649j689j1093J779J0894k54m595M380N021
$$ -10371 -9120 5222 5962 -6065 -4282 7367 5678 -5415 -3636 7258 7004 2409 6789 11810
364A1810j0370j0866N159O523q160q642Q245R721n906o815J1868J2697r747j5382
$$ 11810 1440 -9426 -4267 2256 -5904 -14546 -6301 3420 -2486 -9301 2567 15264 5517 -9865
378i865L081R356n293p481P897Q084o969q584R455O251r586p175Q701K683j4556
$$ -9865 -6784 2572 -2721 -10202 -2305 5779 -1190 -9774 -319 5932 -3654 -10829 -2128 555 -14001
393a4001n178J7469J1681j3132j1092J3871J2620j2509j1266J2644J1647j4460
$$ -14001 -19179 -1710 9971 -3161 -14253 -382 12238 -271 -11537 1107 12754 -1706
405a706j5687Q824J4091q080j2670P236J1441p782p508R899J1702o779o798P639
$$ -1706 -17393 -8569 5522 -2558 -15228 -7992 3449 -4333 -11841 -1942 9760 2981 -3817 3822
419C822K804j1096n753J2418P172j3339p856J3149Q683r585o578J0156N198j3210
$$ 3822 6626 -4470 -10223 2195 9367 -3972 -11828 1321 10004 419 -6159 3997 9195 -4015
433d015r377J0554Q347n819j762R432K136r415J12J1788j754j2042k846R287k412
$$ -4015 -13392 -2838 5509 -310 -2072 7360 9496 81 193 11981 10227 -1815 -4661 4626 2214
448B214j2659M913J6841l357j7190K414J7890K948j5179N58J5636j280j7529j190
$$ 2214 -10445 -5532 11309 7952 -9238 -6824 11066 14014 -1165 -607 15029 13749 -3780 -4970
462d970J5356M22j5176p99J2689n76j3812L915J5776j073j6349k148J3264j294
$$ -4970 10386 10808 -4368 -5167 7522 6946 -6866 -2951 12825 11752 -4597 -6745 6519 5225
476E225j1900J754J4411L10j2294m87J3765N05j1194m522O184j590r652j211Q587
$$ 5225 -6675 -4921 9490 9800 -2494 -2981 10784 11289 95 -4427 1757 167 -9485 -10696 -2109
491b109L728k518m10K494j490m33N177J054n730m163L660K325n884r44N981Q90
$$ -2109 1619 -899 -1309 1185 -305 -738 4439 5493 -237 -4400 -740 1585 -4299 -5243 738 1628
507A628q952k615Q077L667o224j339O926R03q276m447R989M411p151m125O495
$$ 1628 -7324 -9939 -1862 1805 -4419 -5758 1168 2071 -6205 -10652 -663 3748 -3403 -7528 -1033
522a033L534o446k834O964K230q741o436M033N763l982m392N824P063j567n914
$$ -1033 2501 -3945 -6779 185 2415 -6326 -12762 -8729 -2966 -6948 -11340 -5516 1547 -20 -5934
537e934L524P457J82o252l963K221n02l741J87O354L341m420n172M092O516j525
$$ -5934 -2410 5047 5229 -1023 -4986 -2765 -3267 -7008 -6821 -467 2874 -1546 -6718 -2626 3890 2365
553B365n124M52L497j340l870K995O219j94n052j646L849L30k751J889J768l589
$$ 2365 -2759 -2307 1190 -150 -4020 -1025 5194 5000 -52 -1698 2151 2481 -270 1619 3387 -202
569b02n905Q00M291P83q35K813J952j911P95N329J361o195j663K254j210o363
$$ -202 -6107 -5307 -1016 -233 -1068 1745 3697 1786 2581 7910 9271 3076 1413 3667 2457 -3906
585c906J433P366j79p534J455R028q83q836K420J0355j099j3123K30J2069n45
$$ -3906 -2473 4893 4714 -2820 -1365 7663 6780 -2056 364 10719 9620 -3503 -3273 8796 8251
600H251j2464J495J3105p25j4833j97J4372j14j5447j546J2113J09j2825N92J4902
$$ 8251 -4213 -2718 10387 9662 -5171 -5368 9004 8890 -6557 -8103 4010 4119 -8706 -8114 6788
615F788K085j2499q0J2057m68j0478Q18R324n052j2611K534J1249l902q965M660
$$ 6788 8873 -3626 -3706 8351 7883 -2595 -1777 7547 2495 -10116 -7582 3667 -235 -9200 -4540
630d540R974n425q090P725J0690p582j1955O762Q005r208p237J0493Q938j0559
$$ -4540 5434 9 -8081 -356 10334 2752 -9203 -2441 5564 -3644 -10881 -388 8550 -2009
644b009r755J1686Q006j2693q485J2843O655j6177q760J7481J1290j4849r926
$$ -2009 -11764 -78 7928 -4765 -13250 -407 6248 -9929 -18689 -1208 10082 -4767 -14693
657a4693J6155J0458j5408j0208J5772R817j6215j2193J3107R224j3533p176J4971
$$ -14693 1462 11920 -3488 -13696 2076 11893 -4322 -16515 -3408 5816 -7717 -14893 78
670G8Q850j3205o059J4346O970j3377m471J2385K362j3891k557J4675K177j3872
$$ 78 8928 -4277 -10336 4010 10980 -2397 -6868 5517 7879 -6012 -8569 6106 8283 -5589
684e589p09J2341Q9j2334J446J2930k413j3773K197J2350l192j0487O987J2706
$$ -5589 -6298 6043 6132 -6202 -4756 8174 5761 -8012 -5815 6535 3343 -7144 -157 12549
698A2549o852j3046Q462J3043q375j3724Q069J1535j2013j3265J1691J5437q502
$$ 12549 5697 -7349 1113 14156 5781 -7943 126 11661 -352 -13617 -1926 13511 5009
711E009j4113R204J4802p651j1736Q201J1856r236j3073O502J0192o200q844Q447
$$ 5009 -9104 100 14902 7251 -4485 3716 15572 6336 -6737 -235 9957 3757 -5087 3360
725C360P331q539p376Q536P442p946p574N545N318o495l275Q330M707p163l999
$$ 3360 10691 2152 -5224 3312 10754 2808 -4766 779 6097 -398 -3673 4657 9364 2201 -1798
740a798N674K460o062k009M846r99p106J72O105j32n316K383O595k166o827L146
$$ -1798 3876 6336 274 -1735 3111 2112 -4994 -4822 1283 1151 -4165 -1782 4813 2647 -4180 -1034
756a034Q442j538q043k69N196k653p032K119P692p54p020R5O061M7m350J76L714
$$ -1034 7408 5870 -2173 -2442 2754 101 -6931 -4812 2880 2126 -4894 -4799 1262 1309 -3041 -2865 849
773H49j328n121n7M227J738j106O7Q63j116j639J41J396q59k199j942jJ776J973
$$ 849 -479 -5600 -5657 -1430 308 -798 -731 132 -984 -2623 -2482 -1086 -1945 -4144 -6086 -6087 -4311 -2338
791b338Q89m90J069J794n41k580J441L701r07m540j022K632m5l065J182M088k46
$$ -2338 -1449 -1939 -870 924 383 -2197 -756 2945 2038 -2502 -3524 -892 -937 -4002 -2820 1268 1022
808A022l955J9M124J583k077l78Q94k152k248K664L394j289j612K907R46m323
$$ 1022 -2933 -2914 1210 2793 716 338 1232 -920 -3168 -504 2890 1601 -11 2896 3842 -481
824d81j425M891J472o567l148N101J735m262J344R049J070r213k185Q965K683
$$ -481 -1906 2985 4457 -2110 -5258 -157 1578 -2684 -1340 7709 8779 -434 -2619 6346 9029
839I029q987k537Q248K13j0427k35J1339K091j0995j352J0245J67r851N53J2172
$$ 9029 42 -2495 5753 5966 -4461 -4696 6643 8734 -2261 -3613 6632 6799 -3052 -2499 9673
854I673k48j1816j527J0399L96r418R93R357k244j0145K543J0177k977r787J670
$$ 9673 9425 -2391 -3918 6481 6877 -2541 -1548 7809 5565 -4580 -2037 8140 5163 -4624 -2954
869b954P729m353q582O014R876m500p708N777P886o951q295O625P609r511r928
$$ -2954 4775 422 -8160 -2146 7730 3230 -4478 1299 9185 2234 -6061 564 8173 -1338 -11266
884a1266Q031Q752p030p047R838P338j0343q257J0004Q072j0000p879J0016P296
$$ -11266 -3235 5517 -1513 -8560 1278 8616 -1727 -9984 20 8092 -1908 -9787 229 7525
898G525j0346q239J0842Q450j0240q541Q704O770r306o279J0330O742j0485p317
$$ 7525 -2821 -11060 -218 8232 -2008 -10549 -1845 4925 -4381 -10660 -330 6412 -4073 -11390
912a1390Q874O875p793m691Q939N135q754m819Q731M238r310m318O482J556p806
$$ -11390 -2516 4359 -3434 -8125 814 5949 -2805 -7624 1107 5345 -3965 -8283 -1801 -245 -8051
927h051k43J0428K950q684j769Q648P76q032l55Q313j586r510J149J0243K84q441
$$ -8051 -8294 2134 5084 -3600 -5369 3279 4055 -3977 -4332 3981 2395 -7115 -5966 4277 4561 -3880
943c880Q99Q271k372j0041K246R718o23r485J324Q883q13p949K540R282k010r929
$$ -3880 -2981 5290 2918 -7123 -4877 4841 4218 -5267 -3943 4940 4127 -3822 -1282 8000 5990 -3939
959c939Q11R543n44q191P13P170k263p801Q15Q181l22n939J341P300j037n649
$$ -3939 -3128 6415 5871 -2320 -1607 5563 3300 -4501 -3686 4495 4173 -1766 -425 6875 5838 189
975A89J241N512k427o311K10M763p27l675K912M389k016n277J562M165k565m116
$$ 189 1430 6942 4515 -1796 -1586 3177 2450 -1225 1687 6076 4060 -1217 345 4510 1945 -2171
991b171J901L996k329l684L781N303k251n303J357L322k949m365K941M532k859
$$ -2171 -270 3726 1397 -2287 1494 6797 4546 -757 600 3922 973 -3392 -451 4081 1222
1006A222n684J813N925j601m799J827M851k131n176K255N808r56o455q3M105j305
$$ 1222 -4462 -2649 3276 1675 -3124 -1297 3554 1423 -3753 -1498 4310 3354 -3101 -3184 921 -384
1022c84n195J216N875k47m651K32M722j49m594J70L352r09m732J095N160L32k960
$$ -384 -5579 -4363 1512 1265 -3386 -3154 1568 1419 -3175 -3005 347 -562 -5294 -4199 961 1293 -1667
1039a667O82K692j930m298J149K843j475l468J525L722j299k061L719K755l653
$$ -1667 -985 1707 -223 -4521 -3372 -529 -2004 -5472 -3947 -225 -1524 -3585 134 2889 -764
1054g64m344K846M030k572l353L947L627n372m223M504N233m035n384L920N135
$$ -764 -5108 -2262 1768 -804 -4157 -210 3417 -1955 -6178 -1674 3559 -476 -5860 -1940 3195
1069C195l170m027M458N806n036o632K906N996k074m583L253N745l311n577L048
$$ 3195 25 -4002 456 6262 1226 -5406 -2500 3496 1422 -3161 92 5837 2526 -3051 -3
1084cN132l231n588J211M626j131l534L147M983q95m300K25K783q44l408P81K245
$$ -3 5129 1898 -3690 -2479 2147 1016 -2518 629 5612 4717 417 642 3425 2581 -827 -46 2199
1101B199q76j827J623J640m23o57N96o95j819K21K437P87j931M47K320j417l153
$$ 2199 1323 -504 1119 2759 2336 1679 2275 1580 -239 -18 2419 3206 1275 1722 4042 2625 -528
1118e28Q43L257m7m259j41L945L68l305JL544j091m602j671M366K505k980q21
$$ -528 315 3572 3525 -734 -875 3070 3438 133 134 3678 2587 -2015 -3686 680 3185 205 -616
1135f16L345J081m052k141L422J632m270l650K619L201j045j914K246L229k813
$$ -616 2729 3810 -242 -2383 1039 2671 -1599 -5249 -2630 571 -474 -2388 -142 3087 274
1150B74l964N67L454k02k890m86K713J188k276j043L071O85l178j935J357J460
$$ 274 -3690 -3123 331 129 -2761 -3247 -534 654 -1622 -2665 406 1091 -2087 -4022 -2665 -1205
1166a205o76j74J224Q7j721o32J342Q99j089N03K62k82q39R48J464j208j985K13
$$ -1205 -1881 -2055 -831 -744 -2465 -3097 -1755 -856 -1945 -1442 -1180 -1462 -2301 -1353 111 -1097 -3082 -2869
1184b869N58j240q77L350K898k209j917J750K166l412k324L487K982m767l085
$$ -2869 -2311 -3551 -4428 -1078 1820 -389 -2306 -556 1610 -1802 -4126 -639 2343 -2424 -5509
1199e509M524N581l494m259L268L497m551m784M684N692l233n428L671M857k706
$$ -5509 -985 4596 1102 -3157 111 3608 -943 -5727 -1043 4649 1416 -4012 -341 4516 1810
1214A810n267L903N046m006o005L209N835k144l783K046L261l662l667L667L728
$$ 1810 -3457 446 5492 1486 -4519 -1310 4525 2381 -1402 644 3905 243 -3424 243 3971
1229C971l030k173K783K808l203j450L457J411m972k308L776J718l290O30N380
$$ 3971 941 -1232 1551 4359 1156 -294 3163 4574 -398 -2706 1070 2788 -502 128 5508
1244E508n81n975K33N082j007o038Q43O199j367n675J872P233j376p260K72O210
$$ 5508 4927 -1048 -815 4267 3260 -2778 -1935 4264 2897 -2778 -906 6327 4951 -2309 -2037 4173
1260D173k028p516K134Q148q30p830N8P425m34p721Q18P049n10p683N05P474N68
$$ 4173 2145 -5371 -3237 4911 4081 -3749 -3691 3734 3300 -4421 -3603 3446 2936 -4747 -4242 3232 3800
1277C800o481j084N138r43n418J768N768j126m339J227L418k277l247L143K772
$$ 3800 -2681 -3765 1373 430 -4988 -3220 2548 1422 -2917 -1690 1728 -549 -3796 -653 2119
1292B119l605m021L810L576l532j395L774J809m947k479M315K207n482j502N747
$$ 2119 -1486 -5507 -1697 1879 -1653 -3048 726 2535 -2412 -4891 -576 1631 -3851 -5353 394
1307C94N92n009j73O576J621p096k421N494J264n481j661P822J837o164k274N878
$$ 394 986 -4023 -4196 2380 4001 -3095 -5516 -22 1242 -4239 -5900 1922 3759 -2405 -4679 1199
1323A199J573n414k175O000J707m819j018M431J551k740j979K202k35k335J563
$$ 1199 2772 -2642 -4817 1183 2890 -1929 -2947 1484 3035 295 -1684 518 283 -2052 -489
1338d89L158j66k440N65J490j463j967K211P70j495j211J741J942r33m39J668
$$ -489 2669 2503 63 628 2118 655 -1312 899 1669 174 -1037 704 2646 1713 1274 2942
1354B942q19k927O9L507l43k747J89L245K67m128M56M593N48n555j296L929J575
$$ 2942 2123 -804 -735 2772 2429 -318 -129 3116 3383 -745 -289 4304 4852 -703 -1999 1930 3505
1371C505l113j541L087J628k521j270J647J504j630j064Q35M15o27k19R61L51
$$ 3505 392 -1149 1938 3566 1045 -225 1422 2926 1296 232 1067 1482 855 636 1597 1948
1387A948j66j505o23m84O88R32J21K7%L05j158l47K80O7k272RJ860J464j442m37
$$ 1948 1782 277 -346 -830 -142 790 911 938 938 1243 85 -262 18 85 -2187 -2178 -318 1146 -296 -733
1407g33K418J07l265k550K192K725j732k115K299K399j890k847J769K220k007
$$ -733 1685 1792 -1473 -4023 -1831 894 -838 -2953 -654 1745 -145 -2992 -1223 997 -1010
1422a010k111J024J919p51o64J612P8k419l56J733L70j971L19K826p60l275P02
$$ -1010 -3121 -2097 -178 -929 -1593 19 97 -2322 -2678 -945 -575 -2546 -2227 599 -161 -3436 -2734
1439b734L272l33k456M74J981p88k312J844K150j839k178K187K482k756k025L097
$$ -2734 538 205 -2251 -1777 204 -584 -2896 -1052 1098 -741 -2919 -732 1750 -1006 -3031 66
1455F6K332m337k886M405M126l730k754M282K936m902m224M307M114l559l633
$$ 66 2398 -1939 -4825 -420 3706 -24 -2778 1504 4440 -462 -4686 -379 3735 176 -3457
1470c457M377L134l700k645L983J735l971k574M547K055l113r20M188P54n231
$$ -3457 920 4054 354 -2291 1692 3427 -544 -3118 1429 3484 371 -549 3639 4393 -838
1485h38j492M305J034l744k08M464L03m369l3L561nm026N09K645l43k392K234
$$ -838 -2330 1975 3009 -735 -943 3521 3824 -545 -578 2983 2978 -1048 -539 2106 1763 -629 1605
1502A605L068k318m068J303L625j901l410K861L735l048m475K870M344k557m219
$$ 1605 4673 2355 -1713 -410 3215 1314 -2096 765 4500 1452 -3023 -153 4191 1634 -2585
1517b585K613L835l414l640L529L780l417l509K760L145l424k692L654K886m699
$$ -2585 28 3863 449 -3191 338 4118 701 -2808 -48 3097 -327 -3019 635 3521 -1178
1532a178l572L872L601l468k299L689K649m250l181L338K475l339k139L710K096
$$ -1178 -4750 -878 2723 -745 -3044 645 3294 -956 -4137 -799 1676 -1663 -3802 -92 2004
1547B004l229k122L356J823m379j947L231J558k315l49M117N02m385j057K479
$$ 2004 -1225 -3347 9 1832 -2547 -4494 -1263 295 -2020 -2369 1748 2250 -2135 -3192 -713
1562g13P10k424L22L005k42k998N63L048q83l017m37L031m57j866J161L258j172
$$ -713 -3 -2427 -2105 900 658 -2340 -1777 1271 388 -2629 -3066 -35 -492 -2358 -1197 2061 889
1579H89l356O61K601o18k041J188K346j426k402J257K509j181k195J398J979j222
$$ 889 -2467 -1806 795 177 -1864 -676 1670 244 -2158 -901 1608 427 -1768 -370 1609 387
1595C87j925J390K502q24k774J021K429n21j711J293J651q95k925N08J333K87
$$ 387 -1538 -148 2354 1530 -1244 -223 2206 1685 -26 1267 2918 2023 -902 -394 939 1226
1611A226l63M23J026p27p65k11P04j78j66O02J51p74j66J626o3j372p71L92rk90
$$ 1226 863 1286 2312 1585 820 609 1313 1135 969 1571 1722 948 782 2408 2345 973 202 594 585 295
1631B95L80J389Q21j808j429P12P13j28k26O14K62o70j67P18K90r29j061M32P94
$$ 295 675 2064 2885 1077 -352 360 1073 945 719 1333 1595 925 758 1476 1766 837 -224 208 1002
1650A002j113m52J383J330j322k115K55K180Q4j886J73J966k30k357o18K217N12
$$ 1002 -111 -563 820 2150 828 -1287 -1032 1148 1232 -654 -481 1485 1255 -1102 -1720 497 1009
1667A009k058j357J184J432j135q59J252Q48j511o77P31P20k73qQ87m09j494j91
$$ 1009 -1049 -2406 -1222 210 -925 -1784 -532 316 -1195 -1872 -1141 -421 -694 -702 185 -224 -1718 -1909
1685a909J566J044j809n01J494k40j261q04J517M52m29m00K93R43J8L19o8j509
$$ -1909 -343 701 -1108 -1609 -115 -355 -1616 -2420 -903 -451 -880 -1280 -987 -44 -26 293 225 -1284
1703a284j48N83J75j245L57J949K15k077j262K172J460j792j508J791J846q76
$$ -1284 -1432 -849 -674 -1919 -1562 387 602 -1475 -2737 -565 895 -897 -2405 -614 1232 356
1719C56j553J333J686j167j834M54J545R2j069J078M29j066j452J166J446r19
$$ 356 -1197 136 1822 655 -1179 -725 820 912 -157 921 1350 284 -1168 -2 1444 525
1735E25j094J249J455j072j159J055J981r24k548K23J583O62j805l21J007N66
$$ 525 -569 680 2135 1063 -96 959 2940 2016 -532 -309 1274 1936 131 -190 817 1383
1751A383j020o62N28J891n13n78p44k9P95m11m85k7J053Q61j022j087L35J150
$$ 1383 363 -299 229 2120 1607 1029 285 256 1051 640 155 128 1181 2042 1020 -67 268 1418
1769A418l13j306n65R15O70p03M7R69n0p95l78N50O03n28o7J18l08j067q19J243
$$ 1418 1105 -201 -766 149 819 116 163 1132 1082 287 -91 459 1062 534 467 585 277 -790 -1609 -366
1789c66P62j310j255J402J332n94j670J431J466j241l072Q59L176O7k943n13K616
$$ -366 396 -914 -2169 -767 565 -29 -1699 -268 1198 -43 -3115 -2256 920 987 -1956 -2469 147
1806A47M00k498k63K027Q74k469j187J904P92j458k81J549P50j653n50K227M69
$$ 147 547 -1951 -2214 -187 687 -1782 -2969 -1065 -273 -1731 -2012 -463 287 -1366 -1916 311 780
1823G80k042l31J748n65k229L9K503m05j864j42K221r9j474O89J819m75j271M10
$$ 780 -1262 -1593 155 -410 -2639 -2600 -97 -502 -2366 -2508 -287 -386 -1860 -1171 648 173 -1098 -688
1841f88J107j074j000J691J109k435j418K881J625k209j757K031J678k696j572
$$ -688 419 -655 -1655 36 1145 -1290 -2708 173 1798 -411 -2168 -137 1541 -1155 -2727
1856b727L340K550k772k325K920J948k352j643K675J994l818k277K929K123k905
$$ -2727 613 3163 391 -1934 986 2934 582 -1061 1614 3608 -210 -2487 442 2565 -340
1871c40j265K864J603k829j393L281J704k938j593K485J032k553j294K864J219
$$ -340 -1605 1259 2862 33 -1360 1921 3625 687 -906 1579 2611 58 -1236 1628 2847
1886B847l000r76K570R26k504l02K549l62k750J30K820j20k323O42K792j053k925
$$ 2847 -153 -1129 1441 2367 -137 -439 2110 1748 -1002 -872 1948 1828 -495 147 2939 1886 -1039
1903a039R13L210j238l531Q08K710j094l114J319L706j725l246J386K829o36k693
$$ -1039 -126 3084 1846 -1685 -877 1833 739 -2375 -1056 2650 925 -2321 -935 1894 1258 -1435
1919a435J173K717j796l411J562K442j104k662J550J938j952j313J895J775k002
$$ -1435 -262 2455 659 -2752 -1190 1252 148 -2514 -964 974 -978 -2291 -396 1379 -623
1934f23j461J440J011k108k69K393R85k328j047J893J068k174m97J540P6k278
$$ -623 -2084 -644 367 -1741 -2010 383 1368 -960 -2007 -114 954 -1220 -1717 -177 -101 -2379
1950b379l75K435N29k233M32J996l55j671P67K296o25k603L57K053p60k183J021
$$ -2379 -2754 -319 210 -2023 -1591 405 50 -1621 -854 1442 817 -1786 -1429 624 -136 -2319 -1298
1967a298K150o54k220K70K296j01j731J148J097r92j012L82J555k14o58P39k13
$$ -1298 852 198 -2022 -1752 544 443 -1288 -140 957 -35 -1047 -665 890 676 18 757 544
1984E44n67l00J380J74j241m52P48k38r24P97J430J7p97J25O90k15k17M23J47
$$ 544 -23 -323 1057 1231 -10 -462 286 48 -876 -79 1351 1368 571 696 1386 1171 954 1377 1524
2003A524j136r62J340N93n80r55R00Q61j627o80J761J331j195j224Q26Q70p22
$$ 1524 388 -574 766 1359 779 -176 724 1585 -42 -722 1039 2370 1175 -49 777 1647 925
2020I25p79O97M36p17j20L10K19l20J6j39q28r21J258Q51r18m09J091J242j198
$$ 925 146 843 1279 562 442 752 971 651 667 528 -300 -1221 37 888 -30 -439 652 1894 696
2039F96j104Q02J040r72j221O18O75j438p56J303P72j386k18J288O09j639k64
$$ 696 -408 394 1434 462 -759 -141 534 -904 -1660 -357 415 -971 -1189 99 708 -931 -1195
2056a195K069K74k475p30K067R11j721j049K283K33k430o21K071O92j830p97J221
$$ -1195 874 1148 -1327 -2057 10 921 -800 -1849 434 667 -1763 -2384 -313 379 -1451 -2248 -1027
2073a027L02j094K73K052n22j495M56J828o92j585J022J455j736k656J104K666
$$ -1027 -725 -1819 -1546 506 -16 -1511 -1055 773 81 -1504 -482 973 -763 -3419 -2315 351
2089C51q38j840J187J809p69j424J190J609j135j789R82J659j977n14J890J369
$$ 351 -487 -2327 -1140 669 -100 -1524 -334 1275 140 -1649 -667 992 -985 -1499 391 1760
2105A760k398j582K469J178k355r87K404Q00k110j241K417J733j624j116J585
$$ 1760 -638 -2220 249 1427 -928 -1915 489 1289 -821 -2062 355 2088 464 -652 933
2120I33J142j777o76J828J82j988o11J586o1j389M11K266l50k018N31K314r7k106
$$ 933 2075 298 -378 1450 1632 -356 -967 619 558 -831 -420 1846 1496 -522 9 2323 2226 120
2138A20O34J602j061k203N46K205o01j787O56J576n09j666P63J189j151j357J279
$$ 120 754 2356 1295 -908 -362 1843 1242 -545 111 1687 1178 -488 275 1464 313 -1044 235
2155B35J358r53j266J509J620j528j366P77Q50q54j530R52P86r36r84J052P33
$$ 235 1593 640 -626 883 2503 975 -391 386 1236 382 -1148 -196 590 -346 -1330 -278 455
2172D55m77l66Q01L34n84J14R09k05j406m97R68l45j104J66J568p6j769K0J196
$$ 455 -22 -388 413 747 163 277 1186 981 -425 -922 46 -299 -1403 -1237 331 255 -1514 -1494 -298
2191b98K38j078q7R37m45q19Q38J313j99j180o1P07l63r23L64O27o52j046P04
$$ -298 -60 -1138 -1225 -288 -733 -1552 -714 599 400 -780 -841 -134 -497 -1420 -1056 -429 -1081 -2127 -1423
2210a423R35O0m47Q83L59o71l98Q45N60n94o43R7M9m51k3P36l1l81l82L67N17
$$ -1423 -488 -428 -875 8 367 -304 -702 143 703 109 -534 -437 -388 -839 -862 -126 -157 -538 -920 -553 -36
2231c6l02Q06K90p37n49K05O38J66l07N13L56n34q29Q82L70p98o23K91J36m00
$$ -36 -338 468 758 21 -528 -323 315 481 174 687 1043 509 -320 562 932 134 -489 -198 -62 -462
$$ [...]
8191h
##END NTUPLES=NMR FID
##END=
