##TITLE=1H_SAV-64 (AcCl-8)
 CDCl3, 8 sc, 
 27.2.2020
##JCAMPDX= 6.0         $$ Bruker NMR JCAMP-DX V2.0
##DATA TYPE= NMR FID
##DATA CLASS= NTUPLES
##ORIGIN= UXNMR, Bruker Analytische Messtechnik GmbH
##OWNER= root
$$ XWIN-NMR		Version 3.5
$$ Thu Feb 27 16:24:51 2020 Russian Standard Time (UT+4h)  she@DPX200
##.OBSERVE FREQUENCY= 200.1315
##.OBSERVE NUCLEUS= ^1H
##.DELAY= (6, 6)
##.ACQUISITION MODE= SIMULTANEOUS
##.ACQUISITION SCHEME= undefined
##.AVERAGES= 8
##.DIGITISER RES= 18
##SPECTROMETER/DATA SYSTEM= spect
##.PULSE SEQUENCE= zg30
##.SOLVENT NAME= D2O
##.SHIFT REFERENCE= (INTERNAL, D2O, 0, 15.7039)
##AUDIT TRAIL= $$ (NUMBER, WHEN, WHO, WHERE, WHAT)
$$ ##TITLE= Audit trail, XWIN-NMR		Version 3.5
$$ ##JCAMPDX= 5.01
$$ ##ORIGIN= Bruker BioSpin GmbH
$$ ##OWNER= she
$$ F:/spectra/data/she/nmr/H-F/1/audita.txt
$$ ##AUDIT TRAIL=  $$ (NUMBER, WHEN, WHO, WHERE, WHAT)
(   1,<2020-02-27 16:23:25.76 +0400>,<she>,<DPX200>,
      <created by zg, POWCHK disabled, PULCHK disabled
       configuration hash MD5:
       00 E9 B6 7A A2 85 ED C7 34 08 36 98 17 FE 4E 26
       data hash MD5: 16K
       7B A6 FA 03 DA 66 43 95 BD 95 41 A5 03 36 4E 63>)
$$ ##END=
$$ 
$$ hash MD5
$$ FC D0 84 3A 16 05 FD 97 50 89 25 16 55 85 22 2C
##$RELAX= 
##$RELAX= 
##$RELAX= 
##$RELAX= 
##$RELAX= 
##$RELAX= 
$$ Bruker specific parameters
$$ --------------------------
##$DU= <F:/spectra>
##$EXPNO= 1
##$NAME= <H-F>
##$PROCNO= 1
##$TYPE= <nmr>
##$USER= <she>
##$AMP= (0..31)
100 100 100 100 100 100 100 100 100 100 100 100 100 100 100 100 100 100 
100 100 100 100 100 100 100 100 100 100 100 100 100 100 
##$AQSEQ= 0
##$AQ_mod= 1
##$AUNM= <au_zg>
##$AUTOPOS= <>
##$BF1= 200.13
##$BF2= 200.13
##$BF3= 200.13
##$BF4= 200.13
##$BF5= 200.13
##$BF6= 200.13
##$BF7= 200.13
##$BF8= 200.13
##$BYTORDA= 1
##$CFDGTYP= 0
##$CFRGTYP= 5
##$CHEMSTR= <none>
##$CNST= (0..31)
1 1 145 1 1 1 1 1 1 1 1 1 1 1 1 1 1 1 1 1 1 1 1 1 1 1 1 1 1 1 1 1 
##$CPDPRG= <>
##$CPDPRG1= <>
##$CPDPRG2= <>
##$CPDPRG3= <>
##$CPDPRG4= <mlev>
##$CPDPRG5= <mlev>
##$CPDPRG6= <mlev>
##$CPDPRG7= <mlev>
##$CPDPRG8= <mlev>
##$CPDPRGB= <>
##$CPDPRGT= <>
##$D= (0..31)
0 1.2 0 0 0 0 0 0 0 0.06 0 0.03 0 0 0 0 0.0002 0 0 0 0 0 0 0 0 0 0 0 0 
0 0 0 
##$DATE= 1582806205
##$DBL= (0..7)
120 120 120 120 120 120 120 120 
##$DBP= (0..7)
150 150 150 150 150 150 150 150 
##$DBP07= 0
##$DBPNAM0= <>
##$DBPNAM1= <>
##$DBPNAM2= <>
##$DBPNAM3= <>
##$DBPNAM4= <>
##$DBPNAM5= <>
##$DBPNAM6= <>
##$DBPNAM7= <>
##$DBPOAL= (0..7)
0.5 0.5 0.5 0.5 0.5 0.5 0.5 0.5 
##$DBPOFFS= (0..7)
0 0 0 0 0 0 0 0 
##$DE= 6
##$DECBNUC= <off>
##$DECIM= 24
##$DECNUC= <off>
##$DECSTAT= 4
##$DIGMOD= 1
##$DIGTYP= 9
##$DL= (0..7)
0 120 120 120 120 120 120 120 
##$DP= (0..7)
150 150 150 150 150 150 150 150 
##$DP07= 0
##$DPNAME0= <>
##$DPNAME1= <>
##$DPNAME2= <>
##$DPNAME3= <>
##$DPNAME4= <>
##$DPNAME5= <>
##$DPNAME6= <>
##$DPNAME7= <>
##$DPOAL= (0..7)
0.5 0.5 0.5 0.5 0.5 0.5 0.5 0.5 
##$DPOFFS= (0..7)
0 0 0 0 0 0 0 0 
##$DQDMODE= 0
##$DR= 18
##$DS= 0
##$DSLIST= <SSSSSSSSSSSSSSS>
$$ [...]
##$SUBNAM2= <"">
##$SUBNAM3= <"">
##$SUBNAM4= <"">
##$SUBNAM5= <"">
##$SUBNAM6= <"">
##$SUBNAM7= <"">
##$SUBNAM8= <"">
##$SUBNAM9= <"">
##$SW= 24.9337058887773
##$SWIBOX= (0..15)
0 0 2 0 0 0 0 0 0 0 0 0 0 0 0 0 
##$SW_h= 4990.01996007984
##$TD= 16384
##$TD0= 1
##$TE= 0
##$TE2= 300
##$TE3= 300
##$TEG= 300
##$TL= (0..7)
0 120 120 120 120 120 120 120 
##$TP= (0..7)
150 150 150 150 150 150 150 150 
##$TP07= 0
##$TPNAME0= <>
##$TPNAME1= <>
##$TPNAME2= <>
##$TPNAME3= <>
##$TPNAME4= <>
##$TPNAME5= <>
##$TPNAME6= <>
##$TPNAME7= <>
##$TPOAL= (0..7)
0.5 0.5 0.5 0.5 0.5 0.5 0.5 0.5 
##$TPOFFS= (0..7)
0 0 0 0 0 0 0 0 
##$TUNHIN= 0
##$TUNHOUT= 0
##$TUNXOUT= 0
##$USERA1= <user>
##$USERA2= <user>
##$USERA3= <user>
##$USERA4= <user>
##$USERA5= <user>
##$V9= 5
##$VALIST= <valist>
##$VCLIST= <CCCCCCCCCCCCCCC>
##$VD= 0
##$VDLIST= <DDDDDDDDDDDDDDD>
##$VPLIST= <PPPPPPPPPPPPPPP>
##$VTLIST= <TTTTTTTTTTTTTTT>
##$WBST= 1024
##$WBSW= 4
##$XGAIN= (0..3)
0 0 0 0 
##$XL= 0
##$YL= 0
##$YMAX_a= 149903
##$YMIN_a= -104279
##$ZGOPTNS= <>
##$ZL1= 120
##$ZL2= 120
##$ZL3= 120
##$ZL4= 120
##$ABSF1= 10
##$ABSF2= 0
##$ABSG= 5
##$ABSL= 3
##$ALPHA= 0
##$AQORDER= 0
##$ASSFAC= 0
##$ASSFACI= 0
##$ASSFACX= 0
##$ASSWID= 0
##$AUNMP= <proc_1d>
##$AZFE= 0.1
##$AZFW= 0.1
##$BCFW= 1
##$BC_mod= 2
##$BYTORDP= 1
##$COROFFS= 0
##$CY= 11.3945322036743
##$DATMOD= 1
##$DC= 2
##$DFILT= <>
##$DTYPP= 0
##$F1P= 16.9975609425685
##$F2P= -3.02152046262296
##$FCOR= 0.5
##$FTSIZE= 0
##$FT_mod= 4
##$GAMMA= 1
##$GB= 0.15
##$INTBC= 1
##$INTSCL= 1
##$ISEN= 128
##$LB= 0.24
##$LEV0= 0
##$LPBIN= 0
##$MAXI= 10000
##$MC2= 0
##$MEAN= 0
##$ME_mod= 0
##$MI= 1.114404
##$NCOEF= 0
##$NC_proc= 0
##$NLEV= 6
##$NOISF1= 3.799351
##$NOISF2= 2.8
##$NSP= 1
##$NTH_PI= 0
##$NZP= 0
##$OFFSET= 15.70392
##$PC= 1
##$PHC0= -9788.054
##$PHC1= 15.40082
##$PH_mod= 1
##$PKNL= yes
##$PPARMOD= 0
##$PSCAL= 0
##$PSIGN= 0
##$REVERSE= no
##$SF= 200.130013532006
##$SI= 16384
##$SIGF1= 3
##$SIGF2= 2
##$SINO= 400
##$SIOLD= 16384
##$SREGLST= <1H.CDCl3>
##$SSB= 0
##$STSI= 0
##$STSR= 0
##$SW_p= 3612.71676300578
##$SYMM= 0
##$S_DEV= 0
##$TDeff= 0
##$TDoff= 0
##$TI= <>
##$TILT= no
##$TM1= 0
##$TM2= 0
##$TOPLEV= 0
##$USERP1= <user>
##$USERP2= <user>
##$USERP3= <user>
##$USERP4= <user>
##$USERP5= <user>
##$WDW= 1
##$XDIM= 8192
##$YMAX_p= 0
##$YMIN_p= 0
$$ End of Bruker specific parameters
$$ ---------------------------------
##NTUPLES= NMR FID
##VAR_NAME=  TIME,          FID/REAL,        FID/IMAG
##SYMBOL=    X,             R,               I
##VAR_TYPE=  INDEPENDENT,   DEPENDENT,       DEPENDENT
##VAR_FORM=  AFFN,          ASDF,            ASDF
##VAR_DIM=   8192,          8192,            8192
##UNITS=     SECONDS,       ARBITRARY UNITS, ARBITRARY UNITS
##FACTOR=    0.0002004,     1,               1
##FIRST=     0,             0,               0
##LAST=      1.6414764,     0,               0
##MIN=       0,             -104279,         0
##MAX=       1.6414764,     149903,          0
$$ Real data points
##PAGE= N=1
##DATA TABLE= (X++(R..R)), XYDATA
0 0 0 0 0 0 0 0 0 0 0 5 -8 8 -8 8 -11 16 -16 24 -24 32 -33 41 -48 56 -65 73 -81 93 -105 121 -134 152 -171
33 -171 191 -213 237 -264 294 -325 363 -400 444 -491 545 -603 668 -742 825 -921 1031 -1162
51 -1162 1315 -1502 1739 -2040 2446 -3020 3907 -5461 8999 -37565 56158 99326 -63349 -104279
65 -104279 2144 61455 -25089 -65818 -6500 27021 -22636 -24155 39765 52841 -13365 -30086
77 -30086 20117 33608 -13225 -19853 18959 17367 -26255 -20940 26343 25289 -26673 -37304 5853
90 5853 28894 6233 -14400 -11739 -4417 7523 22393 12986 -13293 -7969 28288 26766 -22174
103 -22174 -36010 7008 23563 -16889 -31730 14921 38292 -5865 -37298 -6584 15714 -14867
115 -14867 -31675 4076 24746 -6577 -20946 14287 26333 -17085 -39540 -1019 23100 -6823
127 -6823 -21089 16745 33682 -7539 -30047 11966 40969 200 -40100 -10632 37449 27334
139 27334 -14049 -22078 160 11206 6645 3643 -1958 -13287 -10309 9846 15936 -2063 -13966
152 -13966 1666 20792 19119 5905 -1146 -1984 -2308 -2315 -634 74 1830 2600 -3328 -8774 -4450 2125
168 2125 -8264 -28215 -25164 5584 24488 6473 -17978 -10631 14678 18485 -5117 -21853 -10586
181 -10586 10748 15211 2001 -8738 -5265 2854 428 -8460 -10807 -4288 616 -161 -2829 -1677
195 -1677 1465 6034 8904 4765 -1631 3481 15659 13392 -6303 -11385 9432 23347 6526 -10577
209 -10577 3954 23458 9654 -16144 -10287 13306 12336 -6490 -4988 16682 21675 5902 -2514
222 -2514 1308 835 -1877 6209 11537 986 -4989 12063 24756 5418 -17965 -7481 15006 10426
236 10426 -8147 -4565 13515 12853 -2074 -2259 7579 4370 -5019 -2943 3709 1101 -788 6067 5008
251 5008 -6861 -4929 14790 17311 -6749 -16556 6003 20677 1414 -15269 -574 16866 9323
264 9323 -3691 1428 5197 -5885 -9570 2795 4822 -10010 -8188 14403 17124 -8755 -16468 8110
278 8110 17002 -9495 -22025 4771 24197 4750 -15711 -1810 14998 1849 -15610 -8426 3302
291 3302 -2654 -8256 663 5099 -6386 -9311 5116 6865 -10811 -14625 6072 13713 -6818 -18074
305 -18074 940 16393 2450 -14365 -7062 6716 4036 -6782 -9173 -5508 -2628 2185 5349
318 5349 -1671 -8369 292 10875 312 -15646 -8414 11083 8910 -8873 -7390 11810 12790 -6358
332 -6358 -13106 361 7055 -2309 -6035 1816 5242 1106 3437 7825 -1228 -10665 34 14356
346 14356 4436 -14047 -5709 17669 15438 -10135 -14548 8767 17082 -3588 -15364 1009 14154
359 14154 4092 -7756 -403 9934 5952 -1366 901 3387 -694 -1699 4222 4524 -3119 -2555 8806
374 8806 10207 -3225 -9248 1577 9205 -218 -10415 -2002 11132 9226 -2146 -4081 3144 5367
388 5367 -49 -4191 -3758 77 4253 5055 176 -4519 -799 6169 2543 -7790 -8247 2959 7200
403 7200 -1979 -6785 1146 6903 686 -5849 -2498 1672 -1584 -4555 -738 793 -2527 -2392 3519
418 3519 3168 -5408 -6466 3162 4850 -6761 -10416 1943 10028 -699 -9862 -1650 7800 1162 -9583
433 -9583 -6731 1161 527 -3422 -1052 1664 -1505 -2160 3110 2942 -6455 -8052 2973 8103 -2125
448 -2125 -7933 2419 10748 961 -8737 -3058 5841 1196 -6838 -3504 3323 2217 -1036 874 1725
463 1725 -1459 -758 4715 2587 -5637 -3488 7858 9114 -3003 -6243 6161 11163 -897 -9253
477 -9253 -982 7495 2491 -4991 -1631 4598 3114 346 1382 580 -2677 -605 5303 2738 -4961
492 -4961 -2206 8299 8500 -2977 -6364 3570 8214 -1194 -7526 -575 6709 2926 -3284 -1459 3346
507 3346 2837 -1194 -2559 -2091 -747 2244 2763 -939 -3900 1221 7484 2875 -6270 -5841 3516 6098
523 6098 -1162 -6677 -1520 5169 3352 -2581 -3740 -1395 -228 -1720 -3217 -3720 -2484 -376 4 -2510
539 -2510 -4331 -1781 1195 -1476 -6458 -5838 909 3153 -2866 -8064 -3276 3935 1893 -6783 -9129
554 -9129 -2656 1228 -2374 -6817 -5584 -1478 -908 -2403 -3640 -4563 -4261 -2559 -835 -2819 -5306 -1952
570 -1952 3479 1638 -5097 -4657 2447 3170 -5104 -8007 -263 4546 -1049 -6144 -1946 2446 139 -3887
586 -3887 -2540 -812 -1928 -759 2163 286 -3466 -539 5948 3356 -5617 -4645 5478 6043 -4107
601 -4107 -6795 2584 6946 -1011 -6016 -354 3140 -914 -3365 -52 26 -3392 -807 4203 1016 -5225
617 -5225 -1161 6181 2857 -7005 -3901 7190 5558 -5690 -5289 6337 7708 -2766 -6037 1461
631 1461 4046 -1418 -1856 1881 426 -2541 1833 6672 396 -6713 92 9121 3198 -7056 -1635
646 -1635 9342 5754 -5059 -2311 7845 5515 -4301 -3365 5510 4838 -2387 -1738 3653 1325 -2601
661 -2601 1665 5282 -1889 -7082 1720 9096 66 -9150 -1438 9580 4265 -7051 -3696 5453 3192
676 3192 -4740 -2685 3549 1195 -3667 -241 3447 -1545 -5329 442 3413 -3076 -6088 1935 5932
691 5932 -1901 -7105 1235 7778 919 -6766 -950 5922 2528 -2797 -150 3490 1111 -618 2787
706 2787 3153 -2487 -2001 4844 5482 -2802 -4229 4651 7575 -513 -3944 3120 7211 1372 -2869 1898
722 1898 5480 1819 -502 3004 3857 831 10 3124 2677 -1244 -375 4454 3241 -2620 -1854 4920
738 4920 4957 -2175 -4073 2127 5495 1158 -2926 317 3516 2740 868 498 83 11 2084 3153 677
755 677 -1637 598 4320 2092 -2066 -893 3464 2786 -1376 -1671 1909 3341 417 -1327 451 3147
771 3147 2811 941 -1052 -181 2356 3283 1084 -1863 -693 2729 3233 -214 -2557 -610 1638 1326
787 1326 -1261 -2479 -452 1635 1157 -1288 -2706 -751 1504 -140 -2682 -2334 900 843 -2221 -3029
803 -3029 -1001 198 -899 -2898 -2369 -1180 -1057 -943 -1935 -3439 -2531 229 634 -3451 -5018 -629 2381
820 2381 -1215 -5349 -2951 1890 801 -2871 -3196 104 392 -1429 -1130 -428 -1924 -1799 436 993 -2499
837 -2499 -3124 890 2115 -2033 -3945 640 3088 -1129 -4421 -199 3515 378 -3508 -1046 2436
852 2436 855 -1447 -120 283 -1373 -570 2218 1502 -3627 -3113 3112 3771 -2771 -4636 1642 4453
868 4453 -769 -3796 245 3609 -144 -2426 354 2524 -416 -1815 1090 1801 -1325 -913 2247 1495
884 1495 -2799 -1545 3760 3150 -3298 -3386 3308 4368 -1685 -4113 1482 4365 -67 -2247 487 2030
900 2030 -202 -427 1794 592 -1859 -24 3649 961 -3745 -1506 4151 2581 -3263 -3083 2802 2848
916 2848 -1926 -2909 1264 2579 -1371 -2116 794 1303 -1119 -816 769 -165 -2163 -302 1866 -805
932 -805 -3586 -756 3062 335 -4784 -2929 2812 2395 -2640 -3723 279 1777 -831 -1844 -416 -701
948 -701 -1444 165 1539 -1017 -2678 -305 2033 -86 -2887 -799 1966 625 -3008 -1169 2583 1546
964 1546 -2466 -2162 1306 2025 -889 -2054 -111 1228 468 310 306 -853 -1204 1386 2039 -433 -2878
981 -2878 -99 2877 1399 -2063 -1516 2157 2669 -715 -1838 492 2022 404 -935 403 1309 672
997 672 371 761 223 -30 670 1392 135 -719 573 2126 1020 -1419 -187 1822 2072 -874 -1760 1140
1015 1140 2868 785 -959 -171 1530 1708 383 -187 -576 110 1176 1620 -50 -1155 -148 1991
1031 1991 1289 -1581 -1249 1144 1370 -662 -1276 871 1548 -160 -1481 298 1453 -173 -1153 -644 53
1048 53 160 280 299 -442 -1569 -146 1659 320 -2875 -2214 1370 2093 -1437 -2560 -345 1991 -8
1065 -8 -1733 -671 17 -469 -1049 317 277 -1335 -936 337 162 -1409 -1165 463 -36 -1522 -1609 1379
1083 1379 1233 -1194 -1862 330 1710 -619 -2171 -864 1081 655 -395 -112 -508 -290 546 522 -503
1100 -503 -1700 -525 1579 914 -1465 -1300 1118 1872 -415 -1422 67 1106 318 -749 84 968 307
1117 307 288 81 148 -11 658 842 10 -745 921 2172 631 -1404 -593 2109 2014 -800 -1543 495 2179
1136 2179 921 -966 -279 1420 1845 690 -174 -358 614 1331 862 -134 -312 796 1486 850 -320 -687
1154 -687 598 1168 -86 -826 453 1495 882 -658 -642 989 1301 -389 -1358 -184 1055 781 -615
1171 -615 -943 -153 1048 765 -27 -1193 -904 297 1303 -598 -1678 -740 1198 289 -1589 -1402 -28
1188 -28 410 -1209 -1429 -308 664 -678 -1022 -541 135 -904 -885 -268 -1160 -1560 68 885 -597 -2280
1206 -2280 -650 1699 58 -2358 -2267 887 762 -1213 -1578 307 955 -664 -988 81 82 -1034 -216
1223 -216 736 -353 -1525 -166 1581 58 -2284 -800 1604 406 -2316 -1452 1268 1464 -1209 -1168
1239 -1168 309 769 -587 -650 255 -329 -861 239 1326 -421 -1276 659 1902 -449 -2169 -131 2330
1256 2330 639 -1843 -151 2422 939 -1092 -685 1180 388 -630 507 1236 -192 -520 1166 1810
1272 1810 -349 -1464 1047 2213 -495 -2200 799 2682 414 -2031 233 2590 960 -1174 -348
1287 -348 1067 494 -466 529 778 -204 -408 1213 737 -1070 -850 1120 1204 -1110 -1374 1036 1792 -723
1305 -723 -1358 284 1247 -554 -1651 -186 554 -522 -516 265 -127 -1074 -301 1029 186 -1668 -1164 921
1323 921 966 -1453 -1224 578 767 -895 -1551 10 527 -868 -1273 392 414 -565 -291 410 -215 -796 20
1342 20 718 -465 -1368 -478 1192 513 -1218 -793 381 1040 -141 -649 -623 138 219 508 -27 -528 4
1361 4 908 458 -831 -1021 551 986 63 -774 523 1280 259 -480 -57 700 308 -27 -164 112 105 474
1381 474 639 235 -377 640 884 94 -498 28 1057 1062 -53 -251 703 813 601 51 -192 99 952 770
1401 770 55 -471 698 1438 692 -704 -322 1157 754 -410 -339 720 732 79 -55 351 781 189 -223
1420 -223 359 199 -86 605 590 -193 -617 711 1265 -332 -1605 -442 1728 635 -1158 -843 973 781
1438 781 -420 -691 -60 -428 -388 25 140 -337 -525 439 489 -903 -1368 139 409 -319 -1373 -127 1112
1457 1112 -432 -1497 -236 561 -67 -661 -162 -219 -561 -363 615 -137 -1163 -256 672 343 -1248 -880
1475 -880 961 940 -1135 -1316 582 1318 -766 -955 369 285 -496 -532 302 55 -629 -468 874 405 -1155
1494 -1155 -574 867 502 -898 -850 1271 1031 -883 -806 955 991 -843 -987 484 571 -50 -293 349 203
1513 203 -205 85 799 -131 -669 -18 1140 477 -988 -218 1068 1067 -667 22 927 642 -181 -31 443
1532 443 9 -99 432 669 352 -312 313 680 -151 -856 428 1169 166 -606 119 1468 436 -685
1550 -685 -579 706 723 -183 -276 199 332 -123 204 50 -549 -462 347 549 -238 -880 -255 719 108 -867 -164
1571 -164 595 111 -446 -663 -130 272 -357 -441 -74 -198 -164 -175 -295 -663 -228 -140 -114 -958 -819 444 274
1592 274 -279 -721 -177 18 -231 -885 -32 -93 308 -206 73 -291 -169 -200 301 -9 -658 -364 254 442 -445
1613 -445 -455 -95 364 -217 -514 -200 467 160 -610 -257 367 736 -238 -249 -133 262 381 14 -100 -151 100
1634 100 91 120 11 -41 234 531 419 -393 -311 307 859 306 -168 287 482 -19 19 -332 241 427 124 -272
1656 -272 -224 154 491 186 138 -104 124 692 161 -205 -204 721 719 -156 -501 -96 465 78 -177 61 205 590
1678 590 127 274 -51 42 327 327 -32 -116 -197 359 145 -457 -40 475 534 -728 -498 335 544 -175 -729 -539
1700 -539 562 294 -16 -338 -238 -71 -276 -464 -405 -167 67 349 90 -501 -423 178 3 -503 -365 -160
1720 -160 268 12 -332 27 140 15 -369 -420 -107 477 202 -495 -564 -144 480 56 -176 -617 167 407 79
1741 79 -380 -263 -234 366 -150 -2 36 65 24 -164 -99 -2 -129 -78 -171 106 214 167 294 -179 -400 90 510
1764 510 541 -253 -357 241 609 220 -353 -81 435 233 -138 -51 260 458 -38 1 65 50 89 225 551 6
1786 6 -258 111 789 522 -154 -103 352 290 66 -37 141 46 -61 -190 258 289 11 -302 62 224 97 31
1808 31 259 -141 75 132 391 -131 -706 -42 545 237 -407 -361 289 256 -140 -264 26 -46 7 -172 -4 -45
1830 -45 9 -214 232 -212 -379 58 223 -429 -555 106 547 -302 -1003 -8 632 106 -753 -384 -1 311 -145
1851 -145 -145 -349 -626 -245 72 184 -485 -616 367 335 -508 -588 -249 199 -132 -635 -310 176 -210 -198 78 178
1873 178 -37 -257 -35 231 -105 -265 -1 35 -657 -200 801 108 -288 -335 473 538 -359 -524 139 559 140
1894 140 78 -107 154 -41 368 300 -64 -20 -365 548 205 -248 -267 570 453 -354 -11 385 220 -198 -178 237
1916 237 358 -248 -232 361 488 -32 -100 178 283 -62 138 261 -114 -12 355 974 400 -688 -289 283
1936 283 367 -40 253 271 330 79 142 148 -71 -242 429 293 -266 -26 467 453 -103 -281 82 533 48 -267
1958 -267 300 318 48 -352 -108 -208 -26 177 -157 -162 -176 -20 257 -173 -678 -164 264 321 -479 -276 109 61
1980 61 -198 -265 -214 9 254 22 -388 -223 -229 -43 -16 -290 -421 73 244 -109 -365 208 391 -378 -362 178
2002 178 1 269 -174 -241 602 288 128 83 -30 -55 148 507 176 -353 -110 580 142 -241 -138 665 156
2023 156 -230 200 105 310 125 100 -14 299 -241 303 31 107 18 135 281 -99 -154 19 557 162 -513 97
2045 97 611 113 -137 164 183 122 -65 347 95 -178 57 490 228 -341 -430 577 720 -203 -410 302 481
2066 481 -197 -392 47 208 265 20 270 169 -224 -169 167 364 -495 37 303 90 -334 -571 350 -191 -378
2087 -378 -572 -21 189 -135 -320 -134 -95 -69 -302 -70 -76 -661 84 -64 -30 -683 -74 257 -142 -577 -181 -119
2109 -119 -109 -538 -407 -72 128 -577 -347 229 -80 -276 -369 16 -264 -204 -97 -81 -252 -411 52 3 -210 -523
2131 -523 -318 318 137 -390 -20 398 266 246 116 13 -100 -326 160 25 -393 -165 287 192 -475 225 159
2152 159 229 -205 -214 161 505 71 -339 -205 344 257 -367 266 292 -72 140 444 -324 -183 -107 392 200 -312
2174 -312 -277 289 204 -275 65 240 625 -124 -193 -154 329 273 -52 85 52 118 117 324 76 -141 -78 123 -68
2197 -68 -40 74 205 77 68 -31 -11 177 19 253 19 -174 -50 280 -174 -113 88 257 -116 -165 -291 154 -42
2220 -42 -21 -338 -49 -141 -128 -125 -19 -231 -138 -171 -168 -86 40 -164 -42 -547 -200 -170 -137 -72 -361 312 162 -69 40
2245 40 -191 203 347 -66 -60 -64 -240 57 -14 -250 -344 -118 210 -224 -397 -72 52 116 36 -241 -91 24 14
2268 14 -91 -124 -7 -116 -157 55 -134 45 -80 100 160 11 83 235 184 -157 -119 265 -149 -55 29 -24 240
2291 240 43 132 177 28 -133 223 -171 -247 -341 126 400 15 -13 259 331 340 -24 338 404 357 -139 83 117 86
2315 86 -57 276 102 224 353 133 -45 2 -274 136 354 -245 184 289 364 -143 -176 -49 97 163 -182 -139
2337 -139 248 -64 7 -132 -68 -32 -62 241 -69 -108 -147 47 -183 -247 -202 38 57 190 -172 -332 -49 -83 138
2360 138 -445 51 -219 -40 313 -358 -142 -37 -70 -210 -95 -59 55 -17 -196 -370 88 87 -59 -155 58 105
2382 105 14 -392 -261 -123 145 -222 -42 105 175 -82 -165 -86 -394 206 -158 40 -80 105 -156 101 112 -17
2404 -17 32 102 35 -6 70 -87 95 85 -232 195 209 -259 83 -92 157 -47 240 280 -52 -329 340 489 208
2427 208 242 -53 226 -24 111 24 -46 4 53 340 74 43 183 53 201 154 -44 -109 53 -309 72 96 243
2450 243 179 -188 45 391 65 -111 -142 -256 204 -158 -115 53 -33 164 -3 38 10 191 247 308 -75 -174 241
2473 241 73 -126 -166 75 -67 -315 -212 -146 79 -36 -276 -26 63 39 198 92 -316 -200 -35 -199 -164 -78
2495 -78 -124 274 -238 -607 4 -36 -253 -222 -118 -181 -133 24 -68 -231 -72 -13 106 134 -215 -384 -94 156 52
2518 52 -107 -12 -212 -324 -325 -85 -144 -88 -102 -90 -50 -65 -88 -143 330 -106 -25 227 -34 -36 -140 215 292 237 -97 107
2544 107 86 -19 53 163 199 -62 -2 98 211 -197 71 -140 31 -236 -118 9 88 86 28 -65 66 124 -125
2567 -125 -133 165 56 -132 -118 -191 120 140 -45 -102 -1 87 -44 34 -128 -218 141 55 -55 0 -95 -162 -76 163 -11
2592 -11 74 79 2 236 86 50 283 -12 11 96 78 202 -119 253 -101 11 124 -82 -68 53 118 -335 71 350
2616 350 139 115 -361 -131 -174 -176 126 -77 -134 -147 -140 173 -309 82 -49 -56 -255 -232 -290 -81 31 -55 45 358
2640 358 118 210 27 142 80 537 252 -374 190 177 117 -98 190 397 -116 56 -166 -129 98 -32 51 161
2662 161 99 -187 69 161 2 -3 90 497 368 -99 32 263 240 -224 132 325 -20 -101 -58 -20 276 137 137 -64
2686 -64 468 132 -104 45 -96 -178 237 359 298 -105 77 310 134 364 -284 -96 -112 133 -194 109 -45
2707 -45 74 66 241 -213 25 25 -57 53 -153 118 178 77 -325 -63 -127 27 38 -50 -244 129 18 217 -126
2730 -126 -162 124 191 35 -215 -229 94 175 -180 -473 70 217 221 -348 -51 172 -275 219 122 -143 109 -115
2752 -115 47 -239 -267 56 40 -249 -428 -146 208 -119 -156 -68 -169 -2 52 76 -38 -54 -14 139 -105 16 -135
2775 -135 -78 -57 43 -4 -201 161 34 -153 28 52 180 -61 -97 -75 19 233 -13 -48 -78 4 158 9 -181
2798 -181 101 62 -44 18 64 129 90 -239 46 54 402 -115 -236 -76 47 118 -147 68 -168 133 -134 169 59
2821 59 97 150 302 66 -313 137 165 244 30 -226 183 151 -343 191 -59 190 97 -174 -30 -84 74 -66 -273
2844 -273 -6 129 -48 237 -112 84 399 -133 -48 -267 -71 155 120 339 -65 28 -84 324 32 66 -96
2865 -96 -33 134 184 -156 -174 -185 98 17 -26 46 183 -87 -267 77 31 -90 -127 82 179 -194 165 -112 -53 -11
2889 -11 -148 147 -31 -106 -88 54 -246 -231 -170 157 70 -84 78 201 -193 53 45 44 -59 -300 -10 -107 -58 -8
2913 -8 35 251 24 -290 -67 -95 -141 -270 -283 0 67 -239 185 24 213 -407 85 21 -22 361 -14 182 -125
2936 -125 -9 -3 213 -243 -239 93 298 -171 65 185 -22 130 -303 55 -36 232 321 -129 -293 -46 116 241
2958 241 -106 15 81 152 -127 41 31 88 34 -215 -65 -222 128 342 -97 -53 -6 -165 224 280 -246 -33 -32
2981 -32 -12 239 124 147 -187 26 197 -341 195 212 315 79 -62 88 -386 -259 264 -138 -225 -1 -155 -43
3003 -43 -232 29 -9 -117 -276 -232 60 218 -2 -11 -83 104 46 -91 29 88 -170 142 -398 -168 20 -156 -229
3026 -229 -142 -410 -137 61 -62 27 -36 -16 97 -251 -155 135 -135 51 -176 106 54 37 171 109 140 -230 10
3049 10 -28 58 -127 36 34 74 -236 119 179 114 190 -67 67 -53 105 196 -197 -24 205 -323 165 -86 182
3072 182 -112 242 265 46 -38 15 134 -133 -121 145 -126 286 -229 -153 -69 -33 87 -107 -11 -55 -12 68 -234 -151
3096 -151 187 38 -225 -211 -130 255 108 -119 39 45 136 -178 119 67 -119 105 -112 141 -19 210 -65 -191
3118 -191 119 121 73 -72 175 -13 299 1 -44 -117 22 63 -36 -168 40 207 24 -28 -116 170 -90 169 -106
3141 -106 161 145 193 248 -286 163 3 40 -134 42 8 -5 -122 -42 -49 -201 -12 -105 -116 -286 -25 46 240 12
3165 12 47 -201 193 55 -47 -235 217 72 92 65 -416 -97 -135 -66 -72 -21 165 105 -104 106 -198 153 -314
3188 -314 -75 454 -301 178 310 -90 64 -60 111 74 62 -54 13 -39 75 157 151 119 -36 40 157 47 -32
3211 -32 -136 -82 75 201 -179 -213 -40 143 100 60 125 78 114 66 -218 -163 191 219 39 -113 -42 73 -137 186
3235 186 356 85 -88 6 91 -42 49 -66 2 142 -90 154 -59 -151 -34 23 178 -346 -127 -143 -43 -232
3257 -232 -258 60 169 -267 -185 -3 -68 -89 86 318 89 -137 189 445 -79 10 -7 0 -114 28 -307 -277 -72
3280 -72 -329 43 173 -334 -344 239 -3 238 -162 178 201 19 -11 -98 -165 -183 -48 -228 -104 46 -30 101 2
3303 2 -10 -65 -76 195 -29 -205 81 445 323 -63 -306 -20 29 -17 162 265 -112 -133 17 -123 123 -58 -11
3326 -11 61 60 -52 11 -69 -18 -20 98 85 45 33 185 201 -130 49 178 -276 330 38 161 -13 -148 -156 232 108
3351 108 351 -28 -145 85 -49 96 257 -59 -100 296 112 -270 -19 454 15 -73 -139 -11 102 -30 -145
3372 -145 -47 52 -306 81 75 3 -30 36 256 -269 -121 -133 215 -206 -85 -57 0 87 50 -175 195 110 98 -173 113
3397 113 -86 423 -73 -24 -201 -270 214 161 88 -52 30 250 -42 -56 279 6 59 -175 -210 -139 36 -502 -66
3420 -66 382 73 105 -300 -29 144 -46 -59 -196 -21 -451 316 243 187 -54 -98 14 269 -249 138 252 63
3442 63 205 -17 52 -206 -56 192 76 96 -45 -120 -86 -198 -32 222 174 -227 45 185 32 -123 -16 -22 99
3465 99 46 -3 -313 -197 104 -261 149 133 198 79 13 -12 98 -23 88 344 93 -60 55 -87 -38 -51 133
3488 133 -46 -34 220 -118 423 -16 81 -157 -70 176 -142 -97 203 12 20 -50 -181 -140 -10 174 -80 -200 75
3511 75 -272 -42 150 45 176 -31 -232 -191 -93 -174 -49 -175 164 181 -170 64 -49 -165 -84 -151 -121 36 214
3534 214 198 -126 -159 -27 -40 66 -115 -246 73 -59 -176 -135 99 -19 136 -318 342 119 143 -20 34 -83
3556 -83 222 -12 28 -286 79 44 198 -99 114 -84 -333 -152 83 247 -144 -11 22 -149 -38 69 -117
3577 -117 94 45 78 -136 167 -16 53 -143 56 163 -71 58 134 -149 -107 287 78 -19 -42 -201 60 34 22
3600 22 -135 0 47 10 162 336 -425 45 -21 20 186 157 -55 -206 80 435 104 -91 111 -243 212 -76
3622 -76 125 53 43 -36 -122 85 67 -124 -62 -155 -181 -51 104 116 35 205 -180 -252 183 115 116 210 -53 -92 -324 -93
3648 -93 -121 -180 -37 159 74 -93 -145 -574 75 -82 -86 119 143 147 -248 -161 -30 75 199 -474 -5 -173 69 70
3672 70 126 -129 -38 -189 -78 -116 -155 -58 -162 5 -199 172 26 -25 182 142 -211 -99 -20 80 98 170 -36 39
3696 39 120 92 -137 77 276 -99 82 -282 61 19 122 -193 200 -79 32 27 31 145 206 128 -68 255 9
3719 9 32 73 175 360 102 -59 217 8 144 33 -70 250 134 112 236 -92 280 55 -167 13 219 13
3741 13 136 4 61 -69 -86 193 -304 -244 -212 186 56 -281 -136 -123 210 -147 -55 257 -32 -233 114 -32
3763 -32 63 80 -439 -55 -50 229 98 165 16 -22 385 126 90 121 -117 168 285 22 79 -118 -198 -97 -84 -1
3787 -1 23 574 26 -59 1 -255 -182 49 -19 -118 -20 176 38 202 351 -57 116 -180 145 -254 -298 -351 -85 -11
3811 -11 203 104 -106 -329 10 302 -163 189 118 -120 88 58 -13 -171 -18 -119 22 -2 -168 -107 -339 -136
3833 -136 -205 41 112 124 -128 -239 -10 151 67 120 146 17 1 23 206 70 -187 21 -23 161 -233 104 167
3856 167 -175 139 40 153 -288 48 -96 -8 179 146 -274 -167 204 -101 -60 -82 243 29 -8 -99 -290 110
3878 110 -311 149 35 203 45 -181 -12 -152 -111 285 -154 92 -99 109 119 -433 -258 -81 102 168 145
3899 145 -12 -189 64 -318 -82 -187 135 156 129 -207 -60 121 -35 -223 -260 -32 158 -64 -131 115 4
3920 4 98 -36 78 -218 -23 358 59 103 -98 -6 117 7 -35 -448 237 -109 16 -181 54 207 -134 68
3942 68 -38 -163 -62 -194 -150 195 100 103 40 -25 26 40 59 -64 -90 -245 19 205 -191 -86 107 85 187 -170
3966 -170 285 -222 -80 72 62 -89 125 -6 123 58 91 51 41 124 -112 127 -33 -100 -134 -71 -10 172 77 99
3990 99 30 53 268 137 -139 239 129 -44 341 22 111 -277 36 -125 14 216 90 -68 71 -33 54 202
4012 202 12 -203 -93 164 -38 63 173 -95 217 203 329 -384 -115 55 55 -88 -168 -81 106 -269 98 -244
4034 -244 -291 289 3 -144 -13 113 19 232 -86 -70 -80 -158 -72 -111 -108 -19 -42 -106 -36 90 -90 -132 1 22 -215
4059 -215 -122 -161 188 5 -189 18 50 65 -45 61 -186 -166 -101 135 20 108 190 -167 46 64 -17 114 9
4082 9 198 -195 107 16 -62 147 22 -187 -221 78 -10 32 28 38 -213 -319 -1 297 -109 70 78 187 124 31 -144
4107 -144 -151 204 -155 -43 16 -116 -25 103 -132 12 -62 -184 -276 353 -140 -92 -57 54 -78 106 10 -23 0 -200
4131 -200 276 174 124 -79 114 93 -61 163 -235 1 127 162 190 233 -13 -27 -68 -17 63 -36 7 -123 -73 123
4155 123 158 -52 -44 345 -155 26 349 -27 365 -3 68 151 -120 -66 124 -30 -79 -115 200 25 135 -374 -24
4178 -24 -14 -191 11 -198 217 179 -19 -155 -77 -107 99 -174 230 15 221 31 306 86 -331 -130 67 -25
4200 -25 -137 130 281 10 -99 240 -239 -288 43 -250 130 105 -130 -55 -18 73 99 -232 -386 -62 -326 -21
4222 -21 -89 92 -118 -149 99 -204 -81 -40 222 157 -300 -156 134 51 0 11 237 -24 68 -104 79 -114 131
4245 131 -61 89 118 -70 242 32 25 -30 -226 -4 -203 -156 209 -20 -203 -91 17 50 151 -192 138 -62
4267 -62 -32 37 110 119 -71 -39 -39 137 -258 74 -228 -75 87 -97 -186 -176 155 -65 -204 205 238 -131 127 278
4291 278 5 271 -184 151 -24 -17 -131 21 2 184 -179 331 120 15 140 73 128 96 406 -105 314 -147
4313 -147 -84 -50 -18 -98 64 115 -114 -310 56 -14 88 144 3 84 -96 58 31 54 -31 85 -198 225 278 18
4337 18 44 143 120 -66 -206 195 52 15 37 123 -69 -29 -93 -116 -230 195 2 62 -115 2 86 18 -91 -87 159
4362 159 -11 24 62 22 11 -128 -119 -18 251 152 83 36 -183 -12 314 -105 -2 96 -88 -181 -24 -85 -221 233
4386 233 -316 -68 -68 -172 170 -129 85 -6 40 0 30 -64 -58 450 12 97 25 -89 -194 195 128 -34 -231 172
4410 172 -31 144 -63 148 87 -122 47 -92 -118 69 -38 -55 77 140 97 -41 158 -73 32 -220 77 -63
4432 -63 14 172 -80 -201 -213 -129 12 138 64 -79 10 -217 -114 86 -106 54 83 -43 -85 268 23 365 -17
4455 -17 28 -10 -241 -80 -13 -197 -264 -3 13 117 10 -59 -10 -138 -183 26 -193 45 160 56 15 28 89 -151
4479 -151 -142 196 76 207 281 43 48 -40 -63 37 -183 -154 -74 44 81 -304 8 -109 -367 -72 -208 102 150 104
4503 104 -15 70 53 30 -36 -49 85 -145 29 120 124 -34 134 -80 57 274 27 325 16 -318 175 -22 -87
4526 -87 17 233 -138 -98 -410 -9 -186 -298 -374 -163 -108 -149 -138 -33 19 -2 3 110 -68 62 -211 -54 -157
4549 -157 -235 -20 16 -5 -22 237 54 -373 48 98 54 160 -76 243 236 66 -191 21 273 14 35 -86 -367
4572 -367 -58 -210 -63 -66 44 58 -294 -13 179 56 19 279 192 178 87 200 -129 -37 90 67 -25 13 136 -161
4596 -161 -188 60 -20 119 -195 -210 87 208 106 178 -21 -146 102 55 385 -157 -117 101 -39 56 -395 79
4618 79 -17 -275 135 142 -2 -213 -99 1 92 41 -320 -111 189 -106 -77 -52 -110 -83 -146 70 -141 19 82 14
4642 14 -54 -118 234 -97 286 89 245 22 123 -65 -62 26 -212 108 -207 172 -129 134 -97 -146 -17 38 331
4665 331 242 -21 -54 -50 7 -245 -35 261 -107 34 298 13 -341 139 -139 -306 44 60 -47 -91 -236 12
4687 12 0 51 62 -118 130 3 -36 131 -3 -25 243 -99 -86 3 130 48 90 123 50 -34 -159 -57 -105 105 6
4712 6 -149 73 -108 -157 32 321 44 -247 269 139 -110 18 3 -52 -3 163 -55 -175 -142 56 382 167
4734 167 -116 -16 9 194 -182 8 1 -178 229 -229 -234 -280 -29 54 -7 -219 -135 -27 -204 -77 -21 -178 43
4757 43 -226 -151 47 -252 225 3 -25 -163 -184 93 24 110 -79 -40 -92 24 293 214 -20 -34 -193 -221 164 91
4781 91 -255 -100 90 -72 156 -111 -16 -63 34 19 -21 204 13 351 71 -167 -65 70 10 -103 203 -157
4803 -157 -129 -187 258 -11 -7 164 4 157 36 -47 41 -72 -56 184 173 110 183 -2 25 -42 -235 1 -216 -58
4827 -58 -65 30 -179 -74 77 -316 -175 -181 -37 -63 267 -117 -81 94 -147 13 84 -263 13 -6 1 -34 -43 -47 -128 211
4853 211 -308 227 -66 275 88 181 -84 -150 -144 -43 -15 -168 -4 101 144 -159 -12 182 -8 197 114 -49
4875 -49 227 75 -3 33 200 43 -122 5 21 -263 -301 -129 -43 -20 107 215 -123 44 -178 -115 -55 274 -66
4898 -66 -159 176 171 19 -268 213 279 12 156 79 21 -169 -20 79 76 -5 111 173 -23 -133 92 -24 -19 201 -343
4923 -343 -69 -77 -47 133 159 -60 -95 -155 16 -88 -51 413 -12 -235 269 -211 -15 -160 17 94 65 -30 -48 86
4947 86 -189 -251 342 -156 38 117 -116 343 57 -83 -25 -129 44 -120 -198 -77 -6 -206 184 -4 -261 -118
4969 -118 -279 143 -197 121 -6 -194 6 90 111 15 174 98 -260 -134 -187 -151 -214 -101 -159 62 -239 245 -49
4992 -49 -105 184 -389 -20 -11 -112 -294 -206 -135 133 -22 -173 -6 -78 -241 47 -241 64 103 98 -73 120 156 -198
5016 -198 25 -152 291 13 -28 93 -5 -264 40 69 72 -29 53 -111 181 55 -236 102 121 -111 46 49 -20
5039 -20 -255 24 -59 -180 52 15 96 56 -36 16 203 -110 -23 -27 -156 58 -130 71 8 -67 30 -31 69 -182 -96
5064 -96 29 -338 55 139 -123 -1 153 -111 -419 216 107 -49 52 139 35 98 -89 -38 229 219 -207 93
5086 93 -45 -81 -20 185 83 -227 28 270 -46 117 -9 -198 122 169 -165 -46 -208 -26 -323 92 -157
5107 -157 -78 -93 -140 83 -84 279 -302 167 232 -66 82 151 -137 362 -143 64 203 133 -46 -322 -21 184
5129 184 86 -214 -62 146 -9 50 181 -64 87 -53 169 48 -70 177 -225 195 -85 -36 -167 110 -1
5150 -1 65 40 -109 250 163 -382 185 -59 -3 -6 345 -118 -136 146 -77 -8 -43 16 20 -45 12 136 9 -9 261 51
5176 51 63 138 1 -157 36 -71 105 63 108 96 78 -47 42 267 205 80 106 122 225 133 56 31 -239 -168 -142
5201 -142 -71 36 41 -102 43 -205 -206 -85 275 -296 43 -74 73 5 -212 146 130 -103 99 55 -186 11 20
5224 20 -70 -24 321 -9 -4 -70 -264 192 147 89 -121 -4 -168 223 -35 83 -6 102 72 -210 159 63 201 -46
5248 -46 59 -289 -6 -25 -70 -296 230 172 -14 -7 -168 55 15 -1 -29 287 199 84 -101 187 30 -135 -51 111
5272 111 48 -74 118 117 -32 -122 -213 92 -207 -74 -149 264 284 145 157 0 127 111 54 80 27 106 -56 19 -71
5297 -71 -24 -116 -23 -135 -291 31 23 -251 120 168 0 168 -32 153 -78 25 -106 38 -58 -76 -121 174 0
5320 0 -55 -63 98 -198 76 -69 -228 -190 136 -167 165 -152 -22 168 114 -36 -14 -100 32 298 60 -86 -196
5343 -196 310 -305 -96 -78 84 244 145 -172 -43 181 -76 113 -309 -49 -128 -234 -22 -69 -195 -116 -37 -228
5365 -228 -149 292 -302 -65 -35 -387 -205 -268 -271 132 -15 -82 -24 17 -196 -44 -35 249 78 -290 177 213 -479 -243
5389 -243 250 162 52 -365 30 -154 -64 -100 64 16 -25 250 107 25 55 187 -200 65 -95 -14 -21 251 148
5412 148 225 -26 10 -105 -171 -19 214 263 86 -122 -205 118 -109 203 -229 221 28 -42 -97 56 184 -118
5434 -118 84 272 216 203 139 -62 -64 -101 27 -112 428 -58 8 -30 -105 -57 68 -118 -73 -178 -302 201 103 113
5458 113 65 12 19 104 -271 -75 -149 52 -252 65 -14 145 163 244 -365 97 71 82 -134 8 -118 -89 80 -585
5482 -585 153 -99 102 172 -151 181 -230 -99 23 -59 -193 -169 -218 -165 257 -51 -136 -37 288 130 -191 -63
5504 -63 -69 -120 -129 46 26 -184 -162 54 -23 -117 135 -38 -116 90 -30 -177 -65 -239 66 -89 -24 252 211 306 90
5529 90 152 104 327 42 155 -52 14 -236 122 -58 156 38 76 31 140 138 55 88 39 7 -276 19 7 -59 137
5554 137 -7 -44 -43 -163 175 97 55 38 -162 -168 -67 220 90 -281 -119 -14 -128 -44 -44 486 -21 -167 -26 -153
5578 -153 127 383 446 -18 -222 58 349 -228 71 281 -56 36 23 117 -3 -125 -74 -92 0 -4 54 124 159 -87
5602 -87 206 -15 4 -77 61 -167 82 -205 -10 -200 4 147 7 160 -84 12 -132 -15 119 -15 -71 -20
5624 -20 -171 161 -159 -118 -71 131 46 -130 -38 -224 261 126 -133 -154 -25 118 121 109 91 61 -349 56 42 63
5648 63 29 -261 151 184 -189 -17 118 -332 -90 96 -60 -179 22 -82 -30 -57 -202 -80 219 153 -67 145
5670 145 -179 -297 -104 -144 -220 298 75 139 -29 19 38 -61 -61 -89 382 -1 -82 130 40 2 60 -112 230 -30
5694 -30 52 129 187 -104 -102 -34 -30 176 -369 156 190 -36 327 -188 -30 -98 64 29 143 266 21 106 -89 -205
5718 -205 -186 264 155 -340 -12 -100 -84 105 134 240 -43 161 -23 -306 -35 -152 43 106 186 219 -73 -155 108
5741 108 102 -15 -58 -94 -43 126 -29 103 219 -57 -155 -176 -27 -214 -191 -41 -10 -65 41 -65 15 -34 -189 22
5765 22 21 -10 38 132 -217 -71 -17 348 253 -235 74 174 -8 216 168 441 133 -196 -159 -14 -101 3 179 37
5789 37 61 -287 67 97 -184 -126 194 97 -20 -136 193 -285 118 -145 -55 9 -58 -32 48 -188 11 -48 -172 69
5813 69 157 -108 92 -39 -236 295 171 -64 141 -27 65 -194 17 -60 167 56 53 -111 66 30 -129 172
5835 172 -238 42 -431 -102 -106 -53 -79 34 249 149 126 11 -110 50 -367 -281 -135 96 37 46 23 100 47 -161
5859 -161 215 -42 102 -157 -138 -105 -95 309 57 195 208 -50 12 13 -99 113 204 55 -251 46 54 -174 156
5882 156 99 135 94 111 1 153 -237 74 278 -31 -186 -4 175 -59 -121 -325 -76 203 -35 -113 26 77
5904 77 153 -39 161 -36 72 -184 107 189 -77 -228 -2 215 13 77 21 139 -233 34 176 -113 -23 -73
5926 -73 -45 206 -41 -205 -60 379 -219 200 134 -70 59 87 11 -40 -45 137 -81 21 47 57 -78 -1 -15 -55
5950 -55 214 180 24 -121 20 69 -128 204 177 -69 47 84 82 -77 126 1 -54 -38 84 293 38 -10 57 -21
5974 -21 25 -20 -283 -23 111 157 -123 145 -214 -25 267 64 -131 -121 -89 43 -52 109 126 -88 190 -173 132
5997 132 110 166 159 143 21 -11 307 -97 -39 -5 -184 -118 -303 75 -244 -147 -63 -15 -218 -84 -71 256 -39 221
6021 221 51 34 33 -17 252 72 91 249 -292 -77 104 226 51 -44 34 163 172 120 -290 252 188 -98 21 -37
6045 -37 241 32 -307 5 23 -186 60 -203 -190 -185 -218 310 -61 15 43 72 44 12 83 3 -118 7 -174 214
6069 214 1 32 198 -27 -279 -7 174 150 161 182 47 125 -88 38 393 -73 32 6 92 180 265 -49 29
6092 29 5 -107 -3 -119 -290 -39 74 264 -32 -142 -17 261 328 6 -292 -7 390 250 -136 -187 133
6113 133 117 -229 -6 -79 -2 36 -14 57 -347 -170 43 -65 -172 -213 -225 3 102 -126 81 -188 216 -183 385
6136 385 -223 -179 -253 249 163 1 39 -148 -73 -310 114 289 155 94 -78 44 -185 -109 176 132 240 -23 -107
6159 -107 -181 -38 -82 -82 -64 -167 177 -154 -294 -50 -111 19 -5 -204 -260 96 34 23 -114 -4 73 -58 159 117
6183 117 15 -250 40 -390 244 -355 288 -121 88 235 91 3 -3 150 -104 141 214 -132 -110 132 150 -25
6205 -25 249 170 -187 -118 -4 -31 52 52 72 -148 -61 53 77 66 -68 -449 -164 1 -123 -93 -74 81 72 -239 -57
6230 -57 312 -604 497 60 101 -2 -35 3 -16 85 -114 -58 -264 225 -286 167 -203 39 -105 -102 206 -110
6252 -110 137 -47 -362 31 25 230 192 413 15 13 -455 -5 -44 -81 157 3 -205 -184 -157 314 350 -102 250
6275 250 -216 -1 58 4 97 -134 -139 -132 198 -286 76 143 46 -23 -155 -32 -15 170 -124 188 181 203 -151 83 -180
6300 -180 361 254 -287 63 -202 -70 186 45 -53 47 218 -47 103 94 -173 -115 -63 198 179 37 -246 283
6322 283 -86 -129 35 -9 205 83 -39 -96 45 -292 111 -114 29 -188 192 129 47 -235 248 -364 240 76
6344 76 -225 -119 186 157 84 -90 370 27 -204 117 -33 32 -176 -154 -115 -258 -194 -134 36 -264 -86 -93 -15 -9
6368 -9 208 19 -37 -115 413 -22 -42 67 -85 66 2 33 -118 298 23 -43 -52 205 227 -67 -104 16 45 149
6392 149 93 -84 -116 -77 21 89 121 -32 -31 -21 -260 141 76 -205 -40 -165 157 191 9 148 -160 19 250 -27
6416 -27 44 -30 1 88 -287 246 -60 -138 -27 19 -78 -132 189 -71 87 12 352 19 -113 160 177 -280 -10 207
6440 207 -277 210 -224 21 80 92 37 -16 237 185 -102 -6 -7 7 -159 -190 218 -203 57 143 -114 -190 302 16
6464 16 -238 180 -147 -37 -82 50 3 23 -44 -334 45 -96 -9 111 272 -133 63 56 -78 19 106 66 99 123
6488 123 69 -122 -31 266 9 21 -73 269 188 32 -39 -111 -74 146 186 -8 136 115 16 -1 69 182 -112 278
6512 278 162 122 134 -154 -191 -243 73 -63 -23 -244 -124 210 120 100 -365 184 -47 232 -8 -212 212 -86
6534 -86 273 -17 -101 253 152 -108 -72 7 -85 74 -193 18 99 -278 -129 -22 -272 -75 116 -70 58 294
6556 294 -152 -239 50 12 -68 -86 -151 -111 -37 139 142 119 -173 229 -44 139 9 336 185 -130 -1 141 -4
6579 -4 -122 101 113 -128 16 -120 41 431 58 209 -165 -193 241 37 50 107 43 186 -2 353 134 -164
6601 -164 -263 -23 107 107 28 -213 -39 57 25 344 175 -55 -149 267 -4 193 192 -226 155 39 -286 173 -78
6624 -78 -229 -195 255 -80 -14 217 -315 -59 54 -154 -92 -158 -172 -183 5 138 -218 -83 -111 -299 56 -99 249
6647 249 192 -130 115 109 -202 125 -64 411 -22 193 -149 -136 -57 -23 116 -66 -102 -34 160 -66 116 -76 -64
6670 -64 34 51 64 -240 -13 -14 -232 56 67 -73 118 -94 156 -59 -86 169 35 131 -10 23 245 -97 -161 -84
6694 -84 -127 125 -24 15 312 -102 30 1 -21 -79 -131 -97 -21 220 -77 67 -27 -17 127 -179 128 -61 169 -67
6718 -67 217 -30 -182 12 -113 -73 93 -83 278 231 -139 196 179 18 198 1 275 218 -135 9 -83 9
6740 9 -118 -57 212 40 -196 -143 154 -83 126 -168 -82 57 -53 -152 93 -20 -40 2 -147 141 -71 -37 -282
6763 -282 -252 -70 -65 87 119 134 49 103 150 71 48 111 -18 -8 -9 -131 -46 -11 -124 195 -235 131 -83 -39 77 -51
6789 -51 22 -68 171 52 -41 -174 14 304 -8 -80 -65 18 -88 21 -304 -172 160 63 43 90 46 397 96 -116
6813 -116 -168 58 204 27 -109 -66 -19 57 -150 -151 -146 8 7 -97 -41 -63 -131 117 298 -118 -175 -100 281 37 -138
6838 -138 249 298 -196 24 -9 189 93 -29 -396 238 332 68 -273 -123 93 -96 -54 -29 -89 126 159 201 12
6861 12 -147 87 -8 -158 51 -158 228 -54 -84 -13 45 -48 154 229 -116 254 -101 -104 -103 409 415 -150 71 -206
6885 -206 204 -90 -13 148 -205 15 -82 50 102 61 114 -35 -191 28 -84 -39 139 353 -163 268 -205 53
6907 53 -92 49 -46 -328 -83 -59 -52 -147 -66 -332 -20 -67 -139 59 108 93 -4 -70 271 328 213 -90 -73 -56 59
6932 59 -72 -244 87 -134 -79 -253 146 125 321 -81 -60 93 212 85 -124 -178 -80 181 248 -38 -168 160
6954 160 264 115 -61 231 62 -1 -13 -81 -128 102 90 -221 -81 168 60 -253 -31 -28 -99 -66 202 162 349
6977 349 187 -55 -187 284 -8 -73 90 111 -17 62 -263 -74 -58 51 -61 375 -68 -55 -176 -83 -39 -65 -194
7000 -194 -185 -38 -116 366 -90 19 172 -37 -18 -82 125 -156 -280 127 224 -170 -68 -27 -37 415 -189 216 3
7023 3 19 23 111 11 -249 -14 -85 -71 -264 -87 -17 -63 -102 14 97 -115 -44 118 -261 -37 335 -92 -127 -85 -309
7048 -309 60 184 -170 97 194 -14 -277 65 150 393 -65 -558 171 93 -4 217 56 385 0 202 218 128
7070 128 -10 -123 16 -69 156 -255 133 -2 87 145 -92 263 63 153 40 175 -67 -172 58 -109 133
7091 133 71 -100 15 -90 -37 37 -247 -20 -396 -115 -135 115 72 86 -97 96 -209 7 -147 70 76 10 -125
7114 -125 -100 -4 20 145 63 186 -187 150 -40 -157 -164 75 -146 10 166 43 55 96 -16 -82 -112 21 327
7137 327 -165 92 78 -135 144 -149 -116 -8 92 -283 146 -199 158 140 -119 93 63 -3 275 -60 25 -367
7159 -367 -30 53 -202 27 51 159 -107 -167 172 79 -264 195 -78 184 -157 43 -74 -40 328 251 -63 -29
7181 -29 -56 349 -39 -160 -236 -218 -166 -101 -156 -9 125 226 -58 35 203 -85 -146 -103 107 -45 109 131 206 89
7205 89 124 41 137 142 254 -325 195 -19 -107 -128 -328 1 76 -26 50 10 -81 151 12 -81 217 57 24 -35 -127
7230 -127 -195 202 -211 -286 172 -70 118 41 -104 -51 109 -94 -198 84 174 166 -11 -35 386 99 24 -138 268
7253 268 203 183 53 -302 -66 141 -198 -103 -3 223 222 -264 -251 -45 99 -8 82 63 127 -56 212 -25 -429
7276 -429 -219 -130 -180 126 -94 -234 -28 58 -97 117 32 -166 65 3 -303 -31 265 -187 -33 54 -101 86
7298 86 213 189 278 -239 -168 41 -69 161 -60 140 -169 133 47 -89 95 -205 150 -52 111 201 -217 -8
7320 -8 165 113 146 137 396 -236 75 206 -194 -276 66 186 72 -2 129 111 249 236 210 -162 197 -102 71 121
7344 121 -233 -113 0 -10 214 -206 17 59 -57 -302 -171 155 -10 -55 106 105 -68 122 -31 182 207 67
7366 67 -188 75 331 341 45 95 -93 199 -172 110 200 -35 -31 297 -68 247 148 -90 54 -117 278 224 296
7389 296 -125 73 -62 -269 106 -71 -244 221 28 102 190 -38 -77 51 14 283 82 71 -64 -197 -72 18
7411 18 -8 11 -228 -117 246 186 145 241 101 179 -30 143 239 128 -45 40 -168 5 -224 29 114 273 97
7434 97 -45 -91 219 16 139 193 -2 -103 88 121 -148 176 283 39 81 67 8 8 105 -45 -247 -62 325
7457 325 -4 -37 156 90 125 -164 -78 295 86 -22 319 332 -193 304 -59 209 -98 100 183 -77 240 -55
7479 -55 181 336 335 19 -242 -140 327 59 73 -33 23 232 -199 2 23 51 -124 -215 17 -9 -126 -34 29 -21
7503 -21 7 -16 383 121 -20 174 -3 72 114 -35 53 -63 -317 -72 45 -18 -200 100 310 -42 128 -352
7525 -352 -46 -129 291 162 -147 297 -262 -50 -288 93 18 -126 -70 -439 -85 141 44 -181 -96 -175 146 436
7547 436 -152 -371 -43 69 147 -70 -90 -71 -108 156 -120 25 8 147 9 106 174 -247 244 -417 -69 285
7569 285 -146 95 -166 47 293 -94 -103 -102 65 -211 -163 -121 37 -101 -97 -16 -90 161 -101 22 -26 -122 163 -87
7593 -87 -221 -368 -14 -326 288 -30 67 -233 -233 -17 103 3 -154 96 72 182 -73 10 161 82 -82 -18 -140
7616 -140 187 -146 -36 90 65 -124 -285 -27 -70 -266 -190 -24 -90 -66 -155 -4 -1 -142 -178 125 -2 43 -90
7639 -90 -74 -244 413 -264 -44 -74 84 51 57 38 105 -29 -140 -4 67 39 290 -191 -45 353 -98 -134 283 33
7663 33 -50 -15 186 134 -74 52 128 70 -31 230 -74 13 -13 310 145 90 84 -43 -30 -69 -26 -130 1 36 110
7688 110 -221 172 47 -309 -4 -138 -255 -149 283 -86 -15 309 52 268 -203 34 85 44 98 78 -104 -107
7710 -107 21 -35 -187 -46 -237 14 -8 -52 -184 216 251 273 106 -108 -45 301 222 -199 -78 28 36 -182 303
7733 303 220 10 -178 -256 -168 -119 26 102 256 80 101 26 131 -48 48 -49 -166 45 68 122 120 5 -31 -275 -155
7758 -155 -29 185 25 -28 0 36 -221 -190 139 -20 165 107 19 87 239 -94 44 -257 122 168 -256 4 237
7781 237 130 121 -237 64 -281 -100 -138 63 249 -68 -43 112 26 -35 -34 193 257 -162 55 199 -19 -60 -31 -88
7805 -88 -393 -38 191 15 180 84 249 -68 -22 92 87 192 -203 -142 -306 107 130 -113 162 33 136 -21
7827 -21 93 -179 -314 -8 -230 -42 75 198 -24 92 184 -18 26 -29 55 214 185 -192 -323 77 -79 -230
7849 -230 -103 -380 44 39 33 219 206 92 2 92 -23 122 25 -88 -227 230 -320 -138 11 65 238 280 2
7872 2 154 117 104 -170 -245 239 52 -142 -159 70 85 -235 47 -123 -215 73 115 -294 -159 -78 -143 110 -139 -165
7896 -165 220 -191 -12 365 -66 -204 70 248 -102 -40 -13 -385 18 38 12 -46 -10 -23 -241 -65 -26 -49 138
7919 138 -107 13 -190 -45 26 -100 236 -166 -49 -136 -54 9 180 216 187 25 92 21 -23 -14 297 58 -211 -236
7943 -236 152 154 46 76 316 120 -33 -89 23 -157 33 52 -3 136 15 78 -12 -158 6 206 -252 -47 123
7966 123 -32 307 -166 127 -43 38 145 -126 251 -89 -192 -20 229 -4 238 131 -146 -71 52 33 -160
7987 -160 -105 23 7 -122 155 -122 93 39 -85 -50 -38 210 201 49 -130 146 51 10 -52 0 -163 -133 29 -93
8011 -93 -80 -231 45 -34 154 18 95 -176 -84 21 124 291 -261 15 101 161 -255 -145 123 -43 161 -188
8033 -188 19 -47 -10 -205 192 294 42 -198 -125 -225 59 2 81 210 126 -124 -251 -202 92 -218 36 -80
8055 -80 -113 -98 -11 375 -113 53 31 202 -66 128 -206 -112 -266 212 -100 -14 -28 -391 122 -105 -263 62 146
8078 146 88 88 56 315 -12 123 -150 131 -197 -257 57 16 -10 -201 86 -118 -66 -181 -271 -213 294 160 -178
8101 -178 254 -324 -12 154 82 -123 104 35 -214 -249 259 -68 -45 228 -84 72 107 6 66 -204 168 127
8123 127 -259 260 -305 -162 -77 206 24 -231 93 -112 -200 20 -186 119 208 36 -140 65 44 -81 46
8144 46 -106 23 100 -204 33 70 130 113 1 -89 -138 188 -173 -121 87 -200 -229 -189 -183 129 -37 33 -21 -119 -215
8169 -215 393 -247 -103 221 -80 117 -181 14 172 -43 -8 244 102 220 226 69 -150 113 -16 181 22
8190 22 93
8191I3
$$ Imaginary data points
##PAGE= N=2
##DATA TABLE= (X++(I..I)), XYDATA
0 0 0 0 0 0 0 0 0 -5 8 -8 8 -8 15 -16 16 -24 24 -32 39 -42 50 -58 68 -80 90 -104 119 -135 153 -172 193
31 193 -217 244 -273 304 -341 377 -421 465 -516 572 -632 701 -774 859 -953 1060 -1180 1319
49 1319 -1482 1674 -1906 2190 -2552 3026 -3681 4648 -6218 9209 -16956 78563 149903 -45436
63 -45436 -75942 40864 97863 -8574 -56179 9699 52574 -2042 -13212 41969 50176 -17354
75 -17354 -28587 30505 50400 3639 -3718 37488 40695 -2378 1111 42128 35288 -19021 -25776
88 -25776 19879 35904 164 -24365 -12913 3045 9842 14753 4637 -16291 -8466 23780 19695
101 19695 -23226 -28800 18653 35771 -4934 -20535 21787 38141 -10023 -40111 -3416 24660
113 24660 -3929 -21179 13066 32082 -1253 -19721 11110 22309 -18288 -35266 6948 31767
125 31767 -643 -19518 12922 26491 -13575 -33218 9047 34908 -6247 -39823 -2472 43365
137 43365 23606 -23088 -24064 7417 17801 3461 -6235 -10480 -16846 -12366 3500 4033 -16512 -25671
151 -25671 -7791 8842 529 -16233 -19440 -12149 -6312 -2837 804 1970 2680 1188 -3644 -8513
165 -8513 -6312 -2728 -11717 -25049 -16571 9883 17698 -8807 -31839 -19106 7281 6526 -16848 -24901
179 -24901 -4259 18612 17552 82 -8616 -446 8424 4977 -4244 -5184 2050 5161 601 -4029
193 -4029 -3746 -1338 351 -199 -4548 -8339 -2704 7635 4198 -11255 -10828 10748 21249 2124 -14534
208 -14534 222 16761 1259 -22286 -12964 12031 9715 -11563 -10475 9609 9683 -10163 -17886
221 -17886 -8778 -3714 -5216 577 4923 -4164 -9677 3677 11661 -8002 -26806 -11687 12696 6552
235 6552 -13492 -8869 9574 6800 -9714 -9906 2120 555 -8585 -5743 2759 495 -3683 264
249 264 108 -9418 -7480 7882 7449 -15080 -20778 3492 16382 -3673 -18959 -1214 16957 6594
263 6594 -9888 -4516 2573 -5189 -8540 3536 6569 -7157 -6948 10958 9671 -15908 -21793 3388
277 3388 12142 -12388 -21904 6688 24182 768 -19841 -3196 15436 1559 -15130 -4917 10432
290 10432 4492 -4429 2547 6417 -4449 -8258 4032 5765 -9974 -11908 8240 14292 -5678 -14585
304 -14585 6146 20074 3421 -12930 -2436 13463 8201 -4576 -4467 3445 6247 7249 7210 -97
318 -97 -5375 2078 10470 721 -12247 -2168 16737 12420 -5745 -4000 13988 13009 -7050 -11322
332 -11322 5440 12798 1554 -3601 5300 8530 2031 1298 3707 -1723 -8037 2217 14385 4759
346 4759 -11597 -2569 18825 13199 -12149 -13362 10506 16328 -5590 -15667 2545 15421 2262
359 2262 -10786 -1977 8786 3146 -6328 -3383 1655 -1224 -2487 2946 3945 -2822 -2530 6214 5745
374 5745 -6822 -11587 451 8020 -2468 -11199 -1238 10128 4677 -8433 -8651 -45 2325 -3266
388 -3266 -6037 -2985 1781 4116 2425 -2986 -6161 -2234 3396 -385 -8818 -6769 4551 6778 -3356
403 -3356 -8027 254 5872 -1207 -7668 -3034 2225 -256 -3709 48 2302 -1001 -1361 2696 1888 -5567
419 -5567 -5455 3627 4957 -5372 -7241 5602 11422 -181 -8739 473 9781 2162 -7833 -3479 6374
434 6374 5196 -785 637 3618 542 -1508 2615 2677 -4638 -4383 6328 9984 -630 -5836 5177
449 5177 11591 1549 -7320 143 9535 4528 -3847 176 7456 5302 -156 585 2336 -384 -673
464 -673 3479 1885 -4303 -1780 8628 8107 -3779 -6016 6353 10727 -1581 -8844 1171 10498
478 10498 3436 -4577 -754 5843 3079 -1689 -1447 -208 -2454 -809 4003 1536 -4767 -2070 6931
493 6931 5920 -5348 -7634 3296 7775 -1769 -7785 721 7843 2786 -4649 -2436 3225 1900 -3462
508 -3462 -4005 -1774 -53 1123 629 -2916 -4500 96 4394 -930 -8723 -6552 3271 5035 -3705 -7700
524 -7700 -946 5154 1205 -5042 -5432 -1315 63 -1524 -3066 -2604 -1223 -9 -485 -3183 -4597 -2913
540 -2913 -421 -2507 -6306 -4528 1729 2591 -3582 -6654 -1320 5065 1613 -6010 -6277 1802 5080 32
556 32 -4268 -1741 2530 2147 -1269 -2416 -2368 -1305 -120 679 -843 -2456 146 4294 1560 -4459 -2768
573 -2768 4415 4346 -3353 -4400 3883 7880 1256 -4550 466 5145 1114 -3431 -1706 833 -232 -212
589 -212 1816 -199 -3820 -1001 4228 797 -6804 -4139 5378 5148 -4945 -6262 3833 7448 -1652
604 -1652 -6219 -9 4281 -769 -3781 -386 1006 -2114 -1239 3018 213 -5603 -2168 4703 921
619 921 -7756 -3800 6973 4403 -6252 -5027 6355 7017 -4279 -6772 1949 5432 -829 -2716 1875
634 1875 996 -2222 487 4311 -1709 -7559 -1386 7320 792 -8638 -2881 7767 3582 -7598 -4650
649 -4650 6115 3739 -6417 -5488 4551 3915 -4177 -3640 2423 1008 -3739 -628 2538 -3234 -7504
664 -7504 419 6889 -1986 -10500 -1990 8517 2146 -8969 -4818 5487 3077 -5129 -2389 4779
678 4779 2687 -2660 242 4387 131 -3042 1920 5254 -836 -3929 3402 7155 -971 -5586 2473
693 2473 8691 1040 -6155 670 8275 3916 -2551 862 5550 3186 95 3211 3899 -385 -61 6200
709 6200 5677 -2133 -2907 5634 7864 -1111 -4910 3014 6644 -5 -3880 1471 5305 1490 -1563 1719
725 1719 3457 66 -1058 2365 2503 -1436 -437 4169 2669 -2545 -1700 4703 3874 -2939 -4598 2423
741 2423 5323 -441 -3550 -179 3643 2104 -632 -419 87 654 1777 2392 -244 -1542 1032 3694
757 3694 1708 -2602 -1001 3301 2322 -1770 -2092 1521 2787 -677 -2277 -140 1884 612 -1580 -2103
773 -2103 -1238 1378 1422 -1107 -3119 -1109 2287 1561 -2110 -3437 -696 1432 269 -2518 -2964 -687
789 -687 690 -177 -2797 -3810 -1078 930 -874 -3513 -2212 543 732 -2477 -2807 -46 1160 -541
805 -541 -2248 -1155 472 539 -266 -949 -1422 -677 1428 1203 -2302 -2990 1177 3584 -117 -4023 -1031
822 -1031 3860 2274 -2394 -1635 2185 1782 -50 -334 847 427 -49 1884 2212 -1004 -1525 2467 3314
839 3314 -981 -2853 1563 4100 -711 -3563 760 4293 517 -3787 -525 3172 1139 -1888 -645
854 -645 1286 -460 -234 2048 879 -2995 -2232 3071 3347 -3092 -4679 2041 4406 -1484 -4682 262
870 262 3545 -279 -3181 270 2391 -670 -2489 583 1300 -1316 -1427 1777 944 -2626 -1490 3089
886 3089 1987 -3973 -3498 3226 3843 -3086 -4847 940 3852 -1112 -3853 -597 1431 -927 -1729 111
902 111 -108 -2476 -803 2068 -114 -4158 -2106 3097 1259 -4424 -3701 2225 2210 -3319 -3723 1048 1698
919 1698 -2214 -3186 -179 632 -1974 -1621 451 -167 -2092 -904 1245 -742 -3316 -293 3134 1
935 1 -4124 -2175 3285 2587 -3376 -3510 1286 2365 -767 -2030 -161 440 -220 491 1611 -468 -1977
952 -1977 504 2421 258 -2174 -323 2712 943 -2328 -315 3075 1579 -2310 -1468 2490 2641 -602
968 -602 -1677 745 2076 1153 570 334 -341 -8 1850 1992 -613 -1772 677 3651 1582 -2358 -1248
985 -1248 2414 2599 -1205 -1602 1230 2251 620 -1026 159 1304 620 79 124 -146 96 746 745 -112
1003 -112 -812 328 1841 296 -1785 -536 1831 1285 -1827 -2410 901 2497 -124 -2125 -899 1202
1019 1202 1106 -663 -1360 -736 266 699 696 -568 -1870 -140 1230 277 -1883 -2252 688 781 -1312 -1740
1037 -1740 292 1066 -1315 -2011 -232 885 -532 -2089 -678 626 55 -622 -267 -669 -1509 -202 1056
1054 1056 -211 -2754 -1726 1910 1856 -1446 -2991 120 1985 -200 -2140 -952 909 -348 -470 458
1070 458 567 -315 -352 942 633 -997 -897 867 743 -1258 -333 1803 1191 -1164 -1690 1174 2042 -423
1088 -423 -1847 237 1883 1153 -247 -143 446 324 662 1036 -144 -1173 525 2354 1311 -1145 -729
1105 -729 1790 1668 -563 -1404 687 2005 195 -478 143 1133 723 23 461 323 277 556 762 113 -271
1124 -271 853 1805 434 -1323 -366 1838 1274 -1337 -1902 704 2125 329 -1722 -544 1342 1073
1140 1073 -836 -1085 -820 398 1076 322 -556 -486 361 498 9 -1194 -855 437 573 -387 -1267 37
1158 37 793 -179 -1353 -791 885 605 -1082 -1910 -165 1006 139 -1322 -1459 57 575 220 -942 -1685
1176 -1685 -542 517 795 -673 -1539 -367 1608 192 -1633 -1300 540 999 -806 -1059 500 819
1192 819 -126 -726 402 516 -144 -94 345 -240 -329 620 1536 249 -1338 -104 1775 821 -1756 -959 1841
1211 1841 2010 -719 -1221 1273 1537 -206 -384 506 538 -184 161 1446 652 -461 653 1958 457
1228 457 -1599 -178 2440 1092 -1324 -784 2028 1989 -642 -1002 1300 1334 -541 -275 792 793 -195 628
1246 628 1452 -33 -1256 737 1908 -101 -1721 376 2305 506 -1923 -389 2434 904 -1384
1261 -1384 -526 1462 851 -487 12 945 322 -707 1126 1247 -806 -1695 829 1849 -875 -2134 635
1278 635 2120 -622 -2383 -92 1477 296 -2125 -1012 976 -113 -1471 -482 241 -697 -761 53 272
1295 272 -1668 -1550 506 623 -1456 -1654 679 1382 -1055 -2149 84 1019 -687 -1603 -53 618 -273
1312 -273 -915 171 -45 -1174 -642 831 -84 -2011 -1266 1545 902 -1352 -1357 976 790 -945 -1265 321
1330 321 1186 -496 -601 325 498 -494 -377 504 29 -609 175 662 -45 -1000 -17 1381 563 -681 -885
1349 -885 990 916 -565 -708 389 608 679 741 -54 -235 71 724 203 -856 -429 607 1173 -170 -661
1368 -661 276 909 175 -571 37 588 432 -138 -215 254 235 465 508 -253 -474 590 651 -543 -883 30 1247
1389 1247 588 -533 -217 339 646 67 -617 -502 47 717 386 -986 -791 152 881 -72 -1102 -609 673
1408 673 569 -588 -520 271 687 -640 -527 -67 79 -167 -560 -438 -234 -295 336 241 -910 -1318 402 809
1428 809 -905 -2018 -569 1380 158 -1491 -964 601 469 -974 -1087 45 3 -359 -77 166 -271
1445 -271 -292 432 333 -435 -946 356 855 -535 -938 630 1295 -200 -857 -128 1024 243 -802 -123 -63
1464 -63 -133 52 697 32 -666 212 1055 262 -1227 -689 1458 1274 -590 -1028 1137 1790 -548 -968 330
1483 330 1179 -417 -553 476 775 -314 -36 1122 864 -563 -102 871 696 -777 -798 1487 996 -403
1501 -403 -531 1275 1008 -709 -944 637 1044 -29 -322 323 582 122 190 765 -213 -438 267 1152 368
1520 368 -1130 -53 983 895 -959 -560 617 202 -850 -169 408 -97 -470 -127 671 -145 -815 -68
1538 -68 170 -308 -832 -71 986 -306 -1142 -115 1225 4 -1278 -891 511 275 -815 -542 -30 79
1556 79 -439 -216 20 -668 -919 79 421 -115 -936 83 295 -210 -909 -375 391 28 -606 -511 174 84 -306
1577 -306 -441 76 298 -103 87 -159 -322 104 -63 225 -669 -123 743 389 -511 -689 143 505 -85 -569
1597 -569 -9 653 461 3 -121 6 -110 -14 207 56 -109 166 748 299 -167 160 194 296 363 -430 540
1618 540 511 167 -417 -133 590 790 -300 -100 -91 543 174 -182 -80 218 570 200 348 76 5 -252 394
1639 394 197 -283 -312 826 316 201 -461 -216 460 177 -351 -103 250 678 7 -174 -64 174 81 24 -389
1660 -389 -375 419 530 -237 -469 -63 386 359 -451 -673 -87 360 -66 -258 -184 289 -32 -360 -112 -132 -257
1681 -257 -366 -89 -85 -532 43 227 -151 -637 -630 374 270 -347 -892 117 602 -28 -759 -329 256 -97 -716
1702 -716 -746 -187 63 -384 -55 -88 -269 110 89 -109 -751 -55 156 167 -334 -483 118 500 139 -219 -576
1723 -576 351 181 -366 -240 595 684 176 -323 -336 209 608 95 -433 37 474 480 174 -430 -326 244 760
1744 760 -140 -140 369 374 359 -74 279 342 70 -4 193 154 125 319 61 -70 -76 207 428 298 -88 -186 293 585
1768 585 214 -532 176 467 265 -297 -87 215 230 114 -156 80 124 -301 165 144 193 -257 -63 221 13
1789 13 -575 19 253 -52 -29 -522 142 9 -137 -401 131 181 -456 -459 -26 -292 -106 -314 -246 -188 -235 303 -202
1812 -202 -663 -805 -28 274 -84 -445 -828 295 424 -293 -521 -503 -305 -124 -82 202 -84 -222 -257 228 -361
1833 -361 -505 87 -40 -510 -445 109 315 -284 -455 30 519 330 -661 -710 440 665 -105 -491 -123 -15
1853 -15 -279 98 319 -442 -400 210 386 -257 -635 356 731 10 -562 8 747 4 -374 89 471 32 -130
1874 -130 161 312 -90 -36 175 -33 -201 -6 598 373 -383 -218 628 537 -278 -698 360 862 265 -271
1894 -271 107 323 132 -260 123 109 -51 96 227 448 -742 10 393 642 21 -549 392 411 -485 -36
1914 -36 180 31 -256 -359 174 337 -255 -233 -69 -18 -30 -12 157 -331 -618 348 325 -13 -757 -378 628 195
1936 195 -302 -303 352 -146 -109 -349 -96 -128 -317 157 40 -365 -422 14 306 -248 -130 297 192 -130 -818 172
1958 172 432 2 -180 -422 45 124 -405 -66 -306 -32 -78 -184 -143 -451 12 282 188 -299 -72 -5 531 -85
1980 -85 -197 -59 -78 302 300 133 -44 -126 240 43 -21 -135 672 390 -172 166 300 462 61 -360 101 323
2002 323 40 -27 -275 94 109 127 272 62 304 310 243 173 -191 -233 550 153 -132 -96 501 523 -199 288 280 170
2026 170 -126 -102 331 307 -150 -384 327 -56 83 20 436 11 -504 236 437 31 -585 84 59 161 -329
2047 -329 94 182 37 -34 84 70 -12 7 193 -2 -552 -359 329 264 -208 -632 94 311 -269 -479 -182 130
2069 130 -323 -381 256 59 39 -222 166 171 -138 -191 77 -126 -555 -411 341 164 -238 -284 26 318 -436 -527
2091 -527 -341 7 -190 -220 188 -151 -507 -56 -49 -102 -299 -275 185 -138 -436 -113 303 182 -480 -217 429 -74
2113 -74 -242 -181 35 128 -2 -172 417 36 -187 157 52 -162 214 115 603 -224 -238 286 743 25 -6 133
2135 133 523 151 -165 120 236 10 57 256 357 267 -276 437 269 116 39 452 315 -139 -162 63 458
2156 458 -11 -98 -271 486 32 -77 -137 332 -111 44 -2 70 -141 75 502 73 -520 -23 157 139 -269 -447
2178 -447 298 -5 61 -537 66 62 -273 116 36 -36 -210 -61 131 124 -183 73 130 48 -401 -230 345 139 -650
2201 -650 -272 193 -9 -521 -208 -266 126 -169 -27 -57 -216 -31 69 -228 -359 -231 263 -150 -168 -275 -104
2222 -104 -43 -38 -126 -233 121 -20 -63 -119 -149 -78 401 -9 -89 -402 133 236 -56 -162 326 -38 -208 -283 -12
2245 -12 83 256 -38 -6 162 -4 12 93 -111 65 163 143 202 127 -113 391 278 -317 32 360 170 -77 -22
2268 -22 -127 177 197 139 176 31 170 3 343 -40 -20 371 62 -161 94 -1 256 -41 -247 -191 52 156
2290 156 -5 7 -77 216 61 274 -49 -74 -25 110 85 33 21 6 403 215 -96 55 267 -118 -215 106 66
2313 66 264 -87 -35 17 -100 47 -119 -280 -208 -138 -22 18 -257 -127 -51 -321 -222 -146 -64 -148 -72 -296 -138 -144 146
2338 146 55 -164 18 -103 80 117 -429 -134 -305 -69 -328 -331 -268 -102 188 -84 63 21 123 -148 -58 -318
2360 -318 53 10 -28 -181 -301 -96 52 126 -93 91 -34 76 107 -60 -10 392 192 -47 60 276 55 102
2382 102 -20 -24 32 -145 -92 127 63 71 176 253 114 -18 -43 -196 213 -163 247 111 193 -74 -193 -63 232
2405 232 -170 -204 237 19 36 -29 253 63 19 148 -38 -2 92 75 159 59 -158 41 212 221 -50 -83 186 241
2429 241 204 -296 -31 59 -141 -80 105 116 27 -68 177 55 -217 -190 -113 -349 -87 -271 -149 50 -67 200 14
2452 14 110 -254 -220 63 -141 -37 67 -114 -37 -38 -91 119 -41 -525 -342 108 92 -275 -92 221 236 -213 -255
2475 -255 188 -70 -24 -374 -24 231 -139 -288 -107 -4 31 -150 136 -373 -34 -23 254 -178 83 -153 173
2496 173 -89 -51 -160 -45 -15 -250 -196 -221 -144 -39 155 -48 312 -76 336 245 -116 -69 165 255 -41 -36 -227
2519 -227 134 201 -8 238 148 58 -91 -20 357 188 102 16 195 176 -249 87 41 -110 28 146 322 5 14
2542 14 -16 263 -14 -223 103 159 -198 -75 189 178 38 92 109 444 -198 -140 -17 75 -198 -88 203 -9 -130
2565 -130 -105 171 88 -361 -263 -14 61 -127 98 321 -52 115 -109 134 -157 94 168 257 -170 -277 -85 259
2587 259 132 -261 74 -98 -156 -189 114 53 -311 -358 -67 52 47 -211 130 112 -526 -409 392 -46 -393 38
2609 38 -337 -129 -187 -334 16 147 94 -44 48 -67 -259 -95 -110 -123 -356 -47 95 -160 -55 54 -67 -336
2631 -336 8 37 220 -62 -35 -238 78 -14 69 259 -114 -117 -126 365 252 -246 -133 207 232 -98 -208 103 214
2654 214 26 -69 331 213 78 -127 146 -75 -71 251 17 55 -202 -28 218 -83 88 101 -195 38 63 -39
2676 -39 -198 -114 184 4 121 303 -336 -60 62 -279 117 -60 -129 -157 18 -3 175 80 -76 -96 14 117
2698 117 -138 -262 312 -91 -314 164 -33 -118 -119 3 328 84 -273 126 -62 63 -53 -235 17 86 -117
2719 -117 -43 306 -87 1 33 -66 203 -25 -154 -304 50 -53 -199 -79 -70 -230 85 62 -279 -138 122 155 91
2742 91 -356 214 40 -39 372 123 9 -107 242 319 2 -257 61 -9 106 -151 266 381 -28 -94 -119 -17
2764 -17 472 238 93 -11 257 -346 -88 79 71 183 103 271 -34 211 -212 201 26 204 176 164 80 6 60
2787 60 105 98 40 276 -49 -13 206 -364 169 77 61 53 121 -235 156 214 -56 -54 -143 88 288 182 -269 99 12
2812 12 292 0 84 -54 80 125 -239 -395 -25 -88 124 -141 -334 168 -233 104 -256 85 -61 92 -32
2833 -32 -129 3 20 -78 -81 -67 -330 -44 -170 -125 -102 -44 121 255 -245 -37 194 -28 -57 -156 -62 43 -174 79
2857 79 34 -288 -114 -63 205 -314 -512 -47 92 -119 -167 -124 -211 15 -8 43 -77 242 -232 -266 -312 78 -124
2880 -124 -343 14 -213 -34 71 49 -62 -384 214 154 39 176 -158 -38 182 -181 -34 72 -58 47 -246
2901 -246 21 67 -113 162 20 -16 -6 -227 128 -106 -11 42 -41 -3 90 50 93 86 -28 -176 321 76 263 -197
2925 -197 -344 220 124 -199 -89 -282 -118 -111 -66 203 78 -53 65 2 53 86 -132 215 -143 -182 190 6 -114
2948 -114 203 132 -19 71 -99 16 173 -42 211 24 -113 215 136 -1 -33 -26 167 237 -151 90 53 -75 19
2971 19 214 16 -129 156 145 149 -159 -127 -24 -29 -211 -112 -176 71 70 -221 -88 169 -262 -256 -2 -108 50 -204
2995 -204 -282 62 200 188 -282 47 -150 33 150 -123 -230 -365 85 178 146 -32 -19 123 190 288 -270 -251 -3
3018 -3 -5 116 76 39 -14 -75 -14 -109 124 61 -3 52 31 61 169 68 114 -240 -26 133 168 161 -226 -47 -46 -44 111 261
3046 261 22 -39 6 16 8 148 122 136 -216 -76 4 -57 -129 -242 -193 64 0 4 -18 -2 -112 79 -85 7 114 -57
3072 -57 157 -144 204 58 -359 -70 -145 -166 57 -86 -120 31 271 -53 -25 -24 -148 -17 -195 -45 11 15 16 10 -65
3097 -65 -290 -108 127 -13 223 -167 -118 -106 67 -220 211 115 29 -215 -11 -1 -14 311 138 -130 54 7 105
3120 105 533 -283 11 170 -145 82 293 213 96 -144 -247 -102 86 30 169 295 -132 -119 -16 -184 -11
3141 -11 68 -46 173 241 75 14 4 65 -4 -219 -116 72 49 251 -48 -16 46 314 165 -75 337 132 311
3164 311 238 -258 -424 21 148 353 240 -47 -54 34 -142 90 85 104 78 22 38 34 39 -16 -98 -63 301 205 -168 17
3190 17 115 188 249 -28 156 -103 -37 53 -123 302 44 -21 116 190 31 -15 -102 -153 32 -211 -208 75 -78 -95 255
3215 255 243 -226 -51 -217 158 44 -470 -204 -305 324 -9 186 -56 -48 -293 66 -6 -154 242 -261 -266 -119
3237 -119 -124 -32 -108 -233 -42 -135 -153 213 98 -9 22 -114 111 49 72 -43 120 18 79 -127 -126 301 -86 -53
3261 -53 145 -30 161 -23 55 201 99 -113 1 70 -79 -92 102 180 -167 -244 302 191 -142 17 -259 49
3283 49 -17 245 -48 -351 221 -44 -5 145 51 -64 21 43 55 166 244 41 -13 -70 4 17 -166 129 219 -63
3307 -63 -5 -228 262 157 -15 -15 64 -101 196 312 259 -71 -187 168 35 -305 -71 -77 -120 108 45 88 -100 -36
3331 -36 -126 -5 333 127 -202 165 159 -10 -112 -96 23 -67 -129 311 45 -102 -89 111 -62 33 -253 -334 -52
3354 -52 -25 -282 23 -34 11 -39 -80 229 283 -49 -120 44 -137 -12 -35 188 -129 61 176 194 110 -5 -155 -127
3378 -127 -22 3 -105 -18 67 62 -46 -288 -159 152 301 -143 52 29 -11 -229 -121 225 -41 0 -189 -59 -76
3401 -76 -56 422 58 68 259 -362 -235 -104 -232 235 78 97 96 109 -22 -198 63 -101 -80 107 54 165 85
3424 85 -116 123 123 -55 257 86 55 -40 -35 149 -87 69 7 -108 6 196 163 -108 -141 6 110 2 -91 -203
3448 -203 198 -216 -83 -81 -133 -104 -72 249 -104 -120 154 -62 -85 85 -24 124 35 55 -153 233 -34 -160 413
3471 413 138 76 109 42 -168 -240 349 197 114 212 -98 150 56 325 12 436 168 -67 161 58 -197 -57
3493 -57 31 -56 9 -47 -94 114 -172 -18 -43 177 -38 -226 -14 73 32 -192 20 -97 -176 194 0 -224 -171 268
3517 268 9 -6 97 -157 87 -138 -264 212 310 -11 217 -67 191 -146 -104 199 -81 -198 205 89 -39
3538 -39 -206 145 224 -12 -277 -114 243 -115 -17 -60 -73 24 38 -129 -27 -253 27 -89 121 -75 -25 86 -79
3561 -79 2 112 -108 368 80 99 110 3 -124 175 140 -79 242 335 -96 -113 284 -241 23 223 65 -41
3583 -41 240 103 92 170 -68 -106 105 35 -82 100 85 17 72 24 -65 29 -56 163 74 -24 -102 104 103 217 142 -33
3609 -33 149 37 36 -277 134 -74 -146 21 27 56 -121 -59 52 123 61 264 166 80 108 -73 108 -76 18 -8 22
3634 22 25 -53 143 6 -212 -96 176 -79 289 -116 84 -13 66 -135 -142 -54 -25 107 -40 0 -113 138 8 -221
3658 -221 -134 -100 -37 247 -48 -136 -68 -41 133 -142 -15 248 108 26 11 -21 -68 160 9 -124 65 -30 145 -420
3682 -420 217 174 139 -147 75 -48 -23 -45 126 60 -133 69 57 39 150 -174 197 105 150 -16 5 168 -92
3705 -92 206 -213 203 18 125 -33 57 -195 115 85 50 201 -87 -54 -27 139 -71 303 228 -257 -152 -231 -113
3728 -113 215 92 49 15 58 -132 30 -104 -15 -132 375 -117 11 169 -50 106 98 -65 -35 -29 -191 -381 -264
3751 -264 -302 -222 -221 30 -201 55 -31 -362 176 84 143 -23 -159 -78 369 -34 123 35 83 -7 70 155 -259 -103
3775 -103 -70 311 -273 -206 -126 162 -66 25 83 157 -131 78 143 -219 11 18 -327 67 -104 -43 56 91 118 -295
3799 -295 -68 27 -108 163 -37 -126 -32 155 8 156 177 -100 -195 -91 -36 -8 242 -285 -282 159 32 -27 99
3822 99 111 -128 151 136 -200 -20 -89 169 182 180 -201 245 29 322 62 68 15 233 77 -32 21 -225 331 43
3846 43 1 85 -28 -156 5 -219 27 -51 91 -125 -40 -6 -201 -359 38 -37 -183 147 -32 -211 -81 -132 112
3869 112 -4 47 13 -279 51 53 -325 86 -72 -286 -114 139 -172 208 -29 65 10 -31 -251 23 326 -337
3891 -337 -77 53 171 -251 -198 -161 23 163 35 -137 -253 74 24 193 -236 -61 109 77 98 103 -248 -47
3913 -47 337 -125 8 -112 -59 84 66 149 22 233 -109 335 -6 284 183 161 122 -41 -109 294 -165 -6
3935 -6 -55 173 29 10 70 48 188 77 -8 102 180 -109 -300 143 188 118 -453 280 -332 17 -216 108 -26
3958 -26 -185 17 -35 -134 -25 -61 -140 163 -125 128 82 -20 116 50 -15 213 -64 -18 -78 -74 -245 -211 75 192
3982 192 40 -287 -191 222 -23 115 107 -26 -273 45 -203 211 -75 187 255 86 238 -7 221 -138 67
4003 67 241 -79 131 44 -101 -89 -119 81 34 -188 63 -27 12 -215 -198 -219 -17 -66 -26 -22 -83 58 -32 -249 141
4028 141 78 -141 -32 -81 -32 49 -141 -142 -36 231 -89 -380 36 172 -134 106 -139 227 -217 52 -215 97
4050 97 -196 -342 -7 -79 140 -21 -32 -36 -64 -49 -110 178 -116 -84 272 -115 -40 53 22 -266 -17 -39 12 88 9
4075 9 191 -405 -90 -63 276 43 -275 67 -26 144 -169 12 -280 -92 -85 90 -28 -188 240 233 173 203 -115
4098 -115 61 -294 163 120 133 -225 -98 82 117 26 77 226 45 54 -19 -58 -295 171 31 98 -58 233 -103
4121 -103 -163 172 200 -11 -34 91 -70 149 -251 60 -42 -215 46 31 149 -51 144 104 -31 -142 128 -55
4143 -55 -169 55 86 -327 110 -145 -277 1 -278 130 173 -219 79 289 30 -31 102 -148 -23 172 29
4164 29 -80 -50 -138 92 -86 -164 157 -5 282 -72 -202 -35 -124 34 -133 -116 -148 29 -167 27 18 142 -56
4187 -56 -12 148 29 -50 -168 272 -291 99 -55 7 -70 59 61 99 -10 -18 -143 65 -55 -25 179 135 56 188
4211 188 77 -31 -190 11 -130 -23 -64 -144 20 10 -28 -47 -26 -109 -105 77 128 311 140 -88 114 278 -177
4234 -177 50 -312 6 220 -122 59 -60 -21 126 -233 -236 120 212 70 -25 159 -1 67 465 164 68 14 85
4257 85 -165 116 134 -56 59 82 -291 132 -111 -219 214 -164 -260 57 -202 -58 -17 -91 224 -145 5 -56
4279 -56 -31 -193 -98 90 -254 -22 -238 105 -122 171 -16 421 -8 -282 78 194 61 -282 -76 -210 -8
4300 -8 -33 41 -409 120 214 227 -101 60 -181 416 -114 209 412 275 -159 -73 226 -140 41 -427 146 -237
4322 -237 -286 -92 -95 -370 -96 -239 12 12 14 28 63 178 -148 -41 195 -253 180 -202 137 262 230 162 57 322
4346 322 -115 -35 -205 214 -9 77 82 222 261 1 6 -101 -218 -10 33 -64 73 242 -27 -237 54 -128 109
4369 109 66 -174 4 -191 243 34 -1 -89 -332 3 -174 -190 -42 -112 77 195 -120 284 -6 -79 -14 38 122
4392 122 -148 -17 97 55 84 -16 79 -120 10 -58 -95 148 80 -62 3 159 -111 208 -126 -231 128 22
4414 22 50 -157 185 149 31 83 198 176 92 -2 34 -53 -65 264 6 -252 49 -88 -153 258 -105 112 -134 409
4438 409 240 108 32 61 -140 -5 -52 -314 62 23 -192 213 -15 165 150 -269 104 -215 200 20 0 -88
4460 -88 60 31 -180 30 -143 240 320 -97 191 -1 61 -168 -71 -109 50 38 -1 -220 -204 201 273 -33 -5 240
4484 240 -72 11 157 207 137 11 51 -105 -247 -185 -177 47 55 -132 130 80 -39 -74 -105 165 -152 -176 -116 28 -93
4509 -93 118 -6 -285 -38 -94 10 199 21 -386 81 23 89 -169 124 -134 208 218 145 191 289 -128 247 -46
4532 -46 67 144 -320 47 123 168 44 104 94 232 -182 57 -46 106 -50 89 -68 -88 -45 -68 -256 -143 -161
4555 -161 -296 -263 -29 -157 -213 -147 -295 -24 56 146 -122 -141 -148 -120 -18 -57 37 -34 263 38 -149 -106 351 -274
4579 -274 61 77 184 82 -69 -134 115 207 119 235 152 42 -37 -126 191 61 -36 -21 192 196 -105 -118 -40 -99 -189
4604 -189 191 -140 31 127 -3 408 54 72 -25 80 26 -98 -3 7 37 -68 -6 160 -61 -3 -67 210 15
4627 15 244 230 99 97 -118 -239 125 -76 -4 -28 25 0 135 -126 399 -115 -265 -308 53 108 -24 35 392 196
4651 196 -338 34 -223 177 134 159 75 308 -87 -319 109 -254 -65 110 -280 -139 232 187 -179 -123 44 -446
4673 -446 227 34 165 35 69 -117 252 -48 -150 -124 121 43 49 163 -124 -40 30 -105 -58 -120 19 -37 37 -80
4697 -80 -77 -203 142 57 -359 161 150 -157 69 -59 201 180 7 101 41 50 162 127 -268 -66 -57 -3 -195 210 8
4722 8 10 -280 -107 207 64 -130 226 91 -77 -100 -60 173 -28 48 124 -40 -186 195 -66 -24 38 -90 173
4745 173 74 167 -141 132 117 -26 -49 -200 113 32 236 222 138 -92 286 76 -308 66 -79 99 -113 -57 -18
4768 -18 -66 -61 61 -83 -186 150 -67 -6 41 156 -236 -106 65 -139 -45 -103 -130 -35 324 390 -79 57 234 -65
4792 -65 55 -31 35 -144 221 26 -283 85 105 348 -206 -238 -191 30 30 -314 113 -39 39 85 64 -171 124 -132
4816 -132 -119 58 42 129 65 -148 133 59 254 -170 -25 -73 -2 -92 201 154 -182 -93 208 29 132 -124 269
4839 269 12 -121 -105 -98 215 171 252 -160 65 -202 -246 156 167 -94 112 262 62 160 -196 -165 -22 -45 17 274
4863 274 -74 -172 -121 39 23 -15 -275 -104 -131 91 269 -120 113 -100 -105 -63 142 -163 -83 -146 -25 -476 -135
4886 -135 -150 190 116 -16 491 -1 -46 -382 29 238 170 -102 -49 -128 -2 89 110 257 -30 127 -323 0 -83
4909 -83 222 142 61 -99 -273 -243 -179 135 4 -36 16 42 263 -143 -85 -114 54 47 49 -42 79 130 70 98 70 427
4935 427 -40 111 189 206 109 -106 106 59 104 208 -90 -234 144 13 -12 -304 8 -131 -20 -137 251 15
4957 15 -320 -97 127 163 28 -89 95 10 -106 143 -70 -284 39 65 101 219 -68 -186 -144 42 -487 84
4979 84 -80 94 -173 -243 317 -135 -185 129 74 -4 78 -59 94 -266 -55 -147 -27 -186 -237 110 -31 279 -198
5002 -198 270 -134 -16 51 110 43 -245 109 109 88 125 -146 69 114 106 131 73 153 53 163 -61 -80 201 -58 -85
5027 -85 -148 -371 -4 -205 -232 51 130 156 -228 80 -235 24 -157 -182 -92 52 137 116 68 -40 4 168 -5 43
5051 43 -187 164 36 61 72 56 177 -148 -42 179 38 -179 143 229 44 39 -112 -25 -166 -117 32 114 -156
5074 -156 -17 172 158 -20 49 -32 -66 38 78 -103 -95 -69 -178 -18 149 -56 69 -84 21 -62 -18 -17 -225 -40
5098 -40 -88 -176 -276 -231 34 15 91 14 160 173 19 -188 212 -7 87 -278 90 5 58 -89 -157 -219 59 -49
5122 -49 -54 -44 -54 48 -41 31 228 -59 189 -130 -217 363 -146 211 200 -139 192 274 257 92 3 -233 -48 255
5146 255 -317 -67 150 320 -187 -250 -203 -77 97 -109 -34 -22 18 -6 151 -69 36 191 -108 23 -128 -82
5168 -82 -100 98 -138 -93 81 65 -62 29 -229 -258 26 -80 -175 -51 -113 -153 196 -163 -210 -190 -23 -19 53 212 -106
5193 -106 31 107 -3 204 200 97 39 -158 334 -101 -95 -69 -348 -34 -43 217 229 -20 -178 -51 7 -29 -210 -73
5217 -73 92 215 58 -14 -145 65 140 89 33 35 164 -112 -133 241 85 -33 -262 -225 67 -20 258 83 -30
5240 -30 -187 91 -53 -236 -172 -149 195 56 -191 -65 122 146 -101 4 -88 116 14 -164 -183 -124 55 -187
5262 -187 97 34 -135 -213 -351 -165 257 145 228 115 64 -69 -47 148 -66 79 -214 -48 -217 -60 -58 -274
5284 -274 148 111 39 69 -65 -33 51 -125 89 -273 -130 66 -33 -190 148 141 141 291 111 -3 -168 -157 -37 -169
5308 -169 -174 -122 -1 -40 -135 232 -124 -172 107 140 167 30 85 -85 32 -144 120 55 153 -59 1 169 -228 -78
5332 -78 -61 -231 41 298 33 -316 -218 -1 -195 320 -123 -276 198 131 215 -31 97 116 19 66 -146 235 -245
5355 -245 -29 284 74 252 -243 -131 34 291 89 -34 158 76 -9 -421 -111 116 -333 -49 -353 -103 -140
5376 -140 144 194 -22 -66 371 47 56 -107 -57 35 196 118 12 63 38 97 -225 -134 -299 168 105 55 79 90 -89
5401 -89 -127 -92 170 -98 -127 -42 28 53 -87 21 -39 125 -124 110 297 48 70 99 -144 8 -100 49 -162
5424 -162 92 -40 -126 -42 -48 223 133 -84 36 -12 174 47 -219 -89 -70 -251 108 63 -78 -157 149 333 45
5447 45 -188 -124 -196 62 -296 -14 11 -152 241 17 6 -60 22 -25 27 -23 -36 48 91 -251 -78 162 149 -103 -98
5472 -98 121 80 -54 -188 -76 193 -102 145 -47 45 60 -33 37 -62 251 219 -56 40 58 213 130 145 -82 73
5496 73 -255 -238 -258 -19 155 93 -134 201 -141 -70 88 -154 -117 -414 302 93 209 205 -91 284 -383 170 -154
5519 -154 80 166 -7 143 -24 -81 -231 -32 2 299 -25 -44 217 94 54 17 10 266 58 84 -147 142 161
5542 161 176 -42 104 199 82 174 29 86 -25 -166 32 64 -130 -318 7 226 63 40 36 113 151 -47 -105 191
5566 191 -76 -178 99 -173 -77 -128 -30 77 60 194 68 -132 -138 40 128 52 -127 -44 -189 -254 -183 377 -131 33
5590 33 61 22 -27 103 -99 -131 91 -44 96 -19 -66 67 123 -21 98 -295 -119 183 129 -440 12 -9 -46
5613 -46 193 -29 -106 166 -45 -286 -272 -113 66 -167 130 -13 -54 -60 -39 -35 65 -8 9 102 110 -14 -75 68 43
5638 43 -125 -237 173 -145 248 142 145 55 -144 -118 -22 172 -97 -167 351 32 29 344 -34 -94 -101 141 193 180 80
5663 80 64 -46 11 103 48 -190 -220 345 -74 -62 -294 -57 -72 171 -458 74 -37 -2 -106 -283 -96 -13 42 87
5687 87 12 -4 213 -126 184 224 9 -17 -138 -115 143 323 36 -201 38 -132 52 154 -388 168 125 59 -32
5710 -32 149 301 -156 -200 115 307 -255 -34 -15 58 202 -193 -63 10 -280 -103 146 80 167 -145 293 95
5732 95 128 -186 -72 22 -33 -132 11 -107 29 -189 -34 42 -329 124 122 65 -67 22 -61 60 -27 -285 -314 -66
5756 -66 6 141 -166 -144 138 -51 295 22 -28 120 -37 40 -147 84 -50 -6 94 59 -52 -27 62 149 -269
5779 -269 -58 -228 -155 67 -54 165 -135 44 -36 -68 193 -172 -345 218 166 199 145 62 -87 56 -286 92
5801 92 158 66 8 -11 50 111 48 99 141 90 203 -26 130 35 73 32 -180 129 130 -5 86 193 -6 -90 46 200
5827 200 -64 -27 89 -70 182 33 179 -135 49 16 55 -93 -95 -85 29 -61 -195 -63 108 -308 -19 -167
5849 -167 45 -186 -91 -163 117 277 -179 107 260 93 -62 22 -243 7 226 -95 157 -135 -422 -109 18
5870 18 -75 -209 -33 54 168 89 -33 -139 28 -33 91 77 25 -58 -49 59 291 -122 193 -147 35 240 -265
5893 -265 -136 171 0 142 -26 258 140 12 257 150 -33 -78 19 185 -216 206 -225 -101 -7 -143 31
5914 31 -54 54 146 12 -327 -40 -150 -150 -179 102 65 326 -248 54 -76 65 -55 173 44 -123 129 116 -32
5937 -32 79 -103 112 -1 46 28 -83 44 206 50 -54 -5 4 -15 -6 -35 26 -398 54 -128 250 -22 -49 41
5961 41 -232 24 -263 8 -88 43 143 32 -82 124 60 -112 -82 -81 -236 -19 166 -32 -61 -22 82 -105 -13
5984 -13 172 -122 211 223 -10 -185 -69 -72 39 -5 120 -51 -46 70 -88 4 -110 179 441 268 -203 189 -117
6007 -117 -18 -38 -19 120 127 -160 -74 129 -120 -2 67 -67 229 -75 -94 -82 -48 38 63 48 -62 -82 -100 173 283
6032 283 17 20 -95 -17 -19 53 -153 97 159 5 -206 -164 -16 -186 167 70 -327 -133 -260 -188 47 -111 5
6055 5 186 -13 163 67 -164 334 -30 179 261 -158 37 -124 -38 -81 16 11 87 188 100 -25 151 -128 0 -33
6079 -33 -176 62 -136 -182 -90 -42 137 167 -247 24 -106 133 -144 119 196 -87 -314 106 168 -76 -10 313 72
6102 72 -81 -145 -107 117 -162 -125 -310 77 217 -163 -36 156 272 -124 -18 229 -133 -135 -56 -311 -218 174 -4
6125 -4 226 -76 187 147 -47 -62 158 -128 56 144 -218 60 -389 230 61 280 82 86 -326 72 -457 367
6147 367 -29 -219 70 -108 25 -267 308 -20 2 -18 -21 -109 -84 69 -54 -34 76 -141 -184 164 166 7 209
6170 209 -28 157 -59 -44 234 254 -162 113 -290 262 -139 -6 31 207 -68 -129 95 66 -106 -14 140 152
6192 152 -315 34 34 47 427 151 -182 2 216 -108 49 59 87 94 -34 46 53 -297 -3 -22 -156 -194 -69 83
6216 83 -46 -133 58 -40 -96 4 -140 0 -79 30 260 55 161 95 40 38 134 240 39 167 148 -220 -197 -111
6240 -111 -98 -199 -222 -208 93 163 -86 -30 59 66 165 104 -16 -365 163 169 -277 -34 35 -226 -329 -68 -70 -37 79
6265 79 82 -82 -170 -16 119 85 -107 -64 -183 19 11 225 12 -79 -97 -51 -78 -45 7 227 -135 313 98 -39 45
6290 45 101 61 212 161 159 -6 -222 -13 -59 132 90 -39 62 -66 -273 179 41 -25 -150 126 195 251 -46 -14
6314 -14 201 -212 171 173 -82 -1 -92 -150 -284 138 -110 -231 89 28 -66 -135 -33 86 -239 -120 189 -114 59
6337 59 37 -71 173 22 -151 -294 62 18 -237 -26 -7 184 -116 -74 179 252 210 87 257 58 -242 35
6359 35 48 -111 232 134 -101 489 93 -35 93 56 -77 -37 -52 -234 -89 38 -333 -144 201 435 -146 59
6381 59 -193 -1 -255 32 90 -117 -121 -21 175 255 -192 98 134 -267 21 125 74 -109 -280 -20 219 23
6403 23 89 -145 319 55 -102 94 99 290 -64 103 19 50 -38 184 181 -16 16 -135 48 91 -179 28 160 -88
6427 -88 -74 148 -31 196 -309 320 -190 181 98 10 103 238 267 -1 31 -284 -63 -22 -61 -156 -68 51 -49 79
6451 79 -129 96 285 145 -121 84 -141 -176 384 -18 -52 69 7 121 6 -155 232 -246 -48 -300 154
6472 154 -7 120 236 46 -120 77 83 -152 90 343 -39 189 72 -33 94 4 -39 114 53 -150 293 -73
6494 -73 257 -35 -115 -270 134 -20 -104 147 -255 168 105 7 -131 -70 -200 23 -34 -192 297 60 2 -76 -94
6517 -94 197 196 108 -121 73 210 -102 20 306 -5 26 44 -16 -137 10 -112 8 -219 -7 -30 -67 -53 -245
6540 -245 -224 207 250 101 334 90 85 -157 -75 51 289 -181 136 235 -358 -97 -103 -65 199 -31 -179 -121 18
6563 18 -25 224 -34 141 -84 137 17 -31 -299 101 111 -53 49 124 -82 -78 -136 -167 13 -199 66 -23 282
6586 282 -24 -173 -52 -309 115 -203 32 -338 -285 98 -47 250 120 -301 -106 -166 -227 176 -198 -89 47
6607 47 -292 21 -41 -365 -272 -122 -73 -142 -73 -167 -124 -158 -16 -23 247 46 -34 -108 -80 93 -181 -296 -24 290 151
6632 151 -113 324 241 257 72 -106 117 80 -90 -409 -200 -48 -252 64 -49 -114 -80 214 97 83 70 35 -233
6655 -233 -168 -171 41 98 225 26 -62 86 -21 81 -185 -55 95 13 124 260 41 -119 239 -34 147 89
6677 89 -77 27 -118 12 -107 354 173 -18 4 161 -43 -46 79 -61 76 29 -97 -126 -146 -123 -87 38 -191
6700 -191 -15 106 64 91 -334 -267 -26 69 31 -156 151 44 81 -85 136 -125 -123 228 -75 -135 -117 97 301
6723 301 179 -150 -133 154 -142 -91 -245 127 -65 -110 -71 85 -150 -72 16 150 -141 -213 -39 -381 -315 16 -227
6746 -227 -186 199 296 -181 -265 -85 65 -5 -96 334 -81 -18 -65 -50 377 -94 -209 -40 -180 -62 85 109 -25
6769 -25 -61 -341 165 -34 -71 126 94 -14 165 -171 3 -98 -240 -3 -322 50 -62 60 -138 313 289 66
6791 66 154 -19 317 -68 54 270 -250 28 72 -353 27 -176 -265 -157 -263 48 383 -139 161 431 -60
6812 -60 32 31 135 327 -273 63 132 -48 57 56 76 57 -157 -160 314 -13 203 -63 148 185 17 135 68 220
6836 220 -23 99 -69 36 202 -44 -19 150 98 -74 123 -151 -81 101 66 -124 -135 360 36 -53 3 -113
6858 -113 133 -249 -187 -1 256 -3 87 -444 -323 -20 207 -92 -37 132 -70 -103 337 18 64 -48 -105 70
6880 70 170 12 18 8 -246 144 99 -56 -83 -118 -7 183 35 -159 -224 -69 -134 211 78 -10 98 -118 11
6903 11 -72 93 -53 -155 -72 -76 -18 3 59 -398 106 204 107 -79 195 -6 0 332 -31 -150 61 307 210 -28
6927 -28 35 -261 58 105 102 -80 10 -25 -102 22 111 214 -150 45 -111 29 -273 -183 -251 -83 9 158 215 -143
6951 -143 -44 -31 -171 -202 -143 207 164 -281 36 174 -13 228 -274 6 -6 222 -37 -186 9 -91 -109 -150 61
6974 61 -143 14 150 257 -202 41 -21 107 36 190 -195 -102 -7 -130 19 56 -54 -192 91 235 145 11
6996 11 128 -136 26 64 -16 -78 76 -114 71 172 -46 -20 -60 -153 140 95 66 -74 -157 114 -50 40 -147 -270
7020 -270 226 355 50 55 -2 33 -98 -451 -5 -137 -94 50 127 178 5 17 51 58 -110 113 -45 270 147 -27
7044 -27 -18 -273 -5 -13 109 96 283 109 126 -27 38 -64 131 -14 34 -41 194 -34 -134 227 3 -191 94
7067 94 41 -52 -328 -182 303 -66 7 -192 -58 -162 -154 117 154 -41 3 -134 -118 -132 389 150 149 -99 -72 -88 -48
7092 -48 99 -80 255 103 51 -58 -297 -18 -149 -224 127 -17 -54 -98 -86 36 156 250 -130 53 -148 -210 183
7115 183 91 -114 -131 -74 -3 54 21 -125 160 84 -125 -44 96 -313 -58 -214 -282 -346 -301 -51 -167 -80 -35 202
7139 202 -137 77 -7 -145 -111 157 -150 60 28 117 -115 -131 328 -194 -114 82 282 181 -410 -156 -49 -155
7161 -155 -179 84 -312 56 -86 -97 138 76 -164 355 -125 365 239 198 -20 -13 -26 99 91 33 52 113 105 -39 249
7186 249 13 83 -112 35 249 -40 153 -22 87 -31 134 -154 -146 -58 46 385 25 75 -43 174 -98 19
7208 19 98 11 87 -64 102 183 -188 509 -64 -142 -178 41 120 -8 -110 -8 -130 -96 21 -43 -238 306 -76
7231 -76 -292 44 -203 89 78 -69 -15 200 -45 14 73 257 -358 156 -79 52 60 -20 -167 42 97 -331 -3
7254 -3 64 -100 -316 47 90 13 -45 0 37 4 -334 -116 -110 -121 267 56 -51 310 64 -91 32 278 224 148 -124
7279 -124 10 69 -1 123 -101 103 47 9 -49 232 -115 -36 521 133 -131 -123 199 -67 81 -33 -67 47 -385
7302 -385 -52 148 -272 59 250 93 -226 74 114 121 -140 -268 158 122 -25 7 -6 -43 75 37 -8 -103 171
7325 171 13 -120 -27 5 257 27 -150 116 147 -98 -275 -285 217 -222 78 101 191 220 74 196 -196 206
7347 206 59 -177 28 -67 -161 48 91 -19 -52 -48 -231 12 -54 316 -262 64 -60 49 66 219 15 -168 67
7370 67 -230 213 -65 270 238 -76 79 17 -81 -229 -110 72 -60 99 -169 -127 -207 -96 -98 69 -77 135 167
7393 167 -188 -168 151 46 106 -155 72 261 202 -227 -136 143 382 -130 -57 -179 156 263 -44 -3 -142 29
7415 29 -140 59 -143 8 -113 172 -67 -69 -80 -25 285 141 -215 -180 290 -167 45 -60 -124 192 279 150 -63
7438 -63 -199 73 -57 -59 119 -75 58 27 -44 138 -93 433 -80 50 215 51 -45 200 -199 51 -102 222
7460 222 148 159 -57 42 24 -205 -37 148 -162 34 117 208 34 -68 86 -165 152 -88 -253 -295 -181 -138 156
7483 156 -133 177 8 97 147 -291 32 160 -81 -62 66 100 -246 40 45 53 -125 20 126 166 -272 -218 -31
7506 -31 47 122 -77 -17 -140 -291 -11 46 20 225 0 43 113 372 -94 -68 -62 -115 107 -154 -71 56 -153 235
7530 235 328 29 -20 159 -325 -239 11 80 -146 55 -55 -52 162 -47 -96 103 162 -127 -97 -353 -96 -239 -28
7553 -28 -274 108 -104 82 -305 -83 43 -190 165 -139 -81 149 -9 -222 -2 -208 -16 38 39 81 145 -10
7575 -10 -49 38 -239 3 -393 -81 55 -16 55 189 112 57 244 -117 -133 114 11 85 -77 110 63 -252 228
7598 228 23 -43 95 27 43 264 -63 124 31 51 33 101 16 377 56 -82 32 -43 -54 -91 54 81 -43 11
7622 11 164 -214 -46 98 -61 267 228 59 25 -100 128 160 97 153 24 61 43 -109 -29 -65 141 -23 208
7645 208 97 -74 52 -308 -72 -154 -47 61 34 -159 -1 -125 -124 -205 -43 -71 -256 -132 122 215 -131 156
7667 156 205 295 -126 -19 -55 227 302 50 -77 -8 -88 35 325 -51 -117 52 -34 58 43 302 -116 -169 -266 193
7691 193 26 10 -188 -107 55 159 -20 -20 91 -179 239 427 106 -51 157 -129 -160 -182 168 32 -318 -44
7713 -44 231 116 -247 -14 14 -78 118 34 -197 -230 234 19 -10 147 174 -101 7 19 103 165 -223 332 -297
7736 -297 133 -93 -52 -91 -308 -69 27 -27 225 -44 47 43 -77 -36 18 66 -34 71 -27 -131 210 -172 152 -270
7760 -270 171 263 10 -138 228 299 -23 39 20 -87 11 -138 -52 51 -87 9 121 33 88 -33 38 11 -360 93
7784 93 205 246 -170 83 13 -157 -119 25 203 276 -472 -168 59 139 -92 -141 -139 -204 -174 102 21 150 108 -217
7808 -217 -48 -257 127 -164 63 -85 59 -217 42 1 23 140 117 -140 14 -37 108 30 3 88 -104 245
7830 245 43 -245 286 403 -64 96 -104 285 134 -17 119 23 94 159 -21 -114 0 80 144 63 116 70 146
7853 146 133 -149 225 -2 44 -225 -154 41 -27 121 -164 91 150 -159 33 115 96 -224 -31 173 69 134 150
7876 150 -120 249 -162 378 74 21 58 128 236 124 7 -68 90 -38 11 -9 78 63 -30 -166 69 60 62 178
7900 178 9 -65 41 132 132 37 -152 120 -123 -10 -52 -165 -190 -72 148 19 72 90 107 222 -235 -1 252
7923 252 96 -28 -6 16 36 29 -106 26 -4 74 -143 97 178 158 -184 61 -17 42 245 27 -83 -164 23 51
7947 51 187 -187 186 -157 149 125 276 110 147 -21 -142 72 -112 335 115 72 -130 228 237 119 60 -200
7969 -200 39 -167 -316 -204 180 211 -5 41 79 158 98 214 295 -59 183 -32 -17 106 -376 230 167 154 276
7992 276 -103 -12 -61 59 113 -12 -138 83 101 144 188 -45 146 53 -111 161 -59 -37 -50 -81 -28 160 82 50
8016 50 -49 231 4 -84 122 -32 -21 -183 0 -346 90 -42 218 5 29 203 -55 -264 366 -3 -201 40
8038 40 3 15 15 -45 -59 333 155 -183 43 -106 149 92 -62 -120 163 33 -208 125 -195 23 -56 182 161 105
8062 105 62 218 -270 -317 125 -120 126 108 -230 -78 32 -95 211 254 42 -204 243 110 -100 75 104 -96
8084 -96 171 -152 -70 -49 98 31 116 -297 236 -76 -140 -45 -282 19 -109 -158 78 142 247 49 -95 -175 35
8107 35 121 113 -100 120 124 -50 138 130 41 132 -39 67 -103 67 205 376 206 26 -119 129 121 -14 14 -216
8131 -216 43 -45 151 -128 118 -179 -6 1 148 -43 -72 26 295 168 -63 13 -219 64 -1 38 -40 -111 48
8154 48 -5 111 -198 249 -108 381 147 -254 163 3 -26 -39 40 211 -29 565 20 117 99 -116 -75 -212 16
8177 16 101 192 -9 -13 120 238 92 117 -28 -293 115 169 37 44
8191D4
##END NTUPLES=NMR FID
##END=
