##TITLE=1H_SAV-61-f4
 CDCl3, 8 sc, 
 3.3.2020
##JCAMPDX= 6.0         $$ Bruker NMR JCAMP-DX V2.0
##DATA TYPE= NMR FID
##DATA CLASS= NTUPLES
##ORIGIN= UXNMR, Bruker Analytische Messtechnik GmbH
##OWNER= root
$$ XWIN-NMR		Version 3.5
$$ Tue Mar  3 14:12:11 2020 Russian Standard Time (UT+4h)  she@DPX200
##.OBSERVE FREQUENCY= 200.1315
##.OBSERVE NUCLEUS= ^1H
##.DELAY= (6, 6)
##.ACQUISITION MODE= SIMULTANEOUS
##.ACQUISITION SCHEME= undefined
##.AVERAGES= 8
##.DIGITISER RES= 18
##SPECTROMETER/DATA SYSTEM= spect
##.PULSE SEQUENCE= zg30
##.SOLVENT NAME= CDCl3
##.SHIFT REFERENCE= (INTERNAL, CDCl3, 0, 15.7039)
##AUDIT TRAIL= $$ (NUMBER, WHEN, WHO, WHERE, WHAT)
$$ ##TITLE= Audit trail, XWIN-NMR		Version 3.5
$$ ##JCAMPDX= 5.01
$$ ##ORIGIN= Bruker BioSpin GmbH
$$ ##OWNER= she
$$ F:/spectra/data/she/nmr/H-F/1/audita.txt
$$ ##AUDIT TRAIL=  $$ (NUMBER, WHEN, WHO, WHERE, WHAT)
(   1,<2020-03-03 14:10:27.98 +0400>,<she>,<DPX200>,
      <created by zg, POWCHK disabled, PULCHK disabled
       configuration hash MD5:
       00 E9 B6 7A A2 85 ED C7 34 08 36 98 17 FE 4E 26
       data hash MD5: 16K
       B3 03 79 C3 5F D8 56 60 C4 D9 A9 26 51 0A F0 82>)
$$ ##END=
$$ 
$$ hash MD5
$$ 08 30 03 F5 F7 B5 FB 69 99 B9 B9 89 F7 3D 90 82
##$RELAX= 
##$RELAX= 
##$RELAX= 
##$RELAX= 
##$RELAX= 
##$RELAX= 
$$ Bruker specific parameters
$$ --------------------------
##$DU= <F:/spectra>
##$EXPNO= 1
##$NAME= <H-F>
##$PROCNO= 1
##$TYPE= <nmr>
##$USER= <she>
##$AMP= (0..31)
100 100 100 100 100 100 100 100 100 100 100 100 100 100 100 100 100 100 
100 100 100 100 100 100 100 100 100 100 100 100 100 100 
##$AQSEQ= 0
##$AQ_mod= 1
##$AUNM= <au_zg>
##$AUTOPOS= <>
##$BF1= 200.13
##$BF2= 200.13
##$BF3= 200.13
##$BF4= 200.13
##$BF5= 200.13
##$BF6= 200.13
##$BF7= 200.13
##$BF8= 200.13
##$BYTORDA= 1
##$CFDGTYP= 0
##$CFRGTYP= 5
##$CHEMSTR= <none>
##$CNST= (0..31)
1 1 145 1 1 1 1 1 1 1 1 1 1 1 1 1 1 1 1 1 1 1 1 1 1 1 1 1 1 1 1 1 
##$CPDPRG= <>
##$CPDPRG1= <>
##$CPDPRG2= <>
##$CPDPRG3= <>
##$CPDPRG4= <mlev>
##$CPDPRG5= <mlev>
##$CPDPRG6= <mlev>
##$CPDPRG7= <mlev>
##$CPDPRG8= <mlev>
##$CPDPRGB= <>
##$CPDPRGT= <>
##$D= (0..31)
0 1.2 0 0 0 0 0 0 0 0.06 0 0.03 0 0 0 0 0.0002 0 0 0 0 0 0 0 0 0 0 0 0 
0 0 0 
##$DATE= 1583230227
##$DBL= (0..7)
120 120 120 120 120 120 120 120 
##$DBP= (0..7)
150 150 150 150 150 150 150 150 
##$DBP07= 0
##$DBPNAM0= <>
##$DBPNAM1= <>
##$DBPNAM2= <>
##$DBPNAM3= <>
##$DBPNAM4= <>
##$DBPNAM5= <>
##$DBPNAM6= <>
##$DBPNAM7= <>
##$DBPOAL= (0..7)
0.5 0.5 0.5 0.5 0.5 0.5 0.5 0.5 
##$DBPOFFS= (0..7)
0 0 0 0 0 0 0 0 
##$DE= 6
##$DECBNUC= <off>
##$DECIM= 24
##$DECNUC= <off>
##$DECSTAT= 4
##$DIGMOD= 1
##$DIGTYP= 9
##$DL= (0..7)
0 120 120 120 120 120 120 120 
##$DP= (0..7)
150 150 150 150 150 150 150 150 
##$DP07= 0
##$DPNAME0= <>
##$DPNAME1= <>
##$DPNAME2= <>
##$DPNAME3= <>
##$DPNAME4= <>
##$DPNAME5= <>
##$DPNAME6= <>
##$DPNAME7= <>
##$DPOAL= (0..7)
0.5 0.5 0.5 0.5 0.5 0.5 0.5 0.5 
##$DPOFFS= (0..7)
0 0 0 0 0 0 0 0 
##$DQDMODE= 0
##$DR= 18
##$DS= 0
##$DSLIST= <SSSSSSSSSSSSSSS>
$$ [...]
##$SUBNAM2= <"">
##$SUBNAM3= <"">
##$SUBNAM4= <"">
##$SUBNAM5= <"">
##$SUBNAM6= <"">
##$SUBNAM7= <"">
##$SUBNAM8= <"">
##$SUBNAM9= <"">
##$SW= 24.9337058887773
##$SWIBOX= (0..15)
0 0 2 0 0 0 0 0 0 0 0 0 0 0 0 0 
##$SW_h= 4990.01996007984
##$TD= 16384
##$TD0= 1
##$TE= 0
##$TE2= 300
##$TE3= 300
##$TEG= 300
##$TL= (0..7)
0 120 120 120 120 120 120 120 
##$TP= (0..7)
150 150 150 150 150 150 150 150 
##$TP07= 0
##$TPNAME0= <>
##$TPNAME1= <>
##$TPNAME2= <>
##$TPNAME3= <>
##$TPNAME4= <>
##$TPNAME5= <>
##$TPNAME6= <>
##$TPNAME7= <>
##$TPOAL= (0..7)
0.5 0.5 0.5 0.5 0.5 0.5 0.5 0.5 
##$TPOFFS= (0..7)
0 0 0 0 0 0 0 0 
##$TUNHIN= 0
##$TUNHOUT= 0
##$TUNXOUT= 0
##$USERA1= <user>
##$USERA2= <user>
##$USERA3= <user>
##$USERA4= <user>
##$USERA5= <user>
##$V9= 5
##$VALIST= <valist>
##$VCLIST= <CCCCCCCCCCCCCCC>
##$VD= 0
##$VDLIST= <DDDDDDDDDDDDDDD>
##$VPLIST= <PPPPPPPPPPPPPPP>
##$VTLIST= <TTTTTTTTTTTTTTT>
##$WBST= 1024
##$WBSW= 4
##$XGAIN= (0..3)
0 0 0 0 
##$XL= 0
##$YL= 0
##$YMAX_a= 84031
##$YMIN_a= -46236
##$ZGOPTNS= <>
##$ZL1= 120
##$ZL2= 120
##$ZL3= 120
##$ZL4= 120
##$ABSF1= 10
##$ABSF2= 0
##$ABSG= 5
##$ABSL= 3
##$ALPHA= 0
##$AQORDER= 0
##$ASSFAC= 0
##$ASSFACI= 0
##$ASSFACX= 0
##$ASSWID= 0
##$AUNMP= <proc_1d>
##$AZFE= 0.1
##$AZFW= 0.1
##$BCFW= 1
##$BC_mod= 2
##$BYTORDP= 1
##$COROFFS= 0
##$CY= 11.3945322036743
##$DATMOD= 1
##$DC= 2
##$DFILT= <>
##$DTYPP= 0
##$F1P= 16.9975609425685
##$F2P= -3.02152046262296
##$FCOR= 0.5
##$FTSIZE= 0
##$FT_mod= 4
##$GAMMA= 1
##$GB= 0.15
##$INTBC= 1
##$INTSCL= 1
##$ISEN= 128
##$LB= 0.24
##$LEV0= 0
##$LPBIN= 0
##$MAXI= 10000
##$MC2= 0
##$MEAN= 0
##$ME_mod= 0
##$MI= 1.114404
##$NCOEF= 0
##$NC_proc= 0
##$NLEV= 6
##$NOISF1= 3.799351
##$NOISF2= 2.8
##$NSP= 1
##$NTH_PI= 0
##$NZP= 0
##$OFFSET= 15.70392
##$PC= 1
##$PHC0= -9787.489
##$PHC1= 13.40082
##$PH_mod= 1
##$PKNL= yes
##$PPARMOD= 0
##$PSCAL= 0
##$PSIGN= 0
##$REVERSE= no
##$SF= 200.130013532006
##$SI= 16384
##$SIGF1= 3
##$SIGF2= 2
##$SINO= 400
##$SIOLD= 16384
##$SREGLST= <1H.CDCl3>
##$SSB= 0
##$STSI= 0
##$STSR= 0
##$SW_p= 3612.71676300578
##$SYMM= 0
##$S_DEV= 0
##$TDeff= 0
##$TDoff= 0
##$TI= <>
##$TILT= no
##$TM1= 0
##$TM2= 0
##$TOPLEV= 0
##$USERP1= <user>
##$USERP2= <user>
##$USERP3= <user>
##$USERP4= <user>
##$USERP5= <user>
##$WDW= 1
##$XDIM= 8192
##$YMAX_p= 0
##$YMIN_p= 0
$$ End of Bruker specific parameters
$$ ---------------------------------
##NTUPLES= NMR FID
##VAR_NAME=  TIME,          FID/REAL,        FID/IMAG
##SYMBOL=    X,             R,               I
##VAR_TYPE=  INDEPENDENT,   DEPENDENT,       DEPENDENT
##VAR_FORM=  AFFN,          ASDF,            ASDF
##VAR_DIM=   8192,          8192,            8192
##UNITS=     SECONDS,       ARBITRARY UNITS, ARBITRARY UNITS
##FACTOR=    0.0002004,     1,               1
##FIRST=     0,             0,               0
##LAST=      1.6414764,     0,               0
##MIN=       0,             -46236,          0
##MAX=       1.6414764,     84031,           0
$$ Real data points
##PAGE= N=1
##DATA TABLE= (X++(R..R)), XYDATA
$$ [...]
$$ plain form
1988 -391 724 -475 -1860 -538 488 -626 -1669 -722 673 -696 -1705 -271 426 -264 -1309 -589
2004 -589 710 -255 -1265 -371 1094 8 -1032 -216 703 184 -801 -682 701 479 -190 -204 361 607
2022 607 19 164 297 255 -266 204 356 349 -6 598 631 -214 -181 793 822 83 128 749 912 231 93 792
2044 792 787 -24 -148 701 758 341 -28 986 826 -154 -87 757 835 -600 -467 947 1078 292 -505 545
2064 545 846 -29 -407 415 876 -11 -498 230 614 169 -355 -172 162 -123 -310 82 26 -123 -27 -257 119
2085 119 -181 -496 -259 -631 -759 -29 -118 -430 -437 -463 -513 -515 -699 -186 -53 -800 -959 -118 -177 -785 -1090 -696 -309
2108 -309 -946 -1235 -243 132 -794 -988 -701 390 -266 -1480 -794 178 -478 -1327 -827 342 -300 -1146 -467
2127 -467 336 -171 -1181 -728 487 -72 -828 -77 387 -268 -1245 -536 281 -86 -614 -372 565 209 -467
$$ packed form
1988c91J115j199j385J322J026j114j043R47J395j369j009J434O97o90j045P20
2004e89J299r65j010Q94J465j086j040Q16R19n19r85J19J383k22o69j4N65K46
2022F07n88J45J33m2n21M70J52pl55O04L3q45L3R74K9p39M5O21J63o81j38O99
2044G92nq11j24Q49N7m17l69J014j60r80O7Q44P8j435J33J414J31p86p97J050
2064E45L01q75l78Q22M61q87m87P28L84m45n24J83L34k85j87L92n6j49R6k30L76
2085A19l00l15K37l72j28P30q9l12pk6n0kj84N13J33p47j59Q41n9o08l05L94L87
2108c09o37k89R92L75r26j94K87J091o56j214O86R72o56q49N00J169o42q46O79
2127d67Q03n07j010M53J215n59p56P51M64o55r77P09Q17l67n28K42R37l56o76
$$ plain form
2146 -467 285 504 83 -373 -110 391 229 -345 82 544 379 -51 599 503 -333 -220 586 762 223 -38
2166 -38 687 864 -15 -257 185 716 -29 -302 513 1036 -65 -628 636 969 132 -825 561 963 -128
2185 -128 -444 476 1227 568 -677 378 1068 162 -828 8 891 133 -463 -62 1071 503 -699 -177 799
2204 799 42 -609 -128 448 147 -675 -308 442 66 -922 -960 -23 -180 -665 -242 4 -276 -847 -150 -205 -245
2225 -245 -395 -759 -421 -475 -639 -13 -127 -553 -955 -497 -35 -614 -970 -314 -205 -755 -739 -315 -172 -755 -1195
2246 -1195 -390 -105 -554 -1230 -311 330 -421 -615 -198 288 -525 -710 -297 303 -239 -789 -91 277 -164 -485
2266 -485 -235 250 -224 -649 -430 492 -11 -223 -522 451 385 -311 56 486 447 -100 79 678 719 -87 -285
2287 -285 229 627 198 108 423 215 327 416 555 533 573 362 464 392 372 525 209 89 669 570 372 94
$$ packed form
2146d67P52K19m21m56K63N01j62n74M27M62j65m30O50r6q36J13Q06J76n39k61
2166c8P25J77q79k42M42N31p45k73Q15N23j101n63J264L33q37r57J386M02j091
2185a28l16R20P51o59j245J055O90r06r90Q36Q83p58n96M01J133n68j202N22R76
2204G99p57o51M81N76l01q22L67P50l76r88l8R37j57m85M23K46k80n71O97n5m0
2225b45j50l64L38n4j64O26j14m26m02M58M62n79l56O56J09n50J6M24J43n83m40
2246a195Q05K85m49o76R19O41p51j94M17M86q13j85M13O00n42n50O98L68m41l21
2266d85K50M85m74m25K19R22n03k12k99R73o6o96L67M30l9n47J79N99M1q06j98
2287b85N14L98m29r0L15k08J12Q9J39k2M0k11J02p2k0J53l16j20N80r9j98k78
$$ plain form
2309 94 434 441 506 491 572 626 645 200 460 571 433 203 32 208 640 474 310 366 149 187 136 241 88 84
2333 84 -188 -28 -108 253 -375 3 334 407 -149 -124 -213 166 -79 -107 -131 15 -122 -168 -239 -116 221 -635 -344
2356 -344 18 -205 -452 -599 -263 -126 -280 -586 -178 -91 -196 -800 -285 96 -317 -797 -407 314 -387 -920
2376 -920 -522 246 -550 -632 -649 172 -81 -448 -771 110 69 -524 -403 64 110 -124 -484 -69 190 -93 -442
2397 -442 22 -15 88 -59 -191 -178 131 -26 59 76 160 482 -77 -38 78 463 -170 -50 336 545 -45 -112
2419 -112 349 128 59 -122 396 909 303 63 97 351 28 111 245 614 200 153 109 197 403 -68 -48 204
2441 204 545 -68 -309 233 442 244 129 256 386 76 -240 -294 -20 236 -181 108 472 -61 -348 -527
2461 -527 -322 279 305 -88 -386 173 350 -335 -458 -539 73 -358 -402 -168 -10 -295 -474 -340 -46 13 -674
$$ packed form
2309I4L40PO5j5Q1N4J9m45K60J11j38k30j71J76M32j66j64N6k17L8n1J05j53m
2333H4k72J60q0L61o28L78L31P3n56K5q9L79k45k8k4J46j37m6p1J23L37q56K91
2356c44L62k23k47j47L36J37j54l06M08Q7j05o04N15L81m13m80L90P21p01n33
2376i20L98P68p96q2j7Q21k53l67l23Q81m1n93J21M67M6k34l60M15K59k83l49
2397d42M64l7J03j47j32J3L09j57Q5J7Q4L22n59L9J16L85o33J20L86K09n90o7
2419a12M61k21o9j81N18N13o06k40L4K54l23Q3J34L69m14m7m4Q8K06m71K0K52
2441B04L41o13k41N42K09j98j15J27J30l10l16n4K74K56m17K89L64n33k87j79
2461e27K05O01K6l93k98N59J77o85j23q1O12m31m4K34J58k85j79J34K94N9o87
$$ plain form
2482 -674 -403 -137 -375 -668 -653 20 -276 -491 -847 -226 -37 -681 -811 -3 -20 -792 -779 -247 -245 -744 -868 -554
2504 -554 -41 -336 -735 -349 -17 -354 -659 -625 150 -413 -689 -354 -200 -86 -593 -192 -288 48 -475 -154 -86
2525 -86 -190 -185 -26 -201 -313 -203 59 -371 -266 -144 33 46 -314 -2 353 149 -290 6 215 314 -589 70
2547 70 615 568 23 -39 -11 501 -171 34 1230 434 -364 -115 1002 629 -297 17 793 977 -223 -113
2567 -113 593 990 118 -242 392 523 355 -262 506 604 111 -108 333 627 -163 -209 -116 363 -44 -208 226
2588 226 649 -180 -203 113 -1 135 -187 97 -141 -34 -130 179 355 -632 -447 98 -232 -548 -346 225 155
2609 155 -717 -260 217 -43 -905 -725 315 -246 -1071 -533 -82 -64 -450 -525 270 -108 -914 -1091 215 -199
2629 -199 -658 -779 266 151 -798 -580 -218 68 -502 -738 -2 190 -222 -633 -244 -189 -487 -682 82 -153
$$ packed form
2482f74K71K66k38k93J5O73k96k15l56O21J89o44j30Q08j7p72J3N32Km99j24L14
2504e54N13k95l99L86L32l37l05L4P75n63k76L35J54J14n07M01r6L36n23L21O8
2525h6j04NJ59j75j12J10K62m30J05J22J77J3l60L12L55k04m39K96K09R9r03O59
2547G0N45m7n45o2K8N12o72K05J196p96p98K49J117l73r26L14P76J84j200J10
2567a13P06L97q72l60O34J31j68o17P68R8m93k19M41K94p90m6R3M79m07j64M34
2588B26M23q29k3L16j14J36l22K84k38J07r6L09J76r87J85N45l30l16K02N71p0
2609A55q72M57M77k60q62J80J040n61q25N38M51J8l86p5P95l78q06j77J306m14
2629a99m59j21J045j15r49K18L62K86n70k36P36J92m12m11L89N5k98j95P64k35
$$ plain form
2649 -153 -222 -518 -261 206 -45 -496 144 91 -44 -31 116 256 -186 -120 70 -9 -69 246 29 -226 186 228
2671 228 444 200 -151 79 373 -5 38 226 236 247 -224 328 613 160 -103 253 519 176 -268 178 771
2692 771 255 -197 373 722 137 -438 -31 434 369 -103 251 354 362 -224 -187 465 172 -193 -183 163 -8 -265
2714 -265 319 295 -101 -215 -32 399 353 29 -55 190 55 39 -241 268 110 -166 -54 0 -284 -242 -244 -300 -422
2737 -422 -260 30 -275 -693 -450 110 -32 -625 -439 127 -238 -591 -611 -72 115 -826 -580 -184 273 -477
2757 -477 -552 82 -80 -272 -324 62 63 -522 -676 -402 164 -613 -777 185 224 -138 -565 -238 654 -330 -684 -348
2779 -348 301 -336 -357 -72 165 -152 -303 -163 120 142 70 226 261 372 -44 273 -83 15 27 332 238 80
2801 80 53 495 143 -68 -30 811 457 237 74 622 192 -37 363 670 519 -32 416 448 387 28 430 855
$$ packed form
2649a53o9k96K57M67k51m51O40n3j35J3J47J40m42O6J90p9o0L15k17k55M12M2
2671B28K16k44l51K30K94l78M3J88J0J1m71N52K85m53k63L56K66l43m44M46N93
2692G71n16m52N70L49n85n75M07M65o5m72L54J03Qn86L7O52k93l65J0L46j71k57
2714b65N84k4l96j14J83M31m6l24q4K45j35j6k80N09j58k76J12N4k84M2kn6j22
2737d22J62K90l05m18K43N60j42n93J86N66l65l53k0N39J87r41K46L96M57p50
2757d77p5O34j62j92n2L86Jn85j54K74N66p77j64R62L9l62m27L27Q92r84l54L36
2779c48O49o37k1K85K37l17j51J40K83K2p2J56L5J11m16L17l56R8J2L05r4j58
2801H0k7M42l52k11L8Q41l54k20j63N48m30k29M00L07j51n51M48L2o1l59M02M25
$$ plain form
2823 855 600 -133 31 392 580 34 114 703 812 -12 130 358 670 -100 -122 758 684 -33 -290 305 435
2844 435 74 28 326 867 -21 20 -24 457 11 7 203 464 98 -88 331 180 -115 -304 -147 52 -154 -303
2866 -303 -219 -89 -89 -172 53 -164 -196 -222 -28 -323 -378 -349 246 -406 -469 -27 -138 30 -639 -416 -120 -407 -645
2889 -645 -447 -23 -359 -614 -60 23 -242 -485 -380 -147 37 -291 -343 265 -65 -495 -388 -87 15 -299 -528
2910 -528 -201 -97 -163 -377 152 187 -295 -49 194 305 -50 -87 34 217 123 -25 3 -58 -108 160 377 377 115
2933 115 25 32 143 570 320 116 132 436 169 -37 368 519 138 303 156 348 497 149 232 42 163 423
2955 423 90 138 490 383 -84 164 205 442 -50 177 253 141 138 -285 -171 601 238 80 42 484 327 -78
2977 -78 28 404 301 330 -224 -181 -140 -146 234 -221 200 -57 -36 -220 -41 -15 -227 -289 -153 -10 -418 -268 -487
$$ packed form
2823H55k55p33J64L61J88n46Q0N89J09q24J42K28L12p70k2Q80p4p17k57N95J30
2844D35l61m6K98N41q88M1m4M81m46mJ96K61l66j86M19j51k95j89J57J99k06j49
2866c03Q4J30%q3K25k17l2k6J94k95n5K9N95o52o3M42j11J68o69K23K96k87k38
2889f45J98M24l36k55N54Q3k65k43J05K33J84l28n2O08l30m30J07L01J02l14k29
2910e28L27J04o6k14N29L5m82K46K43J11l55l7J21J83r4j48K8o1n0K68K17%k62
2933A15r0PJ11M27k50k04J6L04k67k06M05J51l81J65j47J92J49l48Q3j90J21K60
2955D23l33M8L52j07m67K48M1K37m92K27P6j12lm23J14P72l63j58l8M42j57m05
2977g8J06L76j03K9n54M3M1oL80m55M21k57K1j84J79K6k12o2J36J43m08J50k19
$$ plain form
3000 -487 -232 -19 -260 -93 138 -138 -772 -320 -279 -41 -486 -474 -425 -292 -356 -485 -96 -143 -663 -412 -156 41
3022 41 -252 -284 -285 -329 -118 -486 -275 -140 63 -612 -318 -48 -73 -93 -590 -269 88 -385 -235 -309 229 48 -527
3045 -527 -185 305 233 -255 -250 284 71 -274 -198 70 -138 -533 18 233 501 -36 -33 52 326 321 110 81 254
3068 254 308 107 27 290 361 -63 105 405 364 477 -197 102 374 65 -9 284 205 224 449 268 164 263 92
3091 92 103 243 2 118 111 446 548 159 -69 86 295 8 117 5 -48 241 220 85 70 450 -24 79
3113 79 133 -101 93 -181 -44 83 -23 -143 -246 -216 112 61 -175 216 248 -271 -242 -219 168 71 -296 -209 -227
3136 -227 -20 -565 -504 15 232 -290 -313 -181 118 -322 -425 -165 110 -101 -362 -194 157 -217 -361 -273 -127
3157 -127 -12 -231 106 -65 -39 -16 -90 -67 -3 55 18 -43 -212 -199 119 -149 -6 99 7 57 -51 78 5 -11
$$ packed form
3000d87K55K13k41J67K31k76o34M52M1K38m45J2M9J33o4j29L89m7n20K51K56J97
3022D1k93l2jm4K11l68K11J35K03o75K94K70k5k0m97L21L57m73J50p4N38j81n75
3045e27L42M90p2m88NN34k13l45P6K68k08l95N51K15K68n37LQ5K74nk11k9J73
3068B54N4k01q0K63P1m24J68L00m1J13o74K99K72l09p4K93p9J9K25j81j04R9j71
3091I2J1J40k41J16pL35J02l89k28J55K09k87J09j12n3K89k1j35j5L80m74J03
3113G9N4k34J94k74J37J27j06j20j03L0L28n1k36L91L2n19K9K3L87r7l67Q7j8
3136b27K07n45O1N19K17n22k3J32K99m40j03K60K75k11k61J68L51l74j44Q8J46
3157a27J15k19L37j71K6K3p4K3O4N8l7o1j69J3L18k68J43J05r2N0j08J29p3j6
$$ plain form
3181 -11 -54 145 227 175 -311 225 30 -435 -186 167 486 108 -240 262 382 38 -132 351 613 -51 64
3202 64 271 484 186 -237 272 460 248 32 33 242 151 36 -49 85 221 -173 65 421 146 2 -89 82
3224 82 381 -80 19 304 -133 -6 -71 158 150 149 -34 221 -157 -72 15 44 -297 -231 134 60 6 -184 133 -179
3248 -179 -272 -71 146 105 -259 -163 142 -166 -504 -209 -5 -104 -426 -195 -114 243 -709 -636 -145 -21 -544 -519
3270 -519 -155 26 -264 -632 -110 -79 -266 -487 -381 187 -321 -307 -458 -436 -312 -340 -191 145 96 -525 -187 118
3292 118 -48 -546 -109 -173 -396 -295 -336 -110 -338 79 106 -34 -290 4 -66 -65 -230 -205 -145 -223 -385 282 255
3315 255 190 34 -25 554 413 -49 24 385 455 257 38 115 449 -220 -227 454 282 -149 11 247 712 -190
3337 -190 -45 172 372 -174 -136 517 422 76 -113 536 743 163 -271 297 326 262 309 230 479 371 28 279
$$ packed form
3181a1m3J99Q2n2m86N36j95m65K49L53L19l78l48N02J20l44j70M83K62o64J15
3202F4K07K13k98m23N09J88k12k16JK09r1j15q5J34J36l94K38L56k75j44r1J71
3224H2K99m61R9K85m37J27o5K29qjj83K55l78Q5Q7K9l41O6L65p4n4j90L17l12
3248a79r3K01K17m1l64R6L05l08l38K95K04r9l22K31Q1L57r52P3M91J24n23K5
3270e19L64J81k90l68N22L1j87k21J06N68n08J4j51K2J24k8J49L36m9o21L38L05
3292A18j66m98M37o4k23J01m1K26k28M17K7j40k56K94p0Jj65K5O0p8j62O67k7
3315B55o5j56n9N79j41m62P3L61P0j98k19P7L34o69pO81j72m31J60K36M65r02
3337a90J45K17K00n46L8O53r5l46j89O49K07n80m34N68K9o4M7p9K49j08l43K51
$$ plain form
3359 279 389 -50 -126 258 616 293 -125 301 210 190 -36 131 215 -103 299 295 -164 -71 56 228 34 -144
3381 -144 -138 -216 -220 -203 -104 10 -76 -188 -284 -25 -135 -415 74 259 113 -413 100 -245 -288 -285 -254 77 -146 -552
3405 -552 -100 227 -2 -305 -611 -36 -137 -193 -257 -20 -37 -516 -601 -69 -105 -511 -440 -123 -22 -15 -540 -138 -5
3428 -5 -44 -593 -122 -100 -248 -21 -116 39 -418 -3 -78 -13 -409 -163 142 -119 244 -214 -56 -14 80 138 -85
3451 -85 0 -290 -92 117 -515 172 267 111 -49 90 81 353 139 -145 321 117 -69 0 237 488 112 -163
3473 -163 137 417 32 101 177 312 319 -250 168 198 -153 -202 -137 573 100 11 -156 316 -55 -368 -130 244 187
3496 187 33 32 21 2 49 -70 -171 289 81 -39 83 23 -343 -255 -220 -48 -112 177 -7 -254 -180 48 -227
3519 -227 -309 -269 -110 -195 -125 -174 -147 0 -7 -535 86 -79 -244 -131 -118 94 -315 -500 180 31 -356 -403 -88
$$ packed form
3359B79J10m39p6L84L58l23m18M26r1k0k26J67Q4l18M02mm59R3J27J72j94j78
3381a44Op8mJ7R9J14q6j12r6K59j10k80M89J85j46n26N13l45m3LL1L31k23m06
3405e52M52L27k29l03l06N75j01n6o4K37j7m79q5N32l6m06P1L17J01Pn25M02J33
3428el9n49M71K2j48K27r5J55m57M15p5O5l96K46L05k61L63m58J58M2R4N8k23
3451h5Q5k90J98K09o32O87R5j56j60J39rK72k14k84M66k04j86O9K37K51l76k75
3473a63L00K80l85O9P6J35Pn69M18L0l51m9O5P10m73q9j67M72l71l13K38L74n7
3496A87j54jj1j9M7j19j01M60k08j20J22o0l66Q8L5J72o4K89j84k47P4K28k75
3519b27q2M0J59q5P0m9K7J47pn28O21j65j65J13J3K12m09j85O80j49l87m7L15
$$ plain form
3542 -88 -160 117 -247 -215 -112 -334 -212 -13 153 -175 -120 144 8 -101 -304 -173 -126 -297 -362 -184 94 37
3564 37 122 -158 -72 -52 -90 -223 162 1 -13 279 -203 66 188 98 52 251 354 63 -128 36 86 539 257
3587 257 -27 135 205 68 -89 97 213 226 -258 345 256 322 50 -45 138 95 293 49 137 103 -214 104 117
3610 117 438 88 -335 186 516 97 -297 -25 166 -7 40 232 235 165 -90 -34 277 111 -22 -156 31 128
3632 128 0 -121 -12 271 65 -250 53 -56 -153 -40 -173 -388 85 -168 42 -222 -53 -169 -215 -95 96
3653 96 100 -205 -320 -112 60 31 -52 -67 -383 -325 -379 -183 192 47 -431 -205 -297 -211 -566 -261 54 -382 -333 -172
3677 -172 82 -470 22 -409 18 116 -309 -238 -100 -61 -319 -245 -176 137 -257 -333 -32 -197 -322 -286 -114 341
3699 341 20 163 -143 -218 284 98 104 324 93 8 -51 -20 490 152 -134 -199 88 161 201 17 177 397 282
$$ packed form
3542h8p2K77l64L2J03k22J22J99J66l28N5K64j36j09k03J31M7j71o5J78K78n7
3564C7Q5k80Q6K0l8j33L85j61j4K92m82K69J22r0m6J99J03k91j91J64N0M53k82
3587B57k84J62P0j37j57J86J16J3m84O03q9O6k72r5J83m3J98k44Q8l4l17L18J3
3610A17L21l50m23N21L30m19l94K72J91j73M7J92Lp0k55N6L11j66j33j34J87R7
3632A28j28j21J09K83k06l15L03j09r7J13j33k15M73k53K10k64J69j16m6J20J91
3653I6Ml05j15K08J72k9q3j5l16N8n4J96L75j45m78K26r2Q6l55L05L15m36M9J61
3677a72K54n52M92m31M27R8m25P1J38L9k58P4O9L13l94p6L01j65j25L6J72M55
3699C41l21J43l06p5N02j86OK20k31q5n9L1N10l38k86o5K87P3M0j84J60K20j15
$$ plain form
3722 282 189 180 34 28 -132 -51 457 120 130 237 301 121 -112 208 120 187 90 36 112 22 -27 -245 177 110 -78
3747 -78 -25 244 -120 142 48 139 -1 375 108 -3 37 183 312 38 200 131 58 46 -84 94 174 -334 -102
3770 -102 21 61 -230 -355 196 146 -314 -296 179 128 82 -181 -154 228 -399 -460 -268 -83 -334 -320 -127 -138 -238
3793 -238 -386 -514 -173 137 -162 -269 -248 -163 -427 -106 -111 -63 -58 -275 -231 -13 -295 -63 -51 -94 60 -261 -59
3816 -59 -278 4 73 -321 -325 23 -108 -166 -232 -180 82 -247 102 30 6 192 -173 -351 102 -155 24 13 89 246
3840 246 -142 -173 158 236 -143 -130 88 226 -145 16 200 198 -123 -162 195 237 197 -137 -168 -42 306 53 346
3863 346 254 32 221 238 200 183 -18 -35 510 224 65 304 38 158 58 5 51 -88 108 -127 -128 -158 13
3886 13 431 186 374 -39 171 15 8 65 76 -55 -193 17 -34 309 -252 -299 368 -208 -391 148 54 -203 -326
$$ packed form
3722B82r3rj46oj60Q1N08l37J0J07O4j80k33L20q8O7r7n4P6r0m9k18M22o7j88
3747g8N3K69l64K62r4R1j40L76k67j11M0J46J29k74J62o9p3j2j30J78Q0n08K32
3770a02J23M0k91j25N51n0m60J8M75n1m6k63K7L82o27o1J92J85k51J4J93j1j00
3793b38j48j28L41L10k99j07K1Q5k64L21nM8Nk17M4K18k82K32J2m3J54l21K02
3816e9k19K82O9l94mL48j31n8o6N2K62l29L49p2k4J86l65j78M53k57J79j1P6J57
3840B46l88l1L31P8l79J3K18J38l71J61J84kl21l9L57M2m0l34l1J26L48k53K93
3863C46r2k22J89J7l8j7k01j7N45k86j59K39k66J20j00n3M6j39J96k35jl0J71
3886A3M18k45J88m13K10j56pN7J1j31j38K10n1L43n61m7O67n76j83N39r4k57j23
$$ plain form
3909 -326 237 130 -84 -350 -309 407 -20 -254 -344 85 232 -269 -126 -115 224 -275 -65 63 82 -151 -264
3930 -264 -77 58 -132 -35 32 42 -147 -415 140 -261 -291 -139 -192 36 -100 181 -42 -268 -334 -86 -81 -291 61
3953 61 39 148 -194 -113 110 96 24 -36 3 -96 -174 -87 143 -268 -276 7 -36 447 -43 -274 -147 201 191 -283 110
3978 110 487 395 -91 -20 360 110 -36 -47 165 227 -172 233 270 197 54 -96 104 103 123 249 225 -164 219
4001 219 240 51 241 162 -10 46 131 -44 -231 428 150 19 151 143 26 19 -48 -82 -107 -32 -188 -117 -261 -231 -60
4026 -60 -108 -84 -222 226 56 -40 112 26 -201 -133 -246 -150 -87 -140 -262 3 4 -200 -142 213 260 -180 -532 131
4050 131 -244 -142 -36 -89 35 -421 -412 -135 -131 -246 -291 -162 -6 33 -141 160 -60 68 -27 -240 -121 169 -240
4073 -240 -200 97 397 -101 -100 -184 129 -117 -125 128 80 242 34 -73 -135 21 50 -28 236 14 395 45 -124
$$ packed form
3909c26N63j07k14k66M1P16m27k34r0M29J47n01J43J1L39m99K10J28J9k33j13
3930b64J87J35j90R7O7J0j89k68N55m01l0J52n3K28j36K81k23k26o6K48Nk10L52
3953F1k2J09l42Q1K23j4p2o0L9r9p8Q7K30m11qK83m3M83m90k31J27L48j0m74L93
3978A10L77r2m86P1L80k50j46j1K12O2l99M05L7p3j43j50K00jK0J26k4l89L83
4001B19K1j89J90p9j72N6Q5j75j87O59k78j31J32qj17po7l4k5P5j56P1j44L0J71
4026f0m8K4j38M48j70r6J52q6k27O8j13R6O3n3j22K65Jk04N8L55M7m40l52O63
4050A31l75J02J06n3J24m56RK77Mj15m5J29J56L9j74L01k20J28r5k13J19K90m09
4073b40M0K97L00m98Jq4L13k46qK53m8J62k08j07o2J56K9p8K64k22L81l50j69
$$ plain form
4096 -124 10 64 93 -162 91 14 296 225 442 317 97 339 97 327 187 -96 -29 21 -36 88 -90 402
4118 402 607 356 237 -1 -7 -89 188 387 379 63 -59 20 197 -43 14 60 111 121 178 99 92 52 -115 5 9 229
4144 229 277 -113 -78 15 -269 -23 -162 170 125 -182 -272 -70 34 362 16 -99 231 263 -139 -240 -16 -61
4166 -61 -140 -164 -37 61 -68 -108 18 196 83 -222 -445 -296 -24 -89 -321 -14 1 -220 -436 66 -350 -277 -411
4189 -411 -34 33 -241 -232 52 16 -221 -158 -409 -219 -217 -43 13 -357 -165 -229 -119 311 2 34 208 -260 171
4212 171 -328 70 68 228 -70 -13 -9 94 -121 -261 73 -4 80 316 201 -236 -14 -222 232 -186 -74 217
4234 217 -355 -62 303 122 -74 -19 -98 24 125 -24 82 59 359 358 -50 125 51 -149 87 407 566 -4
4256 -4 4 -358 -82 203 1 280 160 -79 137 123 -328 -51 -85 88 170 141 -21 -186 38 128 80 -216 259
$$ packed form
4096a24J34N4K9k55K53p7K82p1K17j25k20K42k42K30j40k83O7N0n7J24j78M92
4118D02K05k51j19k38oq2K77J99ql16j22P9J77k40N7M6N1J0N7p9pm0j67J20MK20
4144B29M8l90L5R3k84K46j39L32m5l07r0K02J04L28l46j15L30L2m02j01K24m5
4166f1p9k4J27R8j29m0J26J78j13l05k23J49K72o5k32L07J5k21k16N02m16P3j34
4189d11L77O7k74RK84l6k37O3k51J90KJ74N6l70J92o4J10M30l09L2J74m68M31
4212A71m99L98kJ60k98N7MJ03k15j40L34p7Q4K36j15m37K22k08M54m18J12K91
4234B17n72K93L65j81j96N5p9J22J01j49J06k3L00jm08J75p4k00K36L20J59n70
4256dQl62K76K85k02K79j20k39K16j4m51K77l4J73Q2k9j62j65K24R0m8k96M75
$$ plain form
4279 259 79 162 -265 -136 -101 4 -339 -47 124 -532 -418 -67 -64 -250 79 -252 -103 -211 -222 -205 -286 141
4301 141 -95 -66 -143 110 -71 -195 96 -44 -251 -87 0 36 -21 -179 -140 -147 16 -282 129 -174 42 -164 42
4324 42 -110 -5 -116 -340 -110 19 239 -295 -234 -92 25 129 -179 128 -275 -204 -373 -315 67 239 -227
4345 -227 -87 64 -291 138 -5 196 -202 -182 124 19 136 -81 -25 -36 208 145 -334 -29 -121 183 70 15
4367 15 72 -125 27 86 339 182 -136 105 -102 217 259 91 -72 -83 39 173 215 96 103 133 -127 81 6
4390 6 -88 -297 -263 129 183 225 168 69 26 289 152 5 57 135 88 8 381 205 -167 143 -52 -66 164 -148 39
4415 39 46 -346 -107 59 3 -103 76 495 -83 64 -140 81 -138 -186 -228 -202 11 110 -115 25 -56 -6 -328
4438 -328 84 -99 -118 -138 -385 85 -203 -408 -136 62 -102 84 -134 8 -89 -264 21 -224 59 -85 -155
$$ packed form
4279B59j80Q3m27J29L5J05l43K92J71o56J14L51Lj86L29l31J49j08j1J7q1M27
4301A41k36K9p7K53j81j24K91j40k07J64Q7L6n7j58L9pJ63k98M11l03K16k06K06
4324D2j52J05j11k24K30J29K20n34O1J42J17J04l08L07m03P1j69N8L82J72m66
4345b27J40J51l55M29j43K01l98K0L06j05J17k17N6j1K44o3m79L05r2L04j13n5
4367A5N7j97J52N9K53j57l18K41k07L19M2j68j63j1J22J34M2j19PL0k60K08p5
4390Fr4k09L4L92N4M2n7r9m3K63j37j47N2P8m7q0L73j76l72L10j95j4K30l12J87
4415C9Pl92K39J66n6j06J79M19n78J47k04K21k19m8m2K6K13R9k25J40q1N0l22
4438c28M12j83j9k0k47M70k88k05K72J98j64J86k18J42r7j75K85k45K83j44p0
$$ plain form
4459 -155 -259 -268 238 -65 -150 -142 -235 39 -196 -143 128 199 50 -400 202 -45 -290 1 -86 146 -63 -44 173
4482 173 -12 -227 192 374 -74 -150 -174 103 70 368 -168 101 218 73 142 100 116 61 -26 -197 369 168 183
4505 183 100 -32 -124 -4 264 -246 -229 51 260 103 163 251 -201 97 -3 165 -146 -296 -104 -94 290 59
4527 59 398 320 78 157 -122 -9 -15 155 251 46 -24 -131 74 -164 81 -22 -274 -65 -229 110 219 -48
4549 -48 -219 -207 14 -109 91 34 -364 -284 -103 -215 -139 -67 -38 123 166 -211 27 2 -100 38 -189 292 173
4572 173 -239 -32 -116 -68 -86 205 89 44 -194 191 -94 11 -173 -11 -102 118 -134 140 197 -44 137 -193
4594 -193 -160 -137 3 144 100 -205 -11 199 18 -6 -124 85 -57 -209 65 226 78 -465 -185 29 -363
4615 -363 -68 -89 103 369 -29 -229 116 85 -86 274 -58 329 86 424 124 139 212 -66 262 360 182 84
$$ packed form
4459a55j04rN06l03q5Qr3K74k35N3K71P1j49m50O02k47k45K91q7K32k09J9K17
4482A73j85k15M19J82m48p6k4K77l3K98n36K69J17j45O9m2J6n5q7j71N66k01J5
4505A83q3j32r2J20K68n10J7K80K09j57O0Q8m52K98j00J68l11j50J92J0L84k31
4527E9L39p8k42P9k79J13oJ70R6k05p0j07K05k38K45j03k52K09j64L39J09k67
4549d8j71J2K21j23K00n7l98Q0J81j12P6P2K9J61M3l77K38k5j02J38k27M81j19
4572A73m12K07q4M8j8K91j16m5k38L85k85J05j84J62r1K20k52K74N7k41J81l30
4594a93L3K3J40J41m4l05J94K10j81k4j18K09j42j52K74J61j48n43K80K14l92
4615c63K95k1J92K66l98k00L45l1j71L60l32L87k43L38l00J5P3k78L28R8j78r8
$$ plain form
4637 84 253 147 77 421 202 261 -41 -169 224 251 142 181 -162 126 -192 -128 -141 217 330 161 -108 41
4659 41 -284 236 -144 50 -33 28 231 -126 -94 123 72 -52 -48 186 168 7 135 -168 252 113 -197 21 36
4682 36 -51 14 193 9 -249 -487 -363 -305 -326 54 217 39 -51 -244 105 -194 105 84 67 114 -15 44 166
4705 166 -120 -99 -48 73 209 -245 -166 -205 -413 277 -25 -282 -137 -289 89 -124 -96 -23 -203 39 1 52 0
4728 0 -181 -235 -255 -353 -218 61 -380 59 -244 -93 -50 -55 68 171 -73 141 -155 -175 59 -135 -168 216 -245
4751 -245 -97 157 -29 -48 75 -129 50 30 29 28 107 62 -188 147 -212 312 -60 -74 364 63 125 -15 8 32
4775 32 -122 8 14 144 172 18 -110 122 90 -279 84 -221 -118 319 41 4 -30 149 28 211 89 -161
4797 -161 90 -43 -29 82 138 17 90 29 -93 85 44 -87 27 -79 -14 133 -129 -12 -83 -130 -286 -40 -143
$$ packed form
4637H4J69j06p0L44k19N9l02j28L93K7j09L9l43K88l18O4j3L58J13j69k69J49
4659D1l25N20l80J94q3O1K03l57L2K17n1j24MK34j8j61J28l03M20j39l10K18J5
4682C6q7O5J79j84k58k38J24N8k1L80J63j78r0j93L49k99K99k1j7M7j29N9J22
4705A66k86K1N1J21J36m54P9l9k08O90l02k57J45j52L78k13K8P3j80K42l8N1n2
4728@j81n4k0r8J35K79m41M39l03J51M3nJ23J03k44K14k96k0K34j94l3L84m61
4751b45J48K54j86j9J23k04J79k0jjP9m5k50L35l59N24l72j4M38l01O2j40K3K4
4775C2j54J30OJ30K8j54j28K32l2l69L63l05J03M37k78l7l4J79j21J83j22k50
4797a61K51j33J4J11N6j21P3o1j22J78m1j31J14j06O5J47k62J17p1m7j56K46j03
$$ plain form
4820 -143 -52 77 77 106 -97 -189 29 55 -69 240 -130 -208 -198 285 -62 -121 5 -176 -51 -122 10 -137 -105 -326
4844 -326 223 17 32 90 55 374 -40 231 158 -126 -77 -261 -198 -46 -124 -93 -228 13 96 -8 189 137 405
4867 405 16 -76 -100 66 350 64 -33 14 123 258 -28 -111 -44 146 116 -255 115 9 -27 -190 164 71 85
4890 85 256 69 -84 168 330 -104 -16 150 -302 156 92 -103 30 -89 -92 -38 -173 -146 101 -200 -28 251
4912 251 11 42 191 -179 -218 -154 -128 25 -59 -20 128 428 237 -48 -328 142 -12 -211 -298 157 281 -46
4934 -46 185 -101 47 -479 -214 94 -288 -213 44 -145 -97 -80 106 45 11 -448 -37 117 -332 78 -291 -236
4956 -236 -138 202 23 -98 24 -251 -468 -89 -43 160 -110 -338 49 -153 -413 15 -127 -214 200 -379 88
4977 88 -221 172 -43 176 81 -250 63 -192 -67 -323 -174 -70 -89 151 39 -107 0 70 -96 -18 58 31
$$ packed form
4820a43R1J29%K9k03r2K18K6j24L09l70p8J0M83l47n9J26j81J25p1J32j47L2k21
4844c26N49k06J5N8l5L19m14K71p3k84M9j84O3J52p8L1j35K41Q3j04J97n2K68
4867D05l89r2k4J66K84k86r7M7J09J35k86q3O7J90l0l71L70j06l6j63L54r3J4
4890H5J71j87j53K52J62m34Q8J66m52M58o4j95J33j19lN4j35K7K47l01J72K79
4912B51k40L1J49l70l9O4K6J53q4L9J48L00j91k85k80M70j54j99q7M55J24l27
4934d6K31k86J48n26K65L08l82P5K57j89M8J7J86o1l4m59M11J54m49M10l69N5
4956b36R8L40j79j21J22k75k17L79M6K03k70k28L87k02k60M28j42q7M14n79M67
4977H8l09L93k15K19r5l31L13k55J25k56J49J04j9K40j12j46J07P0j66P8P6k7
$$ plain form
4999 31 13 15 -96 -73 93 60 92 -235 -138 -11 106 141 27 18 24 267 261 15 -15 113 -8 238 -134 283 52
5024 52 422 -19 242 51 -240 89 -121 52 -130 -73 -101 -254 -80 -229 238 132 56 -6 -185 -2 -72 107
5046 107 123 52 56 -80 82 -172 61 -110 98 162 -199 -181 211 -101 41 17 12 -282 -4 268 80 -154 4
5069 4 240 -339 -121 101 -224 18 -278 -77 -6 -137 -68 -72 -15 167 37 136 134 -75 211 42 -60 -129 -89 -245
5093 -245 404 -22 -82 -150 19 142 -309 73 -41 -235 -30 106 113 -127 -19 -10 104 -141 -87 -71 56 -127 -119
5116 -119 -127 76 74 -154 106 -169 -255 -36 75 364 -125 106 115 240 -99 -365 -168 -49 -12 130 213 -64 367
5139 367 -128 98 50 283 -25 -270 118 239 -15 -126 -187 15 62 48 -85 -61 115 -10 169 -264 288 -104
5161 -104 -192 144 128 63 156 124 -443 32 -34 134 -126 -242 -99 -51 -454 240 119 56 -8 16 24 -424 58 -127
$$ packed form
4999C1j8Kj11K3J66l3L2l27R7J27J17L5j14rOK43ok46l0J28j21K46l72M17k31
5024E2L70m41K61j91k91L29k10J73j82N7k8j53J74j49M67j06p6o2j79J83p0J79
5046A07J6p1Mj36J62k54K33j71K08O4l61J8L92l12J42k4nk94K78K72j88k34J58
5069DK36n79K18K22l25K42k96K01P1j31O9mN7J82j30R9kk09K86j69j02o9M0j56
5093b45O49m26o0o8J69J23m51L82j14j94K05J36Pk40J08RJ14k45N4J6J27j83Q
5116a19qK03kk28K60k75q6K19J11K89m89K31RJ25l39k66J97J19L7J42Q3k77M31
5139C67m95K26m8K33l08k45L88J21k54j11o1K02M7j4j33K4J76j25J79m33N52l92
5161a04q8L36j6o5R3l2n67M75o6J68k60j16J43M8m03O94j21o3o4K4Qm48M82j85
$$ plain form
5185 -127 110 -90 30 -428 264 63 -205 -100 -94 135 309 159 118 -178 -46 -86 -178 -160 -16 -143 -261 148
5207 148 106 -443 6 136 -455 219 70 -20 -354 -94 -332 217 -52 -80 -205 -120 -194 -43 0 -104 -125 -283
5229 -283 -221 73 166 -38 -153 -217 -196 -239 307 68 280 17 121 -48 -85 -120 12 105 -127 -93 -73 -4 -101 -41
5253 -41 65 151 -32 27 -53 18 113 8 118 -19 218 76 383 135 196 19 137 -189 146 -78 -196 -172 18
5276 18 -30 196 161 -123 184 -26 -86 -149 111 -32 198 -178 -113 -30 -143 -14 -55 388 -159 -85 199 256 -200
5299 -200 -368 -45 57 49 92 236 173 157 -252 179 112 181 -131 -14 -129 -87 347 342 -18 112 176 188 161 -4
5323 -4 10 25 -231 36 238 242 8 -52 -72 -234 233 -88 -8 -69 149 -114 46 190 -138 -197 -287 -114 52 -145
5347 -145 -171 132 -57 -91 -279 86 -82 111 -235 -45 94 -58 -150 -224 188 98 -78 -103 200 -96 -512 -15
$$ packed form
5185a27K37k00J20m58O92k01k68J05OK29J74j50m1k96J32m0r2J8J44j27j18M09
5207A48m2n49M49J30n91O74j49r0l34K60k38N49k69k8j25Q5p4J51M3j04k1j58
5229b83O2K94R3k04j15o4K1m3N46k39K12k63J04j69l7l5J32R3k32L4K0O9r7O0
5253d1J06Q6j83N9q0P1R5j05J10j37K37j42L07k48O1j77J18l26L35k24j18K4J90
5276A8m8K26l5k84L07k10o0o3K60j43K30l76O5Q3j13J29m1M43n47P4K84N7m56
5299b00j68L23J02qM3J44o3j6m09M31o7O9l12J17j15M2M34nl60J30O4J2k7j65
5323dJ4J5k56K67K02Mk34o0k0j62M67l21Q0o1K18k63J60J44l28n9r0J73J66j97
5347a45k6L03j89l4j88L65j68J93l46J90J39j52r2p4M12r0j76k5L03k96m16M97
$$ plain form
5369 -15 -355 363 -25 -111 -165 151 0 -173 -35 81 122 64 -244 -97 87 120 -83 49 86 -28 245 -256
5391 -256 77 132 -145 187 81 45 197 -57 -157 60 347 -38 -145 409 11 -67 18 111 -154 177 -30 -173
5413 -173 216 128 90 -97 143 231 216 31 236 -62 62 -134 147 -3 54 32 276 86 -235 -2 -10 140 -145
5436 -145 152 -76 57 123 183 83 -151 78 -273 86 -167 -83 79 -217 161 90 -21 8 -49 51 122 -114
5458 -114 -261 -225 -9 -18 -130 42 119 -89 97 -287 -73 -145 -41 59 260 43 -138 -191 -134 -117 41 -297 47
5481 47 -4 -54 108 91 -184 -1 254 -328 28 -278 -175 102 152 72 269 -60 -198 -74 193 -113 39 187
5503 187 -22 -235 82 -89 -274 75 409 265 -86 155 42 137 10 -28 -18 -203 -82 1 3 -251 -127 -158
5525 -158 -130 -132 -54 379 36 20 -41 -164 16 -45 9 215 -69 -49 -193 138 94 -15 66 186 -260 104 156 189
$$ packed form
5369a5l40P18l88q6n4L16j51j73J38J16M1n8l08J47J84L3k03J32L7j14K73n01
5391b56L33N5k77L32j06l6J52k54j00K17K87l85j07N54l98p8Q5R3k65L31k07j43
5413a73L89q8l8j87K40Q8j5j85K05k98J24j96K81j50N7k2K44j90l21K33qJ50k85
5436a45K97k28J33O6O0j00k34K29l51L59k53Q4J62k96L78p1j11K9n7J00P1k36
5458a14j47L6K16rj12J72P7k08J86l84K14p2J04J00K01k17j81n3N7J7J58l38L44
5481D7n1n0J62j7k75J83K55n82L56l06J03K77N0q0J97l29j38J24K67l06J52J48
5503A87k09k13L17j71j85L49L34j44l51K41j13R5j27l8J0j85J21Q3Kk54J24l1
5525a58K8kP8M33l43j6o1j23J80o1N4K06k84K0j44L31m4j09Q1J20m46L64N2L3
$$ plain form
5549 189 -108 151 160 -51 -29 -14 199 236 84 39 -36 40 -226 -200 -189 153 -278 -158 -66 -431 94 66 68 149 72
5574 72 -137 109 -145 -56 0 49 -250 166 -356 -38 153 -211 -103 -23 214 -299 193 -45 -66 3 162 52
5596 52 17 -67 72 304 158 -100 -34 63 210 -35 -19 -191 151 62 -25 -248 -187 212 -95 -74 33 219 -307
5619 -307 -164 -27 61 88 194 261 40 139 -67 -164 313 -12 -8 289 -86 -1 -133 74 518 -167 48 207 235
5642 235 286 73 -195 146 114 -104 -90 -247 -9 -77 -154 -19 -298 39 -45 -71 -195 -22 168 186 70 -108 245
5665 245 -251 0 -97 -201 188 -163 152 187 170 53 -110 138 55 59 100 41 454 -122 -124 -403 -113 -187 -54 217
5689 217 -31 -112 51 146 64 -241 128 228 70 -162 -106 132 -91 -363 -242 187 -178 -67 -97 -85 -303 -280
5711 -280 -299 -66 -231 -4 142 33 189 129 19 22 151 386 78 3 191 -79 123 38 260 153 119 -314
$$ packed form
5549A89k97K59Rk11K2J5K13L7j52m5p5P6k66K6J1L42m31J20R2l65N25k8KQ1p7
5574G2k09K46k54Q9N6M9k99M16n22L18J91l64J08Q0K37n13M92k38k1O9J59j10
5596E2l5q4J39K32j46k58O6R7J47k45J6j72L42q9q7k23O1L99l07K1J07J86n26
5619c07J43J37Q8K7J06O7k21R9k06r7M77l25MK97l75Q5j32K07M44o85K15J59K8
5642B35N1k13k68L41l2k18J4j57K38o8p7J35k79L37q4k6j24J73J90J8j16j78L53
5665B45m96K51r7j04L89l51L15L5j7j17j63K48q3MM1n9M13n76kk79K90p4J33K71
5689B17k48q1J63R5q2l05L69J00j58k32N6K38k23k72J21M29l65J11l0J2k18K3
5711b80j9K33j65K27J46j09J56o0j10LJ29K35l08p5J88k70K02q5K22j07l4m33
$$ plain form
5733 -314 216 63 70 -144 -280 -83 -341 74 -2 146 -1 51 8 113 173 -192 -147 -166 -114 -28 -119 53 91 -207
5757 -207 123 13 -98 58 31 -15 139 102 170 -350 -140 41 -182 50 -110 45 14 54 81 154 -19 139 -119
5780 -119 -32 125 -147 88 -5 160 -150 -162 169 31 -331 -118 116 188 117 -91 -70 89 -54 70 174 -141
5802 -141 403 -196 -126 51 194 135 -73 -57 316 -8 -138 -18 260 6 284 18 192 101 105 -102 136 190
5824 190 -202 161 -172 -51 -193 -9 -262 -8 -27 201 158 142 82 -41 -20 62 86 -116 119 153 29 -128 36
5847 36 111 -240 202 99 78 -237 175 226 147 -132 -176 -356 -99 -43 -28 -73 -259 5 14 -151 -208 133 -3 -74
5871 -74 -112 -89 -40 73 -107 157 -45 0 -40 -147 -261 -11 117 -204 -85 129 35 -155 56 146 36 46 9
5894 9 -22 129 -84 -57 -53 -90 283 -255 120 297 227 109 -95 -38 -179 -29 -224 7 -68 47 -172 78 291
$$ packed form
5733c14N30j53Pk14j36J97k58M15p6J48j47N2m3J05O0l65M5j9N2Q6r1J72L8k98
5757b07L30j10j11J56k7m6J54l7O8n20K10J81k23K32j60J55l1M0K7P3j73J58k58
5780a19Q7J57k72K35r3J65l10j2L31j38l62K13K34P2p1k08K1J59j43J24J04l15
5802a41N44n99P0J77J43n9k08J6L73l24j30J20K78k54K78k66J74r1Mk07K38N4
5824A90l92L63l33J21j42J84k53K54j9K28m3j6o0j23K1Q2K4k02K35L4j24j57J64
5847C6P5l51M42j03k1l15M12N1p9k79m4j80K57N6J5m5j86K64Rj65n7L41j36p1
5871g4l8K3M9J13j80K64k02M5m0j07j14K50J28l21J19K14r4j90K11R0j10J0l7
5894Il1J51k13K7Ml7L73n38L75J77p0j18k04N7j41J50j95K31p5J15k19K50K13
$$ plain form
5917 291 116 -230 73 69 23 81 -119 -147 -200 90 -83 107 -249 157 -172 -124 79 344 -215 -196 34 -361 134
5940 134 -242 30 65 229 -155 -153 25 -194 141 132 70 -114 70 78 42 108 104 33 63 -314 262 -42 253 -147 133
5965 133 -123 -18 -62 -43 -12 117 -74 -301 167 -50 -52 174 354 -263 -209 -97 3 -120 -146 -159 -40 -17 377
5988 377 -169 191 190 -211 167 20 160 -154 -44 -129 49 168 -55 62 68 5 -34 115 53 -477 -241 105 267
6011 267 -99 63 -74 -37 -6 -148 -92 135 147 177 -127 234 118 155 41 132 -167 89 37 -175 116 -163 -77
6034 -77 -111 266 -16 90 -142 179 -436 104 -76 277 -38 -139 428 181 168 25 111 201 -152 -176 114 -64
6056 -64 -104 -258 275 -13 262 -31 61 120 -44 34 81 5 -248 -138 -172 432 186 208 -8 -130 -42 50 -4 218
6080 218 -349 -59 395 152 -49 238 -287 -12 56 169 0 117 112 -197 -77 -33 -199 -136 -109 7 -200 -2
$$ packed form
5917B91j75l46L03mm6N8k00k8n3K90j73J90l56M06l29M8K03K65n59J9K30l95M95
5940A34l76K72L5J64l84KJ78k19L35ro2j84J84Ql6O6mp1L0l77N76l04K95m00K80
5965A33k56J05m4J9L1J29j91k27M68k17kK26J80o17N4J12J00j23k6j3J19K3L94
5988C77n46L60jm01L78j47J40l14J10q5J78J19k23J17Oo3l9J49o2n30K36L46J62
6011B67l66J62j37L7L1j42N6K27J2L0l04L61j16L7j14R1k99K56n2k12K91k79Q6
6034g7l4L77k82J06k32L21o15N40j80L53l15j01N67k47j3j43Q6R0l53k4K90j78
6056f4m0j54N33k88K75k93R2N9j64P8M7p6k53J10l4O04k46K2k16j22Q8R2n4K22
6080B18n67K90M54k43k01K87n25K75O8J13j69J17nl09J20M4j66O3K7J16k07J98
$$ plain form
6102 -2 -18 -274 234 -2 -208 295 -156 185 175 -4 -230 -323 -3 145 76 -15 -24 241 22 127 105 147 20 -18
6126 -18 -71 128 -279 144 -155 -164 -131 -35 -206 35 -85 99 115 57 -235 119 -228 77 258 -19 255 129 71
6149 71 163 43 17 162 94 -335 -111 -72 11 27 -173 -13 -358 35 2 -68 131 -195 -99 353 -278 53 -227
6172 -227 192 -74 -238 -207 -134 163 9 -24 49 148 -36 -192 -265 -105 292 392 -66 59 -81 -100 -104 267 -135
6195 -135 258 248 161 119 -215 76 20 32 270 -96 -254 -9 -73 -234 -56 103 46 -54 51 -96 -209 73
6217 73 -145 189 -310 -187 -54 -101 -107 14 -182 -201 101 127 296 172 52 -350 -170 -154 183 44 -204 230
6239 230 70 -42 190 199 46 -97 -373 176 28 51 -196 100 -157 56 -97 -51 -46 57 105 57 -118 -84 -386
6262 -386 -182 4 -103 71 -273 21 391 21 -54 36 143 -104 -132 5 -97 52 127 -48 53 115 189 23
$$ packed form
6102bj6k56N08k36k06N03m51L41j0j79k26r3L20J48o9r1rK65k19J05k2M2j27l8
6126a8n3J99m07M23k99rL3R6j71K41j20J84J6n8k92L54l47L05J81k77K74j26n8
6149G1R2j20k6J45o8m29K24L9Q3J6k00J60l45L93l3p0J99l26R6M52o31L31k80
6172b27M19k66j64L1P3K97j54l3P3R9j84j56p3J60L97J00m58J25j40j9mL71m02
6195a35L93j0q7m2l34K91n6J2K38l66j58K45o4j61J78J59n7j00J05j47j13K82
6217G3k18L34m99J23J33m7oJ21j96j9L02K6J69j24j20m02J80J6L37j39k48M34
6239B30j60j12K32Rj53j43k76N49j48K3k47K96k57K13j53M6NJ03M8m8j75L4l02
6262c86K04J86j07J74l44K94L70l70p5R0J07k47k8J37j02J49P5j75J01O2P4j66
$$ plain form
6284 23 41 42 228 -318 -37 -148 189 -15 -52 66 -30 295 8 -140 311 16 126 -195 -155 -42 -255 -110
6306 -110 160 63 14 116 18 69 -60 -344 74 13 186 -126 6 6 -133 -90 56 -80 -54 14 -93 -148 18 -9
6330 -9 -98 97 -124 -128 -125 -71 219 169 -32 201 -189 4 -127 -257 52 -12 62 -216 -3 -46 60 -30 3 267 75
6355 75 55 131 132 -75 -141 -1 57 86 226 -259 90 -84 171 16 18 -114 199 -114 -188 -117 -25 45 -124 176 -59
6380 -59 4 63 76 -48 -301 -91 64 150 -200 106 61 63 166 35 -119 -171 -103 -148 236 -20 373 99 -227 1
6404 1 364 30 -102 68 -283 -273 212 -1 -18 3 118 -95 9 188 -37 70 195 -82 -275 -192 -7 133
6426 133 172 -162 -81 188 -296 184 64 46 40 9 27 -173 5 -61 -7 -24 218 -296 -41 164 -17 42 -103 85
6450 85 90 53 269 137 147 78 -84 172 314 133 183 -157 298 -141 -129 46 42 -98 65 40 51 -323 -28 24
$$ packed form
6284B3J8JJ86n46K81j11L37k04l7J18r6L25k87j48M51k95J10l21M0J13k13J45
6306a10K70r7m9J02r8N1j29k84M18o1J73l12J32%j39M3J46j36K6O8j07n5J66k7
6330iq9J95k21mLN4K90n0k01K33l90J93j31j30L09o4P4k78K13m3J06r0L3K64j92
6355G5k0P6Jk07o6J40N8K9J40m85L49j74K55j55Kj32L13l13p4P1R2P0j69L00k35
6380e9O3N9J3j24k53K10J55Q6l50L06m5KJ03j31j54n2O8m5L84k56L93k74l26K28
6404AL63l34j32J70l51J0M85k13j7K1J15k13J04J79k25J07J25k77j93Q3J85J40
6426A33L9l34Q1K69m84M80j20j8ol1J8k00J78o6N4j7K42n14K55K05j81N9j45J88
6450H5Nl7K16j32J0o9j62K56J42j81N0l40M55m39J2J75mj40J63k5J1l74K95N2
$$ plain form
6474 24 -117 82 -258 180 -199 -42 -245 15 158 -67 -70 -191 -2 -121 41 81 -26 -135 -182 171 147 -62
6496 -62 225 117 -160 -29 113 -99 213 174 -106 199 153 200 -100 92 17 -93 -220 320 52 -138 223 31
6518 31 91 -103 140 -290 -118 173 16 63 -58 -290 162 26 32 -73 90 -176 183 260 467 120 221 5
6540 5 162 136 -61 96 -94 -43 -94 -102 -48 185 -109 -12 149 75 56 -187 135 -88 57 -141 339 -28 80 -164
6564 -164 319 203 -189 159 -117 -82 118 -112 -109 19 187 203 -514 -199 69 195 92 21 192 34 185 -144
6586 -144 19 115 211 -144 -256 50 109 53 116 94 112 71 -128 -85 56 -108 292 -22 -221 -75 -45 78 -91
6609 -91 41 3 98 162 -175 -1 -18 -146 252 87 110 -35 107 210 -50 128 -23 -173 179 -81 -193 -215
6631 -215 -17 -21 -10 59 -284 134 -1 -246 208 -293 -178 188 154 349 -6 75 -76 -41 18 -33 -50 -80 -281 287
$$ packed form
6474B4j41J99l40M38l79J57k03K60J43k25lj21J89j19J62M0j07j09m7L53k4k09
6496f2K87j08k77J31J42k12L12l9k80L05m6M7l00J92p5j10j27N40k68j90L61j92
6518C1O0j94K43m30J72K91j57M7j21k32M52j36Oj05J63k66L59P7K07l47J01k16
6540EJ57k6j97J57j90N1n1qN4K33k94R7J61p4j9k43L22k23J45j98M80l67J08k44
6564a64M83j16l92L48k76L5K00k30LJ28J68J6p17L15K68J26j03p1J71j58J51l29
6586a44J63R6R6l55j12L06N9n6O3k2J8m1j99M3J41j64M00l14j99J46L0J23j69
6609i1J32l8R5O4l37J74j7j28L98j65K3j45J42J03k60J78j51j50L52k60j12k2
6631b15J98mJ1O9l43M18j35k45M54n01J15L66l4J95l55Q1j51L5N9n1j7l0k01N68
$$ plain form
6655 287 -145 118 78 -210 181 -21 52 -113 159 -276 -219 78 -88 20 -29 47 -238 79 237 -197 -120 243
6677 243 -175 13 89 41 5 132 -44 -37 51 144 111 34 229 -146 -83 -96 -323 -69 181 58 -150 -41 -223 -263
6701 -263 168 -227 -45 -160 -151 -190 -366 87 -246 -57 -53 24 -63 26 76 -156 15 -177 -94 69 206 -95 88
6724 88 132 -201 -180 -217 -160 -26 104 204 -137 113 154 -103 39 -85 -296 96 -152 -7 62 -2 -110 315 -58
6747 -58 38 118 118 -166 -28 -86 34 100 -160 41 -238 -66 88 -45 -365 -412 223 -129 95 257 -72 108 -120
6770 -120 -153 -55 64 -115 -16 -26 65 -65 -193 376 -158 -56 -29 -167 -266 38 192 263 206 224 171 186 132 9
6794 9 60 49 166 422 150 229 -96 -27 93 -398 39 204 -384 -106 46 48 52 -95 -97 -102 183 -218 94 65 -91
6819 -91 33 14 -168 66 -161 303 140 37 96 -214 -4 -47 155 -119 -84 123 244 108 -136 12 -107 -27
$$ packed form
6655B87m32K63m0k88L91k02P3j65K72m35N7K97j66J08m9P6k85L17J58m34P7L63
6677B43m18J88P6m8l6J27j76PQ8R3l3p7J95l75O3j3k27K54K50j23k08J09j82m0
6701b63M31l95J82j15Rl9j76M53l33J89MP7q7Q9N0k32J71j92Q3J63J37l01J83
6724H8M4l33K1l7N7J34J30J00l41K50M1k57J42j24k11L92k48J45O9o4j08M25l73
6747e8R6Q0%k84J38n8J20O6k60K01k79J72J54j33l20m7O35l52K24J62l29J80k28
6770a20l3R8J19j79R9j0R1j30j28N69n34J02K7j38r9L04J54P1n7J8n3J5n4j23
6794IN1j1J17K56k72P9l25O9J20m91M37J65n88K78J52KMj47knK85m01L12k9j56
6819i1J24j9j82K34k27M64j63j03N9l10K10m3K02k74L5K07J21j36k44J48j19Q0
$$ plain form
6841 -27 3 -21 -142 -101 -87 -26 300 16 -10 -36 -22 339 289 215 -87 128 -21 -18 69 68 67 -151 -153 121 -70 257 36
6868 36 -101 35 -62 153 -84 50 -185 263 104 -248 111 -72 -154 73 62 -100 16 -4 51 -31 -275 194
6890 194 58 10 -97 -63 -47 -227 -22 131 -101 107 -32 -97 40 199 0 484 -10 -14 -11 -29 -65 222 -31
6913 -31 -112 -96 142 -99 -251 -43 142 84 -83 106 198 -57 -148 290 44 -93 -9 36 -28 -128 -104 -7 46 36
6937 36 -18 -40 114 45 -231 -305 110 -38 -129 15 308 -66 79 -57 48 20 107 30 -40 158 41 -13 -72 -13
6961 -13 -175 -137 113 77 -209 -111 0 -124 -50 -129 -182 41 5 -218 -166 255 -263 93 -176 65 -60 585 -207
6984 -207 -163 261 -63 -210 -40 293 310 28 -251 31 69 -198 -116 189 -72 -204 -349 375 -58 57 -94
7005 -94 63 12 8 0 400 40 -109 27 -66 -79 37 -81 -15 130 -36 -138 -41 -5 153 -27 -45 -62 79 87 -31
$$ packed form
6841b7L0k4j21M1J4O1L26k84k6k6J4L61n0p4l02K15j49LQ7jjk18kK74j91L27k21
6868C6j37J36r7K15k37J34k35M48j59l52L59j83q2K27j1j62J16k0N5q2k44M69
6890A94j36m8j07L4J6j80K05J53k32K08j39o5J37J59j99M84m94mLj8l6K87k53
6913c1q1J6K38k41j52K08J85n8j67J89R2k55r1M38k46j37Q4M5o4j00K4R7N3j0
6937C6n4k2J54o9k76p4M15j48r1J44K93l74J45j36J05k8Q7p7p0J98j17n4n9N9
6961a3j62L8K50l6k86R8J11j24P4p9n3K23l6k23N2M21n18L56k69K41j25O45p92
6984b07M4M24l24j47J70L33J7k82k79K82L8k67Q2L05k61j32j45P24m33J15j51
7005i4J57n1mqM00l60j49J36r3j3J16j18O6J45j66j02R7L6J58j80j8j7J41Qj18
$$ plain form
7030 -31 76 175 -39 -205 -34 65 -69 -77 -98 -79 118 -209 -51 182 -200 411 25 -181 -166 70 -148 66 -183
7053 -183 216 239 315 -56 -45 143 136 -46 10 357 122 -1 -250 -75 -113 -216 -220 185 11 -156 84 5 162
7076 162 105 -188 -229 72 -302 -237 -166 22 -6 -242 41 46 -101 125 -249 57 -253 -143 -213 -236 33 -97 10
7099 10 38 102 -1 161 290 53 59 -131 -214 -120 -153 23 -223 7 -275 97 146 35 92 -40 -99 211 61 -136
7123 -136 15 -204 -55 78 174 -82 -85 287 -124 -136 120 -96 -50 -133 350 66 401 293 155 -45 123 280
7145 280 214 81 -27 -150 76 88 -92 152 -70 119 -107 127 97 242 52 -39 -32 -19 70 -237 -24 32 64
7168 64 180 46 -62 54 99 68 -125 17 -36 -9 286 89 38 -200 -223 -64 -67 -15 158 -164 74 61 178 184
7192 184 -321 106 -23 -317 139 122 5 -98 192 -23 153 -15 -64 12 -148 -8 -41 155 -23 80 120 -148
$$ packed form
7030c1J07R9k14j66J71R9j34qk1J9J97l27J58K33l82O11l86k06J5K36k18K14k49
7053a83L99K3P6l71J1J88pj82N6L47k35j23k49J75l8j03mM05j74j67K40p9J57
7076A62n7k93m1L01l74O5P1J88k8k36K83Nj47K26l74L06l10J10p0k3K69j30J07
7099A0K8O4j03J62J29k37Oj90q3R4l3J76k46K30k82L72M9j11N7j32n9L10j50j97
7123a36J51k19J49J33R6k56lL72m11j2K56k16M6q3M83k84L35j08j38k00J68J57
7145B80o6j33j08j23K26J2j80K44k22J89k26K34l0J45j90r1PJ3Q9l07K13N6L2
7168F4J16j34j08J16M5l1j93J42n3K7K95j97n1k38k3J59lN2J73l22K38j3J17O
7192A84n05M27j29k94M56j7j17j03K90k15J76j68m9P6j60J40l3J96j78J03M0k68
$$ plain form
7214 -148 99 -79 -87 100 -261 177 -150 -248 156 26 62 177 206 -201 -96 54 -194 -85 232 23 32 107 185
7237 185 -194 326 159 57 -120 50 -7 -203 114 -38 108 77 3 261 -110 -70 193 15 -72 -162 -28 -55
7259 -55 -242 -219 -143 224 -109 72 -36 -237 53 175 -9 -80 -168 -464 -8 150 445 148 119 40 -45 145 -46
7282 -46 54 28 15 -214 121 -150 -114 -380 -217 87 204 -233 405 26 -170 15 -55 146 143 49 38 237 -234
7305 -234 11 -20 -91 -110 -96 -48 37 24 -161 -12 -158 128 -106 73 185 -86 -307 -34 47 106 106 -110 -230 -90
7329 -90 186 -185 -18 29 223 -214 35 -88 -83 -209 -22 -198 140 132 -35 29 109 119 -152 469 158 24 -40
7352 -40 -3 -153 -275 28 154 2 128 124 11 45 143 -129 117 166 -3 -7 30 -190 240 29 19 -13 -13 -287 22
7377 22 86 -74 102 -231 56 48 61 -144 -358 364 97 344 149 -80 157 -168 115 2 -131 12 277 27
$$ packed form
7214a48K47j78qJ87l61M38l27r8M04j30L6J15K9m07J05J50k48J09L17k09RP5P8
7237A85l79N20j67j02j77J70n7j96L17j52J46l1p4K58l71M0K63j78q7r0J34k7
7259e5j87K3P6L67l33J81j08k01K90J22j84p1q8k96M56J58K95k97k9p9q5J90j91
7282d6J00k6j3k29L35k71L6k66J63L04J17m37O38l79j96J85p0K01lr4j1J99m71
7305b34K45l1p1j9J4M8Q5j3j85J49j46K86k34J79J12k71k21K73Q1N9%k16j20J40
7329i0K76l71J67M7J94m37K49j23Nj26J87j76L38qj67O4Q0J0k71O21l11j34o4
7352d0L7j50j22L03J26j52J26mj13L4R8k72K46M9j69mL7k20M30k11j0l2%k74L09
7377B2O4j60J76l33K87qJ3k05k14P22k67K47j95k29K37l25K83j13j33J43K65k50
$$ plain form
7399 27 -54 181 4 197 20 -194 -21 -183 27 101 -222 -144 -15 181 -1 -86 -80 -242 0 -80 -37 2 -88 -23
7423 -23 3 -16 35 -43 74 298 53 -140 112 212 -17 27 -300 256 171 48 -136 96 78 109 41 -122 -72 0
7447 0 -69 93 -115 282 -12 -45 -130 166 26 -112 -77 -30 89 -114 23 367 143 -336 121 133 21 5 153
7470 153 -18 -148 121 -23 230 -32 -88 221 251 -73 -24 81 298 92 -189 113 -58 300 -305 21 209
7491 209 114 378 -72 -34 269 -204 18 -298 -57 -194 21 232 -160 1 217 -430 60 189 71 -160 179
7512 179 -123 -48 221 -71 38 56 -27 38 -290 102 1 -166 142 233 -4 -119 199 -94 72 -59 -41 224
7534 224 -67 328 -298 195 -202 -130 208 -292 -17 -73 -276 308 -25 45 -56 43 97 242 -104 196 172 -50
7556 -50 -48 -157 243 -15 -157 195 97 78 115 -93 2 -37 211 -353 -81 120 293 -112 -236 -10 142 22 109
$$ packed form
7399B7q1K35j77J93j77k14J73j62K10P4l23P8J29J96j82q5Oj62K42q0M3L9r0O5
7423b3K6j9N1p8J17K24k45j93K52J00k29M4l27N56q5j23j84K32j8L1o8j63N0P2
7447@o9J62k08L97k94l3q5K96j40j38L5M7J19k03J37L44k24m79M57J2j12j6J48
7470A53j71j30K69j44K53k62n6L09L0l24M9J05K17k06k81L02j71L58o05L26J88
7491B09r5K64m50L8L03m73K22l16K41j37K15K11l92J61K16o47M90J29j18k31L39
7512A79l02P5K69k92J09J8q3O5l28L92j01j67L08R1k37j15L18k93J66j31J8K65
7534B24k91L95o26M93l97P2L38n00K75n6k03N84l33P0j01R9N4J45l46L00k4k22
7556e0Kj09M00k58j42L52r8j9L7k08R5l9K48n64K72K01J73m05j24K26J52j20Q7
$$ plain form
7579 109 -220 -59 -11 -206 85 -166 349 -8 62 42 427 4 -84 -3 404 83 -278 306 -82 143 65 154
7601 154 22 -236 -167 16 -127 59 -162 -497 61 49 37 -1 46 -43 315 -185 436 294 134 -231 154 -142
7623 -142 -139 -137 254 -62 -80 -22 -265 -83 -11 83 -92 -150 -41 3 346 55 7 117 -398 176 -101 50 -43 82
7647 82 69 -76 -302 -58 89 46 201 87 3 133 -108 -130 232 102 115 15 -328 277 23 -74 74 360
7669 360 273 45 -66 -86 397 197 -55 -21 81 9 -112 247 283 157 10 259 -3 190 -112 -13 -276 314
7691 314 -96 -183 232 43 -58 144 115 119 115 -84 266 111 213 -216 -17 88 -36 -164 313 54 24 306
7713 306 -93 246 -88 154 283 31 229 -94 212 26 350 -127 248 -184 -140 16 -141 176 273 -63 285
7734 285 137 -110 160 25 426 -97 127 -23 14 79 -22 133 -94 24 106 -47 106 173 -314 -252 245 -36
$$ packed form
7579A09l29J61M8j95K91k51N15l57P0k0L85m23q8Q1M07l21l61N84l88K25p8Q9
7601A54j32k58O9J83j43J86k21l35N58j2j2l8M7q9L58n00O21j42j60l65L85k96
7623a42LKL91l16j8N8k43J82P2R4j75n8J09M4L43k91m8J10n15N74k77J51r3J25
7647H2j3j45k26K44J47m3J55j14q4J30k41k2L62j30J3j00l43O05k54r7J48K86
7669C60q7k28j11k0M83k00k52L4J02p2j21L59L6j26j47K49k62J93l02R9k63N90
7691C14m10q7M15j89j01K02k9Mmj99L50j55J02m29J99J05j24j28M77k59l0K82
7713C06l99L39l34K42J29k52J98l23L06j86L24m77L75m32M4J56j57L17R7l36L48
7734B85j48k47K70j35M01n23K24j50L7O5j01J55k27J18Q2j53J53O7m87O2M97k81
$$ plain form
7756 -36 -122 8 60 -31 165 124 -194 -99 165 161 -201 85 164 44 -23 66 134 -296 -187 -240 26 119 -93 128 5
7781 5 -342 161 29 -152 -53 72 153 15 -1 54 135 288 69 -103 -49 5 -64 -166 -216 -52 -80 215 -245 -31
7805 -31 -26 175 49 178 -102 101 22 -42 6 65 79 -195 -103 250 149 178 -13 -327 -310 1 181 28 30 43 33
7830 33 17 92 44 42 -107 76 144 -149 246 -156 167 4 41 400 -182 48 143 142 7 163 -134 -58 13 -14 -265
7855 -265 150 -67 -163 -68 -22 106 156 206 -327 -226 79 174 -132 242 103 46 279 -146 -241 123 137 73 109 -67
7879 -67 -149 24 -25 212 -38 82 -21 -422 55 -75 -203 107 -124 -189 151 -95 244 323 -104 55 -194 -57
7901 -57 -161 -261 -106 -129 202 -41 -10 -51 -14 -155 -17 -140 -109 -204 -73 178 5 -11 11 183 21 -205 -176
7924 -176 -178 -5 -95 -8 210 -104 -30 175 34 -67 -90 -130 174 -39 28 109 305 -97 -171 142 25 236 -367
$$ packed form
7756c6q6J30N2r1J96m1l18R5K64ml62K86P9j20o7Q9O8m30J09n3K66R3k12K21j23
7781El47N03j32j81R9J25Q1j38j6N5Q1J53k19j72N4N4o9j02n0J64k8K95m60K14
7805c1NK01j26J29k80K03p9o4M8N9J4k74R2L53j01K9j91l14J7L11J80j53KJ3j0
7830C3j6P5m8kj49J83O8k93L95m02L23j63L7L59n82K30R5jj35J56k97P6P1k7k51
7855b65M15k17r6R5M6J28N0N0n33J01L05R5l06L74j39n7K33m25r5L64J4o4L6j76
7879f7q2J73m9K37k50J20j03m01M77j30j28L10k31o5L40k46L39P9m27J59k49J37
7901e7j04j00J55k3L31k43L1m1L7j41J38j23L1r5J31K51j73j6K2J72j62k26K9
7924a76kJ73r0Q7K18l14P4K05j41j01k3m0L04k13O7Q1J96m02p4L13j17K11o03
$$ plain form
7947 -367 -154 79 140 -32 145 -34 -50 178 -138 163 315 91 287 -23 128 -176 -62 27 -196 190 208
7968 208 180 125 283 198 165 187 108 16 -138 -68 -124 82 152 -109 6 -151 127 -210 26 -199 108 158 120 -65
7992 -65 -103 65 293 -98 -269 99 84 167 137 133 -277 183 -160 -157 -7 117 -15 -267 34 67 30 157 -160 119
8016 119 154 289 -116 109 -187 -121 34 -124 94 -402 -140 163 159 217 -201 -357 44 28 16 -193 -35 -259
8038 -259 70 66 -86 -31 -46 153 -137 -24 162 112 -196 -3 -142 -249 12 -128 181 -55 -322 -190 -8 -85
8060 -85 -134 167 -49 -80 44 82 114 174 159 -159 -104 26 -58 -5 -194 96 333 72 182 -22 -89 -182 -137 136
8084 136 113 298 61 272 222 101 102 81 -83 257 -190 185 178 79 49 -91 -126 230 -10 -165 -51 129 -93
8107 -93 -170 -260 -168 -57 283 148 26 106 179 7 -83 95 -130 152 -112 -278 -209 -86 15 -80 106 -223 -232 24
$$ packed form
7947c67K13K33O1j72J77j79j6K28l16L01J52k24J96l10J51l04J14Q9k23L86J8
7968B08k8n5J58q5l3K2p9r2j54P0n6K06P0k61J15j57K78l37K36k25L07N0l8j85
7992f5l8J68K28l91j71L68j5Q3l0mm10M60l43LJ50J24j32k52L01L3l7J27l17K79
8016A19L5J35m05K25k96O6J55j58K18m96K62L03mN8m18j56M01j6j2k09J58k24
8038b59L29mj52N5j5J99k90J13J86n0l08J93j39j07K61j40L09k36k67J32J82p7
8060h5m9L01k16l1J24L8L2O0j5l18N5J30q4N3j89K90K37k61J10k04o7r3M5K73
8084A36k3J85k37K11n0j21Jk1j64L40m47L75pr9l0j40l5L56k40j55J14J80k22
8107i3p7r0R2J11L40j35j22Q0P3j72r0J78k25K82k64j66O9J23J01r5J86l29rK56
$$ plain form
8131 24 -161 98 -160 361 23 -176 16 82 64 -64 105 -52 574 155 44 98 -15 133 -275 222 203 223
8153 223 -18 -64 211 15 279 444 129 -5 49 -181 -37 187 -51 -245 -179 187 -17 98 153 17 56 248
8175 248 -28 54 190 -45 -129 -104 -228 130 -6 114 89 261 1 -14 -317 -20
$$ packed form
8131B4j85K59k58N21l38j99J92O6j8j28J69j57O26m19j11N4j13J48m08M97j9K0
8153B23k41m6K75j96K64J65l15j34N4k30J44K24k38j94O6L66k04J15N5j36L9J92
8175B48k76Q2J36k35q4K5j24L58j36J20k5J72k60j5l03K97
8191b0
$$ Imaginary data points
##PAGE= N=2
##DATA TABLE= (X++(I..I)), XYDATA
$$ plain form
0 0 0 0 0 0 0 0 0 0 0 0 8 -8 8 -8 8 -16 16 -16 24 -24 32 -32 40 -45 50 -57 66 -77 88 -97 109 -123 138 -154
34 -154 173 -193 214 -238 264 -293 326 -359 397 -440 488 -541 599 -670 749 -840 950 -1079
52 -1079 1241 -1446 1712 -2082 2627 -3512 5197 -9567 45066 84031 -13648 -24924 30220 49113
66 49113 -11607 -24233 27297 49325 711 -14793 28834 48637 3093 -20199 14902 42038
78 42038 16310 -1527 19851 30864 1708 -13471 11853 31744 12402 -6416 4787 19359
90 19359 13299 9420 17875 17569 2743 527 13461 15206 525 -6147 103 5126 7470 15540 16961
105 16961 972 -8776 7706 22040 5711 -13516 -2447 13556 186 -17369 -821 22519
117 22519 8322 -19326 -11274 16456 12396 -12249 -10391 10857 8013 -10262 -4109 12536 -2508
$$ packed form
0@%%%%%%%%%%Qj6J6j6J6k4L2l2M0m8N6o4P2q5R5j07J23j43J65j85K06k32K61k92
34a54L27l66M07m52N02n57O19o85P56q37R28j029J140j269J419j589J790k029
52a079K320k687L158l794M709o139Q709j4764N4633L8965r7679j1276N5144J8893
66D9113o0720j2626N1530K2028m8614j5504M3627J9803m5544k3292L5101K7136
78D2038k5728j7837K1378J1013k9156j5179K5324J9891j9342j8818J1203J4572
90A9359o060l879Q455l06j4826k216J2934J745j4681o672O250N023K344Q070J421
105A6961j5989r748J6482J4334j6329j9227J1069J6003j3370j7555J6548K3340
117B2519j4197k7648Q052K7730m060k4645J858K1248k844j8275O153J6645j5044
$$ plain form
130 -2508 -32434 -23657 13373 20157 -5985 -12182 9265 12592 -11793 -20272 -1213 5590 -13001
143 -13001 -18664 3891 16473 -1957 -21034 -12039 4818 2454 -5974 -718 7916 1698 -11706
156 -11706 -11938 -386 3359 -4951 -11987 -6756 3340 7352 2214 -4185 -4253 6 3701 3928 1716
171 1716 -2014 -6090 -7130 -1869 3710 2999 -1284 -1205 4741 7496 4784 2755 3566 1680 -3693 -3383
187 -3383 4167 8405 2883 -3480 -1152 5683 7625 4785 2918 3379 4287 5229 7680 8427 4422 -2611
203 -2611 -5657 -1399 6414 9457 4278 938 5407 11391 8845 1394 0 4176 2950 -1463 2310
218 2310 10471 7104 -4956 -6491 4957 9733 2665 698 8509 9625 -1081 -3748 6470 7716
232 7716 -6902 -12832 2048 13451 4516 -5628 725 7897 279 -6432 3236 10892 -145 -10809
$$ packed form
130b508k9926Q777L7030O784k6142o197K1447L327k4385q479J9059O803j8591
143a3001n663K2555J2582j8430j9077Q995J6857k364q428N256Q634o218j3404
156a1706k32J1552L745q310p036N231J0096M012n138o399o8M259L695K27k212
171A716l730m076j040N261N579p11m283P9N946K755k712k029Q11j886n373L10
187c383P550M238n522o363K328O835J942k840j867M61R08R42K451P47m005p033
203b611l046M258P813L043n179l340M469N984k546p451j394M176j226m413L773
218B310Q161l367j2060j535J1448M776p068j967P811J116j0706k667J0218J246
232G716j4618n930J4880J1403q935j0144O353P172p618o711R668P656j1037j0664
$$ plain form
246 -10809 -2037 8544 690 -12638 -7459 4729 1962 -5618 1565 11283 3017 -10781 -7511 4924
260 4924 3089 -8655 -7952 959 -426 -6762 -3465 3748 -800 -8282 -2849 7356 4265 -5366 -5966
275 -5966 -1013 -4768 -9319 -2314 5323 -1394 -9611 -3509 6610 2641 -6606 -3206 4553 429 -6132
290 -6132 -860 5714 -2561 -12642 -6111 5680 2510 -5737 4 8206 2520 -5814 1495 10672 785
305 785 -14061 -7289 8871 5718 -7419 -4039 9919 7641 -5949 -4446 9052 8070 -5858 -6279
319 -6279 9130 12566 -1897 -7976 773 3601 -4379 -3934 8774 11966 745 -3413 6356 10082
333 10082 -1235 -7420 1751 7342 -317 -4933 3342 8589 -658 -7328 2168 12870 7442 -3017
347 -3017 -2730 3586 1730 -3865 -1725 3891 2339 -2391 -974 3719 1713 -2922 -1267 2519 2222 649
$$ packed form
246a0809Q772J0581p854j3328N179J2188k767p580P183R718q266j3798L270J2435
260D924j835j1744P03Q911j385o336L297P213m548p482N433J0205l091r631o00
275e966M953l755m551P005P637o717q217O102J0119l969r247L400P759m124o561
290f132N272O574q275j0081O531J1791l170q247N741Q202n686q334P309R177r887
305G85j4846O772J6160l153j3137L380J3958k278j3590J503J3498r82j3928m21
319f279J5409L436j4463o079Q749K828p980M45J2708L192j1221m158R769L726
333A0082j1317o185R171N591p659m616Q275N247r247o670R496J0702n428j0459
347c017K87O316j856n595K140N616j552m730J417M693k006m635J655L786k97j573
$$ plain form
363 649 3176 3786 -3713 -9267 -4320 2254 -2 -4915 -1755 3708 2400 -2701 -681 3028 -972 -7012
379 -7012 -4863 271 -1189 -5819 -4280 175 -1157 -4116 -335 2754 -3293 -9945 -3056 5635 2107
394 2107 -7201 -4984 1729 -2502 -11412 -7401 3430 2041 -6327 -4376 6171 5362 -6337 -8904 -469
409 -469 1481 -5446 -5233 2583 1250 -7725 -7149 4282 6134 -3058 -4526 4873 5229 -5656 -7658 3102
425 3102 6009 -5308 -8207 4364 9984 -1620 -9599 -34 8358 2214 -3010 4298 9881 666
439 666 -7306 -1171 6092 925 -5477 898 8423 4468 -1138 3604 8603 1928 -4491 2002 9359
454 9359 3487 -4929 -1311 6514 4714 -1950 1069 7557 4861 -1748 510 7012 6193 574 445 3862
470 3862 2728 -1045 217 2553 534 -917 3713 7954 3865 -407 1727 4170 176 -2523 1366
$$ packed form
363F49K527O10p499n554M947O574k256m913L160N463j308n101K020L709m000o040
379g012K149N134j460m630J539M455j332k959L781L089o047o652O889Q691l528
394B107r308K217O713m231q910M011J0831j389q368J951J0547q09j1699k567Q435
409d69J950o927K13P816j333q975N76J1431J852r192j468R399L56j0885k002J0760
425C102K907j1317k899J2571N620j1604p979R565Q392o144n224P308N583r215
439F66p972O135P263n167o402O375P525l955n606M742M999o675o419O493P357
454I359n872q416L618P825j800o664L019O488k696o609K258O502q19n619j29L417
470C862j134l773J262K336k019j451M630M241m089m272K134K443l994k699L889
$$ plain form
485 1366 4802 -83 -5146 -523 4971 1869 -2968 -163 4808 2123 -2887 -484 3328 -1435 -6424
500 -6424 -1866 3846 398 -6082 -3796 2209 326 -5733 -2362 4852 1992 -6265 -5509 1898 782
515 782 -7562 -8423 -441 1727 -4825 -5742 668 1931 -4428 -6555 -1093 2150 -3726 -7532 -3977 -632
531 -632 -3512 -6511 -3498 -335 -3017 -5408 -2607 1286 -775 -4789 -3990 -711 -1301 -4503 -5038 -2718
547 -2718 -1647 -3230 -2989 -682 907 -968 -2678 -1532 -168 -218 -2012 -2537 -1344 -1269 -1940 -1882 -651
564 -651 -53 -657 -739 884 1900 991 -242 -207 830 67 -253 153 169 76 195 1481 2176 1916 1984 2658
584 2658 1729 783 1924 2817 1173 -1133 924 3051 2271 204 1313 4333 3119 344 2338 5631
600 5631 3434 -1036 123 4836 4075 -1477 -719 4535 4162 -1402 -189 6285 5918 -610 -877 5484
$$ packed form
485A366L436m885n063M623N494l102m837K805M971k685n010K403L812m763m989
500f424M558N712l448o480K286O005j883o059L371P214k860q257P56P407j116
515G82q344q61P982K168o552r17O410J263o359k127N462L243n876l806L555L345
531f32k880k999L013L163k682k391K801L893k061m014P99L279n90l202n35K320
547b718J071j583K41K307J589j875j710J146J364n0j794n25J193P5o71N8J231
564f51N98o04q2J623J016r09j233L5J037p63l20M06J6r3J19J286O95k60O8O74
584B658r29r46J141Q93j644k306K057K127p80k067J109L020j214k775J994L293
600E631k197m470J159M713p61n552P58N254l73n564J213O474l67o528k67O361
$$ plain form
616 5484 5294 -1996 -2861 4319 5373 -2126 -3122 4665 7062 -1106 -3727 4107 7220 -238 -3629 2822
632 2822 5708 -1428 -5035 2124 5633 -1208 -4438 2397 6096 -447 -4372 2150 5924 -755 -4557
647 -4557 1949 5016 -2437 -6257 596 5376 -776 -5177 1608 5910 -515 -5230 1096 4929 -1677
662 -1677 -5848 480 4670 -1847 -5793 748 4468 -1851 -4845 2408 5951 -2216 -5949 1539 5600
677 5600 -1976 -6514 1194 5738 -2096 -6961 1164 6412 -955 -6147 2031 7171 -384 -6464 -36
692 -36 5895 -1477 -6971 466 6479 -860 -6792 943 7330 372 -6335 935 7215 -14 -6956 -528
708 -528 6400 61 -6596 -739 7051 1356 -6045 -1495 6093 1742 -5358 -833 5615 1273 -5758
723 -5758 -2091 4376 424 -5724 -1705 4272 1087 -4407 -947 4251 922 -5140 -1603 3692 -198
$$ packed form
616E484j90p290q65P180J054p499r96P787K397q168k621P834L113p458l391O451
632B822K886p136l607P159L509o841l230O835L699o543l925O522L774o679l802
647d557O506L067p453l820O853M780o152m401O785M302o425m715O326L833o606
662a677m171O328M190o517l946O541L720o319k994P253L543q167l733P488M061
677E600p576m538P708M544p834m865Q125N248p367n192Q178N140p555o080O428
692c6N931p372n494P437O013p339n932P735O387o958o707P270O280p229o942O428
708e28O928o339o657N857P790n695p401M550P588m351p100M525O448m342p031
723e758L667O467l952o148M019N977l185n494L460N198l329o062L537N295l890
$$ plain form
738 -198 -5597 -2240 2764 -214 -4470 -1336 3161 405 -4422 -1295 2647 -891 -5175 -1774 2387
753 2387 -1232 -5331 -1750 2269 -1879 -5656 -1785 3005 -303 -4947 -2231 2119 -586 -5221 -2956
768 -2956 1694 -1342 -5324 -3143 1741 -100 -4324 -2226 1785 261 -3954 -3014 950 -887 -4371
783 -4371 -2746 1077 578 -3295 -2747 940 598 -2314 -2146 900 1053 -1763 -1875 992 1281 -1162 -2369
800 -2369 68 966 4 -619 670 1733 1025 643 774 1537 1505 247 -276 473 1797 1708 437 1183 2881
819 2881 2605 1059 1270 2927 2898 933 1082 3274 3869 1743 607 2595 3629 2012 907 3143 4419
836 4419 2364 1623 3555 4816 2455 1078 2620 3674 2140 1356 2617 3766 2429 1944 3545 4340
852 4340 1825 1232 2798 2775 1447 1490 3507 3204 1274 719 2979 3606 733 699 3091 3267 190 289
$$ packed form
738a98n399L357N004k978m256L134M497k756m827L127L942l538m284L401M161
753B387l619m099L581M019m148l777L871M790l308m644K716M350k705m635K265
768b956M650l036l982K181M884j841m224K098M011j524m215R40L964j837l484
783d371J625L823m99l873N48L687l42k912J68L046J53k816j12K867K89k443j207
800b369K437Q98r62o23J289J063p08l82J31P63l2j258n23P49J324q9j271P46J698
819B881k76j546K11J657k9j965J49K192N95k126j136J988J034j617j105K236J276
836D419k055p41J932J261k361j377J542J054j534p84J261J149j337m85J601P95
852D340k515n93J566k3j328M3K017l03j930n55K260O27k873l4K392J76l077R9
$$ plain form
870 289 2975 2502 -1113 -942 2671 2443 -1093 -1280 2644 2538 -1492 -1270 3064 2621 -2260 -2999 1679
887 1679 2523 -2627 -3644 1399 2952 -2072 -3751 1054 2407 -2770 -4656 783 2881 -2402 -5180
902 -5180 -208 2145 -2447 -4843 -224 2392 -2473 -5256 -698 2540 -1967 -5303 -1518 2290 -1434
917 -1434 -4523 -1750 1797 -2005 -4840 -1491 2142 -339 -3702 -1263 1426 -1150 -3998 -1157 1151
932 1151 -1050 -3629 -498 1911 -629 -3164 -399 1953 -147 -2519 -104 1375 -1024 -2938 -12
947 -12 2301 305 -1902 260 2308 -309 -1982 847 2644 -195 -1940 1720 3491 333 -2098 497
963 497 3306 535 -1861 1597 4550 1451 -2072 766 4704 2093 -2190 177 3854 2008 -1774
978 -1774 -161 3884 2654 -1403 -19 4145 3203 -1030 -1296 2839 2531 -637 -601 3260 2957 -1161 -1837
$$ packed form
870B89K686m73l615J71L613k28l536j87L924j06m030K22M334m43m881p39M678
887A679Q44n150j017N043J553n024j679M805J353n177j886N439K098n283k778
902e180M972K353m592k396M619K616m865k783M558L238m507l336L785L808l724
917a434l089K773L547l802k835L349L633k481l363K439K689k576k848K841K308
932A151k201k579L131K409k540k535K765K352k100k372K415J479k399j914K926
947a2K313j996k207K162K048k617j673K829J797k839j745L660J771l158k431K595
963D97K809k771k396L458K953l099l523K838L938k611m283K367L677j846l782
978a774J613M045j230m057J384M164r42m233k66M135l08l168L6L861l03m118o76
$$ plain form
995 -1837 2217 2746 -849 -1838 1976 3342 235 -1806 1069 1971 -661 -2255 79 2235 471 -1607
1011 -1607 -561 1619 494 -1334 -236 551 -904 -1757 -472 257 -660 -1377 -435 538 -407 -1707 -1083
1028 -1083 -889 -1503 -1981 -776 683 -198 -2071 -1191 -619 -2063 -2480 -1031 -369 -1177 -1391 -246 372 -1211
1046 -1211 -2822 -830 -100 -1780 -2648 -506 1100 -1535 -2564 -349 1824 -309 -3277 -1677 1416
1061 1416 -132 -2944 -1408 2070 1338 -2228 -1420 1585 1269 -2698 -2478 1420 2270 -881 -1147 2030
1077 2030 2024 -1818 -2056 1598 2322 -787 -1713 1944 3510 83 -1527 1368 3323 126 -1555 1079
1093 1079 3132 739 -1409 850 3661 2413 -135 369 2206 913 -604 940 2841 1914 954 1452
1109 1452 2422 1204 -113 484 1532 703 364 1898 2828 1121 -169 688 1638 640 -38 899 1456 351
$$ packed form
995a837M054N29l595r89L814J366l107k041K875R02k632j594K334K156j764k078
1011a607J046K180j125j828J098P87j455q53J285P29r17p17R42R73r45j300O24
1028a083J94o14m78J205J459q81j873Q80N72j444m17J449O62q08k14J145O18j583
1046a211j611J992P30j680q68K142J606k635j029K215K173k133k968J600L093
1061A416j548k812J536L478p32l566Q08L005l16l967K20L898Q50l151k66L177
1077B030ol842k38L654P24l109r26L657J566l427j610K895J955l197j681K634
1093A079K053k393k148K259K811j248k548N04J837j293j517J544J901r27r60M98
1109A452R70j218j317N97J048q29l39J534R30j707j290Q57R50r98o78R37N57j105
$$ plain form
1127 351 -259 1459 1850 489 -341 1326 1181 -643 -1065 805 1004 -889 -1356 1357 2389 -660 -2385
1144 -2385 -408 1235 -839 -2140 -198 2113 -144 -2583 -1183 1141 -447 -3066 -1783 909 608
1159 608 -1802 -1565 216 -389 -2247 -1883 468 -158 -2188 -2238 -442 -34 -1215 -1555 -62 404 -1584
1176 -1584 -2037 -897 -514 -1132 -1756 -728 710 -233 -1359 -1442 -369 -718 -800 -413 249 404 -549 -550 -217
1195 -217 284 -205 -803 -153 350 416 156 168 684 601 140 468 1154 1049 -164 -437 726 1003 344 986
1215 986 1603 1441 464 1182 1536 1252 296 970 1988 1677 1415 1146 1894 1077 346 1553 2331 1671 1279
1234 1279 1522 2243 1527 451 2067 2344 1135 375 1797 2946 1175 -325 1542 3052 1349 -9
1250 -9 1884 3436 793 -1080 810 3215 1763 -1333 370 3204 1771 -1142 -175 2570 1593 -1171
$$ packed form
1127C51o10J718L91j361q30J667j45j824m22J870J99j893m67K713J032l049j725
1144b385J977J643k074j301J942K311k257k439J400K324j588k619J283K692l01
1159F08k410K37J781o05j858L64K351o26k030n0J796M08j181l40J493M66j988
1176a584m53J140L83o18o24J028J438r43j126q3J073l49q2L87O62J55r53jL33
1195b17N01m89n98O50N03O6k60J2N16q3m61L28O86j05j213k73J163K77o59O42
1215I86O17j62r77P18L54k84r56O74J018l11k62k69P48q17p31J207P78o60l92
1234A279K43P21p16j076J616K77j209p60J422J149j771j500J867J510j703j358
1250iJ893J552k643j873J890K405j452l096J703K834j433k913R67K745r77k764
$$ plain form
1266 -1171 -306 2780 1557 -1563 -1177 2475 1771 -1803 -1215 2464 1608 -2216 -1456 1915 1353 -2096 -2125
1283 -2125 1741 1507 -2565 -2357 875 1406 -1841 -2076 1495 1691 -1981 -2705 293 924 -2352 -1977 816
1300 816 610 -2040 -1809 962 169 -2400 -2125 1081 657 -2345 -2026 887 537 -2397 -1799 964 1279
1317 1279 -1895 -2055 568 881 -1884 -1043 1264 1394 -1415 -1037 1711 545 -2603 -1691 2619 2079 -1404
1334 -1404 -849 2773 1923 -2338 -1525 2587 2703 -1541 -1257 2827 2925 -846 -1575 2108 3110 -297 -719
1351 -719 2565 3522 -155 -906 2494 3317 43 -225 2450 2880 -206 -545 2928 3157 410 -741 2653
1368 2653 3867 930 -1247 1208 2818 1031 92 1844 2948 981 -358 1338 2320 1013 572 1953
1384 1953 1907 425 439 1955 1607 -6 494 2037 2276 233 -314 1342 1519 -28 299 1861 1300 -670
$$ packed form
1266a171Q65L086j223l120L86L652p04l574N88L679q56l824P60L371n62l449k9
1283b125L866k34m072K08L232N31l247k35L571J96l672p24K998O31l276L75K793
1300H16k06k650K31K771p93k569K75L206m24l002L19K913l50k934N98K763L15
1317A279l174j60K623L13k765Q41K307J30k809L78K748j166l148R12M310n40l483
1334a404N55L622q50m261Q13M112J16m244K84M084R8l771p29L683J002l407m22
1351g19L284R57l677p51L400Q23l274k68K675M30l086l39L473K29k747j151L394
1368B653J214k937k177K455J610j787r39J752J104j967j339J696R82j307m41J381
1384A953m6j482J4J516l48j613N00J543K39k043n47J656J77j547L27J562n61j970
$$ plain form
1402 -670 -642 594 375 -618 182 1541 767 -358 480 1235 203 -1634 -1016 1545 1115 -1403 -970 785
1420 785 824 -1621 -1702 801 1313 -877 -1284 -33 924 -366 -1376 -223 334 -310 -1073 -407 74 -684
1438 -684 -1063 -41 706 340 -244 -441 -356 -595 -806 -77 160 -15 -88 -628 -158 546 -79 -684 -766 321
1458 321 1345 -133 -1160 203 1307 -83 -986 -6 1943 733 -1539 -771 1844 1364 -574 -413
1474 -413 1509 2028 -398 -554 1085 1183 -630 113 1888 2016 180 -377 1689 1634 68 -72 1986 2181
1492 2181 190 -224 1698 1760 370 -155 1213 1686 755 494 1106 1269 532 211 1120 1047 571 905 583
1511 583 412 -44 925 1761 475 -346 607 1892 89 -991 100 1736 181 -1052 255 2176 136
1528 136 -1695 -429 1723 634 -1546 -377 1629 110 -2233 -992 1557 560 -2534 -1266 1381
$$ packed form
1402f70K8J236k19r93Q00J359p74j125Q38P55j032j837O18K561m30k518M33J755
1420G85L9k445q1K503N12k190m07J251R57j290j010J153N57o44p63O66M81p58
1438f84l79J022P47l66n84j97Q5k39k11P29K37j75p3n40M70P04o25o05q2J087
1458C21J024j478j027J363J104j390r03R80J949j210k272P68K615m80j938J61
1474d13J922N19k426j56J639R8j813P43J775J28j836n57K066n5j566j40K058J95
1492B181j991m14J922O2j390n25J368M73r31k61O12J63p37l21R09p3m76L34l22
1511E83j71m56R69Q36j286q21R53J285j803j080J091J636j555j233J307J921k040
1528A36j831J266K152j089k180J169K006j519k343J241K549r97l094J268K647
$$ plain form
1543 1381 724 -2169 -1832 1148 969 -2058 -1502 948 579 -2236 -2314 359 890 -1247 -1643 -15 895
1560 895 -1519 -1947 -371 602 -1192 -1653 -279 335 -1151 -1732 -618 245 -827 -882 64 16 -733 -886
1578 -886 77 -133 -936 -651 305 -19 -977 -424 742 175 -867 -259 622 769 -391 -348 764 136 -722
1597 -722 -201 941 584 -691 -123 1485 1110 -654 -236 1203 1168 -604 -73 1663 1273 -826 -710 1826
1615 1826 2040 -153 -448 1543 1935 268 -857 981 2296 468 -724 705 2025 804 -443 264
1631 264 1670 1412 268 503 1454 888 -442 248 1376 894 -243 217 1092 1070 -64 48 1125 618
1649 618 -92 -296 756 763 -282 -788 -190 396 415 -638 -312 287 129 -180 -304 26 -96 -40 -109 -101 -343
1670 -343 -485 -568 -330 -660 -181 -167 53 -407 -788 -374 -42 -612 -777 -584 69 -696 -861 -812 -471 -702 -611
$$ packed form
1543A381o57k893L37K980j79l027N56K450l69k815p8K673N31k137l96J628R10
1560H95k414m28J576R73j794m61J374O14j486n81J114Q63j072n5R46m8p49j53
1578h86R63k10q03K85R56l24r58N53J166n67j042O08Q81J47j160M3J112o28q58
1597g22N21J142l57j275N68J608l75j764M18J439l5j772N31J736l90k099J16K536
1615A826K14k193k95J991L92j667j125J838J315j828j192J429J320j221j247P07
1631B64J406k58j144K35R51n66j330O90J128m82j137M60Q75k2j134J12J077n07
1649F18p10k04J052Pj045n06N98N86J9j053L26N99j58l09j24L30j22N6o9Qk42
1670c43j42q3K38l30M79J4K20m60l81M14L32n70j65J93O53p65j65M9L41k31R1
$$ plain form
1691 -611 -432 -318 -789 -268 -447 -539 -962 -805 214 236 -650 -988 47 305 -907 -1115 15 541 -218
1710 -218 -1390 -213 398 -127 -968 -330 840 232 -875 -505 495 76 -148 -78 828 756 -421 2 802
1729 802 233 -556 22 963 829 -230 289 1159 1073 42 -2 1176 1257 396 -156 1067 997 611 -70 831
1749 831 1355 852 274 481 633 609 828 1089 780 396 869 934 192 -265 20 774 1043 262 645 897 626
1770 626 -172 55 297 534 237 226 545 396 158 339 480 264 -30 96 348 -43 -167 -45 333 232
1790 232 -566 -270 690 -201 -765 -667 242 42 -441 -746 -110 247 -503 -979 -443 -99 -770 -682 -171 167 -113
1811 -113 -828 -574 -343 -461 -532 -652 -427 -424 -930 -978 -431 -334 -837 -820 -319 -186 -514 -973 -950 43 -186 -1043
1833 -1043 -898 -162 -172 -1050 -1028 8 174 -203 -705 181 386 -256 -717 -23 378 -331 -675 256 586 -265
$$ packed form
1691f11J79J14m71N21j79r2m23J57J019K2q86l38J035K58j212k08J130N26p59
1710b18j172J177O11n25q41O38J170o08j107L70J000m19k24P0R06p2j177M23Q00
1729H02n69p89N78R41j34j059N19Q70q6j031m4J178Q1q61n52J223p0l86o81R01
1749H31N24n03n78K07J52k4K19K61l09l84M73O5p42m57K85P54K69p81L83K52k71
1770F26p98K27K42K37k97j1L19j49k38J81J41k16k94J26K52l91j24J22L78j01
1790B32p98K96R60q91n64R8R09k00m83l05O36L57p50m76N36L44o71Q8N11L38k80
1811a13p15K54K31j18p1j20K25Ln06m8N47R7n03J7N01J33l28m59K3R93k29q57
1833a043J45P36j0q78K2J036J66l77n02Q86K05o42m61O94M01p09l44R31L30q51
$$ plain form
1853 -265 -519 386 811 8 -401 275 836 66 -483 -114 1064 159 -7 421 755 432 -281 91 824 703
1873 703 120 846 949 580 -34 630 886 434 103 714 1012 669 328 812 942 -23 198 1018 901 196
1893 196 -212 891 998 125 -49 825 1111 -90 -105 937 1302 11 -841 952 1443 -153 -691 605
1911 605 711 -170 -915 684 1732 32 -1138 299 948 -265 -1321 16 932 -787 -1467 -146 1080
1928 1080 -251 -1550 -431 950 45 -1612 -480 720 -259 -1355 -764 443 -81 -1639 -716 10
1944 10 -23 -1173 -494 108 -430 -1267 -467 258 -729 -1119 -519 128 -370 -1022 -515 360 -570 -839 57 634
1964 634 -438 -1178 -449 539 -308 -990 30 722 -588 -1056 611 1266 -173 -1201 426 1270 -130
1981 -130 -833 526 1121 -28 -1214 578 1796 237 -863 311 1604 488 -650 664 1866 334
$$ packed form
1853b65k54R05M25q03m09O76N61p70n49L69J178r05j66M28L34l23p13L72P33j21
1873G03n83P26J03l69o14O64K56m52l31O11K98l43l41M84J30r65K21Q20j17p05
1893A96m08J103J07q73j74Q74K86j201j5J042L65j291q52J793M91j596n38J296
1911F05J06q81p45J599J048j700j170J437O49j213j056J337R16j719o80J321J226
1928A080j331j299J119J381r05j657J132J200r79j096N91J207n24j558R23P26
1944A0l3j150O79O02n38q37Q00P25r87l90O00O47m98o52N07Q75r30k69Q96N77
1964F34j072p40P29R88q47o82J020O92j310m68J667O55j439j028J627Q44j400
1981a30p03J359N95j149j186J792J218j559j100J174J293j116j138J314J202j532
$$ plain form
1997 334 -384 259 1427 478 -692 477 1615 994 -87 751 1586 848 -453 131 1581 959 -119
2014 -119 236 1249 1024 192 360 1159 655 -141 542 864 765 47 139 367 381 312 943 624 432 159 814
2035 814 850 -194 -51 596 421 -104 -350 278 604 -641 -478 797 828 -204 -414 281 285 -482 -532 502
2055 502 290 -911 -631 217 613 -772 -1157 -241 147 -558 -726 -156 209 -394 -840 -11 94 -589 -1077
2074 -1077 -883 -281 -384 -521 -293 -568 -530 -769 -406 -76 -826 -447 -434 -529 -495 -74 -83 -291 -502 -507 -195 -461
2096 -461 -582 -141 225 -496 -458 200 398 -357 -707 137 483 -350 -295 318 888 -264 -786 312 1145 -451
2116 -451 -683 151 1000 111 -785 463 1119 168 -498 43 1019 447 -284 -98 940 450 -201 223 825
2135 825 639 -224 120 950 467 -336 531 955 914 138 277 839 362 259 634 544 308 464 247 895 456
$$ packed form
1997C34p18O43J168r49j170J169J138o21j081Q38Q35p38j301N84J450o22j078
2014a19L55J013k25q32J68P99n04p96O83L22r9p18R2K28J4o9O31l19j92k73O55
2035H14L6j044J43O47j75n25k46O28L26j245J63J275L1j032k10O95Mp67n0J034
2055E02k12j201K80Q48L96j385l85R16L88p05j68N70L65o03m46Q29J05o83m88
2074a077J94O02j03j37K28k75L8k39L63L30p50L79J3r5L4M21rk08k11nL12k66
2096d61j21M41L66p21L8O58J98p55l50Q44L46q33N5O13N70j152n22J098Q33j596
2116d51k32Q34Q49q89q96J248O56r51o66N41R76n72p31J86J038m90o51M24O02
2135H25j86q63L44Q30m83q03Q67M24m1p76J39N62m77j03L75r0k36J56k17O48m39
$$ plain form
2156 456 -103 680 107 -93 11 611 1096 32 -311 422 633 -306 -572 378 884 -280 -691 508 818
2175 818 -336 -607 -7 639 -409 -1028 -195 656 -393 -844 284 670 -436 -996 -360 123 -306 -1379
2193 -1379 -491 598 -150 -1029 -472 314 -173 -1220 -474 237 -270 -928 -451 130 -421 -1057 -669 -70 -269
2212 -269 -634 -509 4 -312 -618 -684 133 1 -951 -589 254 69 -313 -377 163 -143 -209 250 0 -368 -436
2233 -436 382 274 -162 -557 222 400 58 -487 250 488 -155 -391 635 539 174 -163 329 801 117 -50
2253 -50 353 681 -51 -319 543 1189 308 -138 187 981 612 -64 235 814 481 39 24 756 976 85 461
2274 461 674 680 214 472 443 706 -41 61 582 713 254 84 170 808 208 220 -120 515 322 206 123 419
2296 419 570 -13 50 75 341 -162 -356 151 -129 67 -201 -44 244 151 -214 -510 31 271 -223 -276 -77
$$ packed form
2156D56n59P83n73k00J04O00M85j064l43P33K11r39k66R50N06j164m11J199L10
2175H18j154k71O00O46j048o19Q33Q51j049m51J128L86j106n60O36M83m29j073
2193a379Q88J089p48q79N57P86m87j047P46P11n07o58M77N81n51o36L88N99j99
2212b69l65J25N13l16l06o6Q17j32r52L62Q43j85l82o4N40l06o6M59k50l68o8
2233d36Q18j08m36l95P79J78l42n45P37K38o43k36J026r6l65l37M92M72o84j67
2253e0M03L28p32k68Q62O46q81m46L25P94l69o76K99N79l33m42j5P32K20q91L76
2274D61K13Om66K58k9K63p47J02N21J31m59j70Q6O38o00J2l40O35j93j16q3K96
2296D19J51n83O3K5K66n03j94N07k80J96k68J57K88r3l65k96N41K40m94n3J99
$$ plain form
2317 -77 -375 -46 -518 -395 -85 -197 -292 -887 -78 -107 -632 -328 -548 -199 -357 -584 -523 -236 -419 -368 -534 -324
2339 -324 -482 -361 -644 -319 -282 -689 -612 -375 6 -416 -418 -421 -241 -179 -562 -348 1 -94 -745 -568 31 105 -251
2362 -251 -342 187 119 -239 -478 -10 274 121 -524 458 609 94 -83 30 317 50 0 -22 648 694 123 73
2384 73 278 545 344 -158 386 425 71 -158 419 477 61 178 157 661 364 178 175 638 422 335 195 345
2406 345 532 399 169 444 455 403 152 -35 319 475 74 23 373 386 106 31 67 524 35 -218 -263 283
2428 283 133 -177 65 761 44 -445 -513 228 322 -161 -62 -134 369 -328 -665 -88 16 -303 -799 -15 113
2449 113 -505 -564 -104 -90 -252 -572 -634 -249 -200 -418 -538 -651 -228 -165 -201 -233 54 -148 -544 -756 -337 -126
2471 -126 -245 -743 -176 -162 -449 -752 -598 114 90 -836 -819 87 91 -552 -332 380 -356 -293 -380 33 -169 -434
$$ packed form
2317g7k98L29m72J23L10j12r5n95Q09k9n25L04k20L49j58k27O1K87j83N1j66K10
2339c24j58J21k83L25L7m07P7K37L81m22klJ80O2l83K14L49r5o51J77N99P4l56
2362b51r1N29o8l58k39M68K84j53o45R82J51n15j77J13K87k67n0k2O70M6n71n0
2384G3K05K67k01n02N44L9l54k29N77N8m16J17k1N04k97j86lM63k16q7j40J50
2406C45J87j33k30K75J1n2k51j87L54J56m01n1L50J3k80p5L6M57m89k53m5N46
2428B83j50l10K42O96p17m89o8P41R4m83R9p2N03o97l37N77J04l19m96P84J28
2449A13o18n9M60J4j62l20o2L85M9k18j20j13M23O3l6l2K87k02l96k12M19K11
2471a26j19m98N67J4k87l03J54P12k4r26J7R06Mo43K20P12p36O3q7M13k02k65
$$ plain form
2493 -434 -485 310 920 -253 -234 332 755 -53 -439 540 694 78 100 172 174 127 -18 293 741 122 104 319
2515 319 340 326 -181 740 400 723 320 432 450 349 349 396 593 320 552 602 765 387 677 399 544 266
2537 266 439 745 474 212 254 714 397 -170 365 1110 885 -89 100 938 356 -145 -341 720 658 -229
2557 -229 -205 918 706 -109 -213 487 611 21 -386 337 440 -149 43 382 628 -316 -595 108 437 -231
2577 -231 -680 -13 436 -105 -305 -164 -124 -128 -435 -180 330 -140 -669 -197 -458 -561 -220 248 15 -493 -416
2598 -416 -207 -242 -592 -584 -60 -278 -476 -293 150 106 -578 -220 414 -25 -466 -183 406 111 -715 -375 533
2619 533 155 -844 -152 399 5 -702 -484 478 218 -764 -341 406 322 -499 -232 427 476 -81 -301 388 639
2640 639 -30 -71 360 430 -430 -526 220 654 -37 -441 -62 360 132 -215 405 637 76 272 -16 218 196
$$ packed form
2493d34n1P95O10j173J9N66M23q08l86R79J54o16K2P2Km7j45L11M48o19j8K15
2515C19K1j4n07R21l40L23m03J12J8j01%M7J97k73K32N0J63l78K90k78J45k78
2537B66J73L06k71k62M2M60l17n67N35P45k25r74J89Q38n82n01j96J061o2q87
2557b29K4J123k12q15j04P00J24n90m07P23J03n89J92L39K46r44k79P03L29o68
2577b31m49O67M49n41k00J41M0ml07K55N10m70n29M72k61j03L41M68k33n08P7
2598d16K09l5l50QN24k18j98J83M43m4o84L58O34m39m41K83N89k95q26L40R08
2619E33l78r99O92N51l94p07K18R62k60r82M23P47q4q21K67O59M9n57k20O89K51
2640F39o69m1M31P0q60r6P46M34o91m04L79M22k28l47O20K32n61J96k88K34k2
$$ plain form
2661 196 275 453 138 315 274 256 6 191 314 608 434 -2 38 395 -148 -44 286 399 -25 -116 541 574
2683 574 -49 -336 13 735 50 -552 216 606 -39 -408 -33 603 -96 -662 -68 640 -91 -793 -277 48
2703 48 -1 -294 -144 -16 272 -842 -163 -72 -94 -634 -78 111 -132 -330 -343 -108 300 -450 -527 78 -227 -754
2725 -754 -378 -257 -39 -353 -224 100 -345 -156 -477 -214 -431 -85 2 -21 -309 -143 -26 -257 -569 -407 89
2746 89 52 -446 -398 305 111 -216 -387 344 334 -306 -353 246 466 -330 -1 440 595 142 -136 353 546 -15
2768 -15 -38 423 622 485 -306 326 686 70 -376 554 550 423 132 311 933 432 247 285 593 102 109 -42
2790 -42 638 532 506 527 459 311 434 509 162 -1 23 790 630 221 80 586 485 201 45 394 141 -202
2812 -202 -44 565 355 -85 170 204 155 -86 -32 435 18 -419 -144 391 154 -278 -789 572 194 -383 -537
$$ packed form
2661A96P9J78l15J77m1j8k50J85J23K94j74m36M0L57n43J04L30J13m24r1O57L3
2683E74o23k87L49P22o85o02P68L90o45l69L75O36o99n66N94P08p31p02N16L25
2703D8m9k93J50J28K88j114O79R1k2n40N56J89k43j98j3K35M08p50p7O05l05n27
2725g54L76J21K18l14J29L24m45J89l21K63k17L46Q7k3k88J66J17k31l12J62M96
2746H9l7m98M8P03j94l27j71P31j0o40m7N99K20p96L29M41J55m53k78M89J93n61
2768a5k3M61J99j37p91O32L60o16m46R30mj27k91J79O22n01j85L8L08m91Pj51
2790d2O80j06k6K1o8j48J23P5l47j63K4P67j60m09j41N06j01k84j56L49k53l43
2812b02J58O09k10m40K55L4m9k41N4M67m17m37K75N35k37m32n11J361l78n77j54
$$ plain form
2833 -537 212 328 -475 -554 82 169 -442 -391 1 -73 -368 -590 -280 99 -186 -455 -298 9 -314 -490 -440 40
2855 40 -357 -573 -359 -89 -238 -582 -198 -324 -70 -672 -376 -501 -211 -238 -57 -124 -33 -138 -451 -423 -146 120
2877 120 -44 46 -192 -248 -41 -103 -292 -1 322 -155 -170 -154 129 -196 -187 -313 91 292 -764 -231 544 251
2899 251 -505 -95 344 459 -172 -128 507 237 -326 -76 413 804 286 -16 270 268 29 394 274 414 218
2920 218 -273 142 565 36 181 13 166 270 472 236 154 467 274 102 -24 179 333 331 33 161 228
2941 228 424 -111 44 81 118 -83 19 104 -74 -273 -45 300 123 -256 -117 -86 -91 -283 -471 -265 48 -358
2963 -358 -263 -130 -64 -167 -412 -652 -129 -182 -210 -149 -119 -162 -173 -436 -270 -229 -150 -654 -374 12 -331 -470 -345
2986 -345 -61 -63 -387 -177 -119 -266 -73 -366 -248 -384 -373 -389 -123 -174 -441 -335 10 -29 -300 -306 139 72 -174
$$ packed form
2833e37P49J16q03p9O36Q7o11N1L92p4k95k22L10L79k85k69J57L07l23j76N0M80
2855D0l97k16K14K70j49l44L84j26K54o02K96j25K90k7J81o7R1j05l13K8K77K66
2877A20j64R0k38n6K07o2j89K91L23m77j5J6K83l25Rj26M04K01j056N33P75k93
2899B51p56M10M39J15o31M4O35k70n63K50M89L91n18l02K86kk39L65j20J40j96
2920B18m91M15M23n29J45j68J53J04K02k36q2L13j93j72j26K03J54kk98J28O7
2941B28J96n35J55L7L7k01J02Q5j78j99K28L45j77l79J39L1nj92j88K06L13m06
2963c58R5J33O6j03k45k40N23n3k8O1L0m3j1k63J66M1P9n04K80L86l43j39J25
2986c45K84kl24K10N8j47J93k93J18j36J1j6K66n1k67J06L45l9k71oM45o7k46
$$ plain form
3009 -174 -357 -134 -120 95 -305 -350 89 50 71 -35 182 263 109 -401 -140 513 516 36 242 181 211 6 -6
3032 -6 180 369 178 67 135 674 266 3 127 223 94 449 -35 507 167 93 200 683 522 -37 -57 -42
3054 -42 350 203 183 296 327 566 58 143 391 230 -365 93 425 114 210 -267 367 302 175 7 39 46 183
3077 183 -237 -61 -64 144 -110 -203 156 -41 -49 10 96 -38 -520 -14 -217 -82 -229 -255 -168 79 141 -297 -186
3100 -186 69 -212 118 -347 61 7 22 -525 -320 60 -229 -306 -165 32 -516 -277 -218 76 124 -330 -533 -167
3122 -167 118 -218 -326 -329 -112 -252 -273 -282 -113 5 -599 -454 101 -40 -398 -296 -97 227 -281 -318 199 422
3144 422 -248 23 384 24 -161 168 78 167 166 271 -14 -5 440 -97 265 161 34 -67 -37 456 194 69
3166 69 -57 253 340 303 158 -88 58 283 265 377 241 363 505 120 170 299 94 603 29 158 293 58
$$ packed form
3009a74j83K23J4K15m00m5M39l9K1j06K17Q1j54n10K61O53Lm80K06o1L0k05j2
3032fJ86J89j91j11O8N39m08k63J24R6j29L55m84N42l40p4J07M83j61n59k0J5
3054d2L92j47k0J13L1K39n08Q5K48j61n95M58L32l11R6m77O34o5j27j68L2PJ37
3077A83m20J76lK08k54r3L59j97qN9Q6j34m82N06k03J35j47k6Q7K47O2m38J11
3100a86K55k81L30m65M08n4J5n47K05L80k89p7J41J97n48K39N9K94M8m54k03L66
3122a67K85l36j08lK17j40k1rJ69J18o04J45N55j41l58J02J99L24n08l7N17K23
3144D22o70K71L61l60j85L29r0Q9jJ05k85RM45n37L62j04j27j01L0M93k62j25
3166F9j26L10Q7l7j45k46J46K25j8J12j36J22J42l85N0J29k05N09n74J29J35k35
$$ plain form
3188 58 -94 469 377 -109 3 179 442 275 -19 414 475 -202 -346 56 576 176 -285 217 694 128 -82
3209 -82 -59 386 225 -110 -95 273 178 -356 -120 122 -45 -43 -144 -78 -138 -244 90 3 -34 -135 -205 38 -279 -91
3233 -91 -197 -91 -18 0 -165 -196 -148 -102 17 -73 -241 -314 198 -44 -302 -310 26 200 -477 -297 82 314 -391
3256 -391 -216 7 75 -384 -312 163 456 24 -212 349 265 -232 -281 204 260 131 -366 10 399 30 -284 108
3278 108 339 127 -82 78 445 315 -93 108 275 223 66 317 582 426 340 150 461 297 -6 44 604
3299 604 92 203 336 714 403 350 672 379 344 118 425 206 256 462 383 204 298 238 355 438 406 296 410
3322 410 208 129 198 422 353 200 111 468 193 166 332 404 302 9 15 386 86 106 -43 -167 336 300 60
3345 60 257 124 19 42 415 309 127 -217 201 176 38 -375 -96 43 -266 -182 36 202 -173 -23 -153
$$ packed form
3188E8j52N63r2m86J12J76K63j67k94M33O1o77j44M02N20m00m61N02M77n66k10
3209h2K3M45j61l35J5L68r5n34K36K42j67Kj01O6o0j06L34q7l7j01p0K43l17J88
3233i1j06J06P3J8j65l1M8M6J19r0j68p3N12k42k58qL36J74o77J80L79K32p05
3256c91J75K23O8m59P2M75K93m32k36N61q4m97m9M85N6j29m97L76L89l69l14L92
3278A08K31k12k09J60L67j30m08K01J67n2j57K51K65j56q6j90L11j64l03N0N60
3299F04n12J11J33L78l11n3L22k93l5k26L07k19N0K06p9j79R4o0J17Q3l2j10J14
3322D10k02p9O9K24o9j53q9L57k75k7J66P2j02k93OL71l00K0j49j24N03l6k40
3345F0J97j33j05K3L73j06j82l44M18k5j38m13K79J39l09Q4K18J66l75J50j30
$$ plain form
3366 -153 156 -225 -166 -514 68 -95 -406 -255 -214 -198 -216 47 -68 -546 -354 37 -132 -522 -104 13 -3 -471
3388 -471 40 88 -259 -253 -132 121 -30 -72 -348 248 -23 -424 -125 143 231 -252 -341 406 -21 -17 -6 309 -162
3411 -162 261 -365 396 409 -227 -196 95 96 -102 -183 272 95 45 -155 383 387 -51 114 118 516 -63 145 112 426
3435 426 165 383 375 84 -221 26 393 239 148 367 532 -191 217 230 188 145 -55 188 238 172 -298 357 497
3458 497 -200 51 213 237 -69 -422 84 106 127 -364 245 345 -79 -302 293 439 406 -131 -114 -46 -70 -320
3480 -320 59 257 -152 -399 -178 195 155 -384 -249 191 323 -122 -231 -164 111 -347 -309 193 -271 -340 -317 -183
3502 -183 -147 -324 -643 -226 -514 -346 -226 83 -373 -136 65 -68 -131 -327 40 -213 -294 -216 -216 -191 191 -250
3524 -250 27 -176 -355 -281 -71 -214 -81 -310 24 98 141 -117 167 -146 -411 -223 45 16 124 -458 257
$$ packed form
3366a53L09l81N9l48N82j63l11J51M1J6j8K63j15m78J92L91j69l90M18J17j6m68
3388d71N11M8l47OJ21K53j51m2k76N96k71m01K99K68Q8m83q9P47m27MJ1L15m71
3411a62M23o26P61J3o36L1K91Jj98q1M55j77n0k00N38Mm38J65ML98n79K08l3L14
3435D26k61K18qk91l05K47L67j54r1K19J65p23M08J3m2m3k00K43N0o6m70O55J40
3458D97o97K51J62K4l06l53N06K2K1m91O09J00m24k23N95J46l3n37J7O8k4k50
3480c20L79J98m09k47K21L73m0n39J35M40J32m45j09O7K75m58L8N02m64o9K3J34
3502a83L6j77l19M17k88J68J20L09m56K37K01j33o3j96L67k53q1P8%K5L82m41
3524b50K77k03j79P4K10j43J33k29L34P4M3k58K84l13k65J88K68k9J08n82P15
$$ plain form
3545 257 342 -168 -302 37 7 -103 -161 146 560 333 21 53 218 198 122 -95 11 451 -44 -36 131 227 -309
3568 -309 166 182 60 459 58 -65 79 29 95 103 250 266 77 -184 -148 -102 56 -262 128 183 -76 129 -8
3591 -8 42 -23 136 -99 29 257 -121 14 -333 195 -213 -346 -209 -70 8 -374 -418 25 -12 -186 -188 114 -128
3614 -128 200 -31 -71 46 -118 -112 -159 -172 -94 -200 -195 -193 -33 -29 -138 -103 -169 -160 -112 23 -259 -133 -475 -287 226 7
3640 7 -32 -326 7 -208 -234 -127 -22 114 -254 -262 -263 32 -259 -191 -101 -36 -79 34 137 102 26 -91 -116 -73 205
3665 205 -68 -486 98 15 -41 67 189 -191 150 -242 181 192 -104 -81 -243 40 264 -137 -346 133 181 236
3687 236 119 236 325 109 -208 188 315 336 62 257 145 -54 246 -30 191 107 207 221 117 -73 174
3708 174 120 164 173 89 -120 -163 132 427 -408 -2 176 88 264 -210 306 46 104 82 118 109 232 -375 -90 37
$$ packed form
3545B57Q5n10j34L39l0j10n8L07M14k27l12L2J65k0p6k17J06M40m95QJ67R6n36
3568c09M75J6j22L99m01j23J44n0O6QJ47J6j89k61L6M6J58l18L90N5k59K05j37
3591hN0o5J59k35J28K28l78J35l47N28m08j33J37J39P8l82m4M43l7j74kL02k42
3614a28L28k31m0J17j64Om7j3P8j06NKJ60Mj09L5o6RM8J35k82J26l42J88N13k19
3640Gl9k94L33k15k6J07J05J36l68qjK95k91O8R0O5m3J13J03l5p6j17k5M3K78
3665B05k73m18N84q3n6J08J22l80L41l92M23J1k96K3j62K83K24m01k09M79M8N5
3687B36j17J17Q9k16l17L96J27K1k74J95j12j99L00k76K21q4J00J4j04j90K47
3708A74n4M4Rq4k09m3K95K95q35M06J78q8J76m74N16k60N8k2L6rJ23o07K85J27
$$ plain form
3732 37 26 52 263 -72 149 0 -24 147 8 -366 -172 -19 144 196 133 -212 -52 190 -74 -109 -307 134
3754 134 -85 -144 -373 -109 83 -75 -344 -243 -12 -330 -116 -56 -471 -439 35 -113 -399 -356 -225 8 99 -87
3776 -87 -114 -39 42 -289 -46 -271 126 -490 -88 186 59 38 -53 -20 -62 183 -20 143 122 230 -295 -27 -153
3799 -153 134 -123 19 306 -202 -43 362 384 32 327 74 68 343 62 -22 228 70 -38 198 19 209
3820 209 195 196 85 -296 -27 177 107 276 61 198 27 13 287 305 404 -45 31 281 249 -88 190 -58 412
3843 412 105 -78 302 -107 -125 220 -152 524 -40 -360 209 166 22 -202 120 219 -104 -131 -174 -138 -54 -207
3865 -207 -2 -143 141 22 -146 -127 -20 213 -306 250 -190 32 -77 -88 -197 -58 15 94 10 -65 199 63
3887 63 67 -43 -170 102 -320 -127 248 -204 -142 -27 209 92 -40 -91 -33 144 -115 -192 -33 312 -26 -372
$$ packed form
3732C7j1K6K11l35K21j49k4J71j39l74J94J53J63N2o3l45J60K42k64l5j98M41
3754A34k19n9k29K64J92j58k69J01K31l18K14O0m15L2M74j48k86M3J31K33R1j86
3776h7k7P5Q1l31K43k25L97o16M02K74j27k1r1L3m2K45k03J63k1J08n25K68j26
3799a53K87k57J42K87n08J59M05K2l52K95k53oK75k81q4K50j58j08K36j79J90
3820B09j4Jj11l81K69K04p0J69k15J37j71j4K74J8R9m49P6K50l2l37K78k48M70
3843D12l07j83L80m09j8L45l72O76n64l20N69m3j44k24L22R9l23k7m3L6Q4j53
3865b07K05j41K84j19j68J9J07K33n19N56m40K22j09j1j09J39P3P9q4p5K64j36
3887F3Mj10j27K72m22J93L75m52O2J15K36j17j32n1N8J77k59p7J59L45l38l46
$$ plain form
3909 -372 -7 -110 0 2 -5 38 -169 -316 284 -67 -75 -12 71 218 -156 -93 275 -127 -44 3 226 144 30 -49 -25
3934 -25 -50 -67 0 201 202 -213 160 20 300 -127 -138 75 87 252 248 -168 355 415 -27 150 89 142 71 -94 162
3959 162 53 248 132 63 -203 -15 243 444 12 56 -145 150 -312 39 69 -124 -80 -188 309 1 -184
3980 -184 9 306 214 -180 15 406 208 -267 188 262 84 -97 -11 276 -59 19 108 -85 -17 5 -198 -120 -271
4003 -271 -213 82 41 -236 -44 -224 76 -149 -244 170 -205 -10 -45 -60 -381 266 -73 -204 -92 -142 -60 -143 -163
4026 -163 -291 -333 16 -19 166 -80 40 88 -123 -179 31 75 18 -285 -147 33 133 -78 95 -65 -136 -103 107
4049 107 230 184 -92 96 377 -262 -118 -4 255 117 -41 71 104 348 -70 -27 -47 286 -65 -172 242
4070 242 114 -108 208 229 100 135 85 -21 28 12 109 381 -76 17 17 195 207 -19 123 154 172 363 217 127
$$ packed form
3909c72L65j03J10KpM3k07j47O00l51qO3Q3J47l74O3L68m02Q3M7K23q2j14p9K4
3934b5k5j7O7K01Jm15L73j40K80m27j1K13J2J65mm16N23O0m42J77o1N3p1j65K56
3959A62j09J95j16o9k66J88K58K01m32M4k01K95m62L51L0j93M4j08M97l08j85
3980a84J93K97r2l94J95L91j98m75M55P4j78j81Q6K87l35P8Q9j93O8K2k03P8j51
4003b71N8K95m1k77J92j80L00k25r5M14l75J95l5j5l21O47l39j31J12n0Q2q3k0
4026a63j28m2L49l5J85k46J20M8k11n6K10M4n7l03J38J80J00k11J73j60p1L3K10
4049A07J23m6k76J88K81o39J44J14K59j38j58J12L3K44m18M3k0L33l51j07M14
4070B42j28k22L16K1j29L5n0j06M9j6R7K72m57R3%J78J2k26J42L1J8J91j46r0
$$ plain form
4094 127 46 -120 123 30 -312 150 278 64 17 -123 -146 183 137 315 125 177 -195 -52 -152 261 156 -285
4116 -285 -153 -29 99 -314 -85 186 14 -292 242 121 -149 -415 -246 83 -52 -218 -227 -88 -115 21 -269
4137 -269 70 -90 -493 62 -217 -325 -37 -251 -216 -346 -123 -105 311 -190 -61 137 -227 -299 -83 104 342
4158 342 -174 -252 -120 122 -201 -210 243 -271 71 3 159 -46 -140 70 18 -186 -133 91 315 -62 -479 131
4180 131 59 51 0 -47 -48 98 -518 -138 283 -39 100 172 345 -9 -100 -164 126 149 -48 -140 -224 -72 411 -206
4204 -206 185 133 -143 -58 -103 454 178 64 2 72 -32 183 276 384 88 170 -147 -203 134 104 437 -44 201
4227 201 -18 297 27 50 84 451 110 246 112 395 -181 -105 271 118 -45 255 249 323 66 -379 63 -25
4249 -25 -120 -232 -208 337 306 2 -325 -118 109 -57 76 -215 -46 -72 -135 -59 -39 -214 55 -44 -43 34 -67 -170
$$ packed form
4094A27q1j66K43r3l42M62J28k14m7j40k3L29m6J78j90N2l72J43j00M13j05m41
4116b85J32J24J28m13K29K71j72l06N34j21k70k66J69L29j35j66rJ39k7J36k90
4137b69L39j60m03N55k79j08K88k14L5j30K23J8M16n01J29J98l64p2K16J87K38
4158C42n16p8J32K42l23rM53n14L42o8J56k05r4K10n2k04N3K24K24l77m17O10
4180A31p2qn1m7jJ46o16L80M21l22J39P2J73l54r1o4K90K3j97r2q4J52M83o17
4204b06L91n2k76Q5m5N57k76j14o2P0j04K15R3J08k96Q2l17n6L37l0L33m81K45
4227B01k19L15k70K3L4L67l41J36j34K83n76P6L76j53j63L00oP4k57m45M42q8
4249b5r5j12K4N45l1l04l27K07K27j66J33k91J69k6o3P6K0j75K69r9JP7j01j03
$$ plain form
4273 -170 161 94 315 5 -85 0 -145 -178 -64 -167 271 -13 -362 -293 -117 -494 -112 -398 -275 -300 -202 270
4295 270 -8 17 -313 -314 -32 -43 -237 283 93 51 51 -150 250 -155 -125 -5 33 252 -129 1 -175 288 101
4318 101 49 317 270 -174 35 176 -81 66 -80 -84 189 330 -28 273 -62 151 -55 -68 161 147 298 222
4340 222 81 225 -94 157 -7 79 65 117 264 416 -85 86 -68 180 80 103 -92 -193 45 30 8 -54
4362 -54 146 -62 -178 468 -70 -43 121 -218 285 24 -203 150 11 125 416 -97 130 -201 -180 -178 -154 39
4384 39 3 -289 -131 -183 -87 -249 -152 66 136 130 -218 -127 -183 91 -319 -304 160 285 7 -196 -198 -392 -432 -215 -360
4409 -360 -73 -117 -162 -67 -59 147 -173 63 -178 -56 -256 -246 8 -119 -42 -17 200 -61 44 -102 -258 97 164
4432 164 -133 0 159 104 18 94 38 -31 120 24 -3 124 12 62 -55 22 124 -102 74 293 29 232 -98
$$ packed form
4273a70L31o7K21l10r0Q5j45l3J14j03M38k84l49O9J76l77L82k86J23k5R8M72
4295B70k78K5l30jK82j1j94N20j90m2%k01M00m05L0J20L8K19l81J30j76M63j87
4318A01n2K68m7m44K09J41k57J47j46mK73J41l58L01l35K13k06j3K29j4J51p6
4340B22j41J44l19K51j64Q6j4N2J47J52n01J71j54K48j00K3j95j01K38j5k2o2
4362e4K00k08j16O46n38K7J64l39N03k61k27L53j39J14K91n13K27l31K1KK4J93
4384C9l6k92J58n2R6j62R7K18P0ol48R1n6K74m10J5M64J25k78k03kj94m0K17j45
4409c60K87m4m5R5QK06l20K36k41J22k00J0K54j27P7K5K17k61J05j46j56L55O7
4432A64k97J33J59n5q6P6n6o9J51r6k7J27j12N0j17P7J02k26J76K19k64K03l30
$$ plain form
4455 -98 330 82 83 118 52 3 -147 59 133 171 -5 319 -92 119 -186 44 -54 217 183 239 122 46 64 255
4479 255 70 289 472 -41 -120 -164 127 -19 213 50 110 -39 -276 -117 171 -43 117 -70 147 129 -21
4500 -21 58 -140 376 -81 112 24 -58 200 84 267 259 -55 -207 183 -123 -23 -190 261 215 23 -179 166
4522 166 -24 263 43 154 -239 -419 103 -23 -62 -27 -241 -42 -156 81 228 -122 -164 35 46 28 -146 99
4544 99 107 -172 -180 -352 162 -316 11 171 192 -91 -149 -262 -90 119 88 -39 -95 287 157 -317 4 46 554
4567 554 -108 189 121 48 65 78 210 -144 -266 100 -65 -75 146 -20 86 -41 35 -131 158 204 263 126 108
4590 108 228 -28 112 84 -35 113 133 -69 127 409 -16 96 14 -386 138 310 21 224 106 9 330
4611 330 -179 235 258 -178 -296 266 200 -34 -5 411 243 56 -91 418 -124 -140 93 44 295 186 25 124
$$ packed form
4455i8M28k48JL5o6m9j50K06P4L8j76L24m11K11l05K30r8K71l4N6j17p6J8J91
4479B55j85K19J83n13p9m4K91j46K32j63O0j49k37J59K88k14J60j87K17j8j50
4500b1P9j98N16m57J93q8q2K58j16J83ql14j52L90l06J00j67M51m6j92k02L45
4522A66j90K87k20J11l93j80N22j26l9L5k14J99j14K37J47l50m2J99J1j8j74K45
4544I9Qk79qj72N14m78L27J60K1k83n8j13J72K09l1j27n6L82j30m74L21M2N08
4567E54o62K97o8p3J7J3J32l54j22L66j65j0K21j66J06j27P6j66K89M6N9j37j8
4590A08J20k56J40k8j19J48K0k02J96K82m25J12q2m00N24J72k89K03j18r7L21
4611C30n09M14K3m36j18N62o6k34K9M16j68j87j47N09n42j6K33m9K51j09j61R9
$$ plain form
4633 124 -54 -13 -220 307 234 -7 -68 106 6 87 -69 -174 312 -83 60 -193 -149 -162 -79 -85 -26 167 -56
4656 -56 2 35 -219 54 -354 -114 -23 -48 -114 -287 8 14 -251 -51 62 -148 4 -142 -146 109 -294 -189 -261 -397
4680 -397 212 96 203 124 142 26 -138 -402 113 68 -281 -138 -42 -114 1 -137 -118 -91 72 -114 -262 105
4702 105 24 -55 -88 34 6 -47 98 12 189 -88 -19 -66 301 16 189 277 120 -175 49 167 80 96 36 5
4726 5 9 -49 149 66 211 61 -22 -69 222 172 69 99 32 350 327 205 112 78 -243 304 -71 195 163 276 -158
4751 -158 7 99 -59 -83 -69 55 193 -198 186 434 190 -37 47 97 2 -28 -378 -11 246 -55 36 452 139
4774 139 -84 8 220 135 119 -346 143 171 -205 -315 188 -335 28 -62 -196 -145 -7 -403 -22 10 -221 -63
4796 -63 -62 -47 -152 244 144 -26 157 72 32 -288 -155 -94 -49 196 -110 184 352 -183 -3 45 67 -246 -64
$$ packed form
4633A24j78M1k07N27p3k41o1J74j00Q1j56j05M86l95J43k53M4j3Q3oN9J93k23
4656e6N8L3k54K73m08K40R1k5o6j73K95Ok65K00J13k10J52j46mK55m03J05p2j36
4680c97O09j16J07p9J8j16j64k64N15m5l49J43R6p2J15j38J9K7J63j86j48L67
4702A05q1p9l3J22k8n3J45q6J77k77O9m7L67k85J73Q8j57k95K24J18q7J6o0l1
4726EMn8J98q3J45j50q3m7K91n0j03L0o7L18k3j22r3l4l21N47l75K66l2J13m34
4751a58J65R2j58k4J4J24J38l91L84K48k44k27Q4N0r5l0l50L67K57l01R1M16l13
4774A39k23R2K12q5j6m65M89K8l76j10N03n23L63r0j34N1J38l96L81L2k31J58
4796f3JJ5j05L96j00j70J83q5m0l20J33O1M5K45l06K94J68n35J80M8K2l13J82
$$ plain form
4819 -64 170 -169 -160 36 -132 29 -12 -106 -96 -227 -124 -265 125 -108 -101 -129 -248 60 58 -156 45 -139 49 243
4843 243 379 -309 256 -126 -134 226 223 95 -6 251 -138 -37 -261 349 -3 -2 142 68 54 -39 10 32 -144 434
4867 434 117 -72 -217 148 -266 -44 -60 143 170 -118 -15 137 252 188 174 217 86 -196 35 -177 336 -155
4889 -155 273 122 116 137 56 59 295 185 255 -211 37 -43 -15 29 -190 441 202 42 34 -115 -455 215 -113 -78
4913 -78 -190 -125 -110 117 -21 104 -34 -92 8 35 -129 28 -235 -48 2 -93 -164 125 153 -265 11 -97 5
4936 5 -215 -67 145 -33 -284 238 -65 7 -141 -159 -250 -1 -36 108 79 16 -163 -123 43 -100 26 -184 -131
4959 -131 -226 -9 -53 -101 118 -246 -150 -52 -188 308 200 25 239 208 34 -148 -19 178 152 -74 -150 125 288
4982 288 -267 34 -236 140 -185 -81 -39 -29 377 52 203 -44 -44 -87 -96 -161 4 186 -251 93 84 112 -35 369
$$ packed form
4819f4K34l39RJ96j68J61m1r4J0j31J03j41L90k33Pk8j19L08kk14K01j84J88J94
4843B43J36o88N65l82qL60lj28j01K57l89J01k24O10l52JJ44p4j4r3M9K2j76N78
4867D34l17j89j45L65m14K22j6K03K7k88J03J52J15o4j4M3j31k82K31k12N13m91
4889a55M28j51oK1q1LK36j10P0m66K48q0K8M4k19O31k39j60qj49l40O70l28L5
4913g8j12O5J5K27j38J25j38n8J00K7j64J57k63J87N0r5p1K89K8m18K76j08J02
4936Ek20J48K12j78k51N22l03P2j48j8r1K49l5J44k9o3j79M0J66j43J26k10N3
4959a31r5K17m4m8K19l64R6R8j36M96j08j75K14l1j74j82J29J97k6k26p6K75J63
4982B88n55L01k70L76l25J04M2J0M06l25J51k47%m3ro5J65J82m37L44rK8j47M04
$$ plain form
5006 369 -106 172 200 172 314 89 -2 188 223 119 -122 346 -61 -260 317 51 84 -111 -140 50 -78 -188
5028 -188 -223 -294 2 105 128 -295 -260 -167 -125 -167 -129 -50 94 -61 229 303 -104 -123 104 -121 -158 16 -117 -293
5052 -293 -383 -202 31 -339 213 -26 39 -49 -90 -149 -414 118 -175 -24 -88 -62 -30 143 54 -98 -113 -102 -61 79
5076 79 159 118 -201 98 143 -114 158 198 -55 -38 164 49 18 -7 -26 259 76 88 103 186 -55 57 45 -94
5100 -94 364 -66 47 -169 -178 257 88 -229 121 205 37 -49 -119 -154 0 -5 -26 110 -165 6 -45 -90 -23 243
5124 243 -59 -104 -3 292 -276 92 -177 -288 288 198 -56 -101 -326 -276 -54 -173 -63 -168 133 183 464 100
5146 100 121 -234 135 -10 -9 220 59 195 -149 -97 8 -213 -111 455 -37 2 161 65 -87 -207 -99 23
5168 23 199 -101 71 -144 11 49 187 -47 159 302 -40 -102 -208 -59 -211 -46 398 149 -224 83 204
$$ packed form
5006C69m75K78K8k8J42k25r1J90L5j04k41M68m07j99N77k66L3j95k9J90j28j10
5028a88l5p1K96J03K3m23L5R3M2m2L8P9J44j55K90P4m07j9K27k25l7J74j33j76
5052b93r0J81K33l70N52k39O5q8m1n9k65N32k93J51o4K6L2J73q9j52j5J1M1J40
5076G9Q0m1l19K99M5k57K72M0k53J7K02j15l1k5j9K85j83J2J5Q3k41J12j2j39
5100i4M58m30J13k16rM35j69l17L50Q4j68q6p0l5J54nk1J36k75J71n1m5O7K66
5124B43l02m5J01K95n68L68k69j11N76r0k54m5k25N0K22j19J10j05L01N0K81l64
5146A00K1l55L69j45JK29j61J36l44N2J05k21J02N66m92L9J59r6j52j20J08J22
5168B3J76l00J72k15J55L8J38k34K06J43l42o2j06J49j52J65M44k49l73L07J21
$$ plain form
5189 204 -126 -221 -161 -258 -110 -297 -156 -253 -19 -240 -108 -26 -64 -90 -26 18 -101 -32 -88 139 -112 63 268 203
5213 203 -331 241 3 12 436 -40 -14 236 122 157 113 125 -118 5 -38 214 193 -107 -54 61 -85 113 414
5236 414 -89 425 -335 -408 215 134 84 175 -19 312 177 145 -157 140 -24 50 38 83 98 -117 111 -141 -267
5259 -267 177 186 -25 -195 96 2 214 121 83 127 233 227 34 -71 -269 -142 -136 79 -154 -132 -484 -141 17 -122
5283 -122 -110 -525 -15 -138 2 -103 -8 -153 -76 -42 113 -52 -27 3 -170 167 -174 -159 -239 196 -86 -50 -336
5306 -336 -176 -107 -63 -86 151 75 133 135 155 -21 -151 34 84 -98 32 212 -94 37 -171 131 266 220 -23
5329 -23 43 -282 108 -62 -194 -131 -241 -99 -99 133 -170 -21 57 103 -84 -305 179 76 -79 130 14 123
5351 123 127 -80 68 83 -176 -161 -31 0 137 -17 -139 -233 -1 22 139 -9 9 -38 -200 245 -27 -145 148
$$ packed form
5189B04l30r5O0r7J48j87J41r7K34k21J32Q2l8k6O4M4j19O9n6K27k51J75K05o5
5213B03n34N72k38RM24m76K6K50j14L5m4J2k43J23m3K52k1l00N3J15j46J98L01
5236D14n03N14p60p3O23q1n0R1j94L31j35l2l02K97j64P4j2M5J5k15K28k52j26
5259b67M44Rk11j70K91r4K12r3l8M4J06oj93j05j98J27OK15k33K2l52L43J58j39
5283a22J2m15N10j23J40j05R5j45P7L4J55j65K5L0j73L37l41J5q0M35k82L6k86
5306c36J60O9M4k3K37p6N8KK0j76j30J85N0j82J30J80l06J31k08L02J35m6k43
5329b3O6l25L90j70j32O3j10J42%K32l03J49P8M6j87k21M84j03j55K09j16J09
5351A23Mk07J48J5k59J5J30L1J37j54j22r4K32K3J17j48J8m7j62M45k72j18K93
$$ plain form
5374 148 160 -360 -136 0 225 322 -5 -147 -33 301 63 -150 -173 282 332 118 -201 -113 49 -44 34 68 30
5397 30 -249 -58 -30 126 132 31 332 -353 -39 -409 242 84 -189 -248 -515 35 -102 11 160 78 -153 -121
5419 -121 -232 -103 58 88 21 -262 -47 45 49 300 -138 56 8 -22 1 -180 -157 -210 -6 -305 -122 -27 490 332
5443 332 -294 -9 -56 203 12 -60 162 14 -100 -274 164 -219 -217 -204 -117 -34 -110 -38 -18 -63 134 207 -51 -25
5467 -25 257 163 23 2 179 80 191 217 -1 63 -302 -57 273 -101 15 -194 192 -126 223 -80 -55 -279
5489 -279 -10 -42 -25 -14 1 -9 -247 233 175 -80 -108 -4 76 -57 -60 -2 -40 17 -21 245 1 38 -112 -234 -232 -86
5515 -86 -158 -55 147 365 -60 220 -2 194 273 -257 -64 91 139 -82 157 346 308 44 -33 -29 80 -30 83
5538 83 139 151 -311 -153 189 327 134 -59 91 -338 69 -312 -231 13 192 177 -177 46 -90 -192 -36 -83
$$ packed form
5374A48J2n20K24J36K25R7l27j42J14L34k38k13k3M55N0k14l19Q8J62r3P8L4l8
5397C0k79J91K8J56Oj01L01o85L14l70O51j58k73n9k67N50j37J13J49q2k31L2
5419a21j11J29J61L0o7k83K15R2MK51m38J94m8l0K3j81K3n3K04k99J83R5N17j58
5443C32o26K85m7K59j91p2K22j48j14j74M38l83KJ3Q7Q3p6P2K0m5J97P3k58K6
5467b5K82r4j40k1J77r9J11K6k18O4l65K45L30l74J16k09L86l18L49l03K5k24
5489b79K69l2J7J1J5j0k38M80n8k55k8J04Q0j33lN8l8N7l8K66k44L7j50j22KJ46
5515h6p2J03K02K18m25K80k22J96P9n30J93J55M8k21K39J89l8k64p7MJ09j10J13
5538H3N6J2m62J58L42J38j93j93J50m29M07l81Q1K44J79j5l54K23j36j02J56m7
$$ plain form
5560 -83 233 -97 -10 -232 230 245 -21 284 -115 -244 -220 -189 56 -96 171 18 -166 94 -94 239 -202 -156
5582 -156 44 -53 20 -301 234 120 -164 -19 -25 39 -26 -1 221 -84 -100 236 -41 -50 137 131 -212 143 -221 -311
5606 -311 44 -146 -285 194 -139 247 -179 54 -97 91 -90 170 -104 -8 -222 -183 -272 -85 281 -94 -80
5627 -80 135 66 24 79 111 347 -103 -195 1 147 -350 87 286 405 -42 87 239 72 -169 -173 133 259 -108
5650 -108 58 -84 -240 -31 111 69 -13 -16 73 553 336 -93 -72 168 157 71 8 -208 -63 -133 -116 216 269 211
5674 211 -64 125 35 -10 140 -23 -10 26 -228 -424 135 -35 -314 -110 153 276 115 26 151 -110 -172 -48
5696 -48 -55 -46 -21 183 65 -270 -29 120 -176 -80 67 224 -62 -274 308 -168 -36 25 164 44 -288 76 -112
$$ packed form
5560h3L16l30Q7k22M62J5k66L05l99j29K4L1K45j52K67j53j84K60j88L33m41M6
5582a56K00r7P3l21N35j14k84J45oO4o5K5K22l05j6L36k77rJ87ol43L55l64r0
5606c11L55j90j39M79l33L86m26K33j51J88j81K60k74R6k14L9q9J87L66l75J4
5627h0K15o9m2N5L2K36m50r2J96J46m97M37J99J19m47J29J52j67k41mL06J26l67
5650a08J66j42j56K09J42m2q2lQ9M80k17m29K1K40j1q6o3k16J45p0J7L32N3n8
5674B11k75J89r0m5J50j63J3L6k54j96N59j70k79K04K63J23j61q9J25k61o2J24
5696d8pRK5K04j18l35K41J49k96R6J47J57k86k12N82m76J32O1J39j20l32L64j88
$$ [...]
8191f3
##END NTUPLES=NMR FID
##END=
