##TITLE=1H_SAV-61-(f7-5)
 CDCl3, 8 sc, 
 3.3.2020
##JCAMPDX= 6.0         $$ Bruker NMR JCAMP-DX V2.0
##DATA TYPE= NMR FID
##DATA CLASS= NTUPLES
##ORIGIN= UXNMR, Bruker Analytische Messtechnik GmbH
##OWNER= root
$$ XWIN-NMR		Version 3.5
$$ Tue Mar  3 14:17:53 2020 Russian Standard Time (UT+4h)  she@DPX200
##.OBSERVE FREQUENCY= 200.1315
##.OBSERVE NUCLEUS= ^1H
##.DELAY= (6, 6)
##.ACQUISITION MODE= SIMULTANEOUS
##.ACQUISITION SCHEME= undefined
##.AVERAGES= 8
##.DIGITISER RES= 18
##SPECTROMETER/DATA SYSTEM= spect
##.PULSE SEQUENCE= zg30
##.SOLVENT NAME= CDCl3
##.SHIFT REFERENCE= (INTERNAL, CDCl3, 0, 15.7039)
##AUDIT TRAIL= $$ (NUMBER, WHEN, WHO, WHERE, WHAT)
$$ ##TITLE= Audit trail, XWIN-NMR		Version 3.5
$$ ##JCAMPDX= 5.01
$$ ##ORIGIN= Bruker BioSpin GmbH
$$ ##OWNER= she
$$ F:/spectra/data/she/nmr/H-F/1/audita.txt
$$ ##AUDIT TRAIL=  $$ (NUMBER, WHEN, WHO, WHERE, WHAT)
(   1,<2020-03-03 14:16:43.57 +0400>,<she>,<DPX200>,
      <created by zg, POWCHK disabled, PULCHK disabled
       configuration hash MD5:
       00 E9 B6 7A A2 85 ED C7 34 08 36 98 17 FE 4E 26
       data hash MD5: 16K
       C2 72 39 98 E4 C1 EE 5B 78 B2 AC 8E E2 91 17 F9>)
$$ ##END=
$$ 
$$ hash MD5
$$ 39 E4 5F 57 8D B5 2D E7 26 F5 A3 1A 09 64 CE 3B
##$RELAX= 
##$RELAX= 
##$RELAX= 
##$RELAX= 
##$RELAX= 
##$RELAX= 
$$ Bruker specific parameters
$$ --------------------------
##$DU= <F:/spectra>
##$EXPNO= 1
##$NAME= <H-F>
##$PROCNO= 1
##$TYPE= <nmr>
##$USER= <she>
##$AMP= (0..31)
100 100 100 100 100 100 100 100 100 100 100 100 100 100 100 100 100 100 
100 100 100 100 100 100 100 100 100 100 100 100 100 100 
##$AQSEQ= 0
##$AQ_mod= 1
##$AUNM= <au_zg>
##$AUTOPOS= <>
##$BF1= 200.13
##$BF2= 200.13
##$BF3= 200.13
##$BF4= 200.13
##$BF5= 200.13
##$BF6= 200.13
##$BF7= 200.13
##$BF8= 200.13
##$BYTORDA= 1
##$CFDGTYP= 0
##$CFRGTYP= 5
##$CHEMSTR= <none>
##$CNST= (0..31)
1 1 145 1 1 1 1 1 1 1 1 1 1 1 1 1 1 1 1 1 1 1 1 1 1 1 1 1 1 1 1 1 
##$CPDPRG= <>
##$CPDPRG1= <>
##$CPDPRG2= <>
##$CPDPRG3= <>
##$CPDPRG4= <mlev>
##$CPDPRG5= <mlev>
##$CPDPRG6= <mlev>
##$CPDPRG7= <mlev>
##$CPDPRG8= <mlev>
##$CPDPRGB= <>
##$CPDPRGT= <>
##$D= (0..31)
0 1.2 0 0 0 0 0 0 0 0.06 0 0.03 0 0 0 0 0.0002 0 0 0 0 0 0 0 0 0 0 0 0 
0 0 0 
##$DATE= 1583230602
##$DBL= (0..7)
120 120 120 120 120 120 120 120 
##$DBP= (0..7)
150 150 150 150 150 150 150 150 
##$DBP07= 0
##$DBPNAM0= <>
##$DBPNAM1= <>
##$DBPNAM2= <>
##$DBPNAM3= <>
##$DBPNAM4= <>
##$DBPNAM5= <>
##$DBPNAM6= <>
##$DBPNAM7= <>
##$DBPOAL= (0..7)
0.5 0.5 0.5 0.5 0.5 0.5 0.5 0.5 
##$DBPOFFS= (0..7)
0 0 0 0 0 0 0 0 
##$DE= 6
##$DECBNUC= <off>
##$DECIM= 24
##$DECNUC= <off>
##$DECSTAT= 4
##$DIGMOD= 1
##$DIGTYP= 9
##$DL= (0..7)
0 120 120 120 120 120 120 120 
##$DP= (0..7)
150 150 150 150 150 150 150 150 
##$DP07= 0
##$DPNAME0= <>
##$DPNAME1= <>
##$DPNAME2= <>
##$DPNAME3= <>
##$DPNAME4= <>
##$DPNAME5= <>
##$DPNAME6= <>
##$DPNAME7= <>
##$DPOAL= (0..7)
0.5 0.5 0.5 0.5 0.5 0.5 0.5 0.5 
##$DPOFFS= (0..7)
0 0 0 0 0 0 0 0 
##$DQDMODE= 0
##$DR= 18
##$DS= 0
##$DSLIST= <SSSSSSSSSSSSSSS>
$$ [...]
##$SUBNAM2= <"">
##$SUBNAM3= <"">
##$SUBNAM4= <"">
##$SUBNAM5= <"">
##$SUBNAM6= <"">
##$SUBNAM7= <"">
##$SUBNAM8= <"">
##$SUBNAM9= <"">
##$SW= 24.9337058887773
##$SWIBOX= (0..15)
0 0 2 0 0 0 0 0 0 0 0 0 0 0 0 0 
##$SW_h= 4990.01996007984
##$TD= 16384
##$TD0= 1
##$TE= 0
##$TE2= 300
##$TE3= 300
##$TEG= 300
##$TL= (0..7)
0 120 120 120 120 120 120 120 
##$TP= (0..7)
150 150 150 150 150 150 150 150 
##$TP07= 0
##$TPNAME0= <>
##$TPNAME1= <>
##$TPNAME2= <>
##$TPNAME3= <>
##$TPNAME4= <>
##$TPNAME5= <>
##$TPNAME6= <>
##$TPNAME7= <>
##$TPOAL= (0..7)
0.5 0.5 0.5 0.5 0.5 0.5 0.5 0.5 
##$TPOFFS= (0..7)
0 0 0 0 0 0 0 0 
##$TUNHIN= 0
##$TUNHOUT= 0
##$TUNXOUT= 0
##$USERA1= <user>
##$USERA2= <user>
##$USERA3= <user>
##$USERA4= <user>
##$USERA5= <user>
##$V9= 5
##$VALIST= <valist>
##$VCLIST= <CCCCCCCCCCCCCCC>
##$VD= 0
##$VDLIST= <DDDDDDDDDDDDDDD>
##$VPLIST= <PPPPPPPPPPPPPPP>
##$VTLIST= <TTTTTTTTTTTTTTT>
##$WBST= 1024
##$WBSW= 4
##$XGAIN= (0..3)
0 0 0 0 
##$XL= 0
##$YL= 0
##$YMAX_a= 112354
##$YMIN_a= -60237
##$ZGOPTNS= <>
##$ZL1= 120
##$ZL2= 120
##$ZL3= 120
##$ZL4= 120
##$ABSF1= 10
##$ABSF2= 0
##$ABSG= 5
##$ABSL= 3
##$ALPHA= 0
##$AQORDER= 0
##$ASSFAC= 0
##$ASSFACI= 0
##$ASSFACX= 0
##$ASSWID= 0
##$AUNMP= <proc_1d>
##$AZFE= 0.1
##$AZFW= 0.1
##$BCFW= 1
##$BC_mod= 2
##$BYTORDP= 1
##$COROFFS= 0
##$CY= 11.3945322036743
##$DATMOD= 1
##$DC= 2
##$DFILT= <>
##$DTYPP= 0
##$F1P= 16.9975609425685
##$F2P= -3.02152046262296
##$FCOR= 0.5
##$FTSIZE= 0
##$FT_mod= 4
##$GAMMA= 1
##$GB= 0.15
##$INTBC= 1
##$INTSCL= 1
##$ISEN= 128
##$LB= 0.24
##$LEV0= 0
##$LPBIN= 0
##$MAXI= 10000
##$MC2= 0
##$MEAN= 0
##$ME_mod= 0
##$MI= 1.114404
##$NCOEF= 0
##$NC_proc= 0
##$NLEV= 6
##$NOISF1= 3.799351
##$NOISF2= 2.8
##$NSP= 1
##$NTH_PI= 0
##$NZP= 0
##$OFFSET= 15.70392
##$PC= 1
##$PHC0= -9793.32
##$PHC1= 24.60082
##$PH_mod= 1
##$PKNL= yes
##$PPARMOD= 0
##$PSCAL= 0
##$PSIGN= 0
##$REVERSE= no
##$SF= 200.130013532006
##$SI= 16384
##$SIGF1= 3
##$SIGF2= 2
##$SINO= 400
##$SIOLD= 16384
##$SREGLST= <1H.CDCl3>
##$SSB= 0
##$STSI= 0
##$STSR= 0
##$SW_p= 3612.71676300578
##$SYMM= 0
##$S_DEV= 0
##$TDeff= 0
##$TDoff= 0
##$TI= <>
##$TILT= no
##$TM1= 0
##$TM2= 0
##$TOPLEV= 0
##$USERP1= <user>
##$USERP2= <user>
##$USERP3= <user>
##$USERP4= <user>
##$USERP5= <user>
##$WDW= 1
##$XDIM= 8192
##$YMAX_p= 0
##$YMIN_p= 0
$$ End of Bruker specific parameters
$$ ---------------------------------
##NTUPLES= NMR FID
##VAR_NAME=  TIME,          FID/REAL,        FID/IMAG
##SYMBOL=    X,             R,               I
##VAR_TYPE=  INDEPENDENT,   DEPENDENT,       DEPENDENT
##VAR_FORM=  AFFN,          ASDF,            ASDF
##VAR_DIM=   8192,          8192,            8192
##UNITS=     SECONDS,       ARBITRARY UNITS, ARBITRARY UNITS
##FACTOR=    0.0002004,     1,               1
##FIRST=     0,             0,               0
##LAST=      1.6414764,     0,               0
##MIN=       0,             -60237,          0
##MAX=       1.6414764,     112354,          0
$$ Real data points
##PAGE= N=1
##DATA TABLE= (X++(R..R)), XYDATA
$$ [...]
2070D37L69l24K33m8L2m41K27K95M4m47k95M6L07k3j69j9L49j76j33j13K16j89
2092A78j34l51P03m30L05l7k30J48P6Q1l46q8J9k39M79j4j99q6j24NK81J10k56
2115a49J74M5m00K4O7j30L17l40N26n55L6q9L57k2j75QR9K0l98L27L46k02o1n6
2139b31L20l27k23L65J23J38o95L51L58j26k93L33l2p6j63J32M00m32r8J90N5
2160F9Q8l14J2K17k09J98m8l0k77J06L36N3K6R7k72L70n05n4M6M14j96n56O78
2183B49P9j63j85j02L91j67k39Q7j34J17k34J71M3L0j81L69l60p5J6o8O1j28J0
2206d13L1J68k36K21J84j8p7k07n0K93R8l27l0Q1K11n7l48m7L22j36l39L25R2
2229b59l5j28k0J63l33K71J54m0l37J19K32j62k0Q0J08L32l90j69L24J5j32J00
$$ plain form
2070 437 806 482 715 667 699 258 485 780 824 377 82 128 435 412 243 224 573 397 264 151 367 178
2092 178 44 -307 396 -34 271 234 4 152 228 309 -37 -125 -106 -345 134 120 -79 -165 -289 -284 -3 107 -149
2115 -149 25 70 -330 -306 -239 -369 -52 -392 134 -421 -385 -474 -117 -139 -314 -306 -207 -187 -585 -258 88 -114 -175 -231
2139 -231 89 -238 -461 -96 27 165 -530 -179 179 53 -240 93 61 -15 -178 -46 354 -78 -176 14 69
2160 69 157 -157 -145 72 -137 61 13 -17 -294 -188 148 201 227 324 52 422 -83 -137 -91 323 127 -429 249
2183 249 328 165 -20 -122 269 102 -137 -50 -184 -67 -301 -130 -87 -57 -238 131 -229 -304 -288 -356 -295 -423 -413
2206 -413 -382 -214 -450 -229 -45 -63 -140 -347 -397 -104 -6 -333 -363 -282 -71 -128 -476 -523 -201 -337 -676 -351 -259
2229 -259 -294 -422 -442 -279 -612 -341 -187 -227 -564 -445 -213 -375 -395 -315 -207 125 -265 -434 -110 -95 -227 -127
2251a27k39K48j12o5P5N10k88J14k24M5J21j48L58l29L00k96N63l43j77K05J07
2272B98K98l12j46L34l03J02J52j29K75k37r9K01j16J09P1k17N08l28L52l71K62
2293G04k94o9P4LJ40j92O25o03P3l1M48m82r6j60L66J76j22j8k42K29lq6j04J
2317C37j29K74L12q78M53n9M7j90l7M47j75j52k72j10L52J23j72K9J85k79o4k12
2339a70Q7J24q0k29J57K03k69K63J47q3j76m01M55K3k10K57l27k72M18m32L14
2360b01%R8l60M51l08j03m8M4K70k22K53r4J08r3j31J58r0J54m0k95K73j6j8o9
2384b79M5r4K21J43l42j57J41J70J30O3qJ95l07P6j24j87K59J33j65R3J09l44
2406b29P1K34j8O6N0j71K45n29J39L61k90L17K0l61L02k32J95k0J24j76j42L81
$$ plain form
2251 -127 -366 -118 -230 -295 -220 290 2 116 -108 -63 58 -90 268 -61 239 -57 506 163 -14 191 298
2272 298 596 284 138 472 169 271 423 294 569 332 233 434 318 427 498 281 789 461 813 442 704
2293 704 410 341 415 418 558 366 991 388 461 430 878 396 300 140 506 682 560 542 300 529 526 440 336 337
2317 337 208 482 794 -84 369 310 357 167 130 577 402 250 -22 -132 220 343 171 200 385 106 42 -170
2339 -170 -83 41 -39 -268 -111 92 -177 86 233 150 -26 -427 28 51 -159 98 -229 -501 -83 -515 -201
2360 -201 -201 -103 -463 -12 -320 -423 -471 -427 -157 -379 -126 -220 -112 -205 -336 -178 -268 -114 -154 -449 -176 -192 -210 -279
2384 -279 -234 -328 -107 36 -306 -463 -322 -152 -22 41 33 228 -79 -3 -127 -314 -55 78 -87 6 115 -229
2406 -229 -158 76 58 124 174 3 248 -281 -142 219 -71 246 266 -95 207 -25 170 150 274 98 -44 337
2428C37p2L8r5j72L87j41j1l64M13q0J3j0o0J23J87n29Q1J80l72J37j11L22j65
2451C6K75q6k88j10K74l77K43k51J61L17j48J04j48r0Oj7l04N65n2j59n2Q7m87
2474e01O10J87m19K74m76n2K21k13K08k02L01n49M09N4j47r1J93jk16L52j05n44
2496g07L66r8K07k7k14L62l02K08k34K15J68O6l85J52K20j55k38l7N19l20K99
2517F5j43k90m5N46n27K01j43K53j0L05k10J21m10K44k03K30j7q5M65m86O2J64
2539H7KJ18m20K14K21j72k15k78P45m4n9j24l12K15P2j68L26l2j80M2Q9k50Q9
2562c4Q4O6K3j33L0j74J92J08k75L18k56P8P3j68L2n6J08q8j76J87K76m06J78
2585a3lL25n48n9K98M1j32o6O4K08r8J49l96J28l66K72k02J64L10j72P5j72l0
$$ plain form
2428 337 265 303 208 36 423 282 271 -93 320 240 253 243 183 306 493 -36 45 225 -147 -10 -121 201 36
2451 36 311 225 -63 -173 101 -276 -33 -284 -123 194 46 150 2 -88 -82 -99 -403 162 110 -49 -101 -14 -501
2474 -501 109 296 -123 151 -325 -377 -156 -369 -161 -363 -62 -611 -202 -148 -295 -386 -193 -194 -410 -58 -163 -707
2496 -707 -341 -439 -232 -259 -473 -111 -413 -205 -439 -224 -56 10 -375 -223 -3 -158 -396 -433 86 -234 65
2517 65 -78 -368 -413 133 -394 -193 -336 -83 -93 212 2 123 -287 -43 -246 -16 -33 -118 347 -139 -77 87
2539 87 89 207 -213 1 222 50 -165 -443 302 258 199 75 -237 -22 50 -118 208 176 -4 38 127 -123 -34
2562 -34 50 116 139 6 36 -138 54 162 -113 205 -51 27 100 -68 -36 -92 16 -72 -248 -61 215 -191 -13
2585 -13 -16 309 -239 -298 0 41 -91 -157 -93 115 17 166 -230 -102 -468 -196 -398 -234 76 -96 -21 -193 -223
2608b23J0K16k47J16j00K2J16j85K85j56J67l94N2K06l10K46o2K84j80J35R2l73
2630b83k39O92m43M37k31k32K45j07K55k00L1p1J57m58L41L10J9l74J49J52K54
2651D04l4n00K41M8K94k30j14r8L25l04M81k92N3k09K31j50j50N43Lp9k44K82
2673E01J41R3j56k17K15J54k42O8m5O5k6J14l67M07m11J37K7K8J4j91J82p4K90
2696G07k93K46j53l9k65L00o0n18M47J16j38q7j27P4J37l5K3l26L43j55k9L05
2718D73m21j23K25J15r6j86J11J58j80r1j61K42l43J56K27j49j40MJ06Q0j48k7
2740a68r6J46j11P5k18r4k39N00J26k87m9k40L86j98J22K13p8k68K47l43q3J62
2762d95j37l4J50L13J52n65k4N2J84J23J19n09K44J40j70jq8J89j10J51k7K7O5
$$ plain form
2608 -223 -213 3 -244 -128 -228 -206 -90 -275 10 -146 21 -373 -321 -115 -425 -179 -241 43 -137 -2 90 -283
2630 -283 -522 170 -273 164 -67 -299 -54 -161 94 -106 -75 -146 11 -447 -106 204 223 -151 -2 150 404
2651 404 370 -130 111 159 453 223 109 11 336 32 513 221 274 65 296 146 -4 539 542 463 219 501
2673 501 642 735 579 362 577 731 489 557 512 577 551 665 298 705 294 431 458 486 500 309 491 417 707
2696 707 414 660 507 468 203 503 443 -75 372 488 350 263 136 210 347 312 335 9 352 197 168 473
2718 473 52 -71 154 269 173 -13 98 256 76 -15 -176 66 -277 -121 106 -43 -183 -179 -73 7 -141 -168
2740 -168 -264 -118 -229 -154 -372 -466 -705 -205 -79 -366 -415 -655 -269 -467 -345 -132 -210 -478 -231 -574 -657 -495
2762 -495 -632 -666 -516 -203 -51 -616 -640 -588 -404 -281 -162 -671 -427 -287 -457 -458 -546 -357 -467 -316 -343 -316 -251
2785b51q1M24m32O9K0j22L38l07J66J07j1q0n6k2M41l05nk46K47J2j61M96m00
2808a59p2K63k77M59P2l43N08j31m8J75l68K26Q5k12K73k67l02N66j79J56r8j37
2830A90k7L84k80j08K30N0j58k7J07q8J9O7j96JJ32L0m12L35L1j81o3M8J31N3
2854B68l42J74P6k07J39L59k65Q0n7j38o0O3m9M4j50l6L17k3k39M0l15L45J64
2877A88o7l59j18K56J92j07p9J82j95j87J62j22P5j40L02j20j7K09l30J34m3J94
2899A0k3J02o8l35N2K33j78L14j41O8j47L5j33O3J09j34K18k1r8K17j66L48k88
2922C7J90j92p9j92N77k63k09K39p8K51Pl07j4Q4l5J00j86rJ33P4Jj3J10L7j19
2947A44q1K03j24q3m5K64k69K60m3j91K10k51j4J76J7R0Kj40j10J39k06K7N2J02
$$ plain form
2785 -251 -332 92 -340 -271 -251 -373 -35 -342 -176 -69 -80 -160 -216 -238 203 -102 -107 -353 -106 -94 -255 241 -159
2808 -159 -231 32 -245 214 286 -57 451 320 272 447 79 305 390 178 451 184 -118 448 269 425 327 190
2830 190 163 547 267 159 389 439 281 254 361 273 292 359 163 164 296 326 -86 249 280 99 36 84 215 268
2854 268 -74 100 176 -31 108 467 202 282 225 87 27 90 41 85 -65 -101 216 193 -46 -6 -321 24 188
2877 188 121 -238 -356 -100 92 -15 -94 88 -107 -294 -132 -254 -179 -319 -17 -137 -154 55 -275 -141 -184 10
2899 10 -13 89 21 -314 -262 -29 -207 107 -34 34 -113 -78 -211 -148 -39 -173 45 24 -74 143 -23 325 37
2922 37 227 35 -44 -236 341 78 -131 108 30 281 288 -19 -33 51 16 116 -70 -79 54 128 129 116 226 263 144
2947 144 63 266 142 59 14 278 9 269 226 35 245 -6 -20 156 173 263 265 125 15 154 -52 -25 27 129
2971A29o0j08R6l24L97j67K45l10L3m6L93m76pK74j67j75J34R1k96K91n28L32
2993b49j64K32K06J66l15L7J54m5k27k52L79p1j83lL41l43n3J08K2J53m6j8k9
3016b00J07l7q2R6J15k21J28mo7l3K58k26K4K94l55J58k08J69k82K32j12m4J22
3039a68R4l3O1O9J9k79M02K3j85R1M9m2O1q8J76q4j83K69m4j44rK1K8L25j80p5
3065A74J27JL0J42O4k58L1J81j91k8j15R8p1j54L43l4Q9l42J39J9J13K3k49J83
3089C15m4j05J13k69K98J76k00J97k48m01O32k33j45L40l57L05j27j43p3L66k85
3110A12K76k32k7J13k80j1O6O3L8jm37L58j77j8L52l70mK55k44R0j05j94J77J64
3134c6j25J49o1K31l66K0J41j51Q9L20l34O8j90J4J86j96R6k28Q5M8L12l23j3
$$ plain form
2971 129 69 -39 57 -267 130 -37 208 -102 -69 -115 278 -198 -205 69 -98 -273 -139 -48 -344 -53 -581 -249
2993 -249 -413 -181 25 191 -124 -87 67 22 -205 -457 -78 -149 -332 -335 6 -337 -390 -282 -260 -107 -153 -171 -200
3016 -200 -93 -130 -212 -116 -1 -222 -94 -98 -165 -198 60 -166 -142 152 -203 -45 -253 -84 -366 -134 -246 -290 -168
3039 -168 -74 -107 -46 23 42 -237 165 188 3 94 143 101 162 74 250 166 -17 252 208 64 55 76 104 429 249 174
3065 174 301 302 332 474 538 280 311 492 301 273 158 256 185 31 374 340 429 87 226 245 358 381 132 315
3089 315 271 166 279 10 308 484 284 481 233 -168 464 231 86 426 69 374 247 104 31 397 112
3110 112 388 156 129 242 -38 -49 17 80 118 117 -320 38 -139 -157 195 -175 -179 76 -168 -78 -183 -377 -200 -36
3134 -36 -161 -12 -73 158 -208 -188 -47 -198 -109 211 -123 -55 -245 -231 -45 -241 -145 -373 -288 -240 72 -251 -264
3157b64kK04P5j18n5k20K01k33J72K06j68k27L39j00r6k02J77O9J55p2l3j89L67
3180a4j43J93q5m01M86k32J38j04j49J18J32L9l90M18L00n27J92j59K27l34J43
3201a52j45O8P2K27k37r7mJ1K31L5j77jK18j00Mj44n1J53p2Q7j82j13K43L81n15
3226b60K80J24J2k08l7k04K9K41k7p9j45J59j00j46O25k78R6p8k42J23l20M35
3248@j69L09m75J89K31k73R4j3R5q2n14M68m9l4J44K7j62K69l75K4L2J54L24k80
3272f6k5j82J94rj18K2K30j10N0l21j62K63p0J03k35N50n1l79M5J78q1M6M13l12
3296b7j52K0j68j03M92k38J48j83P2J03l0qj10K34o8K62l02n5k19Q0J70j18J89
3319a1n4J7J67P7m91M28j55o5j48K42K52j46j29KR0J49o4L68n49J71K70L7m81
$$ plain form
3157 -264 -266 -62 13 -105 -160 -380 -179 -412 -240 -34 -202 -429 -90 -190 -286 -488 -311 -242 -87 -159 -192 -381 -14
3180 -14 -157 36 -49 -450 36 -196 -58 -162 -311 -193 -61 -22 -412 6 306 -221 -29 -188 39 -295 -152
3201 -152 -297 -229 -157 70 -167 -264 -268 -257 -26 9 -168 -169 49 -51 -47 -191 -242 -89 -161 -74 -256 -369 -126 255 -260
3226 -260 20 144 156 -52 -89 -293 -264 -23 -50 -129 -274 -115 -215 -361 264 -14 82 4 -238 -115 -435 0
3248 0 -169 140 -335 -146 85 -188 -94 -107 -12 -94 -608 -140 -189 -223 -79 -52 -214 55 -320 -296 -264 -110 214 -66
3272 -66 -91 -273 -79 -88 -206 -184 46 -64 -14 -335 -497 -234 -304 -201 -436 114 63 -316 -271 -93 -174 -128 285 -27
3296 -27 -179 -159 -327 -430 62 -176 -28 -211 -139 -36 -66 -74 -184 50 -18 244 -58 -113 -332 -252 -82 -200 -11
3319 -11 -65 -48 119 196 -295 133 -22 -87 -235 7 259 113 -16 -14 76 225 161 529 -20 151 421 458 -23
3342b3k6O3K63L8k71q6P0lK62j71r1nR8M7o9l01K15NJ63K8J11j42k46L55l30R3
3368D7M90m94LO4J49k66k85K83m0J11k20L89O3j19p4k43L53L6k35Q0R8m7jj63
3392b1L08k63J11k36K61Ll10L1K08j40M49j01l00j8K9Q5k17K06J94j62k19J35
3414C3J24O1r7j32J83K98n57r1J04J77Qk3N6j63j95L02k98J36NK0j36L83l75k00
3438c77L97Q4j64j26q7O0L20j88Kk04L84k48J42J8j32n8N5r0N4j36K2l0L01m52
3462d53J60j03J91R8k49O87m85m90M27j08K92j34L1j73J02k61K49l3k09J91j2
3483b82J71j41m04N95k70j45n9J76M3k19L43Mk46j8M57n08K37j49QM5j52L93l50
3506d71K05k44M3J09k04L33k54P0j10L89j93m2L15j79rk77L48o7j81K88M8k55
$$ plain form
3342 -23 -49 14 277 315 44 -42 28 25 287 116 25 20 118 165 96 -205 10 15 178 206 317 175 -71 284 -46 47
3368 47 537 43 46 110 259 -7 -292 -9 -49 62 -158 231 294 175 101 -142 211 247 12 92 190 143 142 -21
3392 -21 287 24 135 -101 160 163 -147 -116 92 -48 401 300 0 -18 11 96 -121 85 279 117 -102 33
3414 33 157 218 121 -11 172 470 -87 -178 -74 103 111 88 144 -19 -214 88 -210 -74 -69 -49 -185 198 -177 -377
3438 -377 20 104 -60 -186 -273 -213 107 -81 -79 -283 101 -147 -5 13 -119 -177 -122 -212 -158 -294 -272 -302 -1 -453
3462 -453 -293 -396 -205 -107 -356 331 -154 -644 -217 -325 -33 -167 -136 -309 -207 -468 -219 -252 -461 -270 -282
3483 -282 -111 -252 -656 -61 -331 -476 -535 -359 -316 -535 -192 -188 -434 -452 5 -503 -266 -415 -407 -362 -514 -121 -471
3506 -471 -266 -510 -467 -358 -562 -229 -483 -413 -523 -134 -327 -369 -54 -233 -242 -519 -171 -238 -419 -131 -83 -338
3528c38K9L93j92j49J45j93M59k92j57K55j11j25L63Qj96j20J08K4L7J58k87K63
3550H2p1n6K10k35L32j33q1P1m4J6j91M66l03k22K89p8L86n15L73l5J40l11m4
3573D6J68m2j5P0l4r3J45j7j41L27j10k46L72m07K38K3r5r7J08k43K32L2QK50
3597D79J46m36j19K75k64J46J03j93j89L44p2N8j62Q9l2OJ06O9q5Q7m78J72j44
3620i4L20j88P9L73m42j5K41q4k51O9K45k25P4NN3L06l84J49n2j78jj17J94k29
3644a52N13k59j18m7J29j51k82J33L13j38n6K94l60J69L6ok46K87j3Q1k93J58
3666hn9K38j34r7k9N7j25O8K19l67K12j46K67j45j49L43Jj80KJ47j36j99JL09
3690I0q3q7q9j82k5R2K87J59l31L5K72j39l75J47l0L68k33Q3J09o1o7p3J91O1
$$ plain form
3528 -338 -309 84 -108 -257 -112 -305 154 -138 -295 -40 -151 -276 87 95 -101 -221 -113 -89 -52 106 -181 82
3550 82 11 -45 165 -70 262 129 48 119 75 91 -100 366 63 -159 130 52 438 -77 296 261 401 90 46
3573 46 214 172 157 227 193 100 245 228 87 414 304 58 430 23 261 284 189 92 200 -43 189 221 229 479
3597 479 625 189 70 345 81 227 330 137 -52 292 220 278 116 205 173 179 285 354 269 356 -122 50 -94
3620 -94 226 38 117 490 48 33 274 190 -61 8 253 28 102 107 160 466 82 231 179 1 0 -117 77 -152
3644 -152 361 102 -16 -63 66 -85 -367 -234 79 -59 -115 179 -181 -12 24 18 -228 59 46 127 -166 -8
3666 -8 -67 171 37 -60 -89 -32 -157 -89 130 -237 -25 -171 96 -49 -198 145 146 -34 -32 115 -21 -220 -219 90
3690 90 7 -80 -169 -351 -376 -284 3 162 -169 -134 138 -1 -376 -229 -259 109 -124 -41 68 7 -60 -133 58 119
3714A19l72L02l57J73J08m12O8N77k33K9o5K3j39pK03j41j15%l9L75Ql02K37K16
3738B56n50J25L67j97j45j25M35k93J75k99L00l04Q9j89O7K44rK4K42l95J24j90
3760b48R4R4k7N7k52J69O0n47M28j29J34N7po0O6l3oj78J35R4j19J9J35l4q6l5
3786b19L27m35K30l01J23l36M70K5nj16kM46j37m80M57r6j43R7q8O4K83j99m04
3809d39M26j61q8K56K00p3rp7r3K33J37l84J41p1J7q8J22j37J34L3l0O3j43j41
3833a72L73j5p9J45j13q4J19J87l12J91q7j47j03k1K26m6m9j92K59r1O2n1J55
3856A55m47L67L5j58K07k43k36L43j4l8j03L46j69j54p8K97k5k08j06L33j33J61
3878A32j87j40mK46j87J17j8r3M0qJ48L1J31k05r5j01K20M2j89q0J08j14j1J27
$$ plain form
3714 119 -253 49 -308 -135 -27 -439 -371 206 -27 2 -63 -40 -179 -186 17 -124 -239 -239 -278 97 105 -197 40 256
3738 256 -294 -169 198 1 -144 -269 166 -127 48 -251 49 -255 -166 -355 -288 -44 -53 -29 213 -182 -58 -248
3760 -248 -154 -60 -87 -30 -282 -113 -53 -600 -172 -301 -167 -110 -117 -177 -111 -144 -150 -328 -193 -99 -218 -199 -64 -98 -184 -219
3786 -219 108 -327 -97 -398 -275 -611 -141 -116 -121 -237 -239 207 70 -410 47 -49 -192 -95 -183 -119 164 -35 -439
3809 -439 -13 -174 -262 -6 194 121 112 35 -58 175 312 -72 69 -2 15 -73 49 -88 46 79 49 112 -31 -172
3833 -172 201 186 107 252 139 55 174 361 49 240 153 6 -97 -118 108 62 13 -179 80 -11 51 0 155
3856 155 -292 75 110 -48 159 -84 -320 23 9 -29 -132 214 45 -109 -187 110 85 -123 -229 104 -29 132
3878 132 -55 -195 -199 47 -140 -23 -41 -134 -94 -102 46 77 208 3 -92 -193 27 69 -120 -200 -92 -206 -217 -90
3902i0j92K14j79K77r5J09j25J03j88m61L35J62J01k61j67J85N70m97N05o34M86
3923A58m69M15n03L26m1J20l2l49K56k74K63J38j60J64k04k95R3L30J53r8k00
3944b09M0j67J32K9L20k39k35K92j76K79j47J40r8j46R5k8J41p0Q0j8Rj62J75
3967C7k54j57K18k40M27m87M41j13Q6R6o3o1k77O3R0j73L06J25j51K16ml47J76
3990d6m1J92j86j62r2L62K38k23k15J93j58j13L30L9K8k36j76J67J62j76j8J78
4012D7K9m61K37n1J78o6J40o6m36L53j01r3r4M59k46N49n07O9m3l28J56K4J69
4035h2pm7n5n9N13l2k10N0m29L7R1q0L35k17pJ12q2J00q7M84p84O77k23j28K84
4060A54l0K47n26K33J79N7m34J98l15Q5R6k4J72r0j17rR5j92L16k33K88k63K61
$$ plain form
3902 -90 -282 -68 -247 30 -65 44 -81 22 -166 -627 -292 -130 -29 -290 -457 -272 298 -199 306 -328 158
3923 158 -311 104 -399 -73 -114 6 -26 -375 -119 -393 -130 8 -152 12 -192 -487 -394 -64 89 -9 -209
3944 -209 -169 -336 -204 -175 145 -94 -329 -37 -213 66 -81 59 -39 -185 -90 -118 23 -47 33 15 24 -138 37
3967 37 -217 -374 -156 -396 31 -456 -15 -128 -42 54 -9 -70 -347 -284 -194 -367 -61 64 -87 129 125 -222 -46
3990 -46 -87 105 -81 -243 -335 27 265 42 -173 20 -138 -251 79 118 146 -90 -266 -99 63 -113 -131 47
4012 47 76 -385 -148 -199 -21 -87 53 -13 -449 -96 -197 -290 -384 75 -171 378 -129 -60 -103 -431 -275 -251 -82
4035 -82 -89 -136 -191 -250 263 231 21 71 -358 -321 -230 -310 25 -192 -199 -87 -169 -69 -156 328 -456 221 -2 -130 154
4060 154 124 371 -155 78 257 314 -120 78 -237 -152 -56 -80 92 2 -115 -124 -29 -221 95 -138 150 -113 148
4083A48J5K2j97K3j54J42O6K69k80N9K8o5k2N1j17k9J49L8J01l2jj36q6J82k58
4108h4J48p6K67J67o8k51J85j51M4j57P1m0n0P0j60L60j26k75m0N04k58M6J00
4131B26l9J5k11J04j03k1p7rQ4P7L9K2j16J60l30K12j70o1K01j00k30M32L6j63
4155b2N4l64q3M6L45M4k70J56k30N60l29m1k4J00R7l59O8N3K19j90m6K1K01k47
4179b41P9j06K32R9j0j58M5J67j49J2J38o9j89N2J15N9o13L36L07j41j6n9K14
4202A04k19K52l81J15P6L9n2m3l1L70l40M22k19k62q7K01j28N5PJ29N3k01O0K73
4226A93k51j87K93j60m3J89j19L8K17j45J9L2K1J40k69q9L48j57M8n6j70L02l47
4249a53L06k51R9J31N3m10M12r8J95J06m54j6K01J50k88J9j40N10m25M6k04O02
$$ plain form
4083 148 163 185 -12 11 -143 -1 65 334 54 113 141 76 54 105 -12 -41 108 146 247 215 214 78 -8 174 -84
4108 -84 64 -12 255 422 354 103 288 137 181 24 95 55 5 75 -85 275 149 -126 -166 338 80 126 226
4131 226 187 202 -9 95 -8 -29 -106 -115 -31 46 85 107 -9 151 -179 33 -137 -198 3 -97 -327 105 141 -22
4155 -22 32 -332 -415 -369 -24 20 -250 -94 -324 236 -93 -134 -158 -58 39 -320 -252 -199 20 -170 -216 -195 6 -241
4179 -241 -162 -268 -36 63 53 -105 -60 107 -42 -30 108 39 -150 -98 17 76 -537 -201 106 -35 -51 -110 104
4202 104 -115 137 -244 -129 -53 -14 -66 -109 -140 230 -110 312 93 -169 -256 -55 -183 -128 -121 8 61 -140 -80 193
4226 193 -58 -245 48 -112 -155 34 -85 -47 170 25 44 76 97 237 -32 -121 227 70 118 62 -108 194 -153
4249 -153 153 -98 1 132 185 -225 187 89 284 390 -64 -80 121 271 -17 2 -138 372 -53 -7 -211 391
4271C91l57k38K02j88j0M51l06J47N4k14Q1R6j20K23k69M7r3o8J21l0K45n04K2
4294c17K15K26K33l41N4j36P6R1J9k19K3M71m89J04O9j26K92n29l8K92J91k44
4316h3K78m0J18k85n9O8k7K30k88j45J29N1%N5k43K98NO1k6m1J98k31j4K5j42
4341a08M00j38Mj37J8p2k57J33L04K25m29J94mk12k6L59l30O1K38k20L67k96j84
4364a10J45n6K92j52L05m26Rk61K51j98J76N06l77l73M17L9n51O50j06l23K8K95
4386A80j40J15j37j19J37Rn9j27K22J14l08L41m56J41j3J97L0q8m46L40j43O5
4408a45J21L6R5k99O6K14J05q9k52M2J11J68l84N0J90k06L04m17J77J2J55l55
4430c01N78k05QK34p01J83j99M22m68K14l40M25qJ8l6K03k36P8K1k60j35K53L10
$$ plain form
4271 391 34 -204 -2 -190 -200 251 -55 92 146 -68 13 109 -11 212 -57 -10 -103 -171 -50 -80 165 -339 -317
4294 -317 -102 124 357 16 70 -66 10 101 120 -99 -76 395 -94 10 79 -47 245 -284 -322 -30 161 -83
4316 -83 195 155 273 -12 -71 -3 -30 200 -88 -233 -104 -53 -53 2 -241 57 62 123 97 56 254 23 9 34 -108
4341 -108 292 154 158 21 39 -33 -290 -157 147 372 -57 137 133 -79 -105 254 -76 -15 223 3 370 74 -110
4364 -110 35 -21 271 119 424 -2 7 -254 -3 -201 -25 481 104 -269 148 187 -364 286 180 -143 -115 180
4386 180 40 155 18 -101 36 45 -14 -141 81 195 -113 228 -228 -87 -100 97 127 39 -407 -67 -210 -145
4408 -145 -24 12 107 -192 -126 88 193 104 -148 -106 5 173 -211 -161 29 -177 127 -290 -113 -101 54 -301
4430 -301 277 72 80 314 -387 -204 -403 19 -449 -235 -575 -150 -158 -140 -176 27 -209 -131 -110 -370 -505 -252 58
4453E8j1m44RK68K3m5n5J15j21J49j88M3M34j70jl10n8J56N2L2k75L23l4oL77
4478C21m43J66j98K93k30K01K02l78J79q0j43K08j53J0K76k36nN3j56K63j89j00
4500a39L71J49n91J33M1j04K2R5L66j67k44J10j74J12j7j09J26J03lL7N3j14j29
4523g3J50P9k57J97L9j97k38K26j78L86j67j67K16J33l6j29l3J34k61K98K7k29
4545h0R5k52J99k16J8K64k9J15m86M3L71J3j20k16J63P7m09j4K39r7J47rj01J17
4569a68K43k71J81J9n9k21L67k10p2L45l30m4K32l71K83n8J26k6j14j34k15L17
4591a80J0j83j1M17J37k20k01J3k76L74L15l17j09J64P1j89R6J33j51K35m13O7
4613b18J73K85j65J70k90J61j58N3k55J38K99k06K20l20j54L45m46L10K71j14
$$ plain form
4453 58 47 -397 -388 -120 -97 -142 -197 -82 -203 -54 -242 -199 235 65 64 -246 -304 -148 -96 -64 -339 -16 -50 -56 321
4478 321 -122 44 -154 139 -91 110 312 -66 113 33 -110 98 -55 -45 231 -5 -10 43 -113 150 -39 -139
4500 -139 232 381 -210 -77 -36 -140 -118 -23 343 176 -68 42 -132 -20 -37 -146 -20 83 80 117 170 56 -73
4523 -73 77 156 -101 96 135 -62 -300 -74 -252 134 -33 -200 16 149 113 -16 -49 85 -176 122 149 -80
4545 -80 15 -237 -38 -254 -236 28 -1 114 -372 -329 42 55 -65 -281 -118 -41 -450 -464 -225 -322 -175 -184 -285 -168
4569 -168 75 -196 -15 4 -55 -276 91 -119 -191 154 -176 -220 12 -359 -76 -134 -8 -34 -148 -282 -497 -180
4591 -180 -170 -353 -364 53 190 -30 -231 -218 -494 -120 195 -122 -231 -67 4 -185 -89 44 -107 128 -285 -218
4613 -218 -45 240 75 245 -45 116 -42 11 -244 -106 193 -13 207 -113 -267 78 -368 -58 213 99
4633I9n13K92J41l0J20j03m2Q9K13l96j14J88k54N27J01l05J45j57k1M59l57j74
4655i2L24r4n1J10j60k8k30K51j11j8m0N1m3Pj48K84J31k74K77pj02k15M20l15
4679g3L24k07N1l7K23n49j85K39L12k10L03K0m81J43K5M07j97Q2r4k38J11P5k51
4702b07K01j47J61l13L73o6q6K84j68k33L58l41K50O8j75j26K31N6j68q7O0K5
4724e0R2k36J90KJ57n2k63O7m4J59k23J99l3k6k71N17m30M04k80L6%J34J20l7
4748A32j30K33j50p2j02k3k2j09J84K01R2l45K54l03K56l84M39n9l0j98K4J26
4770A4l31O92l85R2k12K02k22k23L35K85m48L16o5l49K33k72N88n31L49k75L16
4791A09o8j81J71J2Rj72m7J19k20P4K06P7n15P02j37j22j49n2J70p7J86l43P17
$$ plain form
4633 99 -414 -122 19 -11 109 6 -36 53 266 -130 -244 -56 -310 217 318 13 158 1 -20 439 82 -92
4655 -92 232 138 87 197 37 9 -221 30 -81 -99 -139 -88 -131 -124 -272 12 143 -131 146 139 37 -178 242 -73
4679 -73 251 44 95 58 281 -268 -453 -214 98 -112 191 211 -270 -127 -102 305 108 190 96 -142 -31 44 -207
4702 -207 -6 -153 8 -305 68 2 -84 200 32 -201 157 -184 66 134 -41 -167 64 120 -48 -135 -75 -50
4724 -50 42 -194 -4 -2 155 103 -160 -93 -137 22 -201 -2 -35 -61 -332 185 -245 159 -121 -85 -85 49 169 132
4748 132 2 235 85 13 -89 -112 -134 -243 -59 142 234 -111 143 -160 96 -288 151 92 62 -136 -112 14
4770 14 -317 375 -10 82 -130 72 -150 -373 -38 247 -201 115 50 -299 -66 -338 250 -281 68 -207 109
4791 109 41 -140 31 43 52 -120 -167 -48 -268 -194 12 89 -426 276 139 17 -132 -184 -14 -91 95 -248 469
4814D69o51K49k66K64j58l33M53k60M0J40j86L56J17m73N08j06k2l78L72k46j39
4835b50O7J30K1KJ77j08J23j38o6j81J87K8q4q2J36o4M4M8L91n60K28l03L12l
4859E5j57j18J27q1J66j36K28l11J19K01O6l04rL14j02k4J61p1mM8k34j46Q4j
4883a29k00O22l74OK19k86J42K04R6m58L29l31K24j35j2J1N6O7k79K49p1J81k87
4906a56L57n1j26l27L59k74K9M5L82jm57J78j47J33J6L0%N1o5K38j87j40k11M04
4930H0J32k76P0j1j25L6K6J8K88p4k69N7N5l2J1K46O8j58j89J74K40l89K36l67
4954a53J51L51m95J73J4m50K74M9L77k90k13N72m85J19J24r8j01J22N8l36N87
4975C50k03k01J89l78J13j64M57J02l18K57j85j22J49q4J46k86J99J70p2J10n63
$$ plain form
4814 469 -182 67 -199 65 -93 -426 27 -233 -193 -53 -239 117 234 -239 269 163 141 -237 135 -111 -250
4835 -250 -183 -53 -32 -30 147 39 162 24 -42 -223 -36 -8 -92 -174 -38 -102 -58 -10 381 -179 49 -254 58 55
4859 55 -102 -220 -93 -174 -8 -144 84 -227 -108 93 159 -145 -154 160 58 34 195 124 120 168 -66 -212 -128 -129
4883 -129 -329 293 -81 -75 144 -142 0 204 300 -158 171 -160 64 -71 -83 -72 -16 51 -228 21 -50 131 -156
4906 -156 201 150 24 -303 56 -218 -189 -144 238 237 -220 -42 -189 -56 -40 -10 -10 41 -24 214 27 -113 -324 80
4930 80 212 -64 6 -5 -130 -94 -68 -50 238 164 -105 -48 7 -25 -14 232 300 142 -47 127 367 -22 214 -153
4954 -153 -2 349 -146 27 41 -409 -135 -86 291 1 -212 360 -125 -6 118 20 -81 41 99 -237 350
4975 350 147 -54 135 -243 -130 -294 163 265 -53 204 19 -103 46 -38 108 -178 21 191 119 229 -334
4996c34J40K52J99P1j52j60J1J51K65m08J68m98M80k51q7M33l93j36K40J44J9
5017A54n6l73R8J46K42l12Q1%J94k52O3l2K03k16J92r0k32O35n57Q1K35l87k23
5040d06L58N8K59m11M21l95J77j64K22j58mP7l61K87pk08K21j82L80j48k54J58
5062h0oJ08M0k26n8K47j13K19j97P6j49J48J80j93K63k45Q4P4p08O01j59j16K67
5085E7m15K93P1l45K60o8j26J73M0L21j40k80j15K2L24k34lJ14J37k0r3J66l13
5108a74j57k2N13m04J21l4J46J00j25p5J32P8M0m17N44j37j50J1k71L44k13J54
5130DJ0j71k1j88K54N0J66q2k48R4K56J5J3n53J88N63o30M95l34j72L10K53n20
5153b48L88j08j75J59M2j40M1l00K44m9J23j19L55J7k24O2J35j3l58N02l74j11
$$ plain form
4996 -334 -194 58 257 328 176 16 27 178 443 35 203 -295 185 -66 -153 280 -113 -249 -9 135 154
5017 154 98 -275 -177 -31 211 -101 -20 -20 174 -78 -15 -47 156 -60 132 42 -190 445 -112 -31 204 -183 -406
5040 -406 -48 10 269 -142 279 -116 61 -103 119 -39 -43 34 -327 -40 -47 -255 -34 -216 164 16 -238 -80
5062 -80 -86 22 62 -164 -222 25 -88 131 -66 10 -139 9 189 -4 259 14 98 172 -536 65 -94 -210 57
5085 57 -358 -65 6 -339 -79 -147 -273 -100 -60 261 121 -159 -274 -252 72 -162 -165 -51 86 66 -27 139 -174
5108 -174 -331 -353 160 -244 -123 -157 -11 89 -36 -111 21 99 139 -278 266 129 -21 -10 -281 63 -150 4
5130 4 14 -157 -178 -366 -112 -62 104 22 -226 -132 124 139 152 -401 -213 350 -280 215 -119 -291 19 272 -248
5153 -248 140 32 -143 16 58 -82 -41 -341 -97 -146 -23 -142 213 230 6 68 203 190 -168 334 -40 -151
5175a51M6L52m70L92r8j72L9L46n20N17n17K30o2J15N6j60Nk6J24K99k10j00J17
5198A52j93o6M50k17j26p9Kl5J52K01l53J26M0R1j36m1K0N2J76k89L8l5P6J42
5222A48k72n2K08j55J88P0J94l21q3k10M07j31O3l79M74j57N9J67l31L52oj84
5244D9j86J33K29j77R3p7j95j1q5L56j34j2J1Q6L03m47J14N4l35K72P4o0l24j26
5268c95N40m21L69r9l28M39k9J55l51R3m8O8K32n43L89k83K41K1J77k27j09M8
5290f1n8J07l82J94K31k87N7Q9R1j51M04l08o5L76k80n7J1j93L16k01R1j22K94
5313I6m83K91k98K57L37k39p2l08K96kK0K41r4j24K33l06K03r0j32K44k49L06
5335A27l15K9K00L5j33q9K11O7k98p2K40k27K67m98K33K81J61k35N0k55J77J10
$$ plain form
5175 -151 -105 247 -223 169 71 -101 -62 284 -236 281 -236 -6 -68 47 103 -57 -52 -78 46 345 135 35 152
5198 152 -41 -107 343 126 0 -79 -77 -112 40 241 -112 14 54 145 9 -32 -12 40 216 -73 -35 -70 6 148
5222 148 -124 -176 32 -123 65 135 329 8 -75 -285 122 -9 54 -325 149 -8 51 218 -113 239 233 49
5244 49 -137 -4 225 48 141 64 -131 -142 -227 129 -5 -17 -6 80 383 -64 50 104 -231 41 115 55 -269 -395
5268 -395 145 -276 93 -6 -334 105 76 231 -120 -27 -75 -7 225 -318 71 -212 29 50 227 0 -109 -61
5290 -61 -119 -12 -394 -200 31 -256 -199 -110 -19 -170 234 -74 -139 237 -43 -100 -89 -282 34 -167 -76 -198 96
5313 96 -387 -96 -394 -137 200 -39 -111 -419 -123 -125 -105 136 42 -82 151 -155 48 -42 -174 70 -179 127
5335 127 -188 -159 41 76 -57 -146 65 132 -166 -238 2 -225 42 -456 -223 58 219 -16 34 -221 -44 66
5357F6Q6j81rJ51m60K23K66k5l48K14k1n2J85k07R9O1J2J29k10K44k62J29M6j2
5381A24N7m68L67J50l07J10k6J08k95J36o4K37j20L7j7k2j5K49l04j64M37o0l21
5404a71j62M84r4j04J38J06l6l48O2O9N3k11P9K18O6j43o3Q0M1k04P9K29k41K38
5428A65j50J8n8MJ85k88J3K22k9K33k70k5K2k8J10k34J46J75k56M0n1j8j97k0
5452b91L22j22o7o6J54M3O4L15o58J30K38k3k39Q9K53kj69M7Q5j01j47K30j60
5475g5k30K66l8J73j75J74k49R0L43l63j23K00j9j81J60O9j24J18L60j47k67j40
5497a78J11K48j98oK03k51R1j19K15J18j98J99m47L13n4j88M21k51k63J66k09
5518b77L49j5j82J10k37L82K61n05L27l13P7l27M30L07l38k3j25q1J11K37k46
$$ plain form
5357 66 152 -29 -38 113 -347 -124 142 117 -231 -17 -38 -90 95 -112 -13 48 60 189 -21 223 -39 90 136 124
5381 124 181 -287 80 230 -77 33 7 115 -180 -44 -108 129 9 46 29 7 -8 241 -63 -227 210 150 -171
5404 -171 -333 151 57 -47 91 197 161 -187 -125 -56 -3 -214 -135 83 149 6 -57 23 64 -140 -61 168 -73 165
5428 165 15 33 -25 -21 164 -124 -111 111 82 315 45 20 42 14 124 -110 36 211 -45 -5 -56 -74 -271 -291
5452 -291 31 -91 -158 -224 -70 -27 37 352 -306 -176 62 39 -200 -111 142 140 -29 18 103 2 -145 85 -75
5475 -75 -305 -39 -77 96 -79 95 -154 -64 279 -84 -207 -7 -26 -207 -47 22 -102 16 376 229 -38 -178
5497 -178 -67 181 -17 -23 180 -71 20 -99 116 234 36 235 -212 101 47 -141 280 29 -234 -68 -277
5518 -277 72 57 -125 -15 -252 130 391 -114 213 -100 -23 -350 80 387 49 26 -99 -180 -69 168 -78
5539g8P1K57j37j27qL64k60n2q1M0Q0L3J66n35J39k3l05M30J49l3K82l62N3Po0
5564A0j29k5M9k31L39jl45M68r9k52R7J19M6j73j94J98R1j10K18k28J49L8J42
5587A77j63j39Q6j63L69N2k66J47k01L4j51J54M1J49L5j44k11P8J07k19M53k99
5609g4J91l08P4n6K7K0K74L8m81M15n9M39m05J17j97Q6o2j70P2J25J03l29K78
5632A18j42rr7o7M67l39M3O7J91l21J15k38K72J39q1l2j06Q2j20J02J07k10Q5
5655B6N9P2p8J74j39l95L69k4m7J30P1k12k06L55p2p1r2Q4q7j0K7J75o3j58J50
5680C8l5k45J86N8rJ12k41J70k27K80j93k05L17Q2Rk39J31K7j44L52m8k35L74
5703C15l76R0j28j04J44j02J62J80j33m1J16Q2m45J49j01L40K3M8k51j06n9M3
$$ plain form
5539 -78 -7 250 113 -14 -22 342 82 30 -51 -11 69 102 268 -267 -128 -151 -456 -26 123 90 372 10 63 70 10
5564 10 -119 -144 -95 -326 13 12 -333 135 36 -216 -119 0 46 -127 -321 -123 -32 -142 76 -152 -3 35 177
5587 177 14 -125 -39 -202 167 219 -47 100 -101 -67 -218 -64 -23 126 161 17 -194 -116 -9 -228 225 -74
5609 -74 117 -191 -117 -173 -146 -126 148 186 -295 120 61 500 95 212 15 101 39 -131 -59 66 169 -160 118
5632 118 -24 -33 -130 -197 270 -69 -26 41 232 -89 26 -212 60 199 118 86 -20 62 -58 44 151 -59 26
5655 26 85 157 79 253 114 -281 88 64 17 147 218 6 -200 155 83 12 -80 4 -83 -93 -66 109 46 -112 38
5680 38 3 -242 -56 2 -7 105 -136 34 -193 87 -106 -311 6 88 97 -142 -11 16 -128 224 176 -59 315
5703 315 -61 29 -99 -203 -59 -161 1 181 48 7 123 205 -240 -91 -192 148 171 219 -32 -138 -197 -154
5725a54L69k29mr5M36o95N2J21m2L41j7j99l52N77p2k62Q4N16r2l43m3j2K50j22
5749A3M8r6J36m45K88J57k27K24j03P8j26L41k96R5j13J34O4l39L37l54M4K73
5771A33j78N5J39k42RlK54o0j84LL16l11j90R8L30p2j7k02J3J56p6L01m29K5k1
5796a53J33J46q2j04J99l07k13K53K12l7j38O6J24k79N19k84k28K08jJ85k92J23
5818E0J36j77rK82m8m22K64m4j07K62j69m7J77L2k99K7K66l35J40k59M02N2o0
5841A14J98k38j64K82j39L9k06J73m26J76J69O9K81l91K81n10K75J16k72K4L22
5862A73k86QJ91j32p2J16j09k70M19P2m52J08K2K48L7l09N01j46Q3j76j64K41
5884A03n8K05j84l22M21m00M80m44J39N2q0K42k77J36p5J92k46K13M9j89J95j60
$$ plain form
5725 -154 215 -14 -18 -113 323 -372 -320 -199 -241 100 83 -116 -468 109 37 -225 -141 375 283 -60 -103 -115 135 13
5749 13 61 -35 101 -344 -56 101 -126 98 -5 73 -53 288 -8 87 -26 108 172 -167 170 -184 -140 133
5771 133 -45 10 149 -93 -84 -87 167 107 -77 -74 242 -69 -259 -161 169 97 80 -122 -109 47 -29 272 -157 -132 -153
5796 -153 -20 126 44 -60 139 -168 -381 -128 84 47 -91 -25 99 -180 339 55 -173 35 34 219 -73 50
5818 50 186 9 0 282 234 -188 76 32 -75 187 18 -29 148 180 -119 -92 174 -161 -21 -280 122 174 114
5841 114 312 74 -90 192 53 92 -114 59 -367 -191 -22 47 328 -63 218 -292 -17 99 -173 -149 173
5862 173 -113 -105 86 -46 -118 -2 -111 -381 38 110 -342 -234 -212 36 73 -236 265 119 202 26 -138 103
5884 103 45 250 66 -256 165 -235 245 -199 -60 -8 -88 154 -123 13 -62 130 -116 97 146 -43 152 -8
5906hk7J47j94J41kj08j05K13k17mK84q7n6p9J9k11P73j29m66J29J07K0K3l4j24
5931Ek83L72L0k91J92j10J36k75J28J59j06K5k11K37P2K5k59J92r6K31J97j44
5953B26l20o5K43J61l52L43o3o1m4q1R3Lm5j47j52M31m2k62m8K31K2l16K37J74
5977A66J26o2k77m2K27O1k30M22o97K41j39J60k6j9J74n80K46J04N0K24k76J30
5999a7J27j82O3j20O9n6O9N8j36K81m82K34o8P0J0k7J78j0J40m50N34k40k07K40
6023G8K10k59k81K45q1L62k12r7O0o6o2r0K02mj63k3K29m3j10P2J96l57M4Q2J25
6048E7N6j27P1k8j87K22q9L14N8j90l56L42q1R1j04J50j77j51J67j07O9l5J19
6071H4K45n10K51l8l3r9J75J36l73r8L04r4j18K74o9k49R1n9oK58j34J46j48j68
$$ plain form
5906 -8 -35 112 -82 59 57 -51 -156 57 -160 -164 120 33 -23 -102 -83 -294 479 350 -116 13 120 140 163 129 5
5931 5 -278 94 124 -167 25 -85 51 -224 -96 63 -43 -18 -229 8 80 105 -154 38 -58 173 370 226
5953 226 -94 -159 84 245 -107 236 173 112 68 -13 80 83 38 -109 -261 170 128 -134 -182 49 71 -245 -8 166
5977 166 292 230 -47 -89 138 199 -31 391 -306 -65 -204 -44 -70 -89 85 -495 -249 -145 -95 129 -147 -17
5999 -17 110 -72 -9 -129 -60 -116 -47 11 -125 156 -326 -92 -160 -90 -80 -107 71 61 201 -249 285 45 -162 78
6023 78 288 29 -252 -7 -88 274 62 -35 25 -41 -103 -193 9 5 -158 -181 48 5 -105 -33 163 -194 -150 -68 57
6048 57 113 -14 57 29 -158 64 -25 289 347 157 -199 143 62 153 49 199 22 -129 38 -69 0 -35 84
6071 84 329 -181 70 32 -1 -100 75 211 -162 -260 44 -50 -168 106 37 -212 -121 -180 -186 72 -62 84 -64 -232
6095b32K31j59K06n2J76J5m0k05l1N1j03N1K9m1J95m66M31m5j10L05j81r1j14
6118a80J96j07o1Q3R6j13K81j34Q9q9J52k29j49L33j14m9k47L29Q5j41k57J48
6140g8J19M8m25J83n3M56l33R3K43n09n7L53j88L15N6r0j84L32j04k33Q4j67K10
6163G1k27J87J28j43l22M82j77K01K4q1l89O09p0j69k38L6L05Q0k67k3n3j03N74
6186D35o23K33l1l2K0N5j12K68j36m5M1q9nj48m0L01kk93k8M5J06l0J59k8j64
6211a43j5J03R2J1K61l87P6N3L5J54n85M20k7k3k06K25j93L08j4j24Mj45L80m03
6235a43K92k16j3J91j24m4K15k7Q7l18R5k72qL07l8O5O1M0n05K80j1R5Rk78qJ60
6261a08N1l3J37J56j01l02L90j46J0J61l87P8K7K5k61M52k30k6J48M9m87M45k40
$$ plain form
6095 -232 -1 -160 46 -6 170 185 145 -60 -91 -40 -143 -92 -63 -104 91 -375 56 11 -99 206 25 -66 -180
6118 -180 16 -91 -152 -69 27 -86 195 61 150 61 213 -16 -165 168 54 5 -242 87 172 31 -226 -78
6140 -78 41 89 -336 -153 -206 250 -83 10 253 -256 -313 40 -148 167 223 133 -51 281 177 -56 28 -139 71
6163 71 -156 31 159 16 -306 176 -1 200 224 143 -246 363 293 124 -114 -78 227 307 40 17 -36 -139 435
6186 435 -188 45 14 -18 2 57 -55 213 77 32 73 -16 -21 -169 -209 92 90 -203 -231 -186 -80 -110 49 21 -143
6211 -143 -158 -55 37 48 309 -78 -2 51 86 240 -345 75 48 25 -181 44 -149 159 145 21 25 -120 260 -143
6235 -143 149 -67 -80 111 -13 -57 158 131 218 -100 -5 -277 -285 22 -16 49 110 150 -355 -75 -86 9 18 -260 -268 -108
6261 -108 -57 -90 47 203 102 -200 190 44 54 215 -172 -94 -67 -42 -303 149 -81 -107 41 90 -397 48 -192
6284a92K58j22j35N7J52k13J1J55k4J7K70%m83L32J84n17N14l87K04J0Mj74K04
6307A25m2l10M47M8k51R3P9j65j99J57k36o8K99j74J78LK4m4lM8j76L17j31o7
6331d8o0J78%O7m1o0NL4q5k11M0j56K98k0J51j52j80J04K68k68M33l76O7J13k62
6356a61M81m05o5M18J75n61L38r7j56L07l24j26K11k48K32J29j24Pq0l18K17K80
6378A30m10J32l2M04k19j57K38j28J15m2J9r4J66j98q7N6K00l12M43j68K11l60
6400i3L38l74K24k53J56J11j69n7P4Q3k36L68rj71j68Q6J66O0j07k2P7m5l17m3
6424c21L9K42J09j80mJ65k00K34l37Q3M12j09j14k88J94Q9l7J75k74k7J74j87
6446a62k6J87M3k00M8K11k76L28k90J09J73j42K87m41j21O48m15J11n9j40P5K51
$$ plain form
6284 -192 66 -56 -191 -134 18 -195 -184 -29 -53 -36 234 234 -249 83 267 -250 264 -123 81 91 95 -79 125
6307 125 83 -227 220 268 17 110 189 24 -175 -18 -254 -322 -23 -197 -19 -16 8 -36 -39 9 -167 150 19 -48
6331 -48 -108 70 70 137 96 36 41 75 -10 -221 -181 -337 -39 -59 92 -60 -240 -136 132 -136 297 -79 -12 101 -161
6356 -161 320 -85 -150 268 443 -118 220 123 -33 274 -50 -176 35 -213 19 148 24 31 -49 -367 -150 130
6378 130 -280 -148 -180 224 5 -152 86 -42 73 31 50 -44 122 -76 -163 -107 93 -219 224 56 267 -93
6400 -93 245 -129 95 -158 -2 109 -60 -117 -43 40 -196 172 163 -8 -176 -90 76 136 29 7 84 39 -278 -321
6424 -321 -282 -40 69 -111 -115 50 -150 84 -253 -170 242 133 19 -269 -75 14 -23 152 -122 -149 25 -162
6446 -162 -188 -1 42 -158 -110 101 -175 153 -137 -28 145 3 290 -151 -272 376 -39 72 13 -127 -52 199
6468A99k29K12j99j65K94J08l50P1k5P8J14k56K3K53k53k39K26p6K26P6j61l9
6490a12L51l20J76r7J69j58J95o64M90l35L16j04J19K90l02K7N2j03j98J19J80
6511I1J15m17J55pl3k12L23j89oJ84j77K73k37J50R6m3J60m50M0J36P2K29k73
6534b0P1l0j6k9J13k4J05p1q4K23k30j3j07pL67k18J57k12L06l44K77l86J06K27
6558A61j91O0k48j9L41Q7j13mj45j49J75J42k50K53r8K0k31K74o8R1j13l53M68
6581I0k2o3P3j52j2J62q4m9J40o5%j18J93l10PK61L2J08k73J71j49Q6p4K70l09
6606h7J8L19l49NM49n19K17k85J67q1M37k00J18l70kO3K68r4J93p1o6j12O7k06
6630a21M7K54l75R0L46j02j04j5M0j81J44L9l8J6j85N4K98j39n9k85J04N97k83
$$ plain form
6468 199 -30 182 -17 -182 112 220 -130 -59 -84 -6 108 -148 -125 128 -125 -364 -138 -214 12 88 -73 -112
6490 -112 239 -81 95 -2 167 9 204 -460 30 -305 11 -93 26 316 14 41 93 -10 -208 -89 91
6511 91 206 -211 -56 -63 -96 -308 15 -174 -180 4 -173 100 -137 13 109 66 226 -224 -184 -48 24 253 -20
6534 -20 51 21 5 -24 89 65 170 99 15 238 8 -5 -112 -119 248 30 187 -25 281 -63 214 -172 -66 161
6558 161 -30 30 -218 -237 104 191 78 74 -71 -220 -45 97 -153 100 2 22 -209 65 -3 88 -25 -378 90
6581 90 68 5 78 -74 -86 76 -8 -57 83 18 18 -100 93 -217 -210 51 83 191 -82 89 -60 26 -48 222 -87
6606 -87 -69 250 -99 -94 355 -164 53 -232 -65 -146 291 91 209 -161 -163 -100 168 74 267 196 130 18 85 -121
6630 -121 -74 180 -195 -105 241 139 35 20 60 -121 23 62 24 40 -145 -91 207 68 9 -276 -172 425 142
6653A42j71l4K34k96J46N5k01j2k6L33l83L51k80J87N2k6j55R1j5o4l39L21J16
6676B6K68k16r1k3L76k90q9J06J55j64P9q9k06n7j1J02j2L51j08m52P7L42j22
6699d8k43J33n4L11j11M50k84k29J8j61J84j59O7l14K63K82l90K19J5m8PJ00m32
6722d24L83J48m1K94l16K01l75M06m37L18j52l47K06K19j38k58K11m0Q3k40N72
6743B73%j05k21m35M32k24M26j71M7K48k71o3J7j1nJ85j58l5M1Qj87J80N17k82
6767B06k07k61L24j19K30k70J01J14j74m2K16M5q4k35J31pL9k54L03k66J10K8
6789g2K1k3J55j71n4k84M02J63l13L9j07M64j75k9J10k18M7L39p39K85M09q1l58
6812a90k4%K93l20J80k3L4J86R6j44n78N77lj55J02L1k2o4J43j73R3Q3L5j33Q
$$ plain form
6653 142 -29 -63 171 -125 21 76 -125 -137 -163 170 -213 138 -142 45 97 71 -84 7 -8 -72 -411 -90 26
6676 26 294 78 -13 -36 340 50 -39 67 222 58 137 48 -158 -215 -226 -124 -136 215 107 -345 -268 74 -48
6699 -48 -291 -158 -212 99 -12 438 154 -75 -57 -218 -34 -193 -126 -440 -177 105 -285 -66 -51 -99 -92 8 -424
6722 -424 -41 107 66 360 44 245 -130 276 -161 157 5 -342 -136 83 -55 -313 -102 -142 -59 -299 273
6743 273 273 168 -53 -488 -56 -280 146 -25 22 270 -1 -64 -47 -58 -63 122 -36 -71 -30 -22 -209 -29 488 206
6767 206 -1 -262 62 -57 173 -97 4 118 -56 -98 118 163 79 -156 -25 -32 7 -247 56 -210 -100 -72
6789 -72 -51 -74 81 -90 -144 -428 -26 137 -176 -137 -244 220 45 16 126 -92 -45 294 -445 -160 249 168 -190
6812 -190 -214 -214 79 -241 -61 -84 -50 136 232 88 -490 87 84 -71 31 62 40 -24 119 -54 39 122 157 24 32
6837C2k51J74q9K12j92M01l48j35M05J01j45m59K81r7j4J6J73m3J0j42N08l70
6859B8r1J14m1j01k84L23k35J81k68K78K34k40J95m1q4k14K36j43K55J65k07J04
6881A64j44r0j91L54P4k39J32k64M04k74QM4L9p2J00nq7j8n6J7j61K98N5J47k85
6906e0j37j3L62k71o3L37r9k33L68k87K45l47q8j22M32l1k75L35L06j92q3q6k
6929Fj78L24j93j7J01j98j0L70j3l54M9K9j93M07K0j76P5j83J14p3J38K11j54
6952A02j35k31L75J62l60J14l07N10m29J62J33K7n0p9j14J57j9k34K99l26L30
6973H7j18k3J12j7j20J24m20N37j68R6r5J89k50O2L02j85j02MK93l11k34J11R8
6996b8p4K59k68J68pn7J63k13K6j55M64l24j2O0m6j60J22k87M12j34J87k82J66
$$ plain form
6837 32 -219 -45 -134 78 -114 287 -61 -196 209 310 165 -294 -13 -110 -124 -108 65 22 32 -110 398 28
6859 28 -63 51 10 -91 -375 -52 -287 -106 -374 -96 138 -102 93 52 -32 -246 -10 -153 102 267 60 164
6881 164 20 -70 -261 93 167 -72 60 -204 200 -74 -66 -22 17 -55 45 40 -47 -65 -121 -104 -265 33 88 235 -50
6906 -50 -187 -200 162 -109 -172 165 66 -167 201 -86 159 -188 -276 -398 34 3 -272 63 369 177 94 8 6
6929 6 -172 152 -41 -58 43 -155 -165 205 192 -162 -113 -84 -277 130 150 -26 49 -134 -20 -93 45 256 102
6952 102 -33 -264 111 273 -87 27 -280 230 -199 -37 96 123 73 -6 -120 37 18 -216 83 -243 87
6973 87 -31 -54 58 41 -79 45 -375 162 -6 90 -5 184 -66 -4 298 113 11 15 308 -3 -237 -126 -28
6996 -28 -102 157 -111 57 50 -7 156 -57 -31 -186 278 -46 -58 2 -44 -204 -82 -369 43 -91 96 -186 -20
7019b0j11M7K17k34J18J2k53o6o4J82L10k41K24l04K96l80K70Q9j15LN8lK27k71
7043iq1p4J73K32k04j59J84j82L4k4K52j07j15J48j64N6J88j11k62J67K15j32
7065B5m3k03K46K00l46J28R4j79Q5j23o9o5J10J11J32j17Q8k94L46r5J90k78j06
7088a63L74p2J39m04M11l49N2o5J31j67K21j42j57K43m5L85l55J91m18j83K49
7109a24m5k35M25M5O4n7o9j70L07l47K05j47K3n6K46k51J87j58Q5P4JN2j47M28
7133C36k76o6l34L23L8n8K16k1o7p9k04L44k51j39J52O6l4K02l17L17j64j47J26
7156c7j64K61K4J0M2l3k82J25J24J49j75j88L47n6l0k58K12m6j22J21n2m7L6l34
7180c73J01N8K54j03J41j88J87q3N2J15Q9j77L2j66j35J51L03k42j57J01k18M25
$$ plain form
7019 -20 -131 -84 133 -101 17 29 -224 -290 -354 -172 138 -103 121 -183 113 -267 3 92 -23 -20 38 35 262 -9
7043 -9 -90 -164 9 241 37 -122 62 -120 -86 -110 142 35 -80 68 -96 -40 148 37 -225 -58 157 25
7065 25 -18 -221 25 225 -121 7 101 -78 7 -116 -185 -250 -140 -29 103 -14 74 -220 126 31 221 -57 -163
7088 -163 211 139 278 -126 285 -64 -12 -77 54 -113 108 -34 -191 52 7 392 37 228 -190 -373 -124
7109 -124 -169 -404 21 66 130 73 4 -166 141 -206 -1 -148 -125 -181 65 -186 1 -157 -72 2 3 55 -92 336
7133 336 60 -6 -340 -17 21 -37 179 158 91 12 -192 152 -99 -238 -86 -20 -54 148 -169 148 -16 -163 -37
7156 -37 -201 60 84 94 136 103 -179 -54 70 219 44 -144 203 147 117 -141 71 25 -97 24 -28 -75 -39 -373
7180 -373 -272 -214 40 -63 78 -110 77 -6 46 161 250 73 105 -61 -196 -45 258 16 -141 -40 -258 167
7202A67o55M87k38J04K81k96k6j25N63k3l32P2j96J71k14M03p3k47J33J63j90
7223g1m6J27J2K1j22J31j5j83P3K09k06P7J6R1j07n38M08L75l86j0J78j21K06
7246A19k96R7m3J48r7jj24K32j75J37NK21n1l4j61j2k86N84l90N8Q6j17M4q5K86
7271A45l7j42J80N6j92O7m1J62j76j1J72k31M20n06l4J83L0j86K46J8l92K76k25
7294b18J96m5n1O0K25k44l4rK64mj87R2o2J4L0l3k12K58Jj66M1m2J70j86J08N2
7320A8K56j32n9qp0N5K3q0j2K17l97L08J76m89K32j64p0J05J27k10J98K37r0j43
7344B8j10K30q1k27j44L88k76L19k74L69l14K15Q5O2m72L99m15K86N9k21mJ57
7366E9j55Q8k9L53k98j26J47K6L1l12M83l22K53l69K97J29l57K89nk15J59m1j10
$$ plain form
7202 167 -488 -1 -239 -135 146 -150 -176 -301 262 239 -93 -21 -217 -46 -260 143 70 -177 -44 119 -71
7223 -71 -117 10 22 43 -79 52 37 -146 -73 136 -70 7 23 114 7 -531 -123 252 -134 -144 34 -87 119
7246 119 -177 -80 -123 25 -72 -73 -197 35 -140 -3 2 223 172 138 -23 -35 -321 263 -127 -69 17 -100 -56 -141 145
7271 145 108 -34 146 202 10 77 36 198 22 11 183 -48 372 -134 -168 15 45 -141 105 123 -269 7 -218
7294 -218 -22 -67 -118 -58 167 -77 -111 -120 144 140 -47 45 -17 -3 27 -6 -218 40 41 -125 -84 -126 44 -142 -34 18
7320 18 274 142 83 75 5 60 83 3 -9 208 -189 119 295 -194 38 -126 -196 -91 36 -174 24 261 171 28
7344 28 -82 148 67 -160 -304 84 -192 127 -147 222 -92 123 208 270 -202 197 -218 68 127 -94 -98 59
7366 59 -96 -8 -37 316 18 -108 39 65 96 -216 267 -55 198 -171 126 255 -102 187 182 -33 126 85 -25
7389b5k11M8J79o0j12L00q3N7j2p0j39P2J55J5k87K18k69j45O21l60p2K11J03
7412A34l49J42k37M39j36Q7J37J17k39O0r4k83J38p9m1J53L1k28K17j22J01L95
7434C43j3k29J04r2k96J59j00P3Q5J14k67R2k49M65n36N90l57r4M5M5J68j44K82
7457A88j68K4k44N3j88N18j15j68K41n4k45J33P5J86j29p9J99k14k01K85j38L18
7479B77p2l51K93j46k10L07J7j45o3J5K77l04j36K17M3J30Kj55j07L29m3k19j0
7502e4m6j30K64j10M56l19j19j61J19j20J55j93K64M52l29j08j77J47j93L22k47
7523a27N4q5R4K0r9m57N17K89q2k25J52k3k18L41j35J11k99L85l87J56k35M51
7545A98j18j12J30l8o0K73k56k48L25l85K65K43j48q5k0o6K28m15M49j25J7j43
$$ plain form
7389 -25 -236 -188 -9 -69 -181 119 36 93 81 11 -128 -56 99 114 -173 45 -224 -369 252 -108 -180 31 134
7412 134 -215 -73 -310 129 -7 80 217 334 95 155 61 -222 -84 -163 -204 -51 -20 -248 -31 -153 -52 343
7434 343 330 101 205 113 -183 -24 -124 -51 34 148 -119 -27 -276 189 -347 243 -114 -208 -163 -118 50 -94 188
7457 188 20 44 -200 -147 -335 183 68 -100 141 87 -158 -25 50 236 107 28 227 13 -188 97 -41 277
7479 277 205 -146 147 1 -209 98 115 -30 -93 -78 199 -105 -241 -24 19 149 151 -4 -111 218 175 -44 -54
7502 -54 -100 -230 34 -76 380 61 -58 -219 -100 -220 -65 -258 6 458 129 21 -156 -9 -202 120 -127
7523 -127 -73 -158 -64 -44 -143 -600 -83 206 124 -101 51 28 -190 151 16 127 -172 213 -174 -18 -253 198
7545 198 80 -32 98 60 0 273 17 -231 94 -291 -26 217 69 -16 -36 -102 126 -289 160 35 52 -91
7567i1q8kJ87r8n7K03J09k72K46l18J13k5m6M01k77q9K94p1O5m61M89j66L6j92
7591a10KP3j2L27k60j11j47L70o3k9K13j76n4K21m22r5K23M10k08m7j47K89L1
7614B78Q4l77P3l35L96j8q7J31l36J20J10K7l53J22J78p3j0j40J92K19k30k44
7636b73K98J97M2j09n3l70K82j18J79j44K12J11j30q4J10L3k33n7N7j94K55j08
7658i7J75m6J98N6l01k25J27J43j80K81k12J38J31l61L11K93o84N8J40o6J11k
7680a2n2q8K8Q7p1P8j42J95j14O0K08q1l38K36J78p13O07Lr2o0LJ85p4J22m7o2
7706D4j72L06n05L61J94l10M42l87n3m4j33J65J0K08l11K62r0q1J95r9J66j81
7728a3o1r7P3j23L49q9o5J04j47o7J0J68r9J79j75K52j93J3j43p2K58K02l1m34
$$ plain form
7567 -91 -179 -181 6 -92 -149 54 163 -109 137 -181 -68 -93 -139 262 -15 -104 190 119 184 -277 212 46 82 -110
7591 -110 -108 -35 -47 280 20 -91 -238 132 69 40 253 77 23 244 -178 -273 -50 360 152 105 -42 247 278
7614 278 362 -15 58 -277 119 101 14 145 -191 -71 39 66 -287 -165 13 -60 -70 -210 -18 201 -29 -273
7636 -273 25 222 264 155 102 -268 14 -104 75 -69 143 254 124 40 150 183 -50 -107 -50 -244 11 -97
7658 -97 78 32 230 286 -15 -240 -113 30 -150 131 -81 57 188 -173 138 431 -253 -195 -55 -121 -10 -12
7680 -12 -64 -152 -124 -37 -108 -30 -172 23 -91 -31 177 96 -242 -6 172 -541 66 69 -23 -83 -80 105 31 153 106 44
7706 44 -128 178 -327 34 228 -82 360 -27 -80 -124 -257 -92 -82 126 -185 77 -13 -94 101 2 168 -13
7728 -13 -74 -171 -98 -221 128 39 -26 78 -69 -136 -126 42 -57 122 -53 199 6 19 -124 -196 62 264 233 -201
7752b01P6O5J50J08r1k34M2l9J66j7J22K5m57L82j09Mr5r8K37J8K08l67j74L79
7776A00j03oJ20l43k1K08j36J68J13jk20L43k2j49R5o2R5N7j40j08J24l20rL10
7800I3k26l4M03n0k19n7J83j26J43j19P5j69J72k18L09kj45J91J48n70N29l68
7822e7k9M25m14O3m8j94K53j8o1m5j6J78J25k8j83j9j83K22p4N0J96k90j1J56
7846bj77J61j15O6j28K40p8j65J57k27L60K24k42n6J09l12K88j8q5m2P0j08N4
7869b6J20k0j19j26O1K19l18L06j74O0J31R9l10j32Q5J17L2J88k27o6J21j6k26
7892b21j7L65Q0l97M94j04j49o0j08J44R9j68K96k32L7O6j58L41k86J51l00M38
7914C11j10m44K15J36k23l6Q7L80k54k27K97p6J3j61Q3j35J47L7K64n1j58m0n
$$ plain form
7752 -201 -125 -60 90 198 107 -127 -85 -124 42 25 147 172 -285 97 -12 -8 -103 -201 36 54 262 -105 -279 100
7776 100 -3 -9 111 -232 -253 -45 -181 -13 100 99 -121 222 200 51 146 84 179 236 96 -12 112 -208 -217 93
7800 93 -133 -167 236 186 -33 -90 93 -33 110 -9 66 -103 69 -149 160 158 13 204 352 -218 311 -57
7822 -57 -86 339 -75 -12 -60 -254 -1 -19 -80 -125 -141 37 162 134 -49 -68 -251 -29 -103 -53 143 -147 -158 -2
7846 -2 -179 -18 -133 -67 -195 45 -33 -198 -41 -268 92 316 74 18 127 -185 103 85 0 -42 28 -80 -26
7869 -26 94 74 -45 -171 -110 109 -209 97 -77 -17 114 213 -97 -229 -144 -27 5 193 -34 -100 21 5 -221
7892 -221 -238 127 207 -190 304 200 51 -9 -117 27 126 -42 254 22 59 125 -33 308 22 173 -127 311
7914 311 201 -243 -28 108 -115 -151 -64 316 62 -165 132 56 69 -92 -9 -144 3 40 304 253 95 55 50
7937E0l83K36J6K85j80j92q3L11K16n78M12j64J48k5j01QJ55m25J00K38J40j29
7959E5K5j42n1M2k3k62K04K99o5j4k00K08K51l72O0k87J45j8K49J27l86J61PJ52
7983A65k88L10l24J32l56N88k79m82O63l41l5O0K59L6j60L23q6Nnj61J45Q6l93
8006a38J37K03m87J48K05j36P9J24l4l96K86J98J0j71k26K62K01l35K69l04P4
8027c1r3L14l35M5L5k55L86j32R8j70KP0L8p8l1P3k02M73l42J72K8j30M5Ol3k56
8053c03K63J01r2J88k46P7j30R8L16l37K42j89j01JL8j30j96L04J32j18O8j15
8075a29J04L4P9l29K34K8j01J6q4O7j89j38L75J62j61pk07J13J51n51M18J73O
8098F4k0K18jm77K93k3L04l1k73N6k03K82j14j89O5NL77l21J00k2j77N0M3J76
$$ plain form
7937 50 -333 -97 -81 204 24 -168 -251 60 276 -302 110 -54 94 69 -32 -24 131 -294 -194 44 184 55
7959 55 80 -62 -113 -71 -94 -356 -152 147 82 68 -132 76 327 -45 15 -272 -127 -145 104 231 -155 6 13 165
7983 165 -123 187 -137 -5 -361 227 -52 -534 129 -212 -247 -187 72 108 -52 271 185 190 185 24 169 255 -138
8006 -138 -1 202 -285 -137 68 -68 11 135 101 -295 -9 189 199 28 -198 64 265 -70 199 -105 -31
8027 -31 -124 190 -145 -100 -65 -320 66 -66 32 -138 -136 -66 -28 -106 -137 -64 -266 207 -135 37 65 -65 -20 -14 -47 -303
8053 -303 -40 61 -31 157 -89 -12 -142 -44 272 -65 177 -12 -113 -112 -74 -204 -400 -96 36 -82 -14 -129
8075 -129 -25 9 88 -241 -7 21 -80 -64 -148 -81 -270 -408 -33 129 -32 -39 -246 -133 18 -533 -115 58 64
8098 64 44 262 261 -216 77 54 358 327 54 110 -93 189 75 -114 -49 -44 333 12 112 90 -87 -37 6 182
8122A82o6m46L85k14J7O8K55q1m67L14j22M35k60p9R2j21lR0K10l40M0J87k63
8145a87q2N66k52r7j50N74k31k07q9J95l29K46J38k91OM92p14L57j06J76k96J98
8167h3l1N40l69J14k1k21K04o2J3P5l47K62j90k85K65J87J9m5l22J76J20N4j04
8190e1q0
$$ plain form
8122 182 116 -330 55 -159 -142 -74 181 100 -367 -53 -175 260 0 -79 13 -108 -111 -21 189 -151 -111 76 -187
8145 -187 -269 297 45 -52 -202 372 141 -66 -155 40 -289 -43 95 -196 -190 302 -412 -55 -161 15 -281 -83
8167 -83 -114 426 57 171 150 -71 133 71 84 159 -188 74 -116 -401 -136 51 70 25 -297 -121 -1 53 -51
8190 -51 -131
8191a31
$$ Imaginary data points
##PAGE= N=2
##DATA TABLE= (X++(I..I)), XYDATA
0@%%%%%%%%JrJ6j6J6j6K4l2L7m5N1n9P2q6R7j10J29j51J70j92K19k46K78l14L51
33A85l93M40m90N46o07O73p46Q26r15J013j122J244j379J531j703J901k130K399
51A273k719L108l597M228n077O291q187J1587j9564P2027N2984j05575L489O4992
65G5260K3413o3861j7466M0251K1667l2122m955K3283j063l0300M690K8667Q28
78F8292l0015m775K0754P658j2916l585K438l623l395J1305O039j3660j3490R623
92D0650J6109l601j6794n333Q723L890l516j839O92n950o828N744J2519k232j7066
107B5168n846J1470O791j1117r347M608M009n040j01P359l664j4964k343J5436
121B2419M687j4674r620R045O118p393l892L588k856q058K628R536k858j2891
$$ plain form
0 0 0 0 0 0 0 0 0 0 1 -8 8 -8 8 -8 16 -16 21 -24 27 -32 40 -46 51 -59 70 -81 89 -103 116 -130 148 -166 185
33 185 -208 232 -258 288 -319 354 -392 434 -481 532 -590 654 -725 806 -897 1004 -1126 1273
51 1273 -1446 1662 -1935 2293 -2784 3507 -4680 6907 -12657 59370 112354 6779 10268 75260
65 75260 98673 34812 17346 57597 79264 47142 42187 65470 64407 34107 38797 67464 68292
78 68292 38277 33502 54256 61914 48998 45413 47851 44228 40833 52138 58177 44517 31027 40650
92 40650 56759 53158 36364 31031 39754 43644 40128 38289 38981 33031 26203 31947 44466 42234 25168
107 25168 19322 30792 37583 26466 17119 21727 25736 20696 20595 27954 24290 9326 6983 22419
121 22419 27106 12432 2812 11857 17975 10582 6690 10278 7422 -636 1992 11528 8670 -4221
135d221N48J1608K46j1686k591O110j056o686L252P694n163j1272K691J1967M81
150A922j2487m662R407N684n459o457K310L485j362k673K248K006l682l533L350
165i903N125j814n277l42L845J04j296l30m95k625N91M669J064o051k009O353
181h391M690m811m841L309L872l330k667N514K822n647l521N253N166m233m527
196a1342K875M138j247k301K074Q32k224j692L294J676l439l119L293M268j347
211d261l987O12L181m77k860J93L002m26l683J2M483K57n043j325O234K760n308
228f636k594L858J903l155j467L735l83m334Q27N605m51o034k29O513R38o264
244h168q81O176Q64o501o70O223J43o129p19O404J447n210j111M921R16l878p0
$$ plain form
135 -4221 -3673 7935 8181 -3505 -6096 14 -1042 -7728 -4476 3218 -1945 -13217 -10526 1441 1922
150 1922 -10565 -15227 -5820 -136 -5595 -12052 -9742 -6257 -7619 -10292 -8044 -6038 -9720 -13253 -9903
165 -9903 -4778 -6592 -11869 -12211 -8366 -8262 -9558 -9888 -10383 -13008 -12417 -7748 -6684 -12735 -14744 -8391
181 -8391 -3701 -8512 -13353 -10044 -6172 -9502 -12169 -6655 -3833 -9480 -13001 -7748 -2582 -6815 -11342
196 -11342 -8467 -4329 -5576 -7877 -5803 -4971 -7195 -8887 -5593 -3917 -7356 -10475 -7182 -2914 -4261
211 -4261 -8248 -7636 -4455 -4932 -7792 -7599 -4597 -5023 -8706 -8694 -4211 -3954 -8997 -10322 -4088 -1328 -6636
228 -6636 -9230 -5372 -3469 -6624 -8091 -4356 -4739 -9073 -8246 -2641 -3092 -9126 -9355 -2842 -1904 -8168
244 -8168 -9049 -2873 -2009 -8510 -9180 -2957 -2814 -8943 -9662 -3258 -1811 -7021 -8132 -3211 -2295 -6173 -6243
261f243L957m41l349J132L960j264l844J766M244j080m130K381M765k077m809
276e032K614N777j386n376M27N769M49m213l24M634Q70l203n6L805M19l241N94
293B527M176J60m219K6M276J108l674j60L911J074l311n49M165R23l643p78M078
310A0090J744l788j795L215K132k482j338J919J323r48R0J413l01j698P60J877
326A2213r76k325J193K317n04k267N75K874j101k898R04L323l00l779j90K718
342A1777k57k253o50K392j47k568K1K248n2k476l94K289p28k683K09K008m85l063
360E188j33L100m00l551m9L471K1l635j400K878J140l191k029J725J252j788j360
377A239J326P58k055l87J267J88j703o61N67P62j269j157O49L90j159o75J183
$$ plain form
261 -6243 -2286 -2727 -6076 -4944 -984 -2248 -6092 -4326 -82 -1162 -5292 -2911 1854 -223 -5032
276 -5032 -2418 3359 1973 -3403 -2976 2793 3242 -971 -1295 3339 4209 1006 950 4755 5174 1933 2527
293 2527 6703 6863 2644 2670 6946 8054 4380 4220 8131 9205 5894 5345 9510 10433 6790 6012 10090
310 10090 11834 8046 6251 9466 11598 9116 7778 9697 11020 10072 10162 11575 11274 9576 10336 12213
326 12213 11237 8912 10105 12422 11918 9651 10226 13100 11999 9101 10005 13328 13028 9249 9059 11777
342 11777 11520 9267 8617 11009 10862 8294 8315 10563 10511 8035 7641 9930 9202 6519 6728 8736 8251 5188
360 5188 5055 8155 7755 4204 4155 7626 7647 4012 2612 5490 6630 3439 1410 3135 4387 2599 1239
377 1239 2565 3323 1268 881 2148 2336 633 -28 539 1301 32 -1125 -476 -86 -1245 -1920 -737
394g37J54j155r91J174R06j589j092J160R61j277j533Q55J285r49j022L98M39
411c013K70o26L56L47r56q2P65M03j125o11P79Q41p26p90P03Q57k04q41J44J444
431b065n20j192M7P71L97q45j42R66L78j033k2J117N67n75l00K68M89m60p0M83
451a741m03q52O97J364j70j400O6K009O66k314p23K167P83k011j093J675J096
468a84j783j134J774J618j572j145J991J273k036j191J515J331j811j069J248
483a175J302j605m69J778P82j838p68K339P83k347q25K429O63j904j082J725R34
500G22j508r04J787O45j248j92J362pj429m0J638p4j844l24K137M19j396l14J769
519A199R48k253J64K001O78k138j055K255J113j667r16J540J512j350r58J037
$$ plain form
394 -737 -583 -1738 -2729 -1555 -649 -2238 -3330 -2170 -1209 -2486 -4019 -3164 -1879 -2828 -3850 -3452 -3013
411 -3013 -2743 -3369 -3013 -2666 -3622 -3704 -2939 -2536 -3661 -4272 -3493 -2652 -3378 -4168 -3465 -2608 -2812 -3653 -3509 -2065
431 -2065 -2585 -3777 -3730 -2959 -2562 -3407 -3549 -2583 -2205 -3238 -3260 -2143 -1576 -2151 -2451 -2183 -1694 -2154 -2224 -1741
451 -1741 -2144 -2996 -2299 -935 -1105 -2505 -2439 -430 236 -2078 -2801 -634 149 -1862 -2955 -1280 -184
468 -184 -1967 -3101 -1327 291 -1281 -2426 -435 838 -1198 -2389 -874 457 -1354 -2423 -1175
483 -1175 127 -1478 -1947 -169 613 -1225 -1993 346 1129 -1218 -2043 386 1049 -855 -1937 -212 722
500 722 -786 -1690 97 742 -506 -698 664 657 -772 -812 826 752 -1092 -1416 721 1140 -256 -570 1199
519 1199 2147 -106 58 2059 2737 599 -456 1799 2912 1245 329 1869 3381 2031 1073 2110
535B110J460o12q73J222N82j014m32J238Q89j655n48J807J163j245k70J561Q67
552F250r79j329J328J641j165j056J175R47p03p70Q97J301o42j047J192J208q13
569G435j282J358Q91j115o57J394R01k008r97K060Q96j492j014K397R86j839j741
586F173J951J259j592j355J823J244j191j377J394J459j686n46J393L71j683j042
602F595J468L11j158j122J373N34j683m84J493M42j670m80J015K18j488q18J053
619E599J97p10q56K96j63j52k22L13p3l91M67k11p94q35O84M35l95j061j50K19
639B197k25k83K70r7o0j4q83l11L28O09j095n99M81M29p48q39N39Q07m62r39K07
660f88J096n48j265M19K50l68m05K64J61j117p5J076R22j670l60J030N45j583
$$ plain form
535 2110 3570 2958 2085 3307 3889 2875 2443 3681 4570 2915 2367 4174 5337 4092 3822 5383 6250
552 6250 5271 3942 5270 6911 5746 4690 5865 6812 6109 5339 6236 7537 6895 5848 7040 8248 7435
569 7435 6153 7511 8402 7287 6630 8024 8925 6917 5920 7980 8876 7384 6370 8767 9753 7914 6173
586 6173 8124 9383 7791 6436 8259 9503 8312 6935 8329 9788 8102 7556 8949 9320 7637 6595
602 6595 8063 8374 7216 6094 7467 8001 6318 5834 7327 7769 6099 5619 6634 6852 5364 4546 5599
619 5599 5796 5086 4230 4526 4363 4211 3989 4302 4229 3838 4305 4094 3300 2465 3149 3584 3189 2128 1978 2197
639 2197 1972 1689 1959 1862 1802 1788 905 594 922 1531 436 -163 318 747 -1 -840 -301 506 44 -895 -688
660 -688 408 -140 -1405 -986 -736 -1104 -1509 -1245 -1084 -2201 -2276 -1200 -278 -1948 -2308 -1278 -733 -2316
678b316o87J178R01j183j077O95J212p40o23O91Q84n04r27J162K89l55o98J077
696a021O70r85p74J175K04n41l56J539K18j361o44J153J058r27j268J121R82j117
714h74q07N63J642l91p89K29J005n83n85K78J145k34j101N49R06n48o15P60J382
733A932n93j165N71J595p28o79P32J126j164j165J132Q26k85r01M39J138k24j172
751A415K00O93l0q80P97N61m64r74O07P67m49q99J171J448j182j440J322J702
769D365p14j771O61J640m56j922N76K089q61j611Q40J588m97j313M90J325n05
786C924j203N22J226r48r04J198Q87r96r78J282O93j407o65J827J414j442j957
803B473J390J182j003r12J643N71j011q83J118M89q14J27M42l26p64K66P10m7
$$ plain form
678 -2316 -3003 -1825 -924 -2107 -3184 -2489 -1277 -2017 -2640 -1949 -1065 -1569 -2496 -1334 -1045 -1400 -2098 -1021
696 -1021 -351 -1336 -2110 -935 -731 -1272 -1628 -89 129 -1232 -1876 -723 335 -592 -1860 -739 243 -874
714 -874 -1681 -1118 524 133 -656 -427 578 -5 -590 -312 833 599 -502 47 953 405 -210 550 1932
733 1932 1339 174 745 2340 1612 933 1665 2791 1627 462 1594 2420 2135 1234 1673 2811 2587 1415
751 1415 1615 2308 2278 1398 2195 2756 2292 1318 1925 2692 2243 1344 2515 3963 2781 1341 2663 4365
769 4365 3651 1880 2541 4181 3725 1803 2379 4468 3607 1996 2836 4424 3927 2614 3104 4429 3924
786 3924 2721 3243 4469 3521 2617 3815 4702 3706 2728 4010 4703 3296 2631 4458 5872 4430 2473
803 2473 3863 5045 4042 3130 4773 5344 4333 3450 4568 5057 4243 4370 4812 4486 3722 3988 4698 4651
821D651r70P8Q81K47j167M6N34L72n48j22M90j57l00m53K62J06M81o48p2k12K70
842C769j51j93O8K89l25p49j38K39n25J15J20m1p83L56M47l81q79j10R83j70j106
863H35o47Q97K42j066l42P83J01q81j99J91K84k10j81q0m18j14m04M65n72l01
883a617J52N50p68o48K19M84j76p29j34O56N0j093j75M97J39n54n06K7K97Ln31
904c857L53N38m72k88K0J24j14r8k72M31n55j12N90K52p17K10N20K51o69l60Q51
925c374M07p68m06O10O50n18m59J25O46o5J63K72J81l00m14R39j37o2l9N54k26
946b221k52P8R82K51m40j74N97K87l70l74K38Q43l76l78K88O76K87o71j53J176
966B94m6o29M99M44j42k73K86M40o61K46J52M79k55j65O72P47q85n48N97N72m77
$$ plain form
821 4651 3681 3759 4640 4887 3720 3766 4300 4672 4124 4002 4492 4335 4035 3582 3844 3950 4431 3783 3711 3499 3769
842 3769 3618 3425 3493 3782 3457 2708 2570 2809 2284 2399 2519 2478 1695 2051 2498 2117 1238 1128 2111 1941 835
863 835 188 1085 1327 261 -81 702 803 -78 -277 -86 198 -12 -193 -273 -691 -805 -1209 -744 -1316 -1617
883 -1617 -1465 -915 -1683 -2331 -2112 -1628 -1804 -2533 -2667 -2011 -1961 -3054 -3229 -2732 -2593 -3147 -3653 -3626 -3329 -3326 -3857
904 -3857 -3504 -2966 -3438 -3726 -3706 -3582 -3696 -3794 -4066 -3635 -4190 -4302 -3712 -3460 -4177 -3967 -3447 -3196 -3865 -4225 -3374
925 -3374 -2967 -3735 -4141 -3531 -2881 -3399 -3858 -3733 -3087 -3152 -2989 -2717 -2536 -2836 -3250 -2311 -2448 -2510 -2549 -1995 -2221
946 -2221 -2473 -2395 -1413 -1162 -1602 -1776 -1179 -892 -1262 -1636 -1398 -555 -931 -1309 -1021 -345 -58 -729 -882 294
966 294 248 -381 118 562 420 147 433 873 212 458 610 1089 834 669 1341 2088 1203 655 1252 1824 1347
987A347o53L40J021o43m52M81O04o61m78N93R90p68l63J50K38l84o1K97K31n20
1007A309m62J212N30r60p89Q70L07p86m5P19J17m87p21P07L35m01l08K72K45k43
1027A421k77L21L75m07l27L36K85o54k76P91K20p64m88R02L52q74m46R29M81o56
1047A244o74M59M39k83p84O83M18k64m02K44M00m20j77M44K08o74J81O94m0o89
1067A007l59O74L60q40l3Q81J75n88n37O42M06l19l87m5K67O8m02Q6K43mk27K38
1089A306j05J43j20L9J49k28k39J25j35j05j72J78M59m12n51M09M37k56m90P6
1109E08L75j02j097M31L34J33o18j39L55j35j18Q6P5k83r7L11k10n36j39K49M36
1130a81o08m13K80O72m33j45m5O60l16o58k88N30j94k16P0q7L99j76l04j4R2L2
$$ plain form
987 1347 694 1034 2055 1412 960 1441 2045 1384 906 1499 2489 1721 1358 1508 1746 1362 1301 1598 1829 1309
1007 1309 847 2059 2589 1629 840 1710 2017 1231 1186 1905 2022 1535 814 1521 1856 1455 1147 1419 1664 1421
1027 1421 1144 1465 1840 1433 1106 1442 1727 1073 797 1588 1808 1044 556 1458 1810 936 490 1419 1900 1244
1047 1244 570 1029 1468 1185 401 1084 1502 1238 836 1080 1480 1060 883 1327 1535 861 1042 1736 1696 1007
1067 1007 648 1322 1682 842 809 1690 1865 1277 740 1382 1788 1469 1082 1037 1304 1372 970 1056 1299 1295 1068 1306
1089 1306 1201 1344 1224 1263 1412 1184 945 1070 935 830 658 836 1295 883 332 741 1178 922 432 508
1109 508 883 781 -316 115 449 582 -36 -175 180 45 -73 13 88 -195 -292 19 -191 -727 -866 -617 -181
1130 -181 -789 -1202 -922 -250 -683 -828 -873 -213 -529 -1187 -1475 -945 -1139 -1355 -1285 -1372 -973 -1149 -1453 -1467 -1375 -1343
1152a343lP9l16j0L00J31m52k09J40M33j03k90J25K54o1k87N35qK0L4q34M73R95
1175c97q05j30K60L46K13n06L51K36L3k80J84J87K79m34M00p0L9j34Q4O81p2m29
1197C6M00K52L55p32J89M80M3l76j91O71n3j15j91N66K22K7k75N14n8k31RK11
1219A753p7k28N0N11n84l60P59R93j008p2R8O94k93p50M78N35m61l03K15L79l65
1240A964l74K41K97j93m61N69j34j85J95K71m14l39m9L72r2o53K6P16k82n23j49
1261H03N91J04m39k79M1J24K56l04J00k60j26L8lJ32j36O7K46k33l59k7n4J31
1283D13n33J57M09r9l54l8R9K53p9n08Q0K39K26o78k9K79J66k08m27N26m89J75
1305d20L0L44k31p4M5J92l19N4N5L74j99l03M89J53r6n56J83O53jm92K0L14m67
$$ plain form
1152 -1343 -1346 -1267 -1583 -1593 -1293 -1162 -1614 -1823 -1683 -1250 -1353 -1643 -1518 -1264 -1325 -1612 -1077 -1085 -1065 -1031 -1865 -1392 -397
1175 -397 -1202 -1332 -1072 -726 -513 -1019 -668 -432 -399 -679 -495 -308 -29 -463 -63 -133 -94 -228 -144 537 465 36
1197 36 436 688 1043 311 500 980 1023 647 456 1127 1074 959 768 1334 1556 1583 1308 1822 1764 1533 1542 1753
1219 1753 1676 1448 1498 2009 1425 1065 1824 2817 1809 1737 1835 2529 2236 1486 1964 2499 2038 1735 1950 2329 1964
1240 1964 1590 1831 2128 1935 1474 2043 1909 1724 1919 2190 1776 1437 1388 1760 1668 1015 1041 1757 1475 952 803
1261 803 1394 1498 1059 780 821 945 1201 897 997 737 611 649 646 778 642 709 955 722 363 336 282 413
1283 413 -120 37 446 347 -7 -45 54 307 228 -280 -200 39 265 -413 -442 -163 3 -205 -632 -106 -595 -420
1305 -420 -390 -46 -277 -351 -306 -114 -433 -379 -324 50 -149 -452 37 190 94 -462 -279 374 373 -119 -99 215 -252
1328b52k90K83N08k02m13N43K39m18L08K54k43k52rM57q8k17j42K96K98n12j11
1349C7P14r7j23r9M9P1k23J94l1k50M33j63K03j60k42J14lQ9P4j24L08n37O3K58
1373E55K15m31l85L14J19j4j36J66k7P1Q9l61q5n3N19k98k78J05p1j76Q5j03k00
1396c80L61k82J54J4j81J65O9M0l40o3J59k02q8KM17M5j70k80K60P1j25n67L85
1419e36R6l75K3M17k64m9m3M39n04L33L39n65K18l03M61r7J5n67M0R27k49j48
1441c92k91N36q7l11p7N01K02m52L30m2K03m04P3K6L02k40j75Q24J4m04j80L97
1463C53J02j01j02M85l35l09L69L01J04k33k21N98K05q38M8L67M11j93j19J28
1483A020k19J30N2m6K68j72P9M08l41j87N05K27l41Q1n47K25L03l86J63L7M28
$$ plain form
1328 -252 -542 -259 249 47 -366 177 416 -2 306 560 317 65 56 513 425 208 66 362 660 148 37
1349 37 751 654 531 432 481 552 329 523 492 242 675 512 715 555 313 427 424 513 587 463 771 234 297 555
1373 555 770 339 -46 268 387 373 237 403 376 447 536 175 90 37 556 258 -20 85 14 -162 -77 -180 -380
1396 -380 -19 -301 -147 -133 -314 -149 -80 -40 -380 -443 -284 -486 -574 -572 -155 -110 -280 -560 -300 -229 -354 -921 -536
1419 -536 -440 -815 -792 -375 -639 -688 -731 -292 -796 -463 -124 -689 -471 -774 -313 -410 -395 -962 -922 5 -244 -392
1441 -392 -683 -147 -234 -545 -622 -121 81 -371 -41 -83 120 -284 -211 -185 117 -123 -298 526 540 136 -44 353
1463 353 455 354 252 737 402 93 462 763 867 634 413 1011 1216 378 426 793 1204 1011 892 1020
1483 1020 801 931 983 937 1205 1033 1112 1520 1179 992 1497 1724 1383 1464 917 1142 1445 1059 1222 1259 1687
1504A687n93j25J67M03M0n01L17k48m9k98K70L62jk67Rj6j74k7J19J28k59k26
1526G18K59j08k22l58R26o5j97k91O4O0j45m10L07M95p39j42l1K84m72J04J73
1547B10j53l1k41K84R4k15j57K66j05n84j14N81K6m01M8j18M88m97j22K32J09
1568d00J06j56o3R0m66r8J37j11N12k27p4rk79L88O6J30l78L18j84J2m21K26L4
1591h47L19k39k78j36N34j45k91N92l64m8M25o23M00n0m03O70q04N16k22J07K49
1612f38j87L50J4j73j88K56n3m7K49m88K73J31o7k26K42K85j95j90N9J00l6o7
1634e96j37K02k5o9K95k85p4J0J5K41m08N30l31J24R0L6k23M19j04n04k03M83
1656e14K72n75M95k1p9J71l33L68l74L5K43j75J3m5K66n14L14K62J17j50O8J89
$$ plain form
1504 1687 1094 969 1136 1539 1579 1078 1395 1147 1098 800 1070 1432 1431 1164 1173 1157 983 956 1075 1203 944 718
1526 718 977 869 647 289 1215 1150 953 662 726 786 641 231 538 1033 294 152 121 405 -67 37 210
1547 210 57 26 -215 69 163 -52 -209 57 -48 -632 -746 -165 -139 -540 -492 -610 -122 -619 -741 -509 -400
1568 -400 -294 -450 -513 -423 -889 -987 -850 -961 -449 -676 -750 -759 -1038 -650 -584 -454 -832 -514 -698 -686 -1107 -881 -847
1591 -847 -528 -767 -1045 -1181 -647 -792 -1083 -491 -855 -903 -478 -1101 -701 -751 -1154 -484 -1288 -772 -994 -887 -638
1612 -638 -825 -475 -461 -634 -822 -566 -619 -666 -417 -905 -632 -501 -568 -794 -552 -267 -462 -652 -593 -493 -529 -596
1634 -596 -733 -531 -556 -625 -330 -615 -689 -679 -664 -423 -831 -301 -632 -508 -418 -382 -605 -186 -290 -794 -997 -514
1656 -514 -242 -817 -322 -343 -422 -251 -584 -216 -590 -555 -312 -487 -474 -519 -253 -767 -453 -191 -74 -224 -156 33
1678C3l04J13j9o7K2K84n08l3K09R1K45m0n7K27K3k16n5R5K00k3L3l20J40K30
1702C03j2o1J95p4R5k96L12j75Q2J23P2p0l12L16N25k27k88K71O0J86l10K67M25
1725A407K1q80M69L35j28l68M19n9mJ25J47j14k37K09r6K46j21j45K68N1l11J52
1747A386J69J15j37k13q9R0M04l21J07M0k63l81K54J65j59P1k18O4k7k9N1K23
1769A302m83k19M55o5L5m81L25k22K6n19N51J23l47k16j14L76k76l9J12Kl15j28
1791a17m4K38m21J73m6K08k47k49L21Nl36j21J69k95nJ02j63J04m48j32M94K1
1813g89j82l0L35k75k28q0J13j71J33j26QJ69j57N2J39l16K93n9j19rMk15J20
1836a390K25j60M6j04L03J37m60O4J30J44j01R8K80Ok1l55n0K34J13K7k8J59L99
$$ plain form
1678 33 -271 -158 -177 -244 -222 62 -446 -479 -270 -179 66 26 -31 196 219 3 -52 43 243 220 253 -67 73 303
1702 303 291 230 425 351 446 150 462 287 369 492 564 494 182 498 1023 796 508 779 839 1025 715 982 1407
1725 1407 1428 548 1017 1352 1224 856 1275 1216 1212 1337 1484 1370 1133 1342 1246 1492 1371 1226 1494 1545 1234 1386
1747 1386 1555 1670 1533 1320 1231 1321 1725 1404 1511 1551 1288 907 1161 1326 1167 1238 1020 1084 1057 1028 1079 1302
1769 1302 819 600 1055 990 1025 544 869 647 673 154 705 828 481 265 151 527 251 212 324 326 11 -117
1791 -117 -161 77 -344 -171 -217 -9 -256 -505 -184 -179 -515 -636 -467 -762 -767 -665 -828 -724 -1172 -1304 -810 -789
1813 -789 -971 -1001 -666 -941 -1169 -1249 -1136 -1307 -1174 -1300 -1292 -1123 -1280 -1228 -1089 -1405 -1112 -1171 -1290 -1299 -1295 -1510 -1390
1836 -1390 -1165 -1325 -1279 -1383 -1080 -943 -1403 -1339 -1209 -1065 -1166 -1068 -788 -782 -803 -1158 -1208 -974 -861 -834 -862 -703 -304
1859c04k06j14K25K8J52M4j75P0J17j90L79k46K39K71L2k96j53M02j1o9j54N2
1881I3J02L73l27j13K54J13j92rM56p8p4j63J13M7J60k59j09m2J36L78j56j31
1903E72k9K33J50k77j30M7L59n28K00k91RM54k37j98j00K12j5j6j43K7k18L3K91
1926D05k96k5L31l48K1j13O4j1o16M32NL74k76n88O42nJ46n81M01j67j61J59j28
1949c35n0k13J34%j18P8k76K08K78k9j55L47k42K20o54K36M37Q7n11j2N95m60
1971d35J37J57J40j36j08l17N04l99J53l7K35j8n0K12l19L74Q1J61l04L0l10L97
1993A48L61m82l6J72K96J3m15%K18K14l46l1Q4L91K61l01j38J98R2j67o8J8j7
2016D65J43K89k80l64K41K25l48R7kL88n47j36L03Q5J15k70LRJ68o1j12j39J48
$$ plain form
1859 -304 -510 -624 -399 -371 -219 -175 -350 -280 -163 -353 26 -220 19 290 322 26 -127 275 264 195 41 93
1881 93 195 568 241 128 382 495 303 294 750 672 598 435 548 595 755 496 387 345 481 859 703 572
1903 572 543 776 926 649 519 566 925 397 597 306 315 769 532 334 234 446 431 415 272 299 81 114 405
1926 405 109 84 415 67 88 -25 39 28 -588 -156 -151 223 -53 -641 1 -4 142 -439 -38 -205 -366 -207 -335
1949 -335 -385 -598 -464 -464 -582 -504 -780 -572 -294 -323 -478 -131 -373 -153 -807 -571 -134 -47 -558 -570 25 -435
1971 -435 -298 -141 -1 -137 -245 -562 -58 -457 -304 -341 -106 -124 -174 38 -281 93 174 335 31 61 -249 148
1993 148 509 27 -9 163 459 472 57 57 275 489 143 112 196 587 848 547 409 607 699 532 464 482 465
2016 465 608 897 617 253 494 719 371 468 466 854 307 171 474 559 674 404 407 416 584 523 411 272 420
2039D20N6k38M8M1n5q8L6K41n16K25L82m76j51m7J84q0m22K69J34J35K0k69L2
2062a19J34k76j44K56K15m62k89N41k89k2k3lL38m12R3J0j11j35J86K01j08k9
2084d48j55K87m6k38p1M5j26M23l65j22K77j45J71k47L51J47m60j0N2R8qJ60o1
2107d91J97R0k23L2K1k3K00r8j03m8o7K66k05l7N79n02K21j82M4L62j25J5j38
2130b15Q3p6L28k88QL68k43Q8k70L08k62j11J31L03n27Q6P0K70n02N17o7O4m55
2153c92J01K17j98J64J30O2R7j03k43J10K23m35J41M30j02n26K04J20k62O4K84
2174H6R9j40l03K3M70l74k40K30K83j99P7j57K17m8j00j44L28l95l54K74J60L22
2196A15n60M17j16k91J36o9J37L01m9k21R6m91N92J93m04L93l52J9M32j81j09
$$ plain form
2039 420 476 238 286 327 272 184 220 461 -55 170 552 76 -75 -122 62 -18 -440 -171 -37 98 118 -151 -119
2062 -119 15 -261 -405 -149 66 -396 -685 -144 -433 -455 -478 -481 -143 -555 -462 -452 -563 -698 -512 -311 -419 -448
2084 -448 -603 -316 -362 -600 -671 -626 -752 -329 -694 -816 -539 -684 -513 -760 -409 -262 -722 -732 -680 -582 -590 -430 -491
2107 -491 -294 -204 -427 -395 -374 -397 -197 -295 -398 -446 -513 -247 -452 -489 90 -412 -191 -373 -329 33 -92 -77 -215
2130 -215 -132 -208 120 -168 -160 208 -35 53 -217 91 -171 -282 -151 152 -375 -289 -219 51 -451 66 -1 63 -392
2153 -392 -291 -74 -272 -108 22 84 181 78 -165 -55 168 -267 -126 304 202 -324 -120 0 -262 -198 86
2174 86 185 45 -258 -235 235 -139 -379 -149 134 -65 12 -145 72 24 -76 -220 108 -287 -641 -367 -207 115
2196 115 -445 -28 -144 -435 -299 -368 -231 70 21 -200 -104 -595 -3 190 -214 179 -173 -154 278 97 -12
2217a2l23K17J00k3J0L68k50J60L8l7j54J04Lq0K91k83J71P2M3k85N74o09K47
2240C42l0r9K58J31n06J4N41K02k08k54m9K70k64j46L55j66J34o0J0l15J96Q6
2262D42K4k01j27L78M1k75p4q6K34J63j65L8k8J85m10K61K66L6k28j91j55J57
2284B85J76K3o6k33j46J04J2K62k1j22k53J63O7j38j81J76j38K77l64L69n87K09
2306a26Q2j60J33r5j47p0K20o1l17M16J39n72M15J01m28lL3K1R7R5k99K68k20
2329d78r3L40k72k0r1K39K09j31n0j96J45PJ20j90K11n4q0k88K93r4r5J95L77
2352DJ0m92J36K20k49J95k76N6L74m58J26k1K91k54N11j72q9j39K86J9L2l88M49
2375A71p4k25O8j44N62k60J46j01k38Q7j9R3P1P7p0M2K18l75L6Q0k6Q0p0R8O5
$$ plain form
2217 -12 -335 -118 -18 -41 -31 337 87 247 285 248 94 198 201 121 412 129 300 372 415 130 704 95 342
2240 342 312 213 471 602 96 110 651 853 645 391 342 612 348 202 557 391 525 465 475 160 356 442
2262 442 466 265 138 516 557 282 208 122 356 519 354 392 364 549 139 400 666 702 474 283 128 285
2284 285 461 484 418 185 39 143 155 417 396 274 21 184 251 113 -68 108 -30 247 -117 252 -335 -126
2306 -126 -44 -204 -71 -166 -313 -383 -163 -224 -541 -125 14 -558 -143 -42 -470 -473 -440 -419 -322 -227 -526 -258 -478
2329 -478 -571 -231 -503 -523 -614 -375 -166 -297 -347 -543 -398 -391 -271 -461 -250 -304 -384 -672 -379 -473 -568 -373 4
2352 4 14 -478 -342 -122 -371 -176 -452 -396 -22 -480 -354 -375 -84 -338 173 1 -88 -227 59 78 110 -278 171
2375 171 97 -128 -60 -204 358 98 244 143 -95 -8 -27 66 137 214 144 186 404 29 65 145 119 199 129 227 292
2400B92q5p3O8n9J61l64L71k53K68l1j21j17L9OL6R5m09J48L34k65K41j18j34
2423C0K44j86J2oQ0L4k03j30L37j71j53jJ85k21p8j7L26n9r9j47M4J6j40l7O8
2448b72K27j58n1L90j90k88J27%p8Qp3P1p8N8j2p5K23j86K85m76M34j01K1j26
2472c20J77j73r4l4K17P6jJ42j04k65L68j9m06J89R5l7P5k38J09p2K51J3j46L97
2496B00k83l5k8j11M32j74Q3j19pN6K16l13J06L8R8J76n67J93rL39j30K67o13
2519a85L53l4r7j33J51M7K4j3J53J9q3n4l82K31J49O1k66N8P3l0j6l47N89j16
2543A52j54K89l81L78k34L9M3JK9p8k76M42l08K27j76j33j30J49K44k10R0j08
2565a05J24k12k7K03k6l22J76J10j41J1K08j37l2NJJ00n6J18j81J47l7r5j2lk10
$$ plain form
2400 292 207 134 202 143 304 -60 311 58 326 295 174 57 96 102 138 233 -176 -28 306 41 282 164 30
2423 30 274 88 100 94 174 208 5 -125 212 41 -112 -113 72 -149 -227 -244 82 23 -76 -223 -179 -163 -303 -340 -272
2448 -272 -45 -203 -254 136 -54 -342 -215 -215 -293 -285 -358 -287 -365 -307 -319 -394 -171 -357 -72 -548 -114 -215 -194 -320
2472 -320 -143 -316 -410 -444 -227 -151 -152 -10 -114 -379 -11 -30 -436 -247 -152 -189 -114 -352 -243 -315 -64 -51 -197 200
2496 200 -83 -118 -146 -257 175 1 84 -35 -42 14 230 -83 23 61 159 335 -232 -39 -48 291 161 428 -185
2519 -185 168 134 37 -96 55 102 126 113 266 285 202 148 -234 -3 146 207 -59 -1 72 42 26 -321 268 152
2543 152 -2 287 -94 284 50 89 132 133 162 84 -192 250 -58 169 -7 -140 -270 -121 123 -87 3 -105
2565 -105 19 -193 -220 -17 -43 -365 -189 -79 -220 -209 -1 -138 -170 -165 -164 -64 -120 -2 -183 -36 -73 -168 -180 -183 -393
2590c93L14J27j94O2k38j9K02J06R6j26K5l02j09M61p8M8j21n4K69j33r6L27k00
2613b6p6nK57m20K9K57j93N55l01R9j67M27p7Q9l37K31J57m54K46M1j76K67k81
2636A42K92mk37J65j40L40n28K13L52j51k49o8J86J50N8m28L5K26J43l37k6J60
2658B94j88K89j80J43n8j56m2J30m9O6j02j49L54k60J58J26k0l75K47Q1l39K37
2680B07j72J87n4k52R9k44K46j83J79q8k76P6K51R1l20J53l1j0Q7l90K91Nl29
2703d77j63K23P8j13N7l0J24n4m8n28N20k6O2n18K03L63k35R7l37M18m26K58J11
2726d41m68K79K68m63K93j37p4K36N4r7Q7j33J0q5o8M45kk17J41N6J04J20j80
2749b72l35J97K08M5J91l86K96k55r8J88j97L02J6Q3n5k6J72l08J67Q8J18L4k10
$$ plain form
2590 -393 -79 48 -146 -84 -322 -341 -139 -33 63 -63 -38 -340 -449 12 -66 -18 -139 -193 76 -57 -153 174 -26
2613 -26 -102 -107 150 -270 -241 16 -177 378 77 176 9 436 359 448 111 342 499 45 291 332 156 423 142
2636 142 434 430 193 358 218 558 30 243 595 444 195 127 313 463 521 93 128 354 497 160 134 294
2658 294 106 395 215 358 300 144 102 232 183 249 147 -2 352 92 250 376 356 -19 228 309 -30 207
2680 207 35 222 168 -84 15 -229 17 -166 13 -75 -351 -275 -24 67 -253 -100 -131 -141 -54 -444 -153 -148 -477
2703 -477 -640 -417 -339 -452 -395 -425 -301 -355 -403 -931 -411 -437 -375 -893 -690 -327 -562 -465 -802 -384 -810 -552 -441
2726 -441 -909 -630 -362 -825 -532 -669 -743 -507 -453 -550 -463 -596 -586 -671 -739 -294 -296 -513 -372 -316 -212 -92 -272
2749 -272 -607 -410 -202 -157 34 -352 -56 -311 -409 -221 -418 -116 -100 -17 -72 -98 74 -234 -67 21 139 173 -37
2772c7L9pN3P7l36L00j1R3l62M20o7R7k93M08l98K43q7J79J05k15J95K31j93l86
2796D8N0K82K2k85J20J11k9m8p5k08M00j97J02n2km75L58L54m48L56N7k21J06
2819C26j58j60M38k54R1j80q7Q1k44M81l21Q2m0kK15l13m8KN3K78k62N8l49K42
2843g1k41K45l0L4j15K99j17m95L59n3j49K20k28j02K70J76j37j77J87k58K42
2864a41j35p1R4K12k35P8M2P1N8k07K99k96K34j29J32k10j0J10j30L38p3L1r7
2887c5k01J90k07J07j05o5K80j17j03R1K71J37l43k20J02K36o0J06j4P8l12L37
2909A53j7j5k23l7J50k03J55m5J48l02N5J03R0k82O87l17k9J79k56J87p7k1P5
2932A58j61q5k0L24k83j88M18k80K79l23K60k72nN9mn1P4K79j56j10j17J41q2
$$ plain form
2772 -37 2 -5 48 125 -211 89 78 171 -191 229 162 259 -34 374 -24 219 132 311 416 201 396 627 434 48
2796 48 98 380 402 117 237 348 319 271 196 -12 388 191 293 241 239 -236 122 476 28 384 441 220 326
2819 326 168 8 446 192 283 103 16 97 -147 334 13 95 55 53 268 -45 -93 -91 -38 240 -22 36 -313 -71
2843 -71 -312 -67 -97 -63 -178 121 4 -491 -132 -185 -334 -114 -342 -444 -174 2 -135 -312 -125 -383 -141
2864 -141 -276 -347 -253 -41 -276 -198 -156 -85 -27 -234 65 -231 3 -126 6 -204 -214 -104 -234 104 31 62 -35
2887 -35 -236 -46 -253 -146 -251 -316 -36 -153 -256 -165 106 243 -100 -320 -218 18 -42 64 50 128 -184 153
2909 153 136 121 -102 -139 11 -192 -37 -82 66 -236 -181 -78 12 -270 417 100 71 250 -6 181 104 83 158
2932 158 -3 -88 -108 216 -67 -255 163 -117 162 -161 99 -173 -178 -119 -123 -174 -100 179 23 -87 -204 -63 -145
2955a45o7o2K66M2m8k93L57l34L51k71M27l67O4J20m95K80j23K01k78K6M8K91
2977a0j26j42J40J37l59l25K17j2J30J22k67L09l4j9J64k56J72J37j25o3M4q0
2999b46N6m3J79m79M51j02M06n81N7K74j39P6j10M34o97O08m88M63l53K52L7J78
3021B33r4k81J70J36M9J24k13Nj83J05r3J10o2R8J39k3J60l42J59j90L86k55L1
3044A69K1j01O1J27j26J17R6n53R34m95j56J5K40k18R0J85j29J7l54J88L29m7
3066D10j92m6j08J01O0m55pL34k70J23o5J59l57J90J70j49l9P7j64L03l52J33
3088a44K66k08k37R4N13n07J7kj08R7m7O0M2j90K54k52LJ19k19J50J25l24J13
3111c85r2o7K08j74J45J22Q8k72N7j20K93L17l99j6J10nmO8j33J27q6k7q5K1J48
$$ plain form
2955 -145 -212 -274 -8 34 -14 -307 50 -284 67 -204 223 -144 -80 40 -455 -175 -298 -97 -375 -349 -301 -10
2977 -10 -136 -278 -138 -1 -360 -685 -468 -480 -350 -228 -495 -186 -220 -239 -75 -331 -159 -22 -147 -210 -166 -246
2999 -246 -190 -233 -54 -533 -82 -184 222 -359 -302 -28 -167 -91 -201 233 -464 144 -344 119 -234 18 55 233
3021 233 139 -142 28 164 213 337 124 129 -54 51 -42 68 6 104 243 220 380 38 197 7 393 138 169
3044 169 190 89 150 277 151 268 364 -189 745 250 94 109 349 131 221 406 277 294 -60 128 457 410
3066 410 218 172 64 165 225 -230 -237 97 -173 -50 -115 44 -313 -123 47 -102 -141 -64 -228 75 -277 -144
3088 -144 122 -86 -323 -229 284 -223 -206 -208 -316 -219 -266 -206 -164 -354 -100 -352 -349 -230 -449 -299 -174 -498 -385
3111 -385 -477 -544 -336 -510 -365 -243 -155 -427 -370 -490 -197 120 -279 -295 -185 -190 -194 -126 -259 -132 -218 -245 -330 -309 -161
3136a61l13K35K12J50l77J45L57j90j44k35R3J81l37L49k10JK4K07N4J1k34Q7
3158i5K45n96L66L8J9J22k90J86l67L58j24k5k02K64J07o9J03J36O8k14k58R6
3180a32o1N07l02K04n7n0K23k44k2l5j72K49j87j44L68q9k90J86J35J45k52P0
3202E0J62l54l7P9K48j2k03j21M33R6o21M11K50l57m65L17k8O9J71l11M26l02
3224i9r6oJ34J6K9j07M20j89R6k31m1L86q6J6j74m1n5j66L78j31j59J04J8k77
3248b61J49K36j86K54k32R0j77K13k22J01K51o7j44r3M49m04MP9k28J04K09kl2
3271I1L1Q8l18L48j31k45O19p81J52N6J98p6N7jJ29O5j68N0m4j94O1J99P9K3L9
3296C27k92m1J79M1OJ12M7k81K38l72K26o9J70l44J14K68n8J75k75J31p0l45M16
$$ plain form
3136 -161 -474 -239 -27 123 -254 -109 248 58 -86 -321 -228 -47 -384 -35 -245 -244 -220 -13 41 52 -182 -95
3158 -95 150 -446 -80 -42 -23 99 -191 -5 -372 -14 -138 -163 -365 -101 6 -63 40 176 244 30 -228 -132
3180 -132 -193 314 12 216 159 109 332 88 66 31 -141 108 -79 -223 145 56 -234 -48 87 232 -20 50
3202 50 212 -142 -179 -100 148 136 -67 -188 245 341 -280 131 381 24 -441 -124 -152 -83 88 -223 203 -99
3224 -99 -195 -201 -67 -51 -22 -129 291 102 198 -33 -74 312 226 242 68 27 -28 -194 184 53 -106 -2 16 -261
3248 -261 -112 124 -62 192 -40 50 -127 86 -136 -35 216 149 5 -88 361 -43 -39 40 -188 -84 125 123 91
3271 91 122 210 -108 240 109 -136 483 -298 -146 -90 108 32 89 88 217 282 114 164 120 -74 -13 186 265 288 327
3296 327 35 -6 173 214 220 332 379 98 336 -36 190 121 291 -53 61 329 271 446 171 302 232 -113 303
3319C03J06m69O0M35k62j15L47n7L9k54j06J8K3P0J38k49O47n22l42K02R2m8J9
3342G5n1O8n01K69M80l74q8q6L68j66R6k65J54j64n1M16k71J01j18J72j54kj63
3365b55J34J78n9k09K6L47l7n43L43p6N8l40L11M4N4m3k57K01l3J9k18K70P2k9
3389d2q6J99l49J00j08P8l0Q1M1M2k09J43j62O7K54k82L7LJ94l70M0K76k05l8
3413c26J86k81Qj0L41k33k65K10M0o7J26m36J27J63L75m87J83J84j04q8j61N41
3435B6l21Nr9l91O07r4J11j27j57K24q3j88J35p1l12O98l97K87k79K51k00L7j83
3458e21L5K08j46J03m8K24o40M90J23q6l77L25q7L0J71j4k31j5K48J21Rk99L09
3481f8Oj9j76K31l05K33j98J1K49r5R5l11N46n3o4K19l72m2K91Nk61J12j05j70
$$ plain form
3319 303 409 -60 0 435 173 58 405 348 387 133 27 45 68 138 276 27 674 152 -190 12 104 56 75
3342 75 24 92 -409 -140 340 -34 -122 -208 160 -6 90 -175 -21 -185 -236 180 -91 10 -108 64 -90 -92 -255
3365 -255 -121 57 -2 -211 -185 162 125 -418 -75 -151 -93 -433 -122 -78 -24 -67 -324 -123 -156 -137 -355 -85 -13 -42
3389 -42 -128 71 -278 -178 -286 -208 -238 -157 -116 -74 -283 -140 -302 -235 19 -263 -226 -223 -29 -399 -359 -83 -288 -326
3413 -326 -140 -421 -413 -423 -82 -315 -580 -370 -330 -397 -271 -707 -580 -417 -42 -529 -346 -162 -266 -354 -515 26
3435 26 -295 -290 -389 -780 -173 -267 -156 -283 -440 -216 -299 -487 -352 -423 -735 -37 -434 -147 -426 -175 -375 -338 -521
3458 -521 -486 -278 -424 -321 -369 -145 -785 -295 -172 -258 -635 -310 -397 -367 -196 -210 -441 -456 -208 -87 -78 -377 -68
3481 -68 -62 -81 -257 -26 -331 -98 -296 -285 -36 -131 -36 -347 199 146 82 301 -71 -113 178 183 -78 34 -71 -241
3505b41K82Q5j15L8j75L78k75P5k11J54N2k9K87l94J78k55N05k65l4K11l37K94
3527B08n0k20r5L74J70m99K85P9P5k43J32l5n3k10L30j71Q5j34J99J8p5j0N6j16
3551A00j97K27j59K61Q9k89K18K09op3j29j72J59k66K39J97l25P2l2R1j5k13Q5
3574G1K15q6l26M09N4n1k51k3j61J01J68o9K21l68qk0J25N8R3j85O0J96j04k54
3598a35K63k00J78k82K17L1k67J31k3J34l27J83n7K7P6k59j2J26Q6q6nK7j19p2
3622c65K5L17J83j82l12Q1j63Q1J73k52L25j19J12o0M6k42K0K43r3j03K97k42
3644b30K8o0J24j75K63j66nJ33n0L9j48J8j25M27o1Nl47L36k25O0J27J95l77k20
3668d34M90k14N4L10k35k8k35J83j24K97l51K95l78M63m20J62k44L47p0k0N18
$$ plain form
3505 -241 41 126 11 49 -126 252 -23 52 -159 -5 47 18 305 -89 89 -166 339 74 40 251 -86 208
3527 208 158 -62 -157 217 387 -112 173 252 327 84 216 181 128 -82 248 77 162 28 227 245 170 160 216 100
3551 100 -97 130 -29 232 321 32 250 459 453 380 251 79 238 -28 211 408 83 155 123 214 199 -14 71
3574 71 286 200 -126 283 337 286 35 12 -149 -48 120 51 272 -96 -104 -124 1 59 152 -33 27 223 119 -135
3598 -135 128 -72 106 -176 41 72 -195 -64 -87 47 -280 -97 -154 -127 -51 -310 -322 -196 -110 -196 -201 -174 -293 -365
3622 -365 -340 -23 160 -22 -334 -253 -416 -335 -162 -414 -89 -208 -96 -156 -110 -352 -332 -89 -182 -285 12 -230
3644 -230 -202 -262 -138 -313 -50 -216 -221 -88 -138 -99 -247 -229 -354 73 12 17 -330 6 -219 -159 -32 163 -214 -434
3668 -434 56 -158 -104 206 -29 -57 -292 -109 -233 64 -287 8 -370 93 -327 -165 -409 -62 -132 -152 366
3689C66k91j63l0L17k32j21RR5o1K40jM6k19l9q2J92j86K25j39J96l29Q7k62M39
3713E7o3j26P1k60J73M1o4L53j17K49l09P5j11k68M05n53M19J61j77J94k95J03
3735d2J72j28%l93L18k37j1R8K65p7p9Q8l3j17K05j13m3o4L04l81L40J97p3m32
3759b36O1K60p7j85Q7J90k4j96j18M01q6j3p7J40j8j80p7J55J02p7k10M03k43
3782a8K53n9k38L20m47J31M25j89J00k92L99k56J66j41pJJ73l11K36M2k25p4K59
3805B48J45m19r2L25J48j45k28M3p4N6J84j05K49l62K62k26J69J39N2j76k2k9
3827A42q5J84J03j98qj12K25j47K08j81K2j96j55J05j03K34J72j73j14J4P7J54
3849A68n8j28k55N04k31j40j49L34p3k54K81k06J85J39k72K00l38N04m37M1NP3
$$ plain form
3689 366 75 -88 -118 199 -33 -154 -145 -50 -111 129 128 174 -45 -84 -166 26 -160 65 -74 122 -207 -120 -382 57
3713 57 -6 -132 -61 -321 -148 -107 -171 182 65 314 5 80 -31 -299 106 -447 -28 133 -44 150 -145 -42
3735 -42 130 2 2 -391 -73 -310 -321 -223 42 -35 -114 -26 -59 -176 29 -84 -127 -191 113 -268 72 269 196 -236
3759 -236 -175 85 8 -177 -90 100 76 -120 -238 163 77 64 -13 127 109 -71 -148 7 109 32 -178 225 -18
3782 -18 235 176 -62 258 -189 -58 367 178 278 -14 385 129 295 154 147 148 321 10 246 288 63 -11 248
3805 248 393 -26 -118 207 355 210 -18 25 -49 7 191 86 335 -27 235 9 178 317 369 193 171 142
3827 142 57 241 344 146 138 26 251 104 312 131 153 -43 -198 -93 -196 38 210 37 -77 -63 14 168
3849 168 110 -18 -273 231 0 -140 -289 45 -28 -282 -1 -207 -22 117 -155 45 -293 211 -226 -185 -180 -107
3871a07k93M82j97k21M21j47J82l99M04m81L93k83J33m17J42J04L27k36K03L7
3891D7J33l60n6L22k49j13k7J53j94J2L03jj99P5j20N02k21j38m9Q4j01K37L2
3914G2o5j68n3o6Q4Q0M6j78L8J61J68n1J47l83R0r7P2J18j5M8k64K6K17l46L40
3939B1L2j47J09P6j54K09j09j7p4K54j56K11k40m3r2o6J42j52L29Qk35J09m5j35
3963a65jj06L39n8O6o4P1l18o1O49l99j69N70j69j77J53J6k12J26m87J25K65P
3986Ak36K80l18l4M11K13o65M24Q8k00l6P6M0j35L21l75j04K15k0p6R6j20L23
4009A69j51k08L31j84j48nJ94p5R0m4n2J80j29k4o5K2q5k5L50l83L04q1J32l54
4033b41k03L36j91K95j44K24j57m4K26l99M73k66L1o9J91k76L52j05Ok3R6q1j2
$$ plain form
3871 -107 -400 82 -115 -336 85 -62 120 -279 125 -356 37 -246 -113 -530 -388 -284 43 -193 10 47
3891 47 180 -180 -236 86 -163 -276 -303 -150 -344 -332 -29 -30 -229 -154 -274 228 7 -131 -180 -96 -197 40 72
3914 72 7 -161 -214 -280 -196 -116 -70 -248 -210 -49 119 68 215 -168 -78 -175 -103 15 0 48 -216 -190 27 -319 21
3939 21 53 -94 15 91 -63 146 37 20 -54 200 44 255 15 -28 -120 -186 -44 -196 133 141 -94 15 -30 -165
3963 -165 -166 -272 67 9 75 11 82 -236 -297 352 -47 -216 354 185 8 161 177 -35 91 -396 -271 -6 1
3986 1 -235 45 -273 -307 104 317 -348 76 164 -36 -72 4 44 -91 230 -145 -249 -34 -54 -130 -34 -154 169
4009 169 18 -190 141 -43 -191 -196 -2 -77 13 -31 -83 97 -32 -56 -121 -99 -184 -209 141 -242 62 -19 113 -241
4033 -241 -444 -108 -299 -4 -148 76 -81 -125 101 -298 175 -91 -60 -129 62 -214 138 33 39 16 112 31 19
4056A9N0r9K60j66k64L65j9Lj55k35K01J54K36l9k35Kj14K21k1K26p12K79L38
4079B95o01L33J16L6l03j10K9O3J62j84L06j5j3L2m15L14k7j73R5n10L77L98n1
4102A54k53l9K20k29j5n3K40k02P6Q9p3J2K6J8j02J75l36L0J31P2j63L1j33J15
4126b09N0k24J99R3k82J53o9K3J47K9N4j99j98q5J71K37j3j7l33J21J70k16O5
4149c33m2K61J07j56p1L89p2l09M3j41J72m8L1j09J90k55M09k98l4o4L05j40m
4172a69k20J99n1j90K50j27K71K51l69n2Q4m2K2K45k48R2M6n14K95J28Q4k60R6
4195a79K53j9k34J20p1q8L26j6j43m7p7K22j28J30k24M22j46q0j12r8L30J17k93
4218c5K1j79L52r2K09j49j52K29j21K5Q1p8m70K60k17J97o6R9p4Q8J24j61J58
$$ plain form
4056 19 69 -30 230 64 -200 165 146 149 -6 -241 -40 114 350 311 76 78 -36 185 164 390 -322 -43 295
4079 295 -306 27 143 179 -124 -234 -205 -142 20 -164 142 127 114 146 -269 45 18 -155 -60 -570 -193 205 154
4102 154 -99 -138 82 -147 -162 -215 25 -177 -101 -12 -85 -73 -47 -29 -131 44 -292 -262 -131 -59 -222 -191 -324 -209
4126 -209 -159 -383 -184 -91 -373 -220 -289 -266 -119 -90 -36 -235 -433 -518 -347 -110 -123 -140 -473 -352 -182 -398 -333
4149 -333 -375 -114 -7 -163 -234 155 83 -226 -183 -324 -152 -200 -169 -278 -88 -343 66 -232 -266 -330 -25 -165 -169
4172 -169 -389 -190 -241 -431 -181 -308 -37 214 -155 -207 -123 -165 -143 102 -146 -54 -8 -522 -227 -99 -15 -275 -179
4195 -179 74 55 -179 -59 -130 -218 108 92 -51 -98 -175 47 -81 49 -175 247 101 21 -91 -189 141 258 -35
4218 -35 -14 -193 159 67 276 127 -25 204 83 108 189 111 -359 -99 -316 -119 -185 -86 -160 -72 52 -109 49
4241D9n3J53j83rL62l62J51k41J06j94Q5j08K57K7q1n5J41l32L74J54l99K91O8
4264B01m0m58r7M64p1J73j39pk6P4j24j5K06k91p2k1L16k10k17L86k63L61m48
4287c18L15k60J15M1p7K65j87r1j06R7K36Kp5J71l02K54j4q6J78k35M0O3N0j31
4311e5J68m4K02j07k6j57O5j40O8J79o1k03K11m5q2j51J3O6K58l07Q7J13k21K70
4335A01j59lM28l84n8J41j24L35m64J91K01k46R5k15J41j03L93j92M07k97m94
4356c06L16J37k20o7K82j33K15r1r9k83K42k28L21M3k70m3O6K12J24k54k96M31
4378I9J05k82J07j6p4k67J28L36k67K15j19L17l99O1QOK40m71r0J39j54K87q0
4401a71j07L39l73J94K37l86K89l34J37k63N6K37n0r8J31o8j9oK54N0K0l40N8
$$ plain form
4241 49 -4 149 -34 -43 319 -43 108 -133 -27 -221 -136 -244 13 40 -41 -96 45 -287 87 241 -158 133 201
4264 201 161 -297 -394 70 -1 172 33 26 0 74 -50 -65 141 -150 -222 -243 73 -137 -354 32 -231 130 -318
4287 -318 -3 -263 -148 -107 -184 81 -106 -197 -303 -206 30 32 -43 128 -174 80 66 -20 158 -77 -37 26 76 -55
4311 -55 113 69 271 164 138 -19 46 -94 -26 153 92 -111 100 55 -27 -178 -165 -99 159 -148 -61 52 -169 101
4335 101 -58 -61 367 -17 -75 66 -58 277 -187 4 205 -41 54 -161 -20 -123 270 78 485 188 -306
4356 -306 10 147 -73 -140 142 9 224 133 34 -249 -7 -235 86 129 -141 -184 -118 94 218 -36 -332 99
4378 99 204 -78 29 13 -61 -328 -200 136 -131 84 -35 282 -117 -56 -48 -42 198 -273 -363 -224 -378 -91 -171
4401 -171 -278 61 -312 -118 119 -267 22 -312 -175 -438 -382 -145 -195 -293 -162 -230 -249 -255 -1 49 69 -271 -213
4424b13K52J01j17n0j4p2J74K05j13j13l0k11L89l03JKJ29k75K46l04L8R3r1L02
4448B6q5J07L4P4k27O1q7J01k87N90j72J79o25L27J16K16j08k56J11R3q2j80K00
4471A26k45J06q4K07L7k03jJ31k03K54k9J0j82J49n1J41j22K9j82j24M14k35K49
4494A92m92o9N88p9K13m55J8J54J02j63l5k3o6l0J75k8no2J74j09J80l74K09k21
4518b06n1M39j05K57m98m5O1rJ71p8O7lq8L12k95l4J94k19j83O4J86K57k93qJ8
4543h9O3j48K42L4k46J39Q3L3l44K64l44K37J88k70J38n7J2m0R7M6P2j44q9K3
4567a00O7l5l67K68J22m4L65l77l5K46n9P7l2j18K78k0n94N68q6J68j05k83J22
4590B6j27J66J07j33k7K87m27L14l72M02k08l6M38o61L77j62L9P8k72K87r8%q4
$$ plain form
4424 -213 39 140 23 -27 -41 -113 61 266 153 40 10 -201 188 -115 -114 -112 17 -258 -12 -316 -278 -185 -276 26
4448 26 -59 48 82 156 -71 -10 -97 4 -283 307 135 314 -311 16 132 348 240 -16 95 188 106 -74 126
4471 126 -119 -13 -97 110 147 -56 -57 74 -129 125 96 106 -76 73 22 163 41 70 -112 -236 178 -57 192
4494 192 -300 -369 219 140 353 -102 -84 70 172 9 -26 -49 -115 -145 30 2 -3 -65 109 0 180 -194 15 -206
4518 -206 -257 182 77 334 -164 -209 -148 -157 14 -64 3 0 -88 224 -71 -105 89 -130 -313 -249 -63 194 -99 -107 -89
4543 -89 -26 -174 68 102 -144 -5 78 111 -233 31 -313 -76 112 -158 -20 -77 -65 -105 -8 38 110 -34 -123 -100
4567 -100 -33 -68 -435 -167 -45 -89 276 -101 -136 110 51 128 96 -22 256 236 -358 210 124 292 187 -96 26
4590 26 -101 65 172 39 12 299 -128 186 -186 216 8 -28 410 -251 126 -36 3 81 -191 96 -2 -2 -86
4613h6J23r2J30jK4Jm5k5j49Q4m6K15j13r2K07L4Lk49L41k1r5k04L6M6K29m34
4639a79n0L48l65N36k34k18J83k49jm1M15l41L2J54k50K19J21j42k62o8L41J67
4661A16l43K48K3l03K56l6k87J25M3J91L4m52M00P6pk88J79k51L17q7K9l44L24
4684c7k56L01J08k70L25j94j41Q9j38M34k07r8mk39q4L36j38J88k16K29K21n13
4706c04K37m6P7o6K34j03l2k3j96O2J34j5l30J76J42O7k0J05J9j19k55M29l85
4729b12J57J28J12J42j83j32o1j61J11J14L0j73j08J90K8Pq1R4k31L91k32L24
4751B54j77j39q2j62N95o32M41j60J56j13m19N10l74J08J25J7K8j3j36k7K05N6
4773F1k9m22M21m7m26N63j08K72l55K03j49l10K33J83Jm43L22P3k48L12J04l26
$$ plain form
4613 -86 37 -55 75 74 98 99 54 29 -120 -36 -82 133 20 -72 135 169 172 -77 264 243 148 -56 -20 26 255 -179
4639 -179 -229 119 -246 290 56 -162 21 -228 -229 -270 145 -196 -164 -10 -260 -41 80 -62 -324 -392 -51 116
4661 116 -227 21 44 -259 -3 -39 -326 -201 -158 33 67 -385 15 91 84 -204 -25 -276 41 -46 -17 -361 -37
4684 -37 -293 8 116 -154 171 -23 -164 -75 -213 221 14 -84 -88 -327 -411 -75 -213 -25 -241 -12 209 -304
4706 -304 -67 -113 -36 -102 132 29 -3 -26 -222 -160 -26 -41 -371 -195 -53 14 -6 99 118 -1 -256 173 -212
4729 -212 -55 73 185 327 144 12 -49 -210 -99 15 45 -128 -236 -46 -18 -11 -92 2 -229 162 -70 254
4751 254 77 -62 -144 -306 289 -343 98 -62 94 -19 -438 72 -302 -194 -69 -52 -24 -37 -173 -200 5 61
4773 61 32 -390 31 -16 -442 121 13 285 -70 133 -16 -326 -93 90 91 -352 -30 43 -205 107 211 -115
4795a15j54N3J54R2o4K1q3J30j93m5M45l6j54k54M2R1L83o14K50J88k9k71K21
4818E8N5k83L6O6k92J13K73j68J8J58P3j24L0L8N8j09J9P1kpL0n6J0J47m08L0
4844a66K80n1J7j06Q3j70K77o3j38M7n0N0R8Q3m45L50r0l93K86k23J39K24rK00
4868B30ok55J53j32o5L01k41j0N3K44o5j23l20J06M9p1J83P5O8Ol38J44o4j29
4892b07K58ol5k4J24o6K3j5k49J43q2k79K30q1J50L9L06k23Jq4m8K47J08l42j00
4917b12J38R6R8m45L34j09L6L58l01k35L35j30j92J82j16K17k19J50L21m18l0
4938a42J09K46k52j83L17l19K3M29r5k5j80j06J12k55K96k16L19P7K0j63q9J30
4960E3j54j94M81j42Q2k1J20j65J26r0Q5j82j27K25P4j45mQ6J1r7RP7l19M0M35
$$ plain form
4795 -115 -269 -216 -62 30 -34 -13 -96 34 -159 -204 241 205 51 -203 -161 -70 313 -301 -51 137 108 -163 58
4818 58 113 -170 -134 -68 -360 -247 26 -142 -124 34 107 -17 13 51 109 0 19 90 88 81 111 55 65 212 -196 -166
4844 -166 114 63 80 -26 57 -113 164 101 -37 10 -40 10 108 191 -254 96 6 -387 -101 -324 -185 39 30 230
4868 230 224 -31 122 -10 -75 226 -15 -25 28 272 207 84 -236 -130 -81 -152 31 106 174 180 -158 -14 -78 -207
4892 -207 51 45 10 -14 110 44 67 52 -197 -54 -136 -415 -185 -266 -116 -77 229 6 7 -77 -125 122 230 -112 -212
4917 -212 -74 22 120 -325 9 -100 -64 294 -7 -242 93 -37 -229 -47 -163 54 -165 -15 306 -112 -142
4938 -142 -33 213 -39 -222 95 -224 -201 228 133 108 -72 -178 -66 -321 -25 -241 78 155 175 12 -77 53
4960 53 -101 -295 186 44 126 105 225 60 186 96 181 -1 -128 97 171 26 22 108 119 22 31 108 -211 -171 264
4985B64l86Q5L9P1qJ11j16j34J30kJ2p2k50J19K34k90J43j06j17N59k86J28P6
5008B04j68k39K72j92O1K70j40k95j5K75J15k82j70QM78j49k07J07QJ31l03j1
5030b42M78k99L2j4K13l51P2J4j69K05j10K69j90r2K20N7K71m06m6J5m9K6L95
5053B99o21O42m63J42j14J45j28rJ80k2l5j50J24k24K84j03K22k28o1J48J17k93
5075a48j31O28o68K57J04r3K09k88j6P8l1n0K43m2J87k0n62R7L28l46R1N54m74
5098i3rL92j74k53MN8N0j03J32m1M43n40J30J5K3j51K65p3J08l4j35k00K19J46
5122A79M6l57L16j47l8M8R7K9J7j67J44k39m2L86j23M5j63k29L16r6r1K6J2P0
5146C9k3k54P3L34l05k2O2J04M1K06j83j63J16j04kp2K3k2K81k04M8j01K27L7
$$ plain form
4985 264 -122 -37 2 73 65 176 60 -74 56 54 66 -6 -256 -137 97 -193 -50 -156 -273 286 0 128 204
5008 204 36 -203 69 -123 -62 208 68 -227 -242 33 148 -134 -304 -296 182 33 -174 -67 -59 72 -231 -242
5030 -242 236 -63 -31 -45 168 -183 -111 -97 -266 -61 -171 98 -92 -184 36 93 364 -42 -88 -73 -122 -96 299
5053 299 -322 320 -143 -1 -115 30 -98 -107 73 51 16 -134 -10 -234 50 -53 169 -59 -120 28 145 -148
5075 -148 -279 349 -319 -62 42 -51 158 -130 -146 -68 -99 -149 94 52 239 219 -343 -246 82 -264 -173 381 -93
5098 -93 -102 290 116 -137 -133 -75 -25 -128 4 -37 406 -134 -4 11 34 -117 148 75 183 149 14 -186 33 179
5122 179 225 -132 184 37 -1 47 144 173 190 23 167 -72 -114 272 149 194 31 -198 118 22 -69 -43 -31 39
5146 39 16 -238 -165 169 -136 -158 -96 8 49 255 72 -91 25 -79 -81 -153 -130 -152 129 -75 -27 -128 99 136
5170A36l71K41L37l63l3m2P7N3nkr6j46J18J01j16k7j33M53k44q2n5M09l2j84
5194fj0n7J51o6%k73j2N00L0q7j91L5j23j07J70J27J17L02n14J46p7J0N5j28L1
5219B3J19m7q3K0N3J23k44j54M1J58k06J25m6L60K08m87q2J19l4K37l40J75j21
5242h3K52k27J8j08K86N4j76J30j42O4m1j80q5Q5J49K00j17j88M00j85k95K35
5264D6k16K99l03J03K93l44qL44k45O0k07p1P5J71k49K47N2l3M2K0j61j27J66
5287d6j02K6N1j03Q2J55k96K09L3R6k99K93p0Q1k67P6J02P9j18k40J10K18j00
5310c0l15K68k97L90j3J0j05k57L38m6K2p0O0j14K40r4lJ08J28l17J65K0m7j84
5334a43L32k20Q8m32M02m47L59K22k27J5m1K32Q1j39j85J41J08L0J56l11L6j64
$$ plain form
5170 136 -235 6 343 -20 -53 -95 -18 35 30 28 -68 -214 -96 5 -111 -138 -271 182 -62 -144 -199 210 178 -6
5194 -6 -16 -73 78 12 12 -261 -273 227 257 170 -21 14 -109 -216 -46 81 198 500 -14 132 55 65 120 -8 23
5219 23 142 95 12 32 85 208 -36 -190 -149 9 -197 -72 -118 242 450 -37 -119 0 -34 203 -137 38 -83
5242 -83 169 -58 -40 -148 138 192 16 146 4 68 27 -153 -238 -153 -4 196 79 -109 291 106 -189 46
5264 46 -170 129 -174 -71 222 -122 -130 214 -31 29 -178 -249 -174 -3 -252 -5 47 14 56 76 -85 -212 -46
5287 -46 -148 -122 -71 -174 -92 63 -233 -24 9 105 -194 99 29 110 -157 -81 21 100 -18 -258 -148 70 -30
5310 -30 -345 -77 -374 16 3 13 -92 -349 -11 -57 -35 -105 -45 -159 81 -13 -16 92 220 -97 68 88 41 -143
5334 -143 189 -31 57 -375 27 -420 -61 161 -66 -51 -92 140 221 82 -103 38 146 176 332 21 57 -107
5356a07O3N7qK2J81k8l64M38p03O5K97J85q2P3o6M2Q2j96R6J72l29k8M08j53O4
5381A81j19j66k2j27J78Q6j53K56j20j91L80O3j86J21l11K88p7k70k2L17j40n3
5403h7k6J79j2l49J66L10l18N7P3j8j65l1K80j71j1J85l37J63Q2J58j62m8j57
5426b39J95K19p2J28j63o0P4M4P4m23M10j47J12k26L5k36J2O43j89j67J01k21
5448i6K12j43J3J3k04K2J24L23l57k2K54q4q0L14j00m08J22K20j17M1k48K86P
5471I2k27RL64r2k25K05Q2m06J35l13M16J07j9J5q0J29n5q0n43N98k36K16r4p7
5495g9M06l50m13L60r2J19k8pj04J78n0l0p3K16j37J5M7J48o7k89J77K45N0l77
5519a35k02P3R0L73l82Q8J6p9L26o2j10oJ63k35j34K8j34L79p4M1j98j11L71j01
$$ plain form
5356 -107 -44 13 5 27 208 180 -184 254 -449 -384 -87 98 16 89 23 65 147 -49 47 219 -110 -138 270 117 181
5381 181 62 -104 -126 -253 -75 11 -142 114 -6 -197 183 246 60 181 -130 158 81 -189 -211 106 -34 -87
5403 -87 -113 66 54 -295 -129 181 -137 -80 -7 -25 -190 -221 59 -112 -123 62 -275 -112 -30 128 -34 -82 -239
5426 -239 -44 175 103 231 68 8 82 126 200 -223 187 40 152 -74 -39 -275 -263 380 191 24 125 -96
5448 -96 116 -27 -14 -1 -205 -183 -59 264 -93 -115 139 55 -25 289 189 -219 -97 123 6 47 -201 85 92
5471 92 -135 -126 238 146 -79 126 208 -198 -63 -376 40 147 128 143 63 192 137 57 -486 112 -124 92 -2 -79
5495 -79 327 -23 -436 -76 -168 -49 -77 -84 -188 -10 -60 -90 -163 53 -84 -69 -22 126 59 -230 -53 192 242 -135
5519 -135 -337 -264 -174 199 -183 -95 -79 -158 168 106 -4 -10 153 -82 -216 -188 -322 57 -17 24 -174 -285 86 -15
5543a5J10r0j82o5L66k8J86l55J50j55M04o00M32k22rk8j94K33J34k28oO0p3K04
5567B9M7M8N5n7l14J05J29Qj20j87J62k82L60n1K0L25m93J61k07J17K38j56M0
5590b3M6K8Jj70J15J10j82m6J63Q3j50L26l62M84p44M66J4j81J57p1j63K53l21
5613a67K55n9j81R2L9J57k64L42j41j45j17J03j1J42J90l97L31P0j62R0p24L65
5635a92K09J44Q2o36L77J39j83J14r4J08j08J30J9j86K21j49P8K3j00j95J4N08
5657C23n02J91j82L66l59J27L15n95M07k83K21k39L38n98L81J51j78j28J69P1
5677do8J63o4j20J84j27pj17J26j14J29jj85L95l45KJ88J9l9J18m53M87k1j07
5701C9k43j41K76LJ95k00Jm5J63N7l77O03m04r1J35J55j39j8J00J38k18J45l08
$$ plain form
5543 -15 95 5 -177 -242 124 96 282 -73 77 -78 326 -274 158 -64 -73 -101 -295 -62 72 -156 -162 -102 -175 29
5567 29 76 124 179 122 -192 -87 42 50 -70 -257 -95 -377 -17 -68 -48 277 -216 -55 -262 -145 93 -63 -23
5590 -23 23 51 52 -118 -3 107 -75 -121 42 125 -25 301 -61 423 -321 145 159 -22 135 64 -99 154 -167
5613 -167 88 29 -152 -60 -21 136 -128 214 73 -72 -189 -86 -97 45 235 -162 169 239 77 167 -557 -192
5635 -192 17 161 243 -393 -16 123 -60 54 -40 68 -40 90 109 -77 144 -5 73 96 -4 -199 -185 323
5657 323 -179 12 -170 196 -163 -36 279 -316 91 -192 29 -210 128 -470 -89 62 -116 -244 -75 -4
5677 -4 -72 91 27 -93 91 -36 -43 -160 -34 -148 -19 -20 -205 190 -155 -153 35 54 15 133 -320 167 146 39
5701 39 -204 -345 -69 -66 129 -71 -70 -115 48 105 -272 331 -73 -164 -29 126 -13 -31 69 207 -11 134 -174
5724a74J14j64L50j94L74k00m60L70p5j06L98l7k66j0k8K09j12j65MJ11O2n1Q8
5747C8k60J31K79k41Ol1J09J96n58L36J35j20J43j5Nj23j54K06K42k88Q0m38M76
5770A54j99p9K57p4L04n61K68k36P6R9m1J84l93K16m54M54j19J41r7j45J28J8
5792i9k11O03o34K32j47L70k36p3R1k14K93q3K19k09K43l58j7N6K15N5j03j91
5814a98K23k23J54L07l29J42K0n6q0p0J39n0k24L8P9j2K14k25N32k18m01M06j67
5837Am3L50k17k42K23p0j03k63J23M61J2Q9l67j46Q3L4m9j15K10l0M5J85r7j91
5861a17K00M9P8l61K10n6l14L19Q4m0L1q0k16J15J62Rr7J20Q3j85j14j2K18K7
5885A13o2J28j28k76K69J49j25l8J29j43j20k85L89L80l81j45j5K58k38L24m71
$$ plain form
5724 -174 -60 -224 126 -68 306 106 -354 16 -59 -165 233 196 -70 -80 -108 101 -11 -176 -172 -61 1 -50 38
5747 38 -222 -91 188 -53 -47 -78 31 227 -331 5 140 20 163 148 153 30 -124 82 324 36 116 -322 154
5770 154 -45 -124 133 59 363 -198 70 -166 -90 9 -32 152 -241 -25 -479 -25 -144 -3 -100 -245 -117 -99
5792 -99 -310 293 -341 -109 -256 114 -122 -195 -104 -318 -25 -108 111 -98 145 -213 -230 -174 41 96 -7 -198
5814 -198 25 -198 -44 263 -66 76 96 40 -40 -110 29 -21 -245 -207 -128 -140 74 -151 381 163 -238 168 1
5837 1 -42 308 91 -151 72 2 -101 -364 -241 220 232 321 -46 -192 -109 -75 -124 -239 -29 -59 -14 171 74 -117
5861 -117 83 132 210 -151 59 3 -311 8 92 52 83 3 -213 -98 64 73 -24 96 179 -6 -120 -132 86 113
5885 113 51 179 51 -225 44 193 68 30 159 16 -104 -389 0 380 -1 -146 -161 97 -141 183 -288
5906b88L58Q0k15K23k39R6L40o34K59k92L99l30J51K40l36O5q3J50j16L67k29
5927c4j2J69l56L86Lj97k70L94j83J59MO8k22R7pk29K83J65r9k99K79p6K22n09
5951b64K09K1j30N2J4K42q8J%k02J54j95L35l67K23k3m05L46J54lK65k98J01K45
5975C87j80J2n16j8L38K22k41o1K78m46J00K69k09J03P3j78q8J18J3R4k5O9l6
5998G8k43J90Q7j25J25j31J74j82j77J30K55n1n8j02K26kl75k1q0K59m98N84l9
6021B4J97j3l50J55o1R8q9r3J12K67O2j39j81R9k42P7J80P9j07l26K99m4M62j80
6045B86l78L10k27K40j26J59l10P3r3K46k88J01N8O0j8m6n0J54J23o63J97J32
6067f0KJ62j80J49k74J08K4l8J5j97M40k79R2q3K1J68k27j04J30K78q8M7l48J88
$$ plain form
5906 -288 70 150 -65 158 -81 15 355 -279 -20 -312 87 -243 -92 148 -188 -123 -206 -56 -172 195 -34
5927 -34 -46 123 -233 153 156 -41 -311 83 -100 59 63 131 -91 6 -1 -230 53 218 119 -180 99 23 245 -264
5951 -264 -55 -34 -164 -112 -98 144 56 57 57 -145 9 -186 149 -218 5 -18 -423 -77 77 74 339 41 142 387
5975 387 207 219 -297 -315 23 245 4 -57 221 -225 -125 144 -65 38 111 -67 -155 -37 -24 70 45 114 78
5998 78 -165 25 112 -13 112 -19 155 -27 -204 -74 181 130 72 -30 196 194 -181 -202 -282 -23 -521 63 24
6021 24 221 208 -142 13 -48 50 -39 -132 -20 247 309 170 -11 88 -154 -77 103 182 75 -251 48 4 466 286
6045 286 -92 218 -9 231 105 264 -46 27 -66 180 -108 -7 51 111 93 47 -3 151 274 -389 -192 -60
6067 -60 -58 104 -76 73 -201 -93 -69 -107 -92 -289 151 -128 -36 -119 -98 70 -157 -261 -131 147 59 106 -242 -54
$$ [...]
8191a26
##END NTUPLES=NMR FID
##END=
