##TITLE=1H_SAV-58(f4)
 CDCl3, 8 sc, 
 26.2.2020
##JCAMPDX= 6.0         $$ Bruker NMR JCAMP-DX V2.0
##DATA TYPE= NMR FID
##DATA CLASS= NTUPLES
##ORIGIN= UXNMR, Bruker Analytische Messtechnik GmbH
##OWNER= root
$$ XWIN-NMR		Version 3.5
$$ Wed Feb 26 14:01:27 2020 Russian Standard Time (UT+4h)  she@DPX200
##.OBSERVE FREQUENCY= 200.1315
##.OBSERVE NUCLEUS= ^1H
##.DELAY= (6, 6)
##.ACQUISITION MODE= SIMULTANEOUS
##.ACQUISITION SCHEME= undefined
##.AVERAGES= 8
##.DIGITISER RES= 18
##SPECTROMETER/DATA SYSTEM= spect
##.PULSE SEQUENCE= zg30
##.SOLVENT NAME= CDCl3
##.SHIFT REFERENCE= (INTERNAL, CDCl3, 0, 15.7039)
##AUDIT TRAIL= $$ (NUMBER, WHEN, WHO, WHERE, WHAT)
$$ ##TITLE= Audit trail, XWIN-NMR		Version 3.5
$$ ##JCAMPDX= 5.01
$$ ##ORIGIN= Bruker BioSpin GmbH
$$ ##OWNER= she
$$ F:/spectra/data/she/nmr/H-F/1/audita.txt
$$ ##AUDIT TRAIL=  $$ (NUMBER, WHEN, WHO, WHERE, WHAT)
(   1,<2020-02-26 14:00:31.53 +0400>,<she>,<DPX200>,
      <created by zg, POWCHK disabled, PULCHK disabled
       configuration hash MD5:
       00 E9 B6 7A A2 85 ED C7 34 08 36 98 17 FE 4E 26
       data hash MD5: 16K
       C2 1C 85 0C 82 9B EB 78 36 1B FC 13 DE A0 EE BF>)
$$ ##END=
$$ 
$$ hash MD5
$$ 26 1C 8C C5 B6 88 EE 86 69 93 9C BD 0C 10 34 B8
##$RELAX= 
##$RELAX= 
##$RELAX= 
##$RELAX= 
##$RELAX= 
##$RELAX= 
$$ Bruker specific parameters
$$ --------------------------
##$DU= <F:/spectra>
##$EXPNO= 1
##$NAME= <H-F>
##$PROCNO= 1
##$TYPE= <nmr>
##$USER= <she>
##$AMP= (0..31)
100 100 100 100 100 100 100 100 100 100 100 100 100 100 100 100 100 100 
100 100 100 100 100 100 100 100 100 100 100 100 100 100 
##$AQSEQ= 0
##$AQ_mod= 1
##$AUNM= <au_zg>
##$AUTOPOS= <>
##$BF1= 200.13
##$BF2= 200.13
##$BF3= 200.13
##$BF4= 200.13
##$BF5= 200.13
##$BF6= 200.13
##$BF7= 200.13
##$BF8= 200.13
##$BYTORDA= 1
##$CFDGTYP= 0
##$CFRGTYP= 5
##$CHEMSTR= <none>
##$CNST= (0..31)
1 1 145 1 1 1 1 1 1 1 1 1 1 1 1 1 1 1 1 1 1 1 1 1 1 1 1 1 1 1 1 1 
##$CPDPRG= <>
##$CPDPRG1= <>
##$CPDPRG2= <>
##$CPDPRG3= <>
##$CPDPRG4= <mlev>
##$CPDPRG5= <mlev>
##$CPDPRG6= <mlev>
##$CPDPRG7= <mlev>
##$CPDPRG8= <mlev>
##$CPDPRGB= <>
##$CPDPRGT= <>
##$D= (0..31)
0 1.2 0 0 0 0 0 0 0 0.06 0 0.03 0 0 0 0 0.0002 0 0 0 0 0 0 0 0 0 0 0 0 
0 0 0 
##$DATE= 1582711230
##$DBL= (0..7)
120 120 120 120 120 120 120 120 
##$DBP= (0..7)
150 150 150 150 150 150 150 150 
##$DBP07= 0
##$DBPNAM0= <>
##$DBPNAM1= <>
##$DBPNAM2= <>
##$DBPNAM3= <>
##$DBPNAM4= <>
##$DBPNAM5= <>
##$DBPNAM6= <>
##$DBPNAM7= <>
##$DBPOAL= (0..7)
0.5 0.5 0.5 0.5 0.5 0.5 0.5 0.5 
##$DBPOFFS= (0..7)
0 0 0 0 0 0 0 0 
##$DE= 6
##$DECBNUC= <off>
##$DECIM= 24
##$DECNUC= <off>
##$DECSTAT= 4
##$DIGMOD= 1
##$DIGTYP= 9
##$DL= (0..7)
0 120 120 120 120 120 120 120 
##$DP= (0..7)
150 150 150 150 150 150 150 150 
##$DP07= 0
##$DPNAME0= <>
##$DPNAME1= <>
##$DPNAME2= <>
##$DPNAME3= <>
##$DPNAME4= <>
##$DPNAME5= <>
##$DPNAME6= <>
##$DPNAME7= <>
##$DPOAL= (0..7)
0.5 0.5 0.5 0.5 0.5 0.5 0.5 0.5 
##$DPOFFS= (0..7)
0 0 0 0 0 0 0 0 
##$DQDMODE= 0
##$DR= 18
##$DS= 0
##$DSLIST= <SSSSSSSSSSSSSSS>
$$ [...]
##$SUBNAM2= <"">
##$SUBNAM3= <"">
##$SUBNAM4= <"">
##$SUBNAM5= <"">
##$SUBNAM6= <"">
##$SUBNAM7= <"">
##$SUBNAM8= <"">
##$SUBNAM9= <"">
##$SW= 24.9337058887773
##$SWIBOX= (0..15)
0 0 2 0 0 0 0 0 0 0 0 0 0 0 0 0 
##$SW_h= 4990.01996007984
##$TD= 16384
##$TD0= 1
##$TE= 0
##$TE2= 300
##$TE3= 300
##$TEG= 300
##$TL= (0..7)
0 120 120 120 120 120 120 120 
##$TP= (0..7)
150 150 150 150 150 150 150 150 
##$TP07= 0
##$TPNAME0= <>
##$TPNAME1= <>
##$TPNAME2= <>
##$TPNAME3= <>
##$TPNAME4= <>
##$TPNAME5= <>
##$TPNAME6= <>
##$TPNAME7= <>
##$TPOAL= (0..7)
0.5 0.5 0.5 0.5 0.5 0.5 0.5 0.5 
##$TPOFFS= (0..7)
0 0 0 0 0 0 0 0 
##$TUNHIN= 0
##$TUNHOUT= 0
##$TUNXOUT= 0
##$USERA1= <user>
##$USERA2= <user>
##$USERA3= <user>
##$USERA4= <user>
##$USERA5= <user>
##$V9= 5
##$VALIST= <valist>
##$VCLIST= <CCCCCCCCCCCCCCC>
##$VD= 0
##$VDLIST= <DDDDDDDDDDDDDDD>
##$VPLIST= <PPPPPPPPPPPPPPP>
##$VTLIST= <TTTTTTTTTTTTTTT>
##$WBST= 1024
##$WBSW= 4
##$XGAIN= (0..3)
0 0 0 0 
##$XL= 0
##$YL= 0
##$YMAX_a= 207784
##$YMIN_a= -102916
##$ZGOPTNS= <>
##$ZL1= 120
##$ZL2= 120
##$ZL3= 120
##$ZL4= 120
##$ABSF1= 10
##$ABSF2= 0
##$ABSG= 5
##$ABSL= 3
##$ALPHA= 0
##$AQORDER= 0
##$ASSFAC= 0
##$ASSFACI= 0
##$ASSFACX= 0
##$ASSWID= 0
##$AUNMP= <proc_1d>
##$AZFE= 0.1
##$AZFW= 0.1
##$BCFW= 1
##$BC_mod= 2
##$BYTORDP= 1
##$COROFFS= 0
##$CY= 11.3945322036743
##$DATMOD= 1
##$DC= 2
##$DFILT= <>
##$DTYPP= 0
##$F1P= 16.9975609425685
##$F2P= -3.02152046262296
##$FCOR= 0.5
##$FTSIZE= 0
##$FT_mod= 4
##$GAMMA= 1
##$GB= 0.15
##$INTBC= 1
##$INTSCL= 1
##$ISEN= 128
##$LB= 0.24
##$LEV0= 0
##$LPBIN= 0
##$MAXI= 10000
##$MC2= 0
##$MEAN= 0
##$ME_mod= 0
##$MI= 1.114404
##$NCOEF= 0
##$NC_proc= 0
##$NLEV= 6
##$NOISF1= 3.799351
##$NOISF2= 2.8
##$NSP= 1
##$NTH_PI= 0
##$NZP= 0
##$OFFSET= 15.70392
##$PC= 1
##$PHC0= -9784.357
##$PHC1= 7.40082
##$PH_mod= 1
##$PKNL= yes
##$PPARMOD= 0
##$PSCAL= 0
##$PSIGN= 0
##$REVERSE= no
##$SF= 200.130013532006
##$SI= 16384
##$SIGF1= 3
##$SIGF2= 2
##$SINO= 400
##$SIOLD= 16384
##$SREGLST= <1H.CDCl3>
##$SSB= 0
##$STSI= 0
##$STSR= 0
##$SW_p= 3612.71676300578
##$SYMM= 0
##$S_DEV= 0
##$TDeff= 0
##$TDoff= 0
##$TI= <>
##$TILT= no
##$TM1= 0
##$TM2= 0
##$TOPLEV= 0
##$USERP1= <user>
##$USERP2= <user>
##$USERP3= <user>
##$USERP4= <user>
##$USERP5= <user>
##$WDW= 1
##$XDIM= 8192
##$YMAX_p= 0
##$YMIN_p= 0
$$ End of Bruker specific parameters
$$ ---------------------------------
##NTUPLES= NMR FID
##VAR_NAME=  TIME,          FID/REAL,        FID/IMAG
##SYMBOL=    X,             R,               I
##VAR_TYPE=  INDEPENDENT,   DEPENDENT,       DEPENDENT
##VAR_FORM=  AFFN,          ASDF,            ASDF
##VAR_DIM=   8192,          8192,            8192
##UNITS=     SECONDS,       ARBITRARY UNITS, ARBITRARY UNITS
##FACTOR=    0.0002004,     1,               1
##FIRST=     0,             0,               0
##LAST=      1.6414764,     0,               0
##MIN=       0,             -102916,         0
##MAX=       1.6414764,     207784,          0
$$ Real data points
##PAGE= N=1
##DATA TABLE= (X++(R..R)), XYDATA
$$ [...]
2213b213N97K055M05j424q53N13R35O28o23j086l62K296R05j753j718J083K629
2230B014l94k909l85K785J079k191j691R22J994o83j485q18J395R99n08j331n03
2247a710J046J190p2k030n97K094J397j715j913Q24K742O7j912j387J696J972
2263A692n86j838J80J185J044p31j192l7J187R51j124j276K01J833L73j950j452
2280a540J636J740r77k036m58J881J299j426j791M93K026Q4j506j348J304J580
2296I61j26j472j024J230J638k11k190J85J724J232q89j799J88K197P28j710j391
2313g29J058J948n41j787m97J663O25m10j745j20J556J75j003j497N34J621J02
2330I53j584j531R73K134k15k188n92J695J851j660j731K85J892O82j316r53M40
$$ plain form
2213 -2213 -1616 439 844 -580 -1433 -920 15 643 20 -1066 -1428 868 1773 20 -1698 -615 2014
2230 2014 1620 -1289 -1674 1111 2190 -1 -1692 -770 1224 541 -944 -1762 -367 632 124 -1207 -1710
2247 -1710 -664 526 454 -1576 -2173 -79 1318 -397 -2310 -1486 1256 1323 -589 -1976 -280 1692
2263 1692 1106 -732 -552 633 1677 946 -246 -283 904 1855 731 -545 -344 1489 1862 -88 -1540
2280 -1540 96 1836 859 -1177 -1635 246 1545 119 -1672 -1179 847 931 -575 -1923 -619 961
2296 961 835 -637 -1661 -431 1207 996 -1194 -1009 715 1947 1058 -741 -553 1644 2372 662 -729
2313 -729 329 2277 1736 -51 -548 1115 1740 1330 -415 -535 1021 1196 193 -1304 -770 851 953
2330 953 -631 -2162 -1189 945 730 -1458 -2050 -355 1496 -164 -1895 -1610 282 964 -352 -1305 -865
2347h65J754j37j383l63P88J432l60j280n88J040J527r91j523K57J153J190k036
2364c85r65Q16J922n15j896o70J561R33q59j360N8J269J185j282j585L52J866
2381D45P34j627j664R17K142M82k312q06J618J347q37j523N4J583O28j480q44
2398a143O79J196Qj250o83J003J076k76j685K0J247J333j324j419R8K087L79j344
2416Bj364P21J976k8j707o50J237J472p53j467m49J546J252j035j456J53J688
2433A138O13j343j285P34J584l14j344m80P86J356o20j679K05J276Q15r41j720
2450a219P30J487P5j445q58J001J697p45j214p39J209J035p23j134k8J224Q09
2467A162j045j532N35J854P8j330j087J008J815p69j809l67J848Q85j117j411
$$ plain form
2347 -865 889 752 -631 -994 -206 1226 866 -414 -1002 38 1565 574 -949 -692 461 1651 -385
2364 -385 -1350 -534 1388 873 -1023 -1693 -132 801 -58 -1418 -1360 -91 1094 -188 -1773 -1421 445
2381 445 1179 -448 -2112 -1195 947 1429 -883 -1689 -71 1276 439 -1084 -1030 553 1181 -299 -1143
2398 -1143 -464 732 740 -510 -1193 -190 886 610 -1075 -1055 192 1525 201 -1218 -1120 967 1346 2
2416 2 -1362 -641 1335 1307 -400 -1050 187 1659 906 -561 -1010 536 1788 753 -703 -550 1138
2433 1138 1751 408 -877 -143 1441 1127 -217 -697 89 1445 825 -854 -649 627 1442 501 -1219
2450 -1219 -489 998 1073 -372 -1230 -229 1468 723 -491 -1230 -21 1014 291 -843 -871 353 1162
2467 1162 117 -1415 -880 974 1052 -278 -1365 -357 1458 689 -1120 -1487 361 1246 129 -1282
2483a282P51J044L90r02r66J76J341M62j427q48J051J232j31j973l21J869N87
2500A053j291j328N81J671Lj662q07Q46J483m3j057o57N47J163P4j384n26R95
2518c39J493r93j603M66J973K07j593r16J522J240n86j508J76J176L79n68q50
2535c24k89J107M04m63j072pJ608M93j894j050J498J587q65j815j57J897R15j422
2553A51j370Q22J044L75o86q43M7J063N21o60j312M68J787J47j974m60J619J045
2571A784j456j429R59J204j35j582j70J088R30n45j017j12M58J246n23j119r92
2588a411J229J623o10k132K09K096L88k048r30J433J398r71j451M31Q76N49n09
2605A70r26L23N45P29o93r36k40J597M83j490j394J402J675o25j983J79J623N42
$$ plain form
2483 -1282 -531 513 903 1 -965 -789 552 1014 -413 -1261 -210 1022 891 -1082 -1403 466 1053
2500 1053 -238 -1566 -985 686 689 -973 -1780 -934 549 506 -551 -1208 -661 502 576 -808 -1334 -339
2518 -339 1154 161 -1442 -976 997 1204 -389 -1305 217 1457 871 -637 -461 715 1094 526 -324
2535 -324 -613 494 898 435 -637 -644 964 1457 -437 -1487 11 1598 733 -1082 -1239 658 1573 151
2553 151 -1219 -397 647 1022 336 -507 -460 603 1124 464 -848 -380 1407 1554 -420 -880 739 1784
2571 1784 328 -1101 -142 1062 927 -655 -825 263 1193 648 -369 -481 -23 1223 700 -419 -1411
2588 -1411 -182 1441 831 -1301 -1092 1004 1392 -656 -1586 -153 1245 274 -1177 -746 130 679 170
2605 170 -756 -433 112 841 148 -788 -1028 569 1052 -438 -1832 -430 1245 620 -1363 -1184 439 981
2623I81j249p91O22J076l11p02j19l96J016M70r36p80L09J263N79j892r13J634
2641a39J330j377j295Q49J660q6j581m34J023O33l25o38k32M61J073m86p58q91
2659a213J189J415o37k047L39J669O98j770r38J445J196q27j497L10J274J88o67
2676A27m62p4N60O12l57j016j27J501N50r40j425P95J896o12j622R4J081R79j315
2695B45j013M60J004J79o76m55K82P04J15p76j042M85J443o8j652l14J083J186
2713A190p87j741O34J375J15j212n29O60R51j50o89o10N51R60j25p62p97J438
2731D72R14j155j669P95J462L69j669p16R70J001k59j457N4P72P36m53r03k13
2749i49R21P48q35j161L81J284M98j454r67J271J465n68j501M1J099M44n39r58
$$ plain form
2623 981 -268 -1059 -437 639 328 -374 -493 -889 127 597 -339 -1119 -810 453 1032 -860 -1773 -139
2641 -139 1191 -186 -1481 -632 1028 942 -639 -1073 -50 583 258 -380 -612 -151 922 436 -322 -1213
2659 -1213 -24 1391 754 -1293 -954 715 1413 -357 -1295 150 1346 519 -978 -668 606 794 127
2676 127 -335 -409 151 763 406 -610 -737 764 1314 374 -1051 -256 1640 1028 -594 -500 581 1560 245
2695 245 -768 -308 696 875 199 -256 26 730 845 69 -973 -488 955 887 -765 -1079 4 1190
2713 1190 403 -1338 -704 671 786 -426 -955 -295 656 506 -183 -793 -242 718 593 -169 -966 472
2731 472 1386 231 -1438 -643 819 1188 -481 -1197 -227 774 515 -942 -888 -116 620 167 -736 -949
2749 -949 -28 720 -115 -1276 -895 389 887 -567 -1534 -263 1202 634 -867 -826 273 717 178 -780
2767g80J08J051J84k69q74K1J075L16q00r83M30J378j45j498n65K098L24r85j377
2786a291Q52J492j96j450j88M57O94K98p47o40O53R80k93j092o26J329J087j072
2804B47j469O06J830p5j374q73J352R44m18j186J78P30M06k24q98j34O46O22l35
2823E75j101m4J393M78j501o44J329P24o89j300J30J474L04r06j058J61J061J64
2841E50p27l50J6Q76N21j023r90Q27J315m61r08o51J473P24j059j170L81J627
2859I71o20o11n23O74P49k14q32k71O90P66m13j427O4J008J082r21j694N63J598
2878F39O4j646n76J048J177o08p20k01N89R78p08o05n31J060O55n62q68L24P69
2897B78M35j165p60J198J008p43r38j32R25O36p57q81K72J165k1o37n54RJ212
$$ plain form
2767 -780 -672 379 563 294 -580 -559 516 832 32 -951 -521 857 712 -786 -1351 747 1071 86 -1291
2786 -1291 -439 1053 857 -593 -781 -324 370 668 -79 -719 -66 914 621 -471 -1097 232 1319 247
2804 247 -1222 -616 1214 1139 -235 -1108 244 1188 770 -416 -238 492 898 674 -224 -358 288 910 575
2823 575 -526 -570 823 1301 -200 -844 485 1209 520 -780 -650 824 1128 222 -836 -675 386 550
2841 550 -177 -527 -511 365 886 -137 -1127 -300 1015 554 -354 -1005 468 1192 133 -1037 -656 971
2859 971 351 -260 -783 -109 640 426 -406 -677 13 779 366 -1061 -997 11 1093 172 -1522 -959 639
2878 639 703 -943 -1519 -471 706 98 -622 -823 -234 744 36 -569 -1100 -40 615 53 -815 -491 278
2897 278 713 -452 -1212 -14 994 251 -687 -819 106 742 -15 -896 -624 541 520 -117 -671 -662 550
2916E50J49j044o48P31R98k65j343O8R43N48m28j120K23J364J47j065m64M31P49
2935E24K79q52m66R39L00J44j032l26J007N91o56j022M14J109N11j671n38P52
2953GR29o12q22k45J070N01n20q83k68R02J009j038j050M51Q81L67q73q14R27
2972h1O72l85j057K66P78N78l58q73J72Q00J47o16n40K85P95N5r52n9N45N86k40
2993E18j190K47Q61J42o07p19J34J241j5j170n19N21J254k95r61n01P00O83m92
3012a68n75j45J089N67r72q33M71O64O58j038n30O93O80j0j083k58J117M51n12
3031B66p57L1J034K70p63n27M24P86j78r56o81R29O23k23q24l50Q13R06m41j211
3051h29l0J019O08r90o74N99Q52k8n12m96L71Q43q5r06K34M32O16o85j17l13Q93
$$ plain form
2916 550 699 -345 -993 -262 736 471 -872 -804 139 687 259 -861 -638 726 873 -192 -656 -225 524
2935 524 803 -49 -515 424 724 868 -164 -490 517 1108 452 -570 -156 953 1464 -207 -745 7
2953 7 936 324 -498 -743 327 828 308 -575 -843 59 1068 30 -1020 -569 312 679 -194 -1008 -81
2972 -81 591 206 -851 -585 193 771 413 -460 -288 512 659 43 -497 -212 583 638 -314 -373 172 758 518
2993 518 -672 -425 436 578 -29 -748 -614 627 612 -558 -1077 -556 698 403 -558 -1059 -359 324 -168
3012 -168 -743 -888 201 768 -204 -1037 -566 98 756 -282 -812 -119 561 551 -532 -790 327 778 266
3031 266 -491 -460 574 844 81 -446 -22 764 586 -370 -1051 -122 501 278 -546 -896 -83 823 382 -829
3051 -829 -859 160 768 -222 -896 -297 555 527 15 -481 -110 733 648 -258 -24 408 1024 339 222 -91 802
3072H02M12j037j015R10Q76r2j234m31P91P21k41j380L69O96M71n54o97K7J059
3091D53M93q44p17N80N75J64q75m78J064M47k37j062K24Q11J57n64n75J99Q90
3110G05J47p71q82R05M14j73r03j71Q63P25q64j010J73J104K34p64p56N34J005
3129E15l35p29l39N61O52j71o12k25Q72N43o66o70M9Q75N36j060p41P38P71J71
3149G35j348j31R46O06n59q34r0R17L83o09o37k0R83K13o52q47O82Q55j90p67
3169c64o73R59O59m63q73K53J044o3n47j071R67O60j84n16m91O59M37L73j178
3188d12j83O30R44n42j091L95P20M45r11m84K81J067k24o82m57O78J96M9o84m13
3208f78Q15O56k31j276L30P91K90k86j199P20R80l09r52j32O55N30l86n80m6M81
$$ plain form
3072 802 1214 177 -838 72 948 856 -378 -809 -18 703 462 -918 -549 147 618 64 -633 -606 453
3091 453 946 102 -615 -35 540 704 -171 -649 415 862 625 -437 -213 598 755 191 -384 -185 705
3110 705 852 81 -801 104 518 345 -558 -729 134 859 -5 -1015 -842 262 496 -268 -1024 -490 515
3129 515 180 -549 -888 -327 325 154 -458 -683 189 732 66 -604 -555 320 856 -204 -945 -207 564 735
3149 735 -613 -744 202 808 249 -585 -675 242 625 16 -621 -641 342 555 -97 -944 -262 593 403 -364
3169 -364 -1037 -78 581 118 -755 -502 542 479 -68 -1139 -172 488 304 -212 -703 -44 393 766 -412
3188 -412 -595 35 979 437 -654 -259 461 906 -5 -489 -208 859 635 -47 -504 174 370 419 -265 -678
3208 -678 137 793 562 -714 -384 407 697 411 -788 -68 912 603 -349 -481 174 704 318 -262 -308 173
3228A73M62n02o76k03J175M69r57q99N94R76J05j460j76Q42N79o36n06n2P59M24
3248D91p53j60o4N25L33m50n87M67N96m3n52o88N58J337m86j507M96J059J38j011
3268c01n80P95O03j42o64k43N96L40j78o70k13M05Q13n68j003L17Q98K28r98o86
3288a251Q10J022o06q16l5Q36M45l78l89R6M61J87n0n83K6O98K15j76r80K47J194
3309I73j60r70n81J076O99q85o37J41P71M23j129L30n21Q14L4m80o80K04R93K6
3329D41j276j48J361N28q68p86p9J240O78j174q13P35J019k84o92r5L68L15L31
3348H01p79l57N11L31j56q93J22Q75K84q75m27L78Q29k59o99k03P45M25n45o54
3368e46J1O86N85n85o53J97N71N23r64o27N20R71k6j408M27O18N60n55q98n7O71
$$ plain form
3228 173 635 133 -543 -746 429 898 -59 -958 -364 612 717 -743 -919 -77 502 -134 -640 -692 67 491
3248 491 -262 -422 -486 39 372 -78 -665 -198 398 355 -197 -885 -327 1010 524 -983 -487 572 710 -301
3268 -301 -881 -86 517 375 -289 -532 64 404 226 -444 -657 -252 561 -7 -1010 -693 205 433 -565 -1251
3288 -1251 -441 581 -25 -841 -876 -40 405 27 -362 -266 195 382 332 -251 -225 473 688 512 -468 -221 973
3309 973 813 -157 -738 338 1037 152 -485 -344 427 850 -279 51 -470 344 378 -102 -782 -578 415 441
3329 441 -835 -983 378 906 38 -748 -827 413 1091 -83 -896 -161 858 574 -118 -213 155 470 801
3348 801 22 -335 176 507 351 -542 -420 455 739 -136 -563 -185 644 385 -314 -517 228 653 108 -546
3368 -546 -535 151 736 151 -502 -305 266 789 -175 -802 -282 689 663 -745 -318 300 860 305 -593 -650 21
3389B1J69j7o79Q5O98ql19n41M21P77n77q26J97Q69K68p41o87K61J071m9q06l57
3411g70O95M70k09q04J58M06M39M9o14k49J74R25j30r09k40J132K74r17m00K96
3431b24O43r7j040L44K07N49j96p34J50O14J58k67n91LP23K93o16q60P62Q23n72
3452G2n50j84R26K47n44m67M17K13N35o31l13L26K66M53p95l96M04P40k47o77
3472b05l75P21P44p13o65K46P19j6p33o0M56M56k57n37k63P69j28L56o10j15N97
3493C87M14p23o02J2Q30L07r32l30O61M89l16p48N3P31K28j01q74N6K20P25n28
3514d1o23N6P63K9o02m12P00M12L6m50n00Q82K86p95k77N84K93L34n84n38K29
3535b18O81O6n30m27M31O90m48o50k0L45P46p50n45k4Q21J42p17l93M28N90L6
$$ plain form
3389 21 190 173 -506 -421 277 269 -50 -591 -170 607 30 -796 -599 270 538 -203 -890 -629 442 393 -413 -770
3411 -770 -75 395 186 -618 -460 -54 385 434 -180 -429 -255 670 540 -369 -609 523 797 -120 -520 -224
3431 -224 419 322 -718 -374 -167 382 186 -548 -398 216 374 107 -484 -481 242 535 -81 -941 -179 644 72
3452 72 -478 -662 264 511 -33 -500 -83 130 665 34 -279 47 313 766 -29 -425 -21 719 472 -205
3472 -205 -580 141 885 172 -493 -247 472 456 -277 -337 119 575 318 -219 -482 287 159 515 -95 -210 387
3493 387 801 78 -524 -512 318 625 -307 -637 24 513 197 -551 -498 233 461 360 -514 -458 -238 487 -41
3514 -41 -664 -608 155 184 -418 -830 -130 282 318 -132 -632 250 536 -259 -536 48 341 675 91 -447 -218
3535 -218 463 529 -1 -428 3 693 245 -405 -425 -80 666 -84 -629 -653 168 310 -407 -800 -372 218 254
3556B54o61l45N94N45j0r09J31M74M34l01n23k2O35L43k96q03N26M65j95n30K8
3577a66N01K3j35k63l14M68P14n68m65m45J050L14r33m45M97M89M52j305j8J038
3597D89K42l29q44j25Q85K07k90n65K66L86R8l82j49M11L45r6o73o9M59M21l41
3618C46n88k24J016ll92p93L75N47p6m44m45M90N19r0m93l56Q87K14l68p12q2
3639f72J246O9o75m55L00R19j31o89l70M18N12M0q13q6M80M11k33q96K77N77r
3660B20l95o53O88P24l84p42n9M32N11k99m52l68R38J20n63l30L47M58J34o63
3680c36o66O88Q09k17o65l73N72P46j48p49N0M78K26l46p37Q59P1K20m80n59L85
3701a72O94j52o34j04L77M57m99m06K42K91P26p33o08K08O70J9n20n50O76N72
$$ plain form
3556 254 -407 -752 -158 387 377 -532 -401 73 507 206 -317 -339 296 639 343 -460 66 531 336 -194 -166
3577 -166 335 358 223 -40 -354 114 828 260 -205 -650 400 714 -219 -664 -167 322 774 -531 -549 489
3597 489 731 402 -442 -567 318 525 235 -330 -64 322 420 38 -111 300 645 549 -124 -193 266 687 346
3618 346 -242 -466 550 547 155 -638 -263 284 208 -236 -681 -191 328 238 -255 -611 276 490 122 -590 -672
3639 -672 574 643 -32 -487 -187 732 601 -88 -458 -40 472 512 -301 -387 93 504 271 -625 -348 229 220
3660 220 -175 -828 -140 584 200 -542 -601 -169 342 43 -409 -777 161 281 -282 -612 -265 193 327 -336
3680 -336 -1002 -314 495 278 -387 -760 -188 558 410 -339 -289 189 415 69 -668 191 262 482 2 -557 -172
3701 -172 522 370 -264 -368 9 466 -33 -439 -197 94 820 87 -521 -313 357 376 -144 -694 -18 554
3721E54p0o44l91Q52J20l89l27L59L50R7m43k14N1Q27m59k00n05Q21L72p60k78
3742b77P3P93J07n37m90M59K18j23j96n80N39N47l49o21j02O26J99j42n40R2M70
3763A66J66j04n69K8P73K37r87O8J78N12j97o59P8N48J74l50m75j07N69q3j32
3784a66l02j4O39M2n02k26M14L55l27j19n67N51M65m5p91L39N77j7r2k24k70M96
3806B16P3n01j86Q4O99j8p79O0P69m7k58o71N24L94j46n30m67N14O50j50m19l30
3828e19M93M80k53o64J74L66M55k76q17n3J001J24n59l76K00O25k48l53J03M13
3848C16k25L61p63L98K61R8op36N6O07L17j016j47N54N74l64m01n48R09J46m37
3869d6l15J45N42j60L00o98R4L29J94o00l31O55L19k10n02j4O12L13p14j39R8
$$ plain form
3721 554 484 -160 -551 301 421 32 -295 64 414 511 68 -146 -95 732 273 73 -432 389 761 1 -277
3742 -277 -204 589 696 159 -331 128 346 223 27 -553 -14 533 184 -437 -539 87 286 144 -396 -304 166
3763 166 332 228 -341 -313 460 697 -290 -222 -44 468 271 -388 -310 238 412 62 -413 -520 49 -34 -166
3784 -166 -468 -482 157 199 -303 -529 -115 240 -87 -206 -773 -222 243 198 -593 -254 323 306 214 -10 -280 216
3806 216 289 -212 -398 -314 385 367 -412 -352 417 370 112 -559 -35 359 213 -317 -784 -270 380 230 -189 -519
3828 -519 -26 454 201 -463 -289 77 532 256 -561 -614 387 511 -48 -424 -224 401 153 -200 -97 316
3848 316 91 452 -311 87 348 446 440 -296 -240 367 684 -332 -479 75 649 285 -116 -664 245 391 -46
3869 -46 -361 -216 326 166 466 -232 -138 191 385 -215 -546 109 428 218 -284 -298 314 627 -87 -226 -128
3890a28O42q0l83n34K82N86k82m39k21R03j02qn09l03N46L17l59l79Q4P46j41
3911B38l75o13R94K8l35l69j17M60O86l44n78j11K85M63m84j80p3O86l1n56k01
3932e27M86N99k57p48P8O80K5m90n83L61N42j80K8m05M33L16k81k97l57N01O52
3953E76n59m86j71Q97M00q65j39j1O73K8m16n18N32K74K72n34n17O50L88k00m60
3974a86K7N09O9j35l52q1K96K92o46m85Q75K56l97m82M4N23J58m2o36n8P07p9
3996A77o5k97J98N25R0p48j86K51N16k34m92J42N99j71k47j36P3L97P2k74l53
4017a63q0L25K58p04n3P63K9l03o71K78M43m7o6l42L75J25K81m42m20L49J40K78
4039C53m84n9Q2O02k66m61n83J040K82o34k70K86N41k35o08L8J83J00K40l53j11
$$ plain form
3890 -128 514 434 51 -483 -201 385 103 -336 -557 346 244 236 -273 -576 -30 287 -72 -451 -367 379 238
3911 238 -137 -750 244 272 -63 -432 -549 -89 597 253 -325 -436 -151 312 -172 -352 -425 261 230 -326 -527
3932 -527 -41 558 301 -447 -369 311 336 -154 -737 -376 166 -14 14 -391 42 358 77 -220 -577 -76 576
3953 576 17 -469 -640 257 657 -208 -347 -358 315 343 -73 -591 -59 215 487 -47 -564 86 474 274 -186
3974 -186 -159 350 419 284 -68 -149 147 439 -207 -692 183 439 42 -440 -396 127 285 243 -393 -451 256 177
3996 177 112 -185 13 538 628 -120 -306 -55 461 227 -265 -123 476 305 58 -78 -5 392 464 190 -163
4017 -163 -243 82 340 -364 -417 346 375 72 -599 -321 122 75 9 -333 42 167 448 6 -414 -65 75 353
4039 353 -131 -190 -108 494 228 -233 -816 224 506 -128 -398 -112 429 194 -414 -376 -193 -93 147 -206 -317
4060c17K38K03j07l45k0K00K63q6n09K65O14L32q53j02l3Q64k58o44K9Q36j46
4081D24k91l92L2N33k84l00j45R0N72K38n14l12L25L46l28m63J2O39M6l53k85
4102d10K26M25L25n19j5m0L98j18m22j31L73L39p8m85j51L69M15j71o19J12N00
4123C23j35m01k35P07k07J0j80j38N92J27n7o50r3O68j46L7m30oN11K41n94l88
4145d44M89K72j9l78j88K90O06o99j78J08M85K22q05j42K39K63J72m95l39M95
4165d6M96l21m99k3O30J06o23M8K19K98J89o53r4k2M70J7j16m91N16K32j64l07
4187a38lM38k56k87k79J13O08J44o02j3L10J79m53J00l44N59J62k39j98m38P40
4208A03L86m42n20K78N11o0k80l95K18M04k6p08L21R6M75j42n06N2M36K99n45
$$ plain form
4060 -317 -79 124 17 -328 -348 -148 115 29 -480 -215 399 731 -122 -224 -257 607 349 -295 -266 570 424
4081 424 133 -259 -227 306 22 -278 -423 -333 239 477 -37 -349 -24 322 -6 -469 -457 182 228 -125 -410
4102 -410 -184 241 566 47 32 -8 390 272 -150 -281 92 431 353 -132 -283 86 501 330 -289 -177 323
4123 323 188 -213 -448 259 52 62 -118 -256 336 463 406 -244 -337 331 185 222 -208 -214 297 538 -56 -444
4145 -444 45 317 298 -80 -268 22 628 -71 -249 -141 344 566 -239 -381 -142 121 293 -202 -541 -46
4165 -46 450 129 -370 -393 237 343 -280 -232 -13 285 474 -179 -273 -295 175 192 76 -415 101 333 169 -138
4187 -138 -141 297 41 -246 -525 -412 196 340 -262 -275 35 214 -239 -139 -483 76 238 -1 -199 -637 103
4208 103 489 47 -473 -195 316 256 -24 -419 -201 203 177 -531 -210 -114 361 219 -287 -235 201 500 -45
4229d5n1k4O54m12j51n14R81j7N0q05L07K04K05m24l64K86J11L05l40J2M6J7M47
4252D78l71m54J52M46P9o15J46K26K71l53l00M74r5J78m33k78J66N43K7l53j36
4273b02L92j82N5n6O0K83J56k36k79k84O69kr11J38L16K53j56k28p1K26N5Q8k16
4296a32j66J09M76k31l34n0M42N9n57nL83J11j17k89j57M76M27n42j42J95L38
4317B94j41k67l19K77M23k34k04j42K85L33k18m80K55J7K57j10l8j48K97J45m71
4338a89p5L43J33R4o85O4L01L47m32k54L1N27K1j97m18N07J08j16J6l79L96J11
4360B54K12o96J19J93L87k64o63Q4P26L41n16m57J0N93q5m23k32P65r2J83l83
4381E6k36O27L6Kp77K73L95r3m47qM56O4k15k68k04N47K58n45j42j30Q08j73k85
$$ plain form
4229 -45 -96 -120 534 122 -29 -543 438 421 471 -334 -27 177 382 -42 -406 -120 -9 296 -44 -32 14 31 478
4252 478 107 -347 -195 251 330 -285 -139 87 358 5 -295 179 84 262 -171 -449 -283 260 287 -66 -202
4273 -202 190 8 63 7 67 350 506 270 -9 -293 376 374 -537 -399 -83 170 14 -214 -285 -59 -4 84 -132
4296 -132 -298 -189 287 56 -278 -328 114 173 -384 -389 -6 105 -12 -301 -458 18 445 -97 -239 -44 294
4317 294 153 -114 -433 -156 267 33 -171 -313 -28 305 87 -393 -138 -121 136 26 -12 -160 137 282 -189
4338 -189 -264 79 212 306 -379 -315 -14 333 -99 -353 -322 205 226 29 -389 118 226 110 126 -253 143 254
4360 254 466 -230 -111 82 469 205 -458 -374 352 693 177 -280 -270 323 238 -185 -417 348 256 439 56
4381 56 -180 447 483 485 -292 -19 376 283 -164 -172 284 348 133 -135 -339 208 466 -79 -221 -351 457 284 -1
4404al70P3N69O8k72m26K83K94K09p77J16L44J49j39m03M30J44q7k33j33o4M65
4426B39q4l03n7J34L82j95k80j47N47j89k32l25L38K40J03k75l7J22J30J21o40
4447d08N6K88M93l57m55k3K65L74l32m14M33N26k57k66m72M22K57j2l81N3M44
4468B34j59O0j30n03M29J56Nk64M5N21j33l45n74L80Q62j65q15L32L21K90m33
4489A14n57K93M68K4m20l97N03J49Q5l56j91L61L11k65k42j24J95K46j08j70k63
4510c44N62J16k52m62M40K87k2l74k27L14L34k26Mp36M13N89l33k06k61O13L74
4531F03p87j34J18P40j0p97j76L71M91k81k52o8N07N1k60k53m9M26k1k94k12L10
4553B3K94J51q36L37J59J84k01j64n4K32J24l54j0k8K26j44K3k58L38L27n01j47
$$ plain form
4404 -1 -371 -298 271 339 67 -359 -76 218 427 -350 -234 110 259 120 -283 147 291 204 -29 -162 -226 239
4426 239 155 -148 -205 -71 311 116 -164 -311 236 47 -185 -510 -172 68 171 -104 -141 -19 111 232 -408
4447 -408 -352 -64 429 72 -383 -406 -141 233 -99 -513 -80 446 189 -77 -549 -127 130 118 -263 -210 234
4468 234 75 135 5 -498 -69 87 92 -172 -127 394 261 -84 -658 -278 584 419 -396 -64 257 547 114
4489 114 -443 -150 318 342 -78 -475 28 177 262 -94 -285 76 387 122 -120 -244 -49 197 89 -81 -344
4510 -344 218 334 82 -380 60 347 325 -49 -276 38 372 146 150 -586 -173 416 83 -123 -384 229 603
4531 603 -184 -318 -200 540 530 -267 -443 -72 419 138 -114 -182 325 376 116 -137 -186 240 219 -75 -287 23
4553 23 317 468 -368 -31 128 312 111 -53 -107 125 249 -105 -115 -143 83 -61 -38 -296 42 369 -132 -279
4575b79k02L77L27k14m15j55P00J61m73m1j23M57J87l70k02L49k38M63k96k77
4595b64M80M3l01j63j3L38L68m47l12L22J1J21k63m14O91K6P4j49m77J53J29L7
4617a0j5l47N90L41m59o42K50M57j10j41k93L38L74k53k12J72R5K4l02n4L5O67
4639E05n14J74k38j59Q29l50l72k56O20J89j08o45J84N39n7l49m65K64M52l24
4659h1J05o66N51N75k03n11J84j12N57l28o43O27J90j35l02j80J68N74l13l99
4679c42K39L30N8j00k58k9r3M50qk85qL0M35n44l67J81L49L38p46L27K2J27m7
4702E9n52OM11K57m11j46J96J56J95j6k84j85N30K20m95k96M37K41l75j07j20
4723b79O38o3j02j99j08L66o7k41j56j14L99J18k64K6K33Q4j70k44j00L47M5l15
$$ plain form
4575 -279 -481 -104 223 9 -406 -561 139 300 -173 -214 -337 120 307 -63 -265 84 -154 309 13 -264
4595 -264 216 259 -42 -205 -218 120 488 41 -271 51 62 183 -80 -494 197 223 297 148 -329 -176 -47 -10
4617 -10 -25 -372 218 559 100 -542 -292 165 55 -86 -379 -41 333 80 -132 40 135 159 -143 -197 -162 505
4639 505 -9 165 -73 -232 597 247 -125 -381 239 428 320 -325 -141 398 341 -8 -473 -209 243 -81
4659 -81 24 -642 -91 484 281 -230 -46 -158 399 71 -572 55 245 110 -192 -372 -204 370 57 -342
4679 -342 -103 227 285 185 -73 -102 -195 255 247 -38 -46 -16 419 -125 -492 -311 38 376 -370 -43 -21 106 59
4702 59 -493 -487 -76 181 -230 -376 -180 -24 171 155 -129 -314 216 436 -59 -355 82 323 -52 -159 -279
4723 -279 359 296 194 -5 -113 253 186 -55 -211 -325 74 192 -72 -46 187 271 101 -143 -243 104 149 -166
4745a66l00K75L15p0n1K7Q4K13j20k88J5L37j49j97q9k43O70L16o91j24j8O79
4767D25l7p16k00P06K12m22pj37J43K76j84p0j29K26K97n52j27J63K41K16o77
4788c53j25N82N6k2N8l4J96P3m91R2j15N30k07j22l25K4J03N04p64p0M66J50j51
4811E5n51M54J13j26j38J0J95K96p7p59L49Q8J79K24m83K35KK49j09n01j6R4N02
4834B85J5o86K95L52J92m01l50J94L02j30l64P6L44J45k83k21n6M72j33p3j58
4855a83L71j16N4k72k66M74M4K2j66J74m7K3k03j15J25L19k80Rr9j42O69j77n11
4878b93O6qP26k92k22J2N01k01k51j25J45M33k22l43l6M06j39o0l90K69N15o0
4900D31l24o7K0K10J7j73n31N90Q9nl65J11K6L76m04l0o6L7N06k33n09K59J87
$$ plain form
4745 -166 -466 -191 124 54 3 30 114 327 207 -81 -66 271 122 -75 -164 -407 263 579 -112 -236 -254 425
4767 425 388 -328 -528 178 390 -32 -39 -176 -33 243 59 -11 -140 86 383 -169 -296 -133 108 324 -353
4788 -353 -478 104 160 138 196 162 358 431 -60 32 -83 447 240 118 -207 -183 -80 424 -340 -410 56 206 55
4811 55 -496 -42 71 -55 -193 -183 12 308 231 -528 -179 -91 88 312 -171 64 66 315 206 -295 -311 -217 285
4834 285 300 -386 -91 261 453 52 -298 -104 198 68 -296 -220 124 269 -14 -235 -291 181 48 -25 -183
4855 -183 188 72 126 -146 -412 62 106 128 -38 136 89 112 -91 -206 -81 238 -42 -33 -132 -274 395 218 -293
4878 -293 -227 -235 491 199 -23 -11 490 289 38 -87 58 491 269 -74 -110 296 157 97 -293 -24 491 431
4900 431 107 40 60 270 287 114 -417 173 262 257 -108 3 29 405 1 -29 -95 -58 448 215 -294 -35 152
4923A52l5j19l28M35J41l04j14n3L88J60l57j89q5Q29m03m04K12j36L77m4K0k43
4945a00j00O52l29l33m61O11N52p77P6J36L54K4m1l34o1L72Q2m98p7K29K16j42
4967E1k03k47O16J44n04k88L81j3K60n7n05M7O50k2o21J17K66J90q3l31K46O8
4989A62j65J47m58L28O39l24k56j57k10M70m9n43J87L66k06Q9m00L09K49j73J02
5010A07m63J17M27j98j41L7N51N2l54k21J19j32L84j74l40R4M98j99j88K6Q9J34
5032B25K17m89%l0J55J5l95J74J24L51l25n5l5K14J41m58P5M1M55l49j48k83K47
5055a33K60j31n7j1J87k96K07m88M57N8P8q3m94L66L95k00j82o1L07R6j25m00
5077b50J39L90j68j67k96O2N45j85j09L6n1L79j28m01j85M48k9o6k17J24K62J25
$$ plain form
4923 152 117 -2 -330 105 246 -58 -172 -225 163 323 -34 -223 -308 521 118 -286 -74 -210 167 123 143 -100
4945 -100 -200 452 123 -210 -671 -60 492 -285 -209 -73 281 305 264 -70 -131 241 323 -175 -252 -23 193 51
4967 51 -152 -399 217 361 -143 -431 -50 -63 197 140 -365 -318 332 310 -311 -194 72 262 179 -152 94 162
4989 162 -3 144 -314 14 653 329 73 -84 -294 176 127 -416 -229 137 -69 20 -380 -71 178 5 107
5010 107 -356 -239 188 -10 -151 -114 437 489 135 -86 33 -99 285 111 -229 -135 363 164 -24 2 91 225
5032 225 442 -47 -47 -77 78 93 -302 -128 -4 347 22 -33 -68 146 287 -171 -96 -55 400 51 -97 -380 -133
5055 -133 127 -4 -61 -72 115 -181 26 -462 -5 53 131 48 -446 -80 315 115 -67 -128 179 275 150 -250
5077 -250 -111 279 111 -56 -352 -290 255 70 -39 -3 -54 325 197 -204 -389 59 30 -36 -253 -129 133 258
5099B58m19j60K84pK19k71k87M89Q6l1m45K76R6O9m68K62J94J10j86o5J4J4R2
5122A24K26o20m3M30K58l08l33K97N6j36k37n1J14M20O7j99k22l4L01k30jj45
5144b66N4M36l12k08L04J37J64k11k44Q8M6L74n42r3L33O8l8k03j41L42K9K8j30
5167A5q0J27J6m9k50K74K98p3k95j97K27M58m62l18M74K2n2l49L4K04M0J67k05
5190B6q4J44N1R0n33J73J20Q4l7l35K61K27Q2l41N5K11l86K22K5j80L6J49R3p27
5214e74L59K73p9k30Qk26N71J85j25j92J89O1k8l45k60L12K3k4mk38K61J46k96
5237b33K8K48j77K19R4m90O02j34j12r1Rj53J40k00O5J56J94j17J90l21k43M98
5259A72J18n07k66N94Q4J89j21k72K86q0j36j07qJ99L47m15k3NJ25kK8j64K63
$$ plain form
5099 258 -161 -321 -37 -44 175 -96 -383 106 192 161 -284 -8 88 157 -311 -49 145 255 69 4 18 32 124
5122 124 350 -270 -313 117 375 67 -266 31 87 -49 -286 -337 -223 197 264 65 -157 -191 110 -120 -121 -266
5144 -266 -212 224 -88 -296 8 145 309 98 -146 -58 -12 362 -180 -273 60 128 90 -113 -254 88 117 145 15
5167 15 -65 62 78 29 -221 53 351 278 -17 -214 13 471 9 -309 165 187 135 -214 -180 24 64 231 26
5190 26 -58 86 137 227 -306 -133 -13 71 34 -301 -40 187 269 -72 -17 194 -192 30 55 -125 -89 60 153 -574
5214 -574 -215 58 -21 -251 -243 -469 102 287 162 -30 159 220 192 -153 -413 -101 -78 -102 -106 -344 -83 63 -233
5237 -233 -205 43 -134 85 179 -311 291 157 45 -46 -37 -190 -50 -250 -185 -29 165 48 238 -83 -326 172
5259 172 290 -217 -483 111 195 384 263 -9 277 197 61 -46 -54 145 492 77 54 59 184 182 210 46 309
5282C09n8k42l35K12n7M35k08m16K23L5N70q13J83j06M81j1m66K03m5L90n2k18
5304A4j59K42J70m04J80j09K53K93o13J87l63M09J91n45P3M0Q4K56m55l8M18k02
5326g8J04k29k10N11J64r3m17J65K60l8l06k46M17J76j55l06J56M66m48j5q9M66
5348B55j75N17p06k47L04L65n06j94N4J30J63oj77j71L27K10l21k55M2M70k68
5369a89M0o3K50L87n23j21R4M61l15Jk03K18N3K06n99j79O16J02j97l35J36N72
5391D12k64k58K0j87L50O7j39j78L07LJ43m92k49N44o9O9j67n4R6K60k2k45l21
5414c74M66m7j26J17J2K10o4q5j61J13J20J09n08J77K03j32o9q8r2N09m3j40J22
5437B29n40P10j37p1l44J58J19L25p81K57J23L2J96o96L6M29K40l65l30L06K27
$$ plain form
5282 309 251 9 -326 -114 -171 264 56 -360 -137 -102 468 -345 -162 -268 213 202 -264 -61 -106 284 232 14
5304 14 -145 97 267 -137 43 -66 187 480 -133 54 -309 100 291 -254 -181 -141 -57 199 -256 -294 124 -78
5326 -78 26 -203 -413 98 262 169 -248 -83 177 139 -167 -413 4 180 25 -281 -125 341 -107 -122 -211 255
5348 255 80 597 -109 -356 -52 313 -193 -387 -333 -203 -40 -46 -223 -394 -67 143 -178 -433 -391 79 -189
5369 -189 -149 -212 38 425 -98 -219 -125 336 21 22 -181 37 90 296 -303 -482 134 236 39 -296 -160 412
5391 412 148 -110 -90 -277 73 140 1 -177 130 133 276 -216 -465 79 10 79 -88 -142 -46 214 192 -53 -374
5414 -374 92 45 -81 36 48 258 194 109 -52 61 181 290 -218 -41 162 30 -39 -127 -219 290 247 107 229
5437 229 -311 399 262 191 -153 5 124 449 -332 -75 48 80 276 -420 -384 45 285 -80 -410 -104 123
5458A23k9J48n69N67J6p2k13j80N08O6l02n67O86j15O9j25k52M25j95Q2kj94J99
5481G4n8k7l3R8L8k61L32l15K27K2k00L8m5R9K08k09M7k25L05O0m01J21R8j6K38
5506B15k77j22K40J20J0m57J7NN34l6n06k02O98J82l73l21K32n6L61l25j51M21
5528B09q9k89j64J28K83L30n70n7J55L31m1l15k84j36N99N9J5j1o4k4K04l59n7
5551a47J56M9j09J32oL18p5n70j29K43Q9P8M4o1j16K94l30j14L40o5J76j81k2
5574fm2J50J40j46m10L48J35P6k06k72L18qj66k06K43l0N86n99j67J60L31j66
5596F3k77M2J40L99n75q6N0J64M12j28m69L12j18j8K51l89R9K80j90J10q3o4N8
5619a7o1L0K3L1l7K63n73OK92L2Jn10K07O72m24p5n8K0J99J32k71M0J56p5o3j57
$$ plain form
5458 123 94 242 -327 240 256 184 -29 -209 299 365 63 -504 182 67 136 11 -241 184 -11 71 69 -125 74
5481 74 16 -11 -44 54 92 -169 163 -152 75 97 -103 -65 -110 -11 197 -12 35 -190 115 175 -226 -105 -7 -23 215
5506 215 -62 -184 56 176 186 -271 -254 -249 285 249 -257 -459 239 421 48 -273 -41 -97 264 -61 -212 209
5528 209 120 -169 -333 -205 78 408 -162 -219 -64 267 226 -89 -373 -509 90 149 164 153 89 65 269 -90 -147
5551 -147 9 58 -51 81 75 393 318 -252 -381 -138 -49 29 73 12 -104 190 -140 -254 86 21 197 16 -6
5574 -6 -48 102 242 96 -314 34 169 245 39 -233 85 77 -89 -295 -52 -82 504 -95 -262 -102 229 63
5596 63 -214 -172 -32 367 -208 -294 -244 -80 332 204 -265 47 -71 -89 162 -227 -128 152 -38 72 -11 -75 -17
5619 -17 -78 -48 -25 6 -31 232 -341 -335 -43 -11 -10 -520 -313 359 -65 -140 -198 -178 21 153 -118 -78 78 3 -60 -217
5645b17M9J97J38j58j09k46M90Qk51J15r1K09J5n79j26O94J54m62K55q5K92k81
5667A1J62j54Q7M4m6l73J68N7L13m2j11k60J2L55k43L4j31L99k0j66j75J18K2
5690F1l6L5k23J24K98j65j43J74k41M27l71ol04N97J25n02j61K94J43j49K10l11
5712a24L50j00k99p7J23K71k22N6j76O3L26q3r1j15J68K05R6m16j27R6K8K45l02
5735a05j29L89k9k92j97L88j61M15l04qJ46j40J68k77m5Q4L96l94O5j89M72j72
5757H1m7n45L38N21l21k6k18M70Nk15k26O1M16r0K0m27m6L06j24l1Q8Q8L6k5k81
5782a92J79j65nJ12j02L74K18k15Nk47j1J25J15l96M2J70J51k7j04l65M98m9J93
5805C04n00K82k26L80l12l1K65k1j54p0m0J04J03j22j65L19J43J4m22o3K00Q6
$$ plain form
5645 -217 -168 29 167 9 -100 -346 144 152 -99 16 -75 134 149 -430 -556 138 292 -170 85 0 292 11
5667 11 173 19 106 150 104 -269 -101 -44 269 227 116 -144 -132 223 -20 14 -117 282 262 96 -79 39 61
5690 61 25 60 -163 -39 259 94 -49 125 -116 311 -60 -66 -370 227 352 -150 -311 -17 126 -23 187 -124
5712 -124 226 126 -173 -250 -127 144 -78 -22 -198 -135 191 108 17 -98 70 275 371 -45 -172 -76 -48 197 -105
5735 -105 -234 155 126 -166 -363 25 -136 279 -25 -33 113 -27 141 -136 -181 -97 299 -95 -30 -219 253 81
5757 81 34 -511 -173 348 27 1 -217 253 258 43 -183 -122 294 204 224 -203 -249 57 -67 -98 -10 78 114 89 -192
5782 -192 -13 -178 -183 -71 -173 201 419 204 209 -38 -49 76 191 -205 -163 7 158 131 27 -338 160 111 304
5805 304 -196 86 -140 240 -72 -103 162 141 -13 -83 -123 -19 84 -38 -203 116 259 273 -149 -212 -12 74
5827G4J11k64J73j93O7J99M9m27K94k32k9J63j23L82j25m7K1j55P2M0n1P6l5J44
5851A84k78k4J79K67j07M3r6l83K86k03PL9j35K88J12j58l89M40J14l26j9K27
5873F8n2J35k34k25J77L83l25N9j11J82k64K47j95OJ07J24J2k61J93J39J78k40
5895A03l79J52L45j64k42J61J44K57k67l49K57J65J88m56j13K00K91j14j66k88
5915b75rN19Q5k36L5m9O9J26m09J47L75l35m7j63KL70m0k59j73L53J54j27m0j74
5939a01p0K23p3J06j28K9J88k01k28jL36K10k33j86j39L94O2lk09L53j50j12l9
5962B8k91R2N17k04J25j93K61k27j49j43Q0L60j36l74J22P4J38O0m24L41J23k19
5984c9n0J07j1J18K9k74K4j19K59K43l84j76M77j51J2l78Q3N13j67J4m44K80J26
$$ plain form
5827 74 185 -79 94 -99 -32 167 216 -211 83 -149 -178 -15 -138 244 119 72 93 -62 10 50 -1 75 40 184
5851 184 -94 -118 61 328 221 264 168 -215 71 -132 -125 -86 -221 67 179 21 -368 72 186 -140 -159 68
5873 68 16 151 -83 -308 -131 252 -73 -14 -125 57 -207 40 -155 -149 -42 82 94 -167 26 165 343 103
5895 103 -276 -124 221 57 -185 -24 120 377 110 -239 18 183 371 -85 -198 2 293 179 13 -275
5915 -275 -284 235 320 84 119 70 139 265 -144 3 378 43 -4 -167 -165 205 165 -94 -267 86 240 113 73 -101
5939 -101 -171 52 -21 85 -43 -14 174 -27 -255 -256 80 290 57 -129 -268 126 188 185 -24 329 179 67 28
5962 28 -263 -171 346 142 267 74 335 108 -41 -184 -104 256 120 -254 -132 -58 80 140 -284 57 180 -39
5984 -39 -89 18 7 125 154 -120 -96 -215 44 287 -97 -273 204 53 65 -313 -230 283 116 130 -314 -34 92
6007I2J51j88r0M3J67k67%LN1J37j22j83K3L30J83k77j01J7J46j99L41n24k0M52
6031A65J63l37j19K34l8k35%L64k76l5J85l06K96K27m6j78l90K59k43J18k39L49
6053h2R0J83j90q3M66k86jj61k73K30j01L20j0k32R8K67o0n01L01JP4K0k53K04
6077B1l1K51l54j65K12M56k34r4j76L12j67K01j46j7K77j08m5l32q5L72M03r17
6099c66N72n9j72K46l20J20M12m48K16k92K1J03Q4q2l23K93L99m17pk34K52L23
6121C21n03J6N9L86j93j68N1j64L90q3j14k8k36K48r2M1j74J04K29J17m08K58
6143E7M15l81k38n2J59L23p4m14J22J7J24o4K69m36L03J61m99J54p3J59J87l60
6165a41m2N7M05k23j29j39N42j91l97K50l88L54L01j55m04K10J42K14j42r6j83
$$ plain form
6007 92 243 55 -35 8 175 -92 -92 -89 -38 99 -23 -206 -183 147 330 53 -48 -31 115 -84 257 -267 -287 165
6031 165 328 -9 -128 106 68 -167 -167 197 -79 -114 71 -235 61 288 242 64 -326 -67 -310 -192 -431 -82
6053 -82 8 191 1 -82 384 98 97 -64 -337 -107 -208 112 102 -130 -32 235 175 -326 -25 -24 50 70 -183 21
6077 21 -10 241 -113 -278 -66 390 156 62 -114 198 31 232 86 69 346 238 193 -139 -224 148 551 -366
6099 -366 206 147 -25 221 -99 21 433 -15 201 -91 -70 33 117 35 -288 5 404 -13 -20 -254 -2 321
6121 321 -182 -166 -107 279 86 -82 -31 -195 195 112 -2 -30 -266 -18 -110 -69 -243 -139 90 207 -201 57
6143 57 472 91 -147 -199 -40 283 209 -205 -83 -66 58 -6 263 -173 130 291 -208 -54 -127 32 219 -141
6165 -141 -183 -126 279 56 -73 -212 330 139 -258 -8 -396 -42 259 104 -300 -90 52 266 124 28 -155
6186a55L35J92l51n7J47O5p5L0k66K56j81J62l02K80K02J92n44n6Q3K4k3K81k62
6209b3N0J7pm5j1K76j12j20j88K10m36M64J69k37n0J08K40k69K3K13j14j94j01
6232a37J16n4M5M5j29J66J58j18k97p4M72l71K21k55K22J63N4j53l76K65j5J00
6254D8j13n7R0l7K10j43j1j0J4j13P1k10J45L08n36K91j90N03k7l92R9J74l6K85
6278C63k52j02j91J84ok49K20N8K50m72R0J29p3R6j60J48m4r8O3J77k85K51j90
6301i3K34l58q4O11j75J07m61M85l41J30J17l57K65O1l6k40K16N5J27j93l25N0
6323b05N9M59l11J14l10N11l84n7J34Q3mJ25k77RJ81Q6n41K99o4M7J15j08k0k1
6347h0O6J0l56L37j19R0k22o7J27L13j11J06K8k39L60q5j2p1K41k79n2p9m3M69
$$ plain form
6186 -155 180 372 21 -36 111 176 101 131 -135 121 -60 102 -200 80 282 474 -70 -126 -43 -19 -42 239 -23
6209 -23 27 44 37 -8 -19 257 145 25 -163 47 -389 75 244 7 -43 65 305 36 59 272 158 -36 -137
6232 -137 -21 -75 -30 15 -114 52 210 92 -205 -279 193 -178 43 -212 10 173 227 74 -302 -37 -52 48
6254 48 -65 -122 -32 -69 141 -2 -13 -23 -9 -122 -51 -261 -116 192 -344 -53 -243 260 233 -159 -60 114 78 363
6278 363 111 9 -182 2 -4 -253 -33 25 275 -197 -107 22 -51 45 -115 33 -11 -109 -46 131 -154 97 -93
6301 -93 141 -217 -301 310 135 242 -219 266 -75 55 172 -185 80 141 105 -135 81 136 263 70 -255 -205
6323 -205 -146 313 2 116 -194 317 -67 -124 10 93 89 214 -63 -54 127 213 -328 -29 -93 -46 69 -39 -59 -80
6347 -80 -14 -4 -360 -23 -142 -52 -274 -341 -214 99 -12 94 122 -117 243 158 146 75 316 37 -15 -94 -137 332
6371C32l37nRp5K65L6k47R8m71M51N4j08JM9m7j34LK5Q0L70n05o5j4K18J32l17
6397b02m2J51K07j61K5m1J73j2j85m8J32QK09k53o0N5J63o9nj48N1J86k31J4K44
6422A61k10l5J99k47j62M87m03J72j98M75o5P8ll02J59K25k02k29J32k8K10l04
6444i0jL46o66M36O7k39R3P9J05q1n4J8K79l70P2J72l3j78J22l99L68L16k00k40
6468g8k26J56J95J64k49p3K12k0J05m30L49j42J90k58k96L91Rj3k2l45M19J78
6490B16j69m8J90J8m32q9K0K73L30j58j08k66K14J09j12r3j51J56M00m54J53O2
6512F1j73M84k9n26K2j45K42k1l1j28M23j64q7J22k13K11l36N2L49r9K41k9l66
6535a40k09N75J33o17K87k87L10j5k40j00M54j14o4n9MK85P6m44O4j07K12j05
$$ plain form
6371 332 -5 -10 -1 -76 189 225 -22 76 -395 56 110 2 3 52 5 -129 -126 -101 -21 349 -156 -221 -235 -17 115 -202
6397 -202 -244 -93 114 -47 -22 -63 110 98 -87 -135 -3 5 214 -39 -99 -44 119 50 45 -103 -52 134 -97 -83 161
6422 161 -49 -84 115 -132 -294 193 -210 -38 -236 239 174 252 249 -53 106 331 129 -100 32 4 214 -90
6444 -90 -91 255 -411 25 92 -147 -54 25 130 49 -5 13 292 -78 -6 166 133 -45 77 -322 46 362 162 -78
6468 -78 -304 -148 47 211 -38 -111 101 81 186 -244 105 -37 153 -105 -401 -10 -1 -14 -36 -381 38 216
6490 216 47 -1 189 207 -225 -314 -294 -21 309 151 43 -223 -9 100 -12 -105 -256 -100 300 -154 -1 61
6512 61 -112 372 343 -183 -161 -306 -64 -85 -116 -244 179 15 -72 50 -163 48 -288 -236 113 14 255 226 -140
6535 -140 -349 226 359 -258 29 -258 52 37 -203 -303 151 37 -27 -86 -82 203 279 -165 -101 -208 4 -101
6557a01M75m70K79j68L8k35J44J03O5l59J03K63j66J61n0ml6P4Q4l05j0L16Q3
6580B84j68%m17L04o6J05j31n3L49l05P0kJ66m8R7k89L7N5J57j10j09m7L96k38
6604C7p6k40L85J72k88J80k08K03M1o4l39K40K05j69J24l41K19J54m09K22l22
6625b74R1L20k9j11o5o8K68k70J04l58L73J54l0j87o7N26q1j06k21j39J80K1l35
6648c04r5K31K77%l12q4M75j15k39n7J64J78P8k44PJ33pk08k31J23N4N01l22R8
6672A01k50L35j8N8j25r9R5k89J15m25N13J23k37J95l00K28Q9k53m45Q69N7l15
6694B2j67M1J10L20l44J45q6P6J63j65m3m2j09R2mj50J87n4L67j83k32q1K53j41
6718b5K1k18m2L70m53M03k3K6P6o6j67J9L23k44R6n8J50K5k26K91m75K26K20j54
$$ plain form
6557 -101 374 -96 183 15 53 -182 -38 65 130 -229 -126 137 -29 132 82 78 42 116 200 -105 -115 201 284
6580 284 116 116 -301 3 -63 42 -89 -142 207 -98 -28 -30 136 88 185 -104 -67 -12 145 35 -74 -121 275 37
6604 37 -39 -279 106 278 -10 170 -38 165 206 142 -197 43 248 79 203 -138 81 235 -174 48 -274
6625 -274 -183 137 108 -3 -68 -136 132 -138 -34 -392 -19 135 105 -82 -149 377 296 190 -31 -170 10 31 -304
6648 -304 -399 -168 109 109 -203 -287 188 73 -166 -223 -59 119 197 -47 -40 93 86 -122 -353 -230 -176 325 3 101
6672 101 -149 186 168 226 101 2 97 -192 -77 -502 11 134 -103 92 -208 20 109 -144 -589 280 337 22
6694 22 -145 -104 6 326 -18 127 41 117 280 115 72 30 -79 13 9 -141 46 -8 359 176 -56 -137 116 -25
6718 -25 -4 -222 -264 106 -347 56 33 59 135 69 -98 -79 244 0 96 38 188 213 -13 278 -197 29 249 95
6742I5Q6j81J40k9k92j48L26K81l28K52l57P1L22k48r1p9J97J4K08k95Q9p0L20
6765B83l24k12K78J09l13J75K1n4K82j84j52K5oJ29k41J85j72N66j40m80K37j4
6787bK28k03n4j18m2N20l14o57M65J30J10k67L86l56M28j60L1m18L53j02K07n7
6809A08l38M49k86K45j33j87N02j30l54J48O9l8P1Rk65J2L87j54l11L8l6O19m54
6832b9o7o9K18J37k73J59j0pj86j1J70K35K58m82J6j78L41p6K30m70J40o4J07
6855H9l28R3L72k2r3k42J96o1K30j97j52m9J89j7r0j07J02O06m44J2k1j87K10
6878H9P9l21NK20L5O9k36j93L77J39k80J9n0J05J7k37J65J82j85j58j1L52k00
6901a8K36J74p09Q2K19Q6j98lr1M9K80l55L95K1q0J81n40K94j42K34K1l22K99
$$ plain form
6742 95 181 0 140 111 -181 -329 -3 278 -50 202 -155 -84 238 -10 -101 -180 17 31 239 -56 33 -37 283
6765 283 -41 -253 25 134 -179 -4 17 -37 245 61 -91 -66 -72 57 -184 1 -171 395 255 -225 12 -2
6787 -2 226 23 -31 -149 -191 329 15 -642 -177 -47 63 -204 182 -174 254 94 125 -293 60 -42 165 108
6809 108 -230 219 -67 178 45 -142 360 230 -124 24 93 55 126 135 -130 -118 269 115 -196 -158 -194 425 -29
6832 -29 -96 -165 53 190 -83 76 66 59 -127 -138 32 267 525 43 59 -119 222 146 376 -94 46 -18 89
6855 89 -239 -146 226 204 111 -131 65 4 234 37 -115 -164 25 8 -82 -189 -87 519 75 87 66 -121 89
6878 89 168 -153 -148 72 107 176 -60 -253 124 263 -17 2 -48 57 74 -163 2 184 -1 -159 -170 182 -18
6901 -18 218 392 -317 -235 -16 70 -128 -131 -222 -173 107 -248 147 168 88 269 -271 23 -119 115 136 -186 113
6924A13M5k99J5J51k9n1J18J22j76o0l2M97l74j47K86j71m4k79L26P4Q4k01k47
6947b79N94l93K49m22R1J24L11k40k49K54k52K31O4J74k11M36m52r3k33J5N21
6968B40j02l35KL02J34m4m00L62l1k1j82J96j60K21j39j56K36l58K00L0PM28m42
6991a2M3P1k2k05M77k31l63K50J07j45Q1n3L8J08O4j42k51L40n0L5k47j6J97j29
7015e5j62k4p2L26J70j57r3N0R6J72l16k85q1N04o2J44m66N50J9j7j20m43O06
7038B84k23p2p4K15j35L18l21j20j23K46K05l04p2J68R1Nm02p7K95P7r6r6R7M82
7062C68l43k22Q0J29Q1m0k15j24K73Q2J86o3j38LM59m64k05q7K1J88k41J58J32
7085A8K15j41k46MM41j71j62r0j24K30j4P0k22J99K2K88n33L73k23L4N7L5j91
$$ plain form
6924 113 158 -141 -126 25 -4 -55 63 185 9 -51 -83 414 40 -107 179 8 -36 -315 11 85 169 -32 -279
6947 -279 315 -78 171 -251 -160 -36 275 35 -214 40 -212 19 83 257 46 482 30 -63 -296 -281 240
6968 240 138 -197 -195 107 241 197 -203 159 128 107 -75 121 -39 182 43 -113 123 -235 -35 -5 2 430 -12
6991 -12 31 102 80 -125 352 121 -242 8 115 -30 51 -2 36 144 208 66 -185 155 105 140 -107 -123 74 -55
7015 -55 -217 -241 -313 13 183 26 -67 -17 79 251 -65 -350 -431 73 11 155 -311 239 258 241 121 -322 284
7038 284 61 -11 -85 130 -5 313 -8 -128 -251 -5 200 -104 -176 -8 83 88 -314 -391 -96 -19 -115 -211 -114 368
7062 368 25 -197 -117 12 93 53 -162 -286 -13 69 255 192 54 57 516 52 -153 -240 -219 -31 -272 -114 18
7085 18 233 92 -154 -150 291 120 -42 -132 -256 -26 -40 30 -192 7 29 317 -216 157 -66 -32 25 60 -131
7108a31mO6L34m62M5J63k37M10k52k43M08j97J48K5n1p7J9l87K11k2L75k2j00
7131A9l78K28K62j74Q2k3Q3p0j20l30L69P0m5j09J25J12j55j59P5K43q9K41m34
7154a77L9K73k58K21j96Jj22L34l82J98p4K6K25k48M8k43N8N25k87j72J4L0K10
7177D3J75k12J0J4pL8l42K97o5j7q9R1Q0L32l79j38J39J82P6j52L2k02J34J03
7201A43j91j32M08J88k18l12l7J63K60l96J1L98k0j64k19k8J2K23j79k0j47L23
7223F6j51P9m8R5R7L1r4k22N0M11j85p6j18k2J12k00M6J54J39j20J73m67K18L56
7247C24k85Q7l09J67J2K16m16J15P1Q1j56L53l41K15r1o4m3j35L03j6j08J58l04
7270a66L73k87Mo4K43J57O8l57l73N33j76J03j44j60K50j15j8Q9L46j28n55L69
$$ plain form
7108 -131 -135 -69 265 -197 -152 11 -226 184 -68 -311 97 -100 48 73 22 -55 -36 -423 -212 -234 141 119 19
7131 19 -359 -131 131 -43 39 16 99 29 -91 -421 -52 18 -27 -136 -11 101 -54 -213 -138 105 16 257 -177
7154 -177 -138 135 -123 98 -98 -97 -219 115 -267 -69 -143 -117 108 -140 -92 -335 -277 248 -39 -211 -197 -167 43
7177 43 218 6 16 30 23 61 -281 16 -49 -66 -155 -64 16 348 -31 -169 -30 152 228 76 108 -94 40 143
7201 143 -48 -180 228 416 198 -114 -151 12 272 -124 -113 285 265 101 -118 -146 -134 89 -90 -110 -257 66
7223 66 -85 -6 -54 41 138 169 75 -147 -97 314 129 53 -65 -87 25 -175 -129 25 164 44 217 -250 -32 324
7247 324 39 126 -183 -16 -4 212 -204 -89 -18 63 -93 260 -81 134 43 -21 -64 -199 104 88 -20 138 -166
7270 -166 207 -80 -76 -140 103 260 328 -29 -402 131 -45 58 -86 -246 4 -111 -129 -40 306 178 -377 -8
7292hj19J95q4J7k36O9L17J3m51K33jJ04l7p1Q5P5j92P2j24K78k33L92l90m0J61
7317B5Q2j61R7J42r0J98l73j15P8L26j46j22j47n7K99J0j86J26l5K11k11J25k14
7340a38Q3j14L83k61j06J37Q2J08qk01r9O5K0n1L0L08k36m7j28J30k9J95l14K31
7364D0OJ38j35jk23L35n6j10o7j01L40k74J0l8L11j40j96k8k5N02O0l29k92N3
7388b20K49o5m5l6K7O9p9O2j15K56K84l64l3J68j83n5Q7J37k20M3K57m66K40j56
7412a58J44k16J92K8p4L09k32J58r8J39l13p2J66J6J13j33j44J26R3j2o8k31J28
7435a39j58M93n9j58J04L0J06m05K25K6O1l40K76k20o8K90o1j34J80l06J29o1
7457a89L1L02k75J02j70R3k42K83J88k21Q4K10j64J01k38m6L35K9j6j03k94L87
$$ plain form
7292 -8 -127 68 -16 1 -235 -166 151 164 -287 -54 -55 49 12 -59 26 101 -91 -19 -143 135 -98 294 -96 -136 25
7317 25 107 -54 43 185 95 293 -80 -195 -117 209 63 -59 -206 -263 36 46 -140 -14 -49 162 -49 76 -138
7340 -138 -55 -169 214 -47 -153 -16 66 174 166 -35 -134 -69 -49 -100 -70 238 2 -45 -173 -43 -72 123 -191 40
7364 40 46 184 49 48 -175 160 104 -6 -73 -174 166 -108 -98 -136 175 35 -161 -189 -214 288 348 19 -273 -220
7388 -220 29 -36 -81 -117 -90 -21 -100 -38 -153 103 387 23 -10 158 -25 -80 7 144 -76 -33 224 -242 -2 -158
7412 -158 -14 -230 -38 -10 -84 225 -7 151 53 192 -121 -193 -27 -11 102 -31 -175 -49 44 32 -36 -267 -139
7435 -139 -297 196 137 -21 83 113 219 -186 39 65 126 -214 62 -158 -226 64 3 -131 49 -257 -128 -189
7457 -189 -158 144 -131 -29 -199 -106 -348 -65 123 -98 -14 196 32 133 -105 -151 184 213 197 94 -200 187
7479A87m00Q8o3M19k33j69J74m9K96j04l02J68K29j11N2k38j52K48Q1Qk03n1J23
7502bJ08O4m80K24J5R3j83J74K04j79P5l63K76j77k63L12j73K32L1J67q6k7M73
7525E15o79L19j8m53L86K16q3l02J69J01l10K08k65J06R0n2L05j40j99J86J73
7546B73j20k76J68m6j12Q5j00M08j64j33K7j66J60L2K8l98K95K16k95k3J35J79
7568A73l58K24pR0l80K62J6j95L44j40J54j32j54P6L95l38k76J96J85o3M6k20
7590a02k26K48K86L6l35M2K24r2k63K50J01p3jj50k98L08P8j5K01j84k02J25j8
7613f0j83J13L2K93k55j17N13l93K37p5k81K28j78J86Km1L0n8r7M5L0p1J93q4
7637Ik04M88j68k83J6k30M44l8j59K60J23k17k71l9J05J34m3K15J5k35K30k1j43
$$ plain form
7479 187 -213 -125 -188 231 -2 -171 3 -46 250 146 -156 12 241 130 182 -56 -208 40 121 129 -74 -125 -2
7502 -2 106 170 -310 -86 -71 22 -161 13 217 38 113 -250 26 -151 -414 -102 -275 -43 -12 155 69 42 515
7525 515 -164 155 137 -316 70 286 203 -99 70 171 -139 69 -196 -90 0 -52 253 113 -86 100 273
7546 273 153 -123 45 -1 -113 -28 -128 280 116 -17 10 -156 4 36 64 -334 -39 177 -118 -141 -6 173
7568 173 -185 39 32 122 -258 4 20 -175 169 29 183 51 -103 -27 368 30 -246 -50 135 72 118 -102
7590 -102 -328 -80 206 242 -93 -51 173 81 -182 68 169 96 95 -55 -353 -45 33 18 219 35 -167 -42 -60
7613 -60 -243 -130 -98 195 -60 -177 336 -57 180 105 -176 52 -126 60 62 21 51 -7 -104 -59 -29 -100 93 9
7637 9 -195 293 125 -158 -142 -372 72 34 -125 135 258 41 -230 -269 -164 -30 -73 142 157 -78 152 131 -12
7660a2J44j82M1M6k01K80l53M85l78j51J84n8L13j55j36J00J31J3o0j64K34k36
7682a15K00R2l56O6K65j45j88K86J67l1j94j56J07J7J9p8m0j35J50ML9q6J87K12
7706B87l05R0r5J10K2k50lo4J77j1L05m89L02l3j62J83k74J5N7N6l2k02M17m5
7730E6k1J17j73m6K2J24j93n8J88NN0J56l30Q3j01j74K69l7K50l06Q6k18O2L51
7754A62q9l13L75l22J18n5q0L67q6j63L67r7k08J12qR9m0k00K72k52N5P1j09K71
7778B47j53k80K86J6j94J90j96K30n0l46J66Q3P0k5L2p4j21J54j36j14j2M52j80
7801D5P0k56K30j49K10L8m9j23K78k80k89J34J38L9r5k31K80K88k76L29o44M39
7823A26J55k74P5Nj10j65L70k73M25j94j24mJ09j03J1K5k8p4j57K30j13L51m16
$$ plain form
7660 -12 132 -50 -9 37 -164 116 -237 248 -130 -281 -97 -155 158 3 -133 -33 98 111 51 -113 121 -115
7682 -115 85 177 -179 -113 152 7 -181 105 272 241 47 -109 -2 15 34 -44 -84 -219 -69 -65 -26 -112 75 287
7706 287 -18 72 -23 87 109 -141 -144 -208 -31 -42 263 -226 76 43 -119 64 -210 -195 -138 -82 -114 -316 101 56
7730 56 35 152 -21 -67 -45 79 -114 -172 16 21 71 227 -103 -20 -121 -295 -26 -63 187 -119 -33 -251 -189 162
7754 162 73 -240 135 -187 -69 -124 -204 163 77 -86 281 184 -24 88 80 179 139 -61 211 -41 14 85 -24 247
7778 247 94 -186 100 116 -78 112 -84 146 96 -250 -84 -1 69 44 76 2 -119 35 -101 -215 -227 225 45
7801 45 115 -141 89 -60 150 188 139 16 294 14 -275 -141 -3 36 -59 -290 -10 278 2 331 -313 126
7823 126 281 7 82 87 -23 -188 182 -91 334 140 16 12 121 18 29 54 26 -48 -205 25 -88 263 -153
7846a53J79K56k51l33k6M19R9q9m2J37j55L84m55K7P6J26m66K31k87K51r2J27
7868c7Q9J96m09K17m4l82k6M24L06l04p2q1M18n6j90j4p3n6n3M0J98J49j30q0
7892C0k81J8J99j3J56j0j82J5Kj69R9J18q0J65j1Q1n52M43L9j78J64P0j13J68
7916A78k00j40K41J24r8j65Q4k41J57N5j41K16j16k30L5j06M05RO4j02R2k36J96
7939H1k44R9Q1l02L30j48PL0K10j79l1j1m3R6R1r6k29N07l42r4L94k04K56k28
7963C1o3j07K4L5n4k0J24j19J10N3p9L2o1J7K26n9m23N47k83K10k22K96O1l66
7987i0k6m7M43p2j75j07n7K35j34M1Q5M0N4l08K33pj02n6q3L2J65J91l06P0j33
8012a14K42l5m5o1j56oK60k18K56l4m56M78j47P1L9L5J78k15j38K27Q9m48J71
$$ plain form
7846 -153 26 282 31 -302 -328 91 190 101 59 196 41 425 -30 -3 73 199 -267 -36 -323 -72 -164 -37
7868 -37 52 248 -161 56 12 -370 -396 28 334 30 -42 -123 295 239 49 35 -38 -94 -147 -107 91 240 110 30
7892 30 -251 -233 -34 -47 109 99 -83 -68 -66 -235 -136 -18 -98 67 56 137 -415 28 67 -111 53 123 10 178
7916 178 -22 -162 79 203 105 -60 24 -217 -60 -5 -146 70 -46 -276 -241 -347 58 67 131 29 121 -115 81
7939 81 -163 -64 17 -285 45 -103 -96 -66 144 -35 -66 -77 -120 -24 67 -29 -258 249 -93 -187 207 3 259 31
7963 31 -32 -139 -115 -80 -134 -154 -30 -149 -39 14 -65 -33 -94 -77 149 90 -333 214 -69 141 -81 215 276 -90
7987 -90 -116 -163 280 208 33 -74 -131 104 -30 11 96 136 190 -118 115 108 6 -50 -133 -101 64 255 -51 19 -114
8012 -114 128 93 48 -13 -169 -175 85 -133 123 89 -367 111 -36 35 74 109 287 72 -66 161 250 -198 -27
8035b7K4nL4q5J8JK51j7j08j73K31j79j01R3k1K1j09J80n5l84J82J83K3mk53M06
8061A26j09j20J74j58NN7J78k67K08J98n7j57M4l0j8j20M0O8j25n0p4J68K41k7
8085A95k15o0j12J40J59j30k9J0R4K43k47k86J22M39j24L7k21j15K38k18j7k5
8107a22J08k5R9QJ23l62L10j33l95N55k77J18J15O5l33l65N92j57k46N64l45L29
8129B26j20p0j32k6K35k67M00J8l04J15Q0o3j71K83j08m0M7j24j99K72j24N6k8
8152d4J98j19o6J29k15K21k88K14j74nR2J13K9m7j61L76j42l20q0J37K73Q8k61
8175e2N1j23J16oo8N2k33K25J07q5l12K65n7L40j55j50
$$ plain form
8035 -27 -3 -8 26 -59 -41 -40 211 194 86 -87 144 -35 -136 -43 -64 -43 -152 28 -27 -411 -229 -46 -23 -27 -280 126
8061 126 17 -103 71 -87 -82 -25 153 -114 94 292 235 78 122 92 74 -46 -6 62 -63 -113 -187 -19 222 195
8085 195 -20 -80 -192 -52 107 -23 -52 -42 52 295 48 -238 -116 323 199 236 15 -100 138 -80 -97 -122
8107 -122 -14 -39 60 68 191 -171 139 6 -389 166 -111 7 122 187 -146 -511 81 -76 -322 242 -103 226
8129 226 106 36 -96 -122 113 -154 246 264 -40 75 155 92 -79 204 96 56 103 -21 -220 52 -72 -16 -44
8152 -44 154 35 -31 98 -117 104 -184 30 -144 -149 -57 56 85 38 -123 253 111 -209 -289 -152 121 209 -52
8175 -52 -1 -124 -8 -14 -82 -30 -263 -38 69 -16 -328 -63 -120 220 65 -85
8191h5
$$ Imaginary data points
##PAGE= N=2
##DATA TABLE= (X++(I..I)), XYDATA
0@%%%%%%%qJ6j6J6k4L2l7M5n6O9p8R0j08J29j51J74k02K34k66L03l45L90m43M99
31B63n60O32p07P89q79R77j088J206j338J484j642J816k010K229k471K744l055
48a610L410l822M305m882N587o469P609r151J1366j4828K1058l5739J31361R9589
62B07784k61208l2915J61080O7469j52784n9788R5538N2399q4201j6424P6594
73E3544R823r5652j9545O8694J6146o3260m044M9270q791n4792J9963O0516j7141
86A4731o9538P480O4524O657n2639j1854L2722J0493j2601Q850J2625r522o18
99A310J9293r901l5713J3257N6499j403o2461j962P6683J8303q3159m6213N7072
112A605M0118m6946k9240N1425K9010n3212l4343M4800K7019m9960l5828L8953
$$ plain form
0 0 0 0 0 0 0 0 0 -8 8 -8 8 -16 16 -21 24 -32 37 -41 49 -59 70 -81 93 -109 125 -141 162 -183 207 -236 263
31 263 -297 335 -372 417 -462 515 -573 633 -705 779 -863 953 -1057 1172 -1299 1445 -1610
48 -1610 1800 -2022 2283 -2599 2988 -3481 4128 -5023 6343 -8485 12573 -23166 108195 207784
62 207784 -53424 -86339 74741 142210 -10574 -70362 25176 77575 -6626 -23050 53544
73 53544 63367 -32285 -51830 16864 33010 -30250 -34294 14976 6185 -48607 -28644 31872 14731
86 14731 -54807 -47327 17197 23854 -28785 -40639 -7917 2576 -10025 -1175 11450 1928 1310
99 1310 20603 10702 -25011 -11754 44745 43342 -19119 -21081 55602 73905 -9254 -55467 1605
112 1605 41723 -5223 -34463 16962 45972 -7240 -41583 3217 30236 -19724 -55552 -16599
124a6599L2212k1959n812L3514j1039n8518O420P9506J1992q9561l8495Q4049
136E710O5986n4936p1150K5653O0104n227l8556J382K0604p512j7288O392J2481
149C643j725j925N360n312q941Q791R871j9580k6464J1452L4806O981k0732o874
163a0649J1902J934j0602l257J831l220L863J7960Q810j2445o448J3378K358k4051
177h636j0827K7619K4269j8880k9088J2133L4079j98l4318j4529K2335J7546j3786
190G719j7551O468J3187o463j5160L849J8390L454j8627j3932P023J2551p56j0358
204a0206o002L951J2940J5255N34k2354k1308J1827K9008m00k8579m921L5254
217A4999K2631k4171k7040J1931K3454j1617k5979P516L0691O424k1083j1844
$$ plain form
124 -16599 15613 -6346 -12158 21356 10317 -48201 -41781 37725 49717 -39844 -78339 5710
136 5710 71696 16760 -54390 -28737 31367 26140 -12416 -11034 9570 2058 -15230 -8838 3643
149 3643 1918 -7 5353 41 -8900 -109 9762 -9818 -36282 -24830 9976 16957 -3775 -10649
163 -10649 1253 3187 -7415 -10672 -8841 -12061 -8198 9762 18572 6127 -321 13057 15415 -8636
177 -8636 -19463 8156 32425 13545 -15543 -3410 30669 30471 -3847 -18376 3959 21505 7719
190 7719 -9832 -3364 9823 3360 -11800 -7951 10439 13893 -4734 -18666 -11643 908 152 -10206
204 -10206 -16208 -12257 683 15938 16472 -5882 -27190 -15363 13645 13245 -15334 -20255 14999
217 14999 37630 13459 -13581 -1650 21804 10187 -15792 -8276 22415 28839 7756 -4088
229d088J0827J0378n087j2711r056K021J4466J0698j2234k0414M253K2491j51
242A1393k5241q041K1716R955k0021j5764J4055J6260m816j0459J882M414J748
255b919L011m158j6610l921K4834J9377j9043k3012J9812L0044j7526l9555P584
268b2082L8768j013l5695J452M0602Q963l5485j7913K2838J3679j6241r992J1044
281a075M577m189Q694Q539j7616k0223J7538K6569j5112l3202R860L6664j590
294A9434l4893l676L1667P712k6444j1048J7863R195j3637p706O496N520J794
307B277M855k712j3955l54J8036M68k6392p409L1900K0446k5028k2023K0463K3518
321B4090j7664k6080R930K1365m621j0550J0134R634j1906o142J5045J690k3487
$$ plain form
229 -4088 6739 17117 12030 -681 -9737 -7716 6750 17448 5214 -15200 -10947 11544 11393
242 11393 -13848 -21889 -173 9782 -10239 -26003 -11948 4312 -504 -10963 -9081 -4667 -2919
255 -2919 92 -4066 -20676 -24597 237 19614 571 -22441 -2629 27415 9889 -29666 -22082
268 -22082 16686 15673 -20022 -18570 22032 30995 -4490 -22403 435 14114 -2127 -12119 -1075
281 -1075 3502 -687 8007 16546 -1070 -21293 -3755 22814 7702 -25500 -15640 21024 19434
294 19434 -15459 -19135 12532 20244 -6200 -17248 615 9810 -3827 -11533 -5037 483 2277
307 2277 7132 4420 -9535 -9889 8147 8615 -17777 -25186 6714 27160 2132 -19891 572 24090
321 24090 6426 -19654 -9724 11641 7020 -3530 6604 16238 4332 -1810 13235 14925 -8562
334h562m438K8840R770l0055j2661L2325J8680l2607k5872K6929K7768k3923l0612
347b4418J6947K8995j0665k5991O620K1995l824j7350J343Q222p285n792J1946
360G43N750j4669n828K0968J1395k2350j9830J4511K0674r761j8048O591J8585
373H731M84j1405j739N065j444l564K10m5O01Q191N962j0398j0597J1640J6515
388A8207j1106k5711L956K8294N290k4359j1041J9650J3247j2797j2889O751N816
401C308o457l778O233J0q009M064J2025m857j6820L068J8153l048k4492k359K7413
416D454J1064k2763j4528J9761J8480j5401k0523Q552J8788l160j4130L259J4226
429H079K719p656l837p6J48N028O257p700j3582P314K3588J962k6683j1588K1825
$$ plain form
334 -8562 -13000 15840 25610 -4445 -17106 15219 33899 1292 -24580 2349 30117 6194 -24418
347 -24418 -7471 21524 10859 -15132 -8512 13483 9659 -7691 -6348 1874 -5411 -11203 743
360 743 6493 -8176 -14004 6964 18359 -3991 -23821 -9310 11364 1603 -16445 -9854 8731
373 8731 9215 -2190 -3929 1136 -308 -3872 -3662 -3707 -3106 5085 11047 649 -9948 1692 18207
388 18207 7101 -18610 -14654 13640 18930 -5429 -16470 3180 16427 3630 -9259 -2508 3308
401 3308 -3149 -6927 -694 -684 -8693 -4629 7396 2539 -14281 -11213 6940 3892 -20600 -22959 4454
416 4454 15518 -7245 -21773 -2012 16468 1067 -19456 -10904 7884 4724 -9406 -6147 8079
429 8079 10798 3142 -695 -771 -623 4405 10662 2962 -10620 -3306 20282 22244 -4439 -16027 5798
444E798J7444j6988k0876Q450J8388k763j2788J800Q972j836p944J050J686k523
458b130O24M730m545p898Q850J6232p824k4757J458K7704M529k9114j2064K7339
472C134J9677j9069k0291J2763J9071p855j7159K487J0525k78j117L492k855q578
486f053P551J6003p833k4442J493K6976M896k5701q423K3560J1843k0763j3391
499a4284J7003J1672j7162j3727J2121J4139o013j0474J332L046M13N074J683
512D823j4982j2186J7507K3190j2502k8584N691L1708K730k8754r045K1617R846
525A1059j6389p099J3655O323j0043k698Q401q58q390K949P284q110r139J2360
539f95J3584j3193j7520J2681K1649j0306k6351M716K6656J353k3427n016K0732
$$ plain form
444 5798 23242 6254 -14622 -6172 12216 9453 -3335 -1535 7437 5601 -2343 -1293 393 -2130
458 -2130 -1506 3224 -1321 -9219 -369 15863 8039 -16718 -15260 12444 16973 -12141 -24205 3134
472 3134 22811 3742 -16549 -3786 15285 7430 -9729 -7242 3283 3005 1888 5380 2525 -6053
486 -6053 1498 17501 9668 -14774 -13281 13695 18591 -7110 -15533 8027 19870 -893 -14284
499 -14284 2719 14391 -2771 -16498 -4377 9762 3749 -6725 -5393 -2347 -1934 3140 4823
512 4823 -10159 -22345 -4838 18352 5850 -22734 -17043 14665 17395 -11359 -20404 1213 11059
525 11059 -5330 -12429 1226 7549 -2494 -5192 3209 2351 -6039 -3090 4194 -3916 -13055 -695
539 -695 12889 -304 -17824 -5143 16506 6200 -20151 -15435 11221 12574 -10853 -15869 4863
552D863R947j2149r184L671N063J200K751j745r284M56J6462P211j7280j3165
566a1183J3181J5406j0605j6809N976J5590l798j3998J748J2076j634j2220k756
579i026O983L147k319k734l210j031P526Q935o456j5008J414J9192N470j7056
593d173j0670J4365J6777n754j4337J105J2619K939p921n820L647O176J690l647
607F996m414J030N878R25q501p241M441Q643k688j0634k231R633N469q889j1004
622a2587K996J1196R94j1334o940Q970J1793l157j2929k159J2254P879p619r777
636a0420L085J0115L249m905m851K502N937L693m497p321R63R052K665j0283o501
651g517J0077J0978q147j5343K990J5211M7j6326n489J1991Q393o328q495N01
$$ plain form
552 4863 14810 2661 -6523 -2852 2211 3411 6162 4417 -4867 -4411 12051 19262 1982 -11183
566 -11183 1998 17404 6799 -10010 -4034 11556 7758 -6240 -4492 7584 5950 -6270 -9026
579 -9026 -2043 1104 -1215 -3949 -7159 -8190 -664 8271 1815 -13193 -11779 7413 12883 -4173
593 -4173 -14843 -478 16299 10545 -3792 -2687 9932 12871 4950 -870 2777 8953 10643 6996
607 6996 2582 3612 9490 10415 1914 -5327 -886 7757 5069 -5565 -7796 1837 7306 -1583 -12587
622 -12587 -9591 1605 2599 -8735 -15675 -6705 5088 1931 -10998 -13157 -903 6976 -643 -10420
636 -10420 -7335 2780 6029 1124 -3727 -1225 4712 8405 3908 -3413 -2450 6602 9267 -1016 -7517
651 -7517 2560 13538 5391 -9952 -6962 8249 8296 -8030 -13519 -1528 6865 537 -7958 -7457
665g457M988K412j082m590n049L695J0460J222j3255m593J5077R689j3257j3338
679a5078J1383J6097o848j5631M042J5180J08j1353j397P916Q32l370Q74o34n423
694c302L058J0305k737j5867J8J9802L510k2232j0749K1001J4654j7345j6936
707a6820J2845J7056q251j4388M769J0374m110n697N539K685o729J289J0799k126
721G235j4262J854J8236j34k0677k513K2879O178k1733j0109J9033J1907j5340
734B554j3004R769J0246p071o106L341P48m677M274O882r103j2064R771J5964
748A1524r042k0436O549K2834k780k2175j17K0926K995j8279l801J5295M467j0764
762b804k228R069m72o366N159N614r242p652J3371J0852j5687j5049J4370J9263
$$ plain form
665 -7457 -2469 -57 -1139 -5729 -10778 -7083 3377 4599 -8656 -13249 1828 11517 -1740 -15078
679 -15078 -3695 12402 5554 -10077 -6035 9145 9253 -2100 -3497 4419 5251 1881 2755 2121 -3302
694 -3302 -244 10061 7324 -8543 -8525 11277 14787 -7445 -18194 2807 17461 116 -16820
707 -16820 -3975 13081 4830 -9558 -4789 5585 1475 -4222 1317 4002 -2727 -1438 9361 7235
721 7235 -7027 -5173 13063 12929 -7748 -10261 12618 18796 -2937 -13046 5987 17894 2554
734 2554 -10450 -681 9565 2494 -3612 -271 477 -4200 74 6956 -2147 -14211 -4440 11524
748 11524 2482 -17954 -11405 11429 8649 -13526 -13643 7283 10278 -8001 -11802 3493 7960 -2804
762 -2804 -5032 4037 3565 -2801 2358 7972 -1270 -8922 4449 15301 -386 -15435 -1065 18198
776A8198j1989k2738O695K1760k727k0058j090J4966J371j0469j042O809k598
789b912m513O548L244j0012l945J2965O380j4073q426J5959J1498j4620j3545
802a5452J3363J6329r863j6482O673J5628j759j2336K44P032k34j419K148k120
816A752o505K941J1937k136j5874j344J6817M647j6857p899J4457R835j1749j0331
830a0309Q613J0051o086q783L513O760j775k946J408p67j939M417M879o555q137
845g656O114J2888m004j4759k13J5761M895j3976p883R564R773n077q345M80N687
860C249J977k069k874j985J156M937O25o489l761O209O302o147q295L909R883
875F627k001j0454j514J0160M279p650p061M059P817M47o608m523L432O559J569
$$ plain form
776 18198 6209 -16529 -9834 11926 9199 -10859 -11949 3017 4388 -6081 -7123 -314 -2912
789 -2912 -7425 -877 2367 -7645 -11590 1375 7755 -6318 -14744 1215 12713 -1907 -15452
802 -15452 -2089 14240 4377 -12105 -5432 10196 8437 -3899 -3655 3377 3143 1724 3872 1752
816 1752 -4753 -1812 10125 7989 -7885 -9229 7588 12235 -4622 -12521 1936 11771 22 -10309
830 -10309 -1696 8355 2269 -6514 -3001 3759 1984 -962 446 -321 -2260 2157 7036 481 -7656
845 -7656 -1542 11346 7342 -7417 -7630 8131 13026 -950 -8833 731 10504 5427 -2918 -2438 3249
860 3249 5226 3157 283 -1702 -546 4391 5016 -1473 -5234 975 7277 1130 -7165 -3256 6627
875 6627 4626 -5828 -7342 2818 7097 -553 -7614 -3555 4262 4709 -1899 -6422 -2990 3569 5138
890E138n509n897K926P721J842p385o309N184Q456j959r022j680P861M676n805
905B38p009L218O962o47p867k018O617M316m464n987J401O273J347m465m421K114
921d392N782K149m071n950J882Q364L227q564p132O392J0392j748j1813k174J0879
936C223N894p513p523L530P001q69n223j399K163K004N08j561k967N32M090J009
952B899o147l649O713O642n875r020M269J1666m89j1779l415J0682O239o158p225
967d647K108O456K309k162m182j841L339N834r57q675k722R329N932q072q787
982f738N588J0353l890j0964O33R695O08q063k627N939L278l179k786O1R30J634
998D72K048k705n357J900R515J121j1485m569J1562Q491r279j1422N498J2822
$$ plain form
890 5138 -371 -6268 -3342 4379 6221 -1164 -7473 -2289 6167 4208 -4814 -6494 1367 6043 238
905 238 -6771 -3553 3409 2762 -5105 -7123 -506 3810 -654 -6641 -5240 1033 2380 -2085 -6506 -4392
921 -4392 1390 3539 -532 -6482 -4600 3764 6991 -1573 -8705 -2313 8079 6331 -5482 -7656 3223
936 3223 9117 1604 -5919 -2389 4612 3743 -1480 -2879 -716 1288 1796 235 -2732 -2200 1890 2899
952 2899 -3248 -6897 -184 6458 583 -8437 -4168 7498 7009 -4770 -8185 2497 8736 2578 -4647
967 -4647 -2539 3917 6226 4064 -118 -1959 1380 7214 6257 -2418 -5140 4189 10121 2049 -6738
982 -6738 -1150 9203 5313 -5651 -5018 4677 5285 -2778 -5405 534 3812 633 -2153 -2092 -1162 472
998 472 2520 -185 -5542 -3642 5873 6994 -4491 -9060 2502 10993 1714 -9708 -4210 8612
1012H612j442j0680j683P624K916l977l018O68J049P49J095k304l577J800N878
1027C710r28q470j157Q961L219r663o357Q321Q622n275r692J718R284J655p570
1042c622l778M231L758O75k411k351L58M391K838l783n838K033Q274K70q285k828
1058f068Q889N318o569p577M583P375j671p555p75N320K602k631k930k01J563
1073c27K427m57l904l129L640N458j978p726R8Q712L661q347o347O154P922k872
1089B985p984N93P658K320m638k740K474L117n07j909j474L21K737K600k224n020
1105a691J531O498M55q169m827P456O946n247q525J923Q339N75p031k565L830
1120e02K767k050k032K42J038J489R96j859k372J502M963n66p263j114Q440M438
$$ plain form
1012 8612 7170 -3510 -5193 2431 5347 1370 -1648 -980 69 818 1913 -391 -3968 -2168 3710
1027 3710 2782 -5688 -6845 2116 5335 -4328 -10685 -2364 6258 983 -8709 -6991 2293 3948 -3622
1042 -3622 -7400 -3169 589 1264 -1147 -3498 -3140 1251 4089 306 -5532 -3499 4775 5045 -3240 -6068
1058 -6068 2821 8139 1570 -6007 -1424 5951 4280 -3275 -4050 1270 3872 1241 -1689 -1890 -327
1073 -327 2100 1643 -2261 -5390 -1750 3708 1730 -5996 -5898 2814 6475 -1872 -8219 -2065 5857 2985
1089 2985 -4999 -4406 3252 5572 934 -1806 668 3785 3278 1369 -105 216 2953 5553 3329 -1691
1105 -1691 -160 6338 6793 -1376 -6203 1253 8199 2952 -5573 -3650 4689 5264 -1767 -4332 -502
1120 -502 2265 215 -1817 -1575 -537 952 1948 89 -2283 -781 4182 3616 -3647 -4761 3679 8117
1136H117p584o430N944Q258l148q988n0O694J630m773j974J830J147J66K52k255
1152a164l699J935N587j663p936l24R867L069j0077n358Q337P757o620q278M045
1167d522Q316j681n718N46M344N29k165K10k33r88J852L169k932o030L128R325
1183G150j403j1091j982J1532L736r683p168O942P340l726n980J854L587j062
1197D6k059M61m87j092K559K845l645m336N376O929n432r155L366J1334p02j0952
1213d944j767J0518M211p357m759M566M349k804k229J107M66k53K191P04m640
1228f41j866O734L392p548o824O653R144m888j0260K205J0110M14q421k967N410
1243F47K527l910j735J688O44K15J469j345l514P20N718m86p698j618R059M906
$$ plain form
1136 8117 533 -5897 47 8305 5157 -3831 -3881 2813 4443 -330 -2304 -474 673 839 1091 -1164
1152 -1164 -4863 -2928 2659 996 -6940 -7264 2603 5672 -4405 -9763 -1426 6331 -289 -8567 -4522
1167 -4522 3794 2113 -3605 -3059 1285 1814 -351 -141 -374 -1362 490 3659 727 -5303 -2175 7150
1183 7150 5747 -5344 -7326 4206 7942 -1741 -8909 -1967 5373 1647 -4333 -2479 1108 46
1197 46 -2013 -1552 -2039 -3131 -572 2273 -1372 -5708 -332 6597 1165 -7990 -4624 6710 6008 -4944
1213 -4944 -6711 3807 8018 661 -4098 468 4817 2013 -216 891 1357 1104 3295 3999 -641
1228 -641 -2507 4227 7619 71 -6753 -100 9044 4156 -6104 -3899 6211 6625 -1796 -4763 647
1243 647 3174 -736 -2471 -783 -139 76 1545 200 -3314 -2594 3124 2638 -5060 -6678 2381 7287
1259G287p791o507N516Q061l114p384J75N987J123l413n27J351K90P22P88j847
1275G17k566K016M250k106o287J151P511Q81q105l648O691M800n129o221J925
1290d120N432p1l800j235K099J560J72k075j997L95L525R15l682k672M390N184
1306D020k240o648K40N856K255m143l738K584M198L60k874j782R24K919M90l485
1322a064k319K899L898j458n305O04N489J852n279m244L066N122n12m707j793
1337c751L281L484k06l826k147K675L897j439m748l71N288K965m683l377K966
1352HM535j150n074j048L642K678j060l119j001K380L157q48m920k374N208L791
1368D805l787n414K706O691j465o756p04N861K294m637l222K251L946J33k223
$$ plain form
1259 7287 -504 -7011 -1495 6566 3452 -3932 -3757 2230 3353 -60 -587 764 1054 1776 2564 717
1275 717 -1849 167 4417 2311 -3976 -2825 4686 5567 -2538 -6186 505 5305 176 -6045 -4120
1290 -4120 1312 1241 -2559 -3794 -1695 -135 37 -2038 -4035 -3640 -115 800 -2882 -5554 -1164 4020
1306 4020 1780 -4868 -4628 1228 3483 -660 -4398 -1814 2384 2744 -130 -1912 -988 1931 2421 -1064
1322 -1064 -3383 -484 3414 1956 -3349 -2745 2744 4596 -683 -4927 -1861 3261 2749 -1958 -3751
1337 -3751 -470 3014 2808 -1018 -3165 -490 3407 1968 -2780 -3151 2137 5102 419 -2958 8
1352 8 4543 3393 -1681 -2729 913 3591 2531 -588 -1589 791 3948 3100 -1820 -4194 1014 4805
1368 4805 1018 -4396 -1690 5001 3536 -3220 -3924 1937 4231 -406 -3628 -1377 2569 2702 479
1383D79j904K25K804K750k558n520J111P193J310p091l655O561N866n100o820
1398d349K647O181q66n575r54L656J593j600j040j047j017K023K316l393m591
1413f016K455O660q61q460n95Q964K768q980m798P128O897n157o462K880O226
1428B649ll570r12Q02O56J764J315l328k756M123N380k716p217J115Q038R3q277
1445b844k384Q158K895o713l603M272L902k988m070P47K197RK63j147k245j21
1461c672M945K208o247m559O030P257m762q582L072R215L92p858j186N973K233
1476D459l459k324J843N55m95J688L90k666o87M106J355n937k352N868L394n647
1492I1n386N379O775m081p383J557O654J16n356j620L029K065l11o95j375j137
$$ plain form
1383 479 -1425 -1200 1604 4354 1796 -3724 -2613 4580 5890 -1201 -4856 1705 7571 2471 -4349
1398 -4349 -1702 4479 3613 -1962 -2916 740 2333 733 -307 -1354 -2371 -348 1968 -1425 -6016
1413 -6016 -3561 3099 2238 -6222 -6817 2147 4915 -4065 -8863 -1735 5162 5 -6457 -3577 2649
1428 2649 2646 -924 -1836 -1034 -378 1386 2701 -627 -3383 740 6120 3404 -3813 -2698 5340 5433 -2844
1445 -2844 -5228 2930 5825 -888 -4491 -219 3683 695 -3375 -2628 -431 -422 -159 -1306 -3551 -3672
1461 -3672 1273 3481 -2766 -7325 -1295 5962 1200 -7382 -4310 4905 5297 -2561 -3747 2226 4459
1476 4459 1000 -1324 519 1074 579 2267 2657 -9 -696 3410 4765 -1172 -3524 2344 5738 91
1492 91 -5295 84 6859 2778 -4605 -3048 3606 3722 -1634 -3254 -225 1840 1529 834 -541 -1678
1508a678K339K701k104m856O84O279J265o681k434N863M026m631m653K712M177
1523C009j460l606o2K574L97o09n42o96m29J773R93k990l070L128N353j644o769
1540d650J78O967J790o039l618M374M452k152l901R92K781J009j758j254j01R80
1556E0J670m49k386r50L348K341l277m103J742N213p94n489j769M015L432k703
1572a09l941P16L222R03j981k497M63K583P63j605k619K020L842K5l956j476L470
1589a77L071k126l622R51M844J073k813k675J991L271k33l224j658K876K754r26
1605C377l637j174L459K008k316l655k46L798J903l240l626J412L772L11l622
1620a476k303K664L006j380l579n7L795J237k391k071J747L285j63l325j441K576
$$ plain form
1508 -1678 661 3362 1258 -3598 -2914 3365 4630 -2051 -4485 1378 5404 773 -3880 -1168 3009
1523 3009 1549 -2057 -2119 455 852 243 -299 -995 -1424 349 1342 -1648 -4718 -1590 3763 2119 -4650
1540 -4650 -4472 2495 4285 -1754 -5372 -998 3454 1302 -2599 -1607 1174 2183 425 -829 -930 50
1556 50 1720 1271 -1115 -2065 1283 3624 347 -3756 -2014 3199 2405 -3084 -4853 -838 2594 -109
1572 -109 -4050 -3334 -112 791 -1190 -3687 -3224 -641 122 -1483 -4102 -2082 1760 1785 -2171 -3647 -177
1589 -177 2894 768 -2854 -1903 2941 4014 1201 -1474 517 3788 3555 331 -1327 1549 4303 3377
1605 3377 -260 -1434 2025 4033 1717 -1938 -2184 1614 3517 277 -3349 -1937 1835 2146 -1476
1620 -1476 -3779 -1115 1891 511 -3068 -3125 670 1907 -484 -2555 -808 2477 2314 -1011 -2452 124
1636A24L238p49k944j051L156K820j423m017j095L457L023l126l639J517L563
1651B854M57m062j959K471K357j811k813k02L039J393j804k508K01K500J617k065
1667c35k841J082L597O90l701j860L538L506k253m117Q65L708J204l758j912K058
1683e29K396k9k443j345O10J896O77k488k114J225L162j75l433j307L292K043
1699A438k583k768J308L778j27k999n44K653K016j102k559o7K524J818p75k761
1715g50j31K746J808j876l067P18L154O76l310k128K286K294j401k663m98K462
1731C20J409j713k422k19K225P92j126k081L05K963J090k350k281J591L137n60
1747A080l143k16L762J953k151k711J163K990L57k548j359K022K073J88k219j594
$$ plain form
1636 124 3362 2613 -331 -1382 1774 4594 3171 -846 -1941 1516 4539 1413 -2226 -709 2854
1651 2854 3311 -751 -2710 -239 2118 307 -2506 -2708 331 1724 -80 -2588 -2387 113 1730 -335
1667 -335 -3176 -2094 1503 2193 -1508 -3368 170 3676 1423 -2694 -1829 1879 3083 -675 -2587 -529
1683 -529 1867 1838 -605 -1950 -1340 556 1233 -1255 -3369 -2144 1018 843 -2590 -3897 -605 1438
1699 1438 -1145 -3913 -2605 1173 1046 -1953 -2497 156 2172 1070 -1489 -1556 968 2786 2011 -750
1715 -750 -881 1865 3673 1797 -1270 -552 2602 3278 -32 -2160 126 2420 1019 -1644 -2142 320
1731 320 1729 16 -2406 -2625 -400 392 -734 -2815 -2510 453 1543 -807 -3088 -1497 1640 1080
1747 1080 -2063 -2279 1483 3436 1285 -1426 -263 2727 3084 536 -823 1199 3272 3460 1241 -353
1763c53J292J874Rk569j167J638K236j311k804n75K878J415k576k775J581L189
1779A982m95l928j029K963K344j600k941N80K550Q50k254j804Q91K037J275j927
1795e06j862J111K811K03l084j851K693L150j162l802J75L627R71k759k117J828
1811e74K344n48j821r00J349J453J3k114j500J983K323n55m040n08M112J797l391
1828e77l271K106M083l69m459l40K661J825k448j819J003J662P18p84j137o08
1844a754J452J958j655k744L10M251J096m391k114L595L767k860l971J151M136
1859B227L08k812j181K370Q83n26j115n10M07J082J104j821k010J754L140j000
1875B300m022n22M453J927m596k640L283L083j581l390L51K484P75j708p01j55
$$ plain form
1763 -353 939 2813 2822 253 -914 724 2960 1649 -1155 -1730 1148 2563 -13 -2788 -1207 1982
1779 1982 1487 -2441 -3470 -507 1837 237 -2704 -2124 426 1276 -978 -2782 -1891 146 1421 -506
1795 -506 -2368 -1257 1554 1757 -1327 -3178 -485 2665 1503 -2299 -2124 1503 2474 -285 -2402 -574
1811 -574 1770 1222 -599 -1499 -150 1303 1316 -798 -2298 -315 2008 1453 -2587 -3095 1017 2814 -577
1828 -577 -3848 -1742 2341 1972 -2487 -2827 -166 1659 -789 -2608 -1605 57 775 -9 -1146 -1754
1844 -1754 -302 1656 1 -2743 -2433 1818 2914 -1477 -3591 4 3771 911 -3060 -1909 2227
1859 2227 2535 -277 -1458 912 1795 1269 154 -356 51 1133 2237 416 -1594 160 3300 2300
1875 2300 -1722 -2244 2209 4136 -460 -3100 183 3266 1685 -1705 -1354 1130 1905 197 -504 -659
1891f59n4K088O2k080j427K359L052j807m340Q77M335L47m503j131M110J803k646
1908C86k103J351K002q64j392K09N27M32M27o30j609J63K541Q91l375k681L402
1925c23L788j920m672L76M457J134l591j794K375J600o75j411r3L34P34P30q33
1942B16j755N48K583k36l130j244L613J755l034l068K427L529j531l362K6K528
1958a35R26j896j322N55J365Q62m25j739p49K249K510j969k940O21M267Q43l695
1975f72j647K907K737j731k542J104J679Oj468l39M47J040K12j012j374p4K668
1992A941j69k636j712K401K977k186l615N39L496P77k713k016J823K522q52j284
2008g07q53P72J930j21j402j592J934K479r80k472l92L182J266k827j928J505
$$ plain form
1891 -659 -713 1375 1437 -643 -2070 289 3341 1534 -2806 -1929 2406 2753 -1750 -2881 1229 3032 386
1908 386 -1717 -366 1636 772 -620 -411 116 548 975 345 -1264 -1101 1440 2331 -1044 -3725 -323
1925 -323 3465 1545 -3127 -2751 1706 2840 -751 -2545 -170 1430 755 -656 -749 -415 319 1049 216
1942 216 -1539 -991 1592 1356 -1774 -3018 595 2350 -684 -3752 -1325 2204 673 -2689 -2663 -135
1958 -135 791 -1105 -2427 -1872 -507 355 -70 -1809 -2558 -309 2201 232 -2708 -2087 2180 3023 -672
1975 -672 -2319 588 3325 1594 -948 156 1835 1841 373 34 481 1521 1733 721 -653 -727 1941
1992 1941 1772 -864 -2576 -175 2802 616 -2999 -2460 1036 1813 -900 -2916 -1093 1429 577 -707
2008 -707 -1560 -788 1142 1021 -381 -1973 -39 2440 1460 -1012 -1404 1778 3044 217 -1711 -206
2024b06L156n65k602q53J835J456q94j480o79J275J524r59k384n44K810J742l050
2041d18k108J643K902q57l119m45K799J269j413k160M92J664M36n36j350m70J910
2058B39J340j478k512P85L333r2l500o75K577J853j792k670P06K951jk073p24
2075a733J186J204J00j074j228L89K119L4j833j467K083K472j881k879P63L329
2091A584L79l018j216K359K081j721j264j71O65J841l96j576j079J025K144k78
2107A359k767n55K919J294k875j918K166K270j065k833qK731N54j365j318Q20
2123e91R10J60l59r75l92J634J549j215k592R73L364m7l150j148L623J528k198
2140A074k495J812J938j58j872m66O16J212j67n06j494Q1J866L80k026j847J755
$$ plain form
2024 -206 2950 2385 -217 -1070 765 2221 1327 -153 -832 443 1967 1008 -1376 -1920 890 2632 -418
2041 -418 -2526 -883 2019 1162 -1957 -2402 397 1666 253 -1907 -1415 249 685 149 -1201 -1671 239
2058 239 1579 101 -2411 -1626 1707 1615 -1885 -2560 17 1870 78 -2592 -1886 1065 1064 -1009 -1733
2075 -1733 -547 657 757 -317 -1545 -1156 963 997 -836 -2303 -220 2252 371 -2508 -1745 1584
2091 1584 1963 -1055 -2271 88 2169 448 -816 -987 -322 1519 1123 -453 -1532 -507 1637 1359
2107 1359 -1408 -1963 956 2250 -625 -2543 -377 1893 828 -2005 -2013 718 1272 -93 -1411 -591
2123 -591 319 479 120 -855 -1247 387 1936 721 -1871 -898 2466 2419 -731 -1879 1744 3272 1074
2140 1074 -1421 391 2329 2171 299 -167 449 1661 1494 988 -506 -425 1441 1821 -205 -2052 -297
2157b97K660j698k887K65L298K49l276r54K307J487j116j812K29J327R99n17r38
2174f74m09Q93J907m13k376m66K770J599k375k448J750L114q91k986n12K474J099
2191B056j981r79K85R04J32l38j232j63Q24J227r83k168K28L003K18k788j354
2208c109L070J583j937k316J586K239l48j303o58R65Q91K73j174p18N19J291L94
2225A248j427j307J366K098r86k721K10K353R16k334j687J900J889q04k200N7
2241a429J353P86n32j197j70J462Q20n21j500j38K094J289j873j964J392K469
2257B341J52k671r33K328J502j564j805K11J652Q53j417j197N2J576K80j301j285
2274a226Q64J750m50k036p49J772J492j274k047M41J984O84j515j462Q37K085
$$ plain form
2157 -297 2363 665 -2222 -1957 1341 1590 -1686 -2640 -333 1154 38 -1774 -1545 -218 781 264 -674
2174 -674 -1083 -190 1717 1304 -1072 -1538 1232 2831 456 -1992 -242 2872 1981 -1005 -1517 957 2056
2191 2056 75 -904 -619 285 417 79 -1153 -1316 -492 735 -248 -2416 -2188 815 1033 -1755 -3109
2208 -3109 -39 1544 -393 -2709 -1123 1116 768 -535 -1193 -228 663 936 -238 -956 -437 854 1248
2225 1248 -179 -1486 -120 1978 992 -1729 -1519 834 1750 -584 -2271 -371 1518 714 -1486 -1429
2241 -1429 -76 710 178 -1019 -1189 273 1093 572 -928 -1066 1028 2317 444 -1520 -128 2341
2257 2341 2493 -178 -1111 1217 2719 1155 -650 -439 1213 2066 649 -548 -496 1080 1360 59 -1226
2274 -1226 -362 1388 938 -1098 -1847 -75 1417 143 -1904 -1463 521 1205 -310 -1772 -935 1150
2290A150K9j693o38Q85J828m09j646p5J225J525j153j661K38J839R23j991j501
2307a125Q55J943j09j870j161J440J522r93j643o35J894P38j206j556M45J602
2323A41r9r95r89N07K003k58j655p12J626J379r17j810j4K085J071j414j212J89
2341a074K325J75j427j152J245J408k61j381o68J485R50j007j411J6J432N22j056
2358A21j869L19K142L83j873q27J151J448n54k084L04J690L89q18r72J35J683
2375G68J38j214j107J095J737K18j986j244J352J912j40k212m14K023Q62j233
2391E55j320M31J373M15j568q52J297R89m39j410m13J222J146p10j505k18J802
2408G95P93j442j370N80K201p8j596r18J155J381m93j553k26J064J101p12j577
$$ plain form
2290 1150 1179 -514 -1152 -267 1561 1152 -494 -569 656 2181 1028 -633 -395 1444 2367 376 -1125
2307 -1125 -270 1673 1564 -306 -1467 -27 1495 502 -1141 -1776 118 856 -350 -1906 -1461 141
2323 141 42 -953 -1942 -1435 568 310 -1345 -2057 -431 948 31 -1779 -1793 292 1363 -51 -1263 -1074
2341 -1074 1251 1426 -1 -1153 92 1500 1239 -142 -810 675 1625 618 -793 -777 655 1177 121
2358 121 -1748 -1429 713 1096 -777 -1604 -453 995 441 -1643 -1339 351 740 -78 -1050 -915 768
2375 768 906 -308 -1415 -320 1417 1635 -351 -1595 -243 1669 1529 -683 -1097 926 1788 555
2391 555 -765 -334 1039 1454 -114 -966 331 1320 881 -529 -942 280 1426 716 -789 -1007 795
2408 795 1588 146 -1224 -644 1557 1479 -117 -1035 120 1501 1008 -545 -771 293 1394 682 -895
2425h95J03J424Q02j167j428N66J764j10j471j093J213J268m97j442l17J431R16
2442A067r84j295K81J350O18j519j053P27J637l10j352r80J782J010n44j753J73
2459a145J517R30j221j526O16J544rj077p52M62J373J97j485r91J359J616p39
2476F69k243K24J786J167j740j015M48J410P0q81j081O58J034j1j001m36O16J202
2494H76n78j431o3J718R85k200j057J291J864q00j438k68J383J041n82j389L7
2511f11R47R84m40j394k44J549J014j181j426M20K093m88j498m84J219J425j358
2528E27j436J47J482J92j039p37M26O18N15o02j216M92J503K43j351j352J437
2545a51J811j040j978L57K317J42j591j370J262J329k43r17p11O29J112r9r47
$$ plain form
2425 -895 -792 632 1434 267 -1161 -595 1169 1059 -412 -1505 -292 976 479 -963 -1280 151 1067
2442 1067 83 -1212 -931 419 1037 -482 -1535 -808 829 519 -833 -1813 -31 979 435 -1318 -1145
2459 -1145 372 1302 81 -1445 -829 715 706 -371 -1123 -661 712 909 -576 -1567 -208 1408 669
2476 669 -1574 -1350 436 1603 -137 -1152 -704 706 776 -105 -1186 -528 506 495 -506 -942 -326 876
2494 876 298 -1133 -1196 522 1507 -693 -1750 -459 1405 605 -833 -1101 282 1323 741 -648 -611
2511 -611 336 1320 880 -514 -758 791 1805 624 -802 -382 1711 1223 -275 -759 460 1885 527
2528 527 -909 -762 720 912 -127 -864 -438 180 695 93 -1123 -631 872 1115 -236 -1588 -151
2545 -151 1660 620 -1358 -1001 1316 1458 -133 -1503 -241 1088 845 -72 -783 -154 958 859 -88
2562h8p45J96J856k84j851p1J614O34j735j349J664J169n79j379p7J427K81o76
2580Gj285K77J017K82k75q47n75J351J382j426j656N65K141K4k141n61J965J080
2598A325j392j288P17J044L21j185n81N13J70J041o84p02k89J629L80j374j196
2615a551J324J441p62j751K90K031O2j769m36R06J335o80p95j68M17P27M14q59
2633A76o98O5J630j58j945k28J549J222j753j129R15J870q29j530p1J310J031
2650A427j251q93L47P33M21k75r95k54J038Q48n85j617M94J985k01j739n08J389
2668C64J088j154j175O61R75J82o80q00J43J082L8l29r43N4J584J12j276j092
2686a166J187J465q58k038M98J783L47j473r63R05J060k78q96l48J79Q57L81j182
$$ plain form
2562 -88 -833 -637 1219 935 -916 -987 627 1261 -474 -1823 -159 1010 431 -948 -1025 402 683 7
2580 7 -1278 -1001 16 298 23 -824 -1399 -48 1334 -92 -1748 -1183 958 982 -1159 -1720 245 1325
2598 1325 -67 -1355 -638 406 727 -458 -1039 -526 -356 685 1 -701 -990 639 1019 -355 -1551
2615 -1551 -227 1214 452 -1299 -1009 1022 1084 -685 -1121 -215 1120 440 -355 -523 -106 621 1035 176
2633 176 -522 -457 1173 1015 -930 -1158 391 1613 -140 -1269 -354 1516 687 -843 -914 396 1427
2650 1427 176 -717 -370 363 784 509 -486 -740 298 1146 561 -1056 -562 1423 1222 -517 -1025 364
2668 364 1452 298 -877 -216 759 941 261 -539 -396 686 724 395 -548 -494 1090 1202 -74 -1166
2686 -1166 21 1486 628 -1410 -912 871 1218 -255 -1218 -313 747 469 -427 -775 -596 261 642 -540
2704e40m82P45R87k80j450l41J768R23j394j279R38J514k64j460m97J104Q03l59
2722D36j151K82N21N72p9j342kQ66J095j251j217P62J305Nj787m92J381R64q97
2741b9j066J57J140L57p26n43J18R32L55n88q80O4J654j82j060n47J077J479r81
2760G31j487j6J586K95r34q24M53N70L85p10n63L97P94k02q96k25J152N87l92
2779G01j794L58J987j71j166r38P27J425j86j288m00J101N55n43p11j95P68Q82
2797A112n69j055l70J411R27j627p94N56J764n52j554j34J238J006j003r17J46
2814d15Q36N73j002k50l69O65P57q88p95L33J507j42j518n17J310P64j059j381
2832a591R23J400K46j538n10P82P23J00j057k45j86J293M36j022o20P35J142o48
$$ plain form
2704 -540 -1022 -277 710 430 -1020 -1361 407 1330 -64 -1343 -405 1109 845 -615 -1112 -8 795 436
2722 436 -715 -433 88 660 581 -761 -763 103 1198 -53 -1270 -508 797 802 -985 -1477 -96 868 -29
2741 -29 -1095 -938 202 559 -167 -710 -592 340 695 107 -773 -709 945 763 -297 -844 233 1712 731
2760 731 -756 -772 814 1109 175 -649 -196 374 759 49 -514 -117 677 475 -421 -646 506 1093 701
2779 701 -1093 -735 1252 1081 -85 -1023 -296 1129 943 -345 -745 356 911 368 -343 -538 230 1112
2797 1112 543 -512 -882 529 1456 -171 -965 -409 1355 803 -751 -885 353 1359 356 -561 -415
2814 -415 421 994 -8 -258 -627 38 795 -93 -888 -555 952 810 -708 -1225 85 849 -210 -1591
2832 -1591 -668 732 978 -560 -1070 -288 435 535 -522 -767 -953 340 776 -246 -866 -131 1011 363
2850C63j473j14J772J98j061j115J436R31q18q76p0R24N80m98q24l19O86P46l88
2869H0j086p2J403O61j151r95N23J193J30j610j94J014J267q27j014k2J006O13
2887I19n52r12Q8R00M70p44p09M11P36J31j126k74Q30J257j130j147M15J190l4
2906G19j028r05Q41R27O1q23o62Q87R44k71j017j70N90R30n30j170j3J242N56
2925A108j286l44O87R02l11q74n12R95O68l07p78j46L90P56n00j020n9J080O24
2944A073j240p09N76J049k68j115l99R67P11n13j263N00P82M36p90q24L75P70
2962A18P21j022n24M84Q20L7p26r19J203J076p97j190O6J062O17j043r75O05R78
2981E91J23j033p47P84O73O9r75j97Q58K22p32m55p3R80J86n61q32L22J203m06
$$ plain form
2850 363 -1110 -1224 548 746 -315 -1430 6 937 119 -757 -827 97 677 179 -645 -964 -278 468 80
2869 80 -1006 -1078 325 986 -165 -1160 -637 556 686 -924 -1118 -104 1163 336 -678 -700 306 919
2887 919 367 -545 -457 443 913 169 -540 -129 607 738 -388 -662 168 1425 295 -852 -437 753 719
2906 719 -309 -1214 -373 554 615 -208 -870 17 961 690 -327 -497 93 1023 493 -677 -690 552 1108
2925 1108 -178 -522 165 1067 756 -118 -630 365 1033 726 -52 -198 192 948 448 -572 -631 449 1073
2944 1073 -167 -876 -300 749 481 -634 -1033 -66 645 132 -1131 -631 151 587 -203 -1027 -652 118
2962 118 839 -183 -707 -223 597 634 -92 -1011 192 1268 471 -719 -653 409 1026 -17 -992 -387 591
2981 591 714 -319 -1066 -282 391 460 -515 -712 146 368 -364 -819 -892 88 274 -287 -1119 -797 406 0
3001@q35l95J133J020p94p51l96J099R93o46j245K73J132K92q16p35O88R32j20
3020H29q17n32M80P99j91j280J55R96J93p36p15M86J023j27m62j039N26J199k77
3039E10j208Q1N47Q41n25p91Q0Q31Q21j098p63M08J022L68j233m12P56O49j70
3058G14o56l77L52P74p73m59N4P42J80j78j250O00R99m02j233J12Q19P01n71p57
3078f09j23Q16P59r10o53p8J193J81n38p80N78Q88j94p50m92P27P64kj138k37
3098e98J173L38p86j044K22P73N95j107m45J96J184j11j251j18P47N58n6j235
3116i65K55L11J146p72r04K95Q24M62j009j52L88P34j19r28nP09K18l06n99K81
3136a36M25P20r29l97M7Q55mq08m85N68R23l73r31J11M26O47p33p87J73Q65K96
$$ plain form
3001 0 -835 -1230 -97 923 129 -622 -1018 81 1074 428 -817 -544 588 880 64 -671 17 949 829
3020 829 12 -520 -40 759 568 -712 -557 439 632 -104 -819 -333 690 563 101 -938 -412 787 510
3039 510 -698 -617 -70 771 246 -545 -465 366 1187 89 -674 -266 756 1124 -109 -521 235 884 714
3058 714 58 -319 33 807 34 -425 -371 371 551 373 -877 -277 722 320 -913 -801 18 719 148 -609
3078 -609 -732 84 843 -67 -720 -798 395 576 38 -742 -164 724 530 -220 -712 15 779 777 -361 -598
3098 -598 575 913 127 -917 -695 78 673 -434 -879 -683 501 390 -861 -979 -232 326 270 -965
3116 -965 -710 -399 747 -25 -929 -634 190 652 -357 -509 -121 613 494 -434 -439 270 488 182 -417 -136
3136 -136 289 1009 80 -317 -270 585 581 -227 -712 -144 779 406 -525 -414 12 659 -74 -861 -688 177 473
3157D73o14o54L50Q55L16r59n45O61Q28k21r46k06J029N86o60j136M12J077q9
3176E57p26l43L79R13l60n22j62M20P30m40o06l97P97P28j077m86m5J117M10j093
3196b06n90M38J222m40m71k19L17L81k46m36j13M42M82o98m85L28R51N7j278n36
3216a100J389N85m94q47J02R91q0o85o95O54N20q0m66n00Q8J176M1j203j89M56
3236c37J021k65j003k28R87M56r11l87K30P56k2m56l62L86N88l33k30m07N46N67
3256E96k96p52q9Q59N85j133r30O19J319k43q01m70N85L48J00p25k57N66L14n5
3276A40m75l59N11Q18p46o32L22P74J89q34n42J005R18n89q86j3J180J11r17j33
3296a58K81K40L61n39k25k03R52q6l54r13L52Q43N6j157o3Q80O24r88n47L75R93
$$ plain form
3157 473 -141 -795 -445 410 726 -233 -778 -117 711 490 -456 -662 367 953 293 -843 -431 646 557
3176 557 -169 -512 -133 780 420 -102 -264 156 886 446 -160 -557 240 968 -109 -595 -640 477 887 -206
3196 -206 -796 -358 864 424 -47 -266 51 432 186 -250 -363 79 561 -137 -622 -294 657 714 -564 -1100
3216 -1100 289 874 380 -467 -365 626 546 -139 -834 -180 340 260 -206 -706 -618 558 599 -604 -793 -337
3236 -337 684 419 -584 -812 175 631 -280 -667 -437 319 297 -159 -521 -135 453 120 -110 -517 29 596
3256 596 300 -452 -541 318 903 -230 -1160 -541 778 535 -266 -736 -151 197 297 -428 -685 -119 195 140
3276 140 -335 -694 -183 635 -111 -743 -421 353 542 -292 -834 171 1089 500 -386 -399 781 892 -25 -158
3296 -158 123 363 724 185 -40 -243 709 623 269 -644 -292 551 607 -550 -613 267 891 -97 -644 -269 724
3317G24m61l85n68O79J59K8k51n31N47P03Kr18k69P22P50j116n81K88J575l22
3337G75r39m88M57M41J13p97J40L73L63k34n59j13M61M85o38m71J91Q16K07j037
3357d54m78R18P32n16j041L29Q36J64p60k66J94N60K46l49o77O0Q98J91q64n85
3377h62O19Q35k38j031jJ041J98p55m25M37N65j77l78m22K10N53K75n94n10P62
3397A02M40l39q27L4J002K10o22p98Q18P16k1j008k21N27P92m51o49j35P94K74
3417F38m86n88J4P20L27k93p23l1R69Pp91l09N07O41n62m62Q8K73P63o55l95N5
3439b93N91K6j61l40K37N02q8l58n65O34O45k75j108L80Q79l4o32n51J63Q84J13
3460F49m78n82M29M12k17l92l76N97K83K59j129p6Q68M05q52l77L87N08J05r09
$$ plain form
3317 724 263 -122 -690 -11 148 176 -75 -606 -59 644 646 -272 -541 181 931 -185 -766 -478 1097 775
3337 775 -164 -652 -195 246 359 -438 -298 75 438 204 -355 -468 -7 478 -160 -631 -440 376 583 -454
3357 -454 -932 -14 718 202 -839 -510 326 490 -270 -536 -342 218 464 115 -562 -502 396 587 -277 -862
3377 -862 -243 592 354 -677 -678 363 561 -194 -619 -182 383 206 -172 -594 -384 169 444 -150 -660 102
3397 102 542 203 -624 -590 412 622 0 -798 20 736 715 -293 -514 13 805 354 -295 -430 364 638
3417 638 152 -436 -422 298 625 332 -391 -422 547 554 -237 -546 -39 602 40 -422 -334 -61 702 47 -348 -293
3439 -293 298 324 163 -177 60 562 474 116 -449 185 830 555 -553 -173 706 672 40 -511 -348 536 649
3460 649 171 -411 18 430 213 -179 -555 42 325 584 -545 -621 247 652 -200 -577 -190 318 423 -486
3480d86j03N06L06K11o18k84O66M79m30o38q0Q78K43o57k56l06P99N27r26l43
3500e12K73N02j89o32l56R35L09n39k92N0N03M07m45l47j18Q35j27m54k20J75
3520b42J039n18n59m1N78N04o86l32K0Q98j29o28l12K8Q65j20n84n25M72O21l58
3541ip59P2Q93j0j43o17K9R87r2p12k46O91M80m5q05m8N71K46o7m80o6N86L02
3564G58l64q04L59O89J78q65l49M29P40m24o26p7O75l3j22o60J73O71J70n14l40
3585c36j37J022o3n65n91N74M99k69m78m5Q93l9l19q25M44O64J60o88j41J73L78
3606C11M64q35k80N1Q77k92n86r2K02N15m41o02K75N82K35r48k97O22N63l1p58
3627d65k81N98K71m23k63l3J095j11n08l98J01O25J85l92m56N62K21N5p85q3L76
$$ plain form
3480 -486 -589 -83 223 434 -184 -468 198 677 247 -391 -471 407 650 -7 -263 -569 230 757 -169 -512
3500 -512 -239 263 74 -558 -914 21 330 -209 -501 -451 52 459 14 -333 -451 384 257 -197 -417 -242
3520 -242 797 279 -280 -321 257 761 75 -257 -237 661 532 -96 -408 -380 485 365 -219 -744 -272 349 -9
3541 -9 -768 -696 197 187 44 -573 -544 443 351 -361 -607 84 564 519 -286 -334 237 483 416 -64 -130 456 758
3564 758 394 -410 -51 638 816 -49 -398 31 771 347 -279 -356 319 286 164 -496 -323 348 518 4 -336
3585 -336 -473 549 486 -79 -670 -96 403 134 -344 -389 504 465 146 -679 -235 429 589 -99 -240 -67 311
3606 311 775 -60 -340 -289 588 296 -290 -382 -180 335 -106 -708 -433 149 384 -564 -861 -239 324 293 -465
3627 -465 -746 -148 123 -300 -563 -596 499 388 -120 -518 -417 208 393 1 -455 107 328 383 -402 -485 -109
3648a09P06m21o91J44K54L47n10k55J0O81j61o75LM21L22J22r26K37N33K20J8
3669B70r95L55P37K27n72m10N71K20j30k95l42N80O93l95m95l46L94M90l95k53
3689i1L5L15J46m52n01L84Q29k88r49L3N82M88l56o97J08O72K63o02l50K36N68
3710C73J8m16o95O21P04N0n52n04O60L31m68o28L28M43M75p56k70K00O48Ml64
3731B02n90K97O06j42p40k74J087j06m55k80k4N15L23p35l0P9N70j22l88n27O16
3752a18O27n53o77J92L48Q22l45p36j08Q88J61n47j73k79Q38j46n72m3O01K74
3772D54p3p31j43O53K14j03o67Q9N88k9o33j67N14M0N06j303K64M48Q56n49r16
3793f88l1P79K30k91k06Q6P79k84m47k95P59j03k1n91L73N9L37m57n42L58N09
$$ plain form
3648 -109 597 176 -515 -371 -117 230 -280 -535 -525 156 -5 -680 -677 -256 66 188 -738 -501 32 252 270
3669 270 -725 -370 367 594 22 -388 183 403 273 -22 -364 216 909 514 19 -327 67 557 162 -91
3689 -91 -56 259 405 -47 -548 -164 665 377 -572 -539 43 531 175 -522 -414 258 521 -81 -431 -195 373
3710 373 391 -25 -720 -99 605 655 103 -401 259 590 122 -506 -178 265 740 -16 -286 -86 562 566 202
3731 202 -388 -91 515 373 -367 -641 446 340 -115 -395 -419 96 419 -316 -346 -267 303 181 -207 -734 -118
3752 -118 509 -44 -721 -529 -181 641 296 -440 -548 340 501 -46 -219 -498 340 194 -378 -421 180 454
3772 454 381 -350 -493 160 374 271 -396 -307 281 252 -381 -548 -34 6 512 -791 -527 -79 777 228 -688
3793 -688 -719 60 290 -1 -207 -121 658 374 -73 -368 391 288 267 -324 49 108 445 -12 -554 -196 313
3814C13K43o95j61J08M33k81k33l79P91K12j47m73N8K64M50m06k71k43O29O06
3834H18p17q4j0N73K02q33o26J036K44k63n08J50K79K31m45k39m1P37j55m57j73
3855b81L01M62k79m88l55P96K75m40n03P2O70J75n85j79N9O35l23j04j82K84J89
3876A99Rl47o23O96P10k61l77k57L95K00n00j31K83L56Kq10P9M92K6q7l99n8P89
3899C86j68j07n74l47J106N8m26n98M55O66p6n49l31N95L99n42k31j0K46L12k46
3920A8o21J47N67N2l13j03K26L48K5n40l48N85L32j66p25J91L53M49n29j68J42
3941g8M74J8n07j19K76M84k75j18k14R8O97m32p42m7R59J92o69j84j7O96j42m57
3963a07j59M34K43j41o36K18J73N53l46m87j46M39K89m31l88P8O54j85m12j31
$$ plain form
3814 313 556 -139 -300 -192 241 -40 -273 -652 139 351 204 -269 -211 53 503 97 -174 -417 212 818
3834 818 101 17 7 580 782 -51 -677 359 603 340 -168 -18 261 492 47 -192 -233 504 349 -108 -281
3855 -281 20 482 203 -285 -640 156 431 -9 -512 -440 230 405 -180 -359 -300 335 12 -92 -274 10 199
3876 199 208 -139 -762 -66 644 383 6 -251 144 344 -156 -287 -4 352 354 -456 -377 115 141 54 -345 -403 386
3899 386 218 111 -463 -810 296 354 -72 -670 -215 451 375 -174 -505 90 489 -53 -284 -294 -48 264 18
3920 18 -603 -456 111 163 -150 -253 -27 321 346 -194 -542 43 375 209 -516 -325 28 477 -52 -220 -78
3941 -78 396 414 -93 -212 64 548 273 155 -59 39 736 304 -438 -485 474 666 -3 -187 -204 492 350 -107
3963 -107 -266 168 411 270 -366 -148 25 578 232 -255 -401 38 327 -104 -492 -414 240 55 -357 -488
3983d88L95J15M5l35n1N32K36k97n88K93M44Q7k11l83KM06P8m87k40N82L85k01
4005C19n80o0O51k70L9n00L33J72r1k27l89K61O57l68l14k88M35N42n3q28J98
4026c61O76j93j82l73K68M65J6p21J16K97M14k23j88O2QL08m70l11q6N11N54o68
4048h1o25O57J71L76n76k84L13O03n07l07l31R74J28k75n82k55R82J69m35l08
4068a93J65K58P4n89l75J018J43l27m94M66L62j01k27n04J23L38J10r9l52J77
4088b7K19j40k77j88N24J6K22q84M86K78K67m94k05J92J51J72l32m3K06j4P6m32
4110b27K82j4N04m26k50l78O87K53k84k28k77R39m16k72k11L78K58m19n56J49
4130e08L38O96q21k2K5M15L18n15k71L21K76P8n81j64J98O84o84j73J0N85L11
$$ plain form
3983 -488 -93 22 67 -268 -319 213 449 152 -436 -143 301 388 177 -206 -204 202 280 -207 -447 135 520 319
4005 319 -261 -321 330 60 99 -401 -68 104 13 -214 -603 -342 315 -53 -367 -655 -220 322 269 -559 -361
4026 -361 315 122 -60 -433 -165 300 316 -405 -289 8 422 199 11 73 81 389 -81 -392 -478 33 587 -81
4048 -81 -706 -49 122 498 -78 -362 -49 554 47 -260 -591 383 511 236 -346 -601 381 550 115 -193
4068 -193 -28 230 304 -285 -660 358 501 174 -320 146 508 407 180 -324 -201 137 247 148 -204 -27
4088 -27 192 52 -225 -413 111 127 349 -535 -49 229 496 2 -203 -11 140 312 -20 -63 143 129 205 -227
4110 -227 55 41 545 119 -131 -509 178 431 147 -81 -358 581 165 -107 -318 60 318 -101 -657 -508
4130 -508 -170 526 -295 -317 -292 123 441 -74 -345 -24 252 330 -251 -415 -217 467 -217 -390 -380 205 516
4151E16o13l22M51L4J30j69r3o3J60J84o93J29M92m8j26m57j00Q38J80p20n45
4172h35R94K32j98m08J86l3L49j64k88q1J85L51J2n75k64J001R7o61l52N08K90
4193C46j16n32R1L66L4K2m27r3J17L84j60l76L33L50L6l01m76K45K15J12k32l15
4215c77O97J38k37l67o4L20lJ06j19M0Q4J31m04j73J53O29l12m90l63R48N1j34
4237B54n65P7K16N56n61k18n7O88n9o15N9J03L50j47l97j56N94K58m04k27j16
4258c67N69L20q05P4q0O56k62j77k15J55N76k71j22k42M21K40o27l59J43O09k59
4279b3M3m86L08O47m6q03j15O58K48k58n31N7M41J63l68k34P7M98k95n6o7l1L80
4302B07O8l27j67L93j46K32k71o9L9L97k17n61K27L35L08l96l12K20M24j12p63
$$ plain form
4151 516 -97 -419 32 66 196 27 -66 -129 31 215 -478 -349 143 95 -31 -488 -588 250 430 -290 -835
4172 -835 159 391 193 -215 -29 -62 287 123 -165 -246 -61 290 302 -273 -537 464 561 -100 -452 56 346
4193 346 230 -302 -211 155 189 211 -216 -309 -192 192 32 -344 -11 339 375 74 -402 -157 58 170 -62 -377
4215 -377 320 458 221 -146 -210 110 107 213 94 134 218 349 -55 -228 -75 554 242 -248 -611 337 388 254
4237 254 -311 -234 -18 538 -23 -241 -298 390 331 -284 -225 -122 228 81 -316 -472 122 380 -24 -251 -367
4258 -367 202 522 -283 -209 -289 367 105 -72 -287 -132 444 173 51 -191 230 470 -157 -516 -373 236 -23
4279 -23 20 -466 -158 489 443 -360 -475 183 431 173 -358 -301 140 303 -65 -299 -222 276 -19 -75 -142 -173 207
4302 207 275 -52 -219 174 28 260 -11 -80 -41 356 139 -422 -195 140 448 52 -260 -40 384 272 -491
4323d91P1O30K41m55l20J20K50L86l66k75K05K80k5k46m00M76O9J21n74J14L41
4344A52Q0K6l53k93Q69k73m33J23J23L66o1o64R7J80M92m98m07J8N70N17q32R3
4366a08n7N04R3l78n12M05L23j59m59R4K90J42m17P1l3K63K80o31j59K21N08j59
4388A22o30J14N67K53j25n35R6o6O19m63j73j4L07K26k12m86L38M92k02k78l80
4409d30J24N73pn78j23P24O1l75l27p0P16pm13j66N07j36J62k50j29l0M08j03
4431A31m02j50N78J79l11n33J88N70L5l09k76L08j13M22n65p0K17O49l25n95k27
4452e99M02N32j65m57l9P15j0m49m2r6L07Q2k77j72P14J52m50m17L0M10J43M8
4474C62o23K4N85j91n7k20K70R6M7n60o9O86j45l33j90K36N49l15k79k99M80K35
$$ plain form
4323 -491 -420 210 451 -4 -324 -204 46 432 66 -209 -4 276 251 5 -395 81 150 271 -303 -189 152
4344 152 232 258 -95 -388 481 208 -225 -102 21 387 326 -338 -241 -61 431 -67 -474 -456 114 631 -201 -108
4366 -108 -165 339 432 54 -458 -53 270 111 -348 -254 36 178 -239 -168 -201 62 342 -289 -448 -227 281 122
4388 122 -508 -394 173 426 301 -234 -138 -204 415 -48 -221 -235 72 298 86 -400 -62 430 228 -50 -430
4409 -430 -306 267 260 -318 -441 283 344 -31 -358 -428 288 281 -132 -298 209 73 235 -15 -144 -174 234 131
4431 131 -271 -421 157 336 25 -508 -320 250 285 -24 -300 8 -105 317 -248 -318 -101 548 223 -372 -599
4452 -599 -197 335 170 -287 -326 389 379 -70 -112 -208 99 181 -96 -268 446 598 148 -269 -239 171 314 362
4474 362 -261 -237 348 157 100 -120 150 246 293 -267 -336 350 205 -128 -318 -82 467 152 -127 -426 54 289
4496B89k4m20j50K46M9L30l31k20M33J37k53k7k33L54M43r14P2Q0M06j93o3l42
4518c31M17K7j10m1k36K81L29l18m28J8Q04j76l98j19l9N36J7m45j35M72M47o00
4540b8k06m9O09j23M1n64J0M23K60n05m64O03M20n68j58Q3K14L77l59o24O7O80
4562A39K7l61j23K31r0J45O0k84L42Q8j34m39L93M20O0l97l71K12K86l7j99j01
4584a33M72o5J22n53k8K66L10k48l51k1K27J65L6l70j32O28j54n13J66N00j5K42
4606E51r61K82J97J73l69M1j93M87j02K6l03O7J94M5l09J7L8M07J20p43M37P0
4628A72Q9m52n0MM22L24m58k05k3L72J31m80j92L82L68k01k91j12J14M43m66k58
4650c67L99K84j44m09J05m2L38j76k14j48J83L63k52r7q3O14j18n66j91L45L40
$$ plain form
4496 289 265 -155 -305 -59 -10 320 -11 -231 202 339 86 59 -174 180 623 -291 -219 -139 267 74 11 -331
4518 -331 86 113 3 -38 -274 7 336 18 -410 -392 412 236 -162 -281 -320 216 233 -212 -347 125 572 -28
4540 -28 -234 -283 326 203 244 -320 -310 113 373 -132 -596 7 427 -141 -299 -216 -2 375 16 -608 -541 139
4562 139 166 -195 -318 -87 -177 -32 28 -256 86 174 40 -399 -6 414 474 77 -294 -82 204 167 -32 -133
4584 -133 339 274 396 -157 -185 81 391 143 -208 -229 -2 163 199 -171 -303 325 171 -342 -176 324 309 551
4606 551 -410 -128 69 242 -127 -86 -279 208 106 132 -171 -104 90 135 -174 -157 -119 288 408 -335 102 172
4628 172 261 -191 -241 -237 185 509 51 -154 -177 195 326 -154 -346 36 404 203 -88 -200 -86 357 -109 -367
4650 -367 32 316 172 -237 -132 -174 164 -12 -226 -374 -191 172 -80 -177 -260 354 236 -330 -521 -176 164
4671A64J88m40j70Q6L82o5k87j7M18j0q3m11p2L17K24l16l84M59J97o6k19k36
4693c41j2N17L8m60r5M42K07l83q3J15N6K39k88n4K53n5J33l43k30L55J55j46
4715B0k85J4M48J30m46j95J84M62k63k13j3J84K4K51n62P6M32J10j39m07J8L18
4737A48J52k90n68M53M38p9p36K51L40M82k15l89K98m73M23j80q9k19L20L11k43
4758A35m66p8P93k12l27QK40L05k68m56L4J74K51r0l92j68O33j24N8k00l8L81
4780A93j59m81O4N88Q2L7q75M49L36r9K38o19J02K42J5m17K58k28K91j90P6m62
4802e59L97M55j97k38j88N32L3j31l20l68P01o6m91K75J54K27j06m17J98K99k02
4823a2J30n32lN37P3l17o3J69L27j65l89mJ61M40l29m19J77M69J76o98J92NoJ43
$$ plain form
4671 164 352 -88 -258 -172 210 145 -142 -159 259 249 166 -245 -317 0 224 -92 -476 -17 180 114 -105 -341
4693 -341 -353 164 202 -258 -353 89 296 -87 -170 -55 1 240 -48 -102 151 96 229 -114 -344 11 166 20
4715 20 -265 -251 197 327 -119 -314 -130 332 69 -144 -157 27 51 302 -260 -184 248 358 219 -188 -170 148
4737 148 300 10 -558 -105 333 254 -482 -231 109 591 376 -13 285 -188 235 55 -34 -253 67 378 135
4758 135 -331 -409 384 172 -155 -147 93 398 130 -326 -292 -118 133 43 -349 -517 116 -8 50 -150 -188 193
4780 193 34 -447 -383 205 287 324 -551 -102 234 135 373 -246 -144 98 113 -304 -46 -274 17 -173 -97 -559
4802 -559 -162 293 96 -142 -330 202 235 104 -216 -584 117 51 -440 -165 -11 216 110 -307 -109 190 -12
4823 -12 118 -414 -417 120 193 -124 -187 -18 309 144 -245 -249 -88 352 23 -396 -219 250 426 -272 -80 -75 -81 62
4847F2l87m9L70K49j57j12k15M98K1j26l19k14P51j92Q7l06K7J21P6k27J3J61
4869A32K34Jn06J72O0K19L2m87j83M19K09k78k20K67J87o8j81l07L22K95l23j0
4891a4k38M12K8j16l93R3M69j61m01L70o5K6J93l90k57L64K52k73M3l30N47j24
4913C5l2j91K34JL57l73l18J75N0l0l32R3M40l5r3n28J14M96R8k51J60o8J09M5
4937A56q0k02J10L20l35O3l67O93l32k89j2k8O76k51k11l13o2P87j9m68q5n2N53
4960B52K9m35q6L7K41j17m9J18K25r9m54k18L37M16N7l82j37L56L6J84m69O0K68
4983A70L53n86p7Q0K65L1l40j53L46q6K10k87j07M70P0l06k58q1L27L47m71m29
5005e12J74O09rj62k63K57j71J96l35q4J66O91m53k92j32O39k62l8j41L1L35m47
$$ plain form
4847 62 -325 -374 -4 245 88 -24 -239 259 280 154 -165 -379 372 180 267 -39 -12 109 185 -42 -29 132
4869 132 366 367 -139 33 93 312 344 -143 -326 93 302 24 -196 71 258 190 9 -298 24 319 -4 -14
4891 -14 -252 160 188 72 -321 -228 241 80 -321 49 -16 10 203 -187 -444 -80 172 -101 -58 -388 159 35
4913 35 3 -188 46 47 404 31 -287 -112 -62 -92 -424 -331 109 74 -19 -547 -433 63 161 -90 70 2 111 156
4937 156 76 -126 -16 304 -31 32 -335 358 26 -263 -275 -303 373 122 -89 -402 -464 323 304 -164 -249 -301 252
4960 252 281 -154 -240 -203 38 -79 -128 -10 215 116 -338 -556 -219 197 254 -128 -265 91 127 311 -158 -98 170
4983 170 523 -63 -140 -60 205 236 -104 -257 89 3 213 -74 -181 289 359 53 -205 -286 41 388 -83 -512
5005 -512 -338 271 262 100 -163 94 -77 119 -216 -300 -134 557 104 -188 -320 319 57 19 -122 -91 244 -203
5027b03J58m13L71L70k48j67J16l2K40k15k35mL86O8j32j85M7M73k55j11l61J87
5049a45K93J20m98K96R9P4j82k93J04L20k39j59O2J51M9J63n14P7M01q1n3k10
$$ plain form
5027 -203 -45 -458 -87 283 35 -132 -16 -48 192 -23 -258 -262 124 192 60 -125 -78 395 140 29 -332 -145
5049 -145 148 268 -230 66 165 239 57 -236 -132 188 -51 -210 -148 3 52 215 -299 -222 179 98 45 -165
$$ [...]
8191c9
##END NTUPLES=NMR FID
##END=
