##TITLE=1H_SAV-56(6-07)
 DMSO-d6, 8 sc, 
 7.7.2020
##JCAMPDX= 6.0         $$ Bruker NMR JCAMP-DX V2.0
##DATA TYPE= NMR FID
##DATA CLASS= NTUPLES
##ORIGIN= UXNMR, Bruker Analytische Messtechnik GmbH
##OWNER= root
$$ XWIN-NMR		Version 3.5
$$ Tue Jul  7 10:26:12 2020 Russian Standard Time (UT+4h)  she@DPX200
##.OBSERVE FREQUENCY= 200.1315
##.OBSERVE NUCLEUS= ^1H
##.DELAY= (6, 6)
##.ACQUISITION MODE= SIMULTANEOUS
##.ACQUISITION SCHEME= undefined
##.AVERAGES= 8
##.DIGITISER RES= 18
##SPECTROMETER/DATA SYSTEM= spect
##.PULSE SEQUENCE= zg30
##.SOLVENT NAME= DMSO
##.SHIFT REFERENCE= (INTERNAL, DMSO, 0, 15.7039)
##AUDIT TRAIL= $$ (NUMBER, WHEN, WHO, WHERE, WHAT)
$$ ##TITLE= Audit trail, XWIN-NMR		Version 3.5
$$ ##JCAMPDX= 5.01
$$ ##ORIGIN= Bruker BioSpin GmbH
$$ ##OWNER= she
$$ F:/spectra/data/she/nmr/H-F/1/audita.txt
$$ ##AUDIT TRAIL=  $$ (NUMBER, WHEN, WHO, WHERE, WHAT)
(   1,<2020-07-07 10:25:09.31 +0400>,<she>,<DPX200>,
      <created by zg, POWCHK disabled, PULCHK disabled
       configuration hash MD5:
       00 E9 B6 7A A2 85 ED C7 34 08 36 98 17 FE 4E 26
       data hash MD5: 16K
       E9 35 CD E8 8C F5 56 0C 33 DB 7C BA 76 CC 0C FC>)
$$ ##END=
$$ 
$$ hash MD5
$$ 24 82 CC C0 8E 98 F1 A7 A5 77 22 19 AB 3C 91 07
##$RELAX= 
##$RELAX= 
##$RELAX= 
##$RELAX= 
##$RELAX= 
##$RELAX= 
$$ Bruker specific parameters
$$ --------------------------
##$DU= <F:/spectra>
##$EXPNO= 1
##$NAME= <H-F>
##$PROCNO= 1
##$TYPE= <nmr>
##$USER= <she>
##$AMP= (0..31)
100 100 100 100 100 100 100 100 100 100 100 100 100 100 100 100 100 100 
100 100 100 100 100 100 100 100 100 100 100 100 100 100 
##$AQSEQ= 0
##$AQ_mod= 1
##$AUNM= <au_zg>
##$AUTOPOS= <>
##$BF1= 200.13
##$BF2= 200.13
##$BF3= 200.13
##$BF4= 200.13
##$BF5= 200.13
##$BF6= 200.13
##$BF7= 200.13
##$BF8= 200.13
##$BYTORDA= 1
##$CFDGTYP= 0
##$CFRGTYP= 5
##$CHEMSTR= <none>
##$CNST= (0..31)
1 1 145 1 1 1 1 1 1 1 1 1 1 1 1 1 1 1 1 1 1 1 1 1 1 1 1 1 1 1 1 1 
##$CPDPRG= <>
##$CPDPRG1= <>
##$CPDPRG2= <>
##$CPDPRG3= <>
##$CPDPRG4= <mlev>
##$CPDPRG5= <mlev>
##$CPDPRG6= <mlev>
##$CPDPRG7= <mlev>
##$CPDPRG8= <mlev>
##$CPDPRGB= <>
##$CPDPRGT= <>
##$D= (0..31)
0 1.2 0 0 0 0 0 0 0 0.06 0 0.03 0 0 0 0 0.0002 0 0 0 0 0 0 0 0 0 0 0 0 
0 0 0 
##$DATE= 1594103108
##$DBL= (0..7)
120 120 120 120 120 120 120 120 
##$DBP= (0..7)
150 150 150 150 150 150 150 150 
##$DBP07= 0
##$DBPNAM0= <>
##$DBPNAM1= <>
##$DBPNAM2= <>
##$DBPNAM3= <>
##$DBPNAM4= <>
##$DBPNAM5= <>
##$DBPNAM6= <>
##$DBPNAM7= <>
##$DBPOAL= (0..7)
0.5 0.5 0.5 0.5 0.5 0.5 0.5 0.5 
##$DBPOFFS= (0..7)
0 0 0 0 0 0 0 0 
##$DE= 6
##$DECBNUC= <off>
##$DECIM= 24
##$DECNUC= <off>
##$DECSTAT= 4
##$DIGMOD= 1
##$DIGTYP= 9
##$DL= (0..7)
0 120 120 120 120 120 120 120 
##$DP= (0..7)
150 150 150 150 150 150 150 150 
##$DP07= 0
##$DPNAME0= <>
##$DPNAME1= <>
##$DPNAME2= <>
##$DPNAME3= <>
##$DPNAME4= <>
##$DPNAME5= <>
##$DPNAME6= <>
##$DPNAME7= <>
##$DPOAL= (0..7)
0.5 0.5 0.5 0.5 0.5 0.5 0.5 0.5 
##$DPOFFS= (0..7)
0 0 0 0 0 0 0 0 
##$DQDMODE= 0
##$DR= 18
##$DS= 0
##$DSLIST= <SSSSSSSSSSSSSSS>
$$ [...]
##$SUBNAM2= <"">
##$SUBNAM3= <"">
##$SUBNAM4= <"">
##$SUBNAM5= <"">
##$SUBNAM6= <"">
##$SUBNAM7= <"">
##$SUBNAM8= <"">
##$SUBNAM9= <"">
##$SW= 24.9337058887773
##$SWIBOX= (0..15)
0 0 2 0 0 0 0 0 0 0 0 0 0 0 0 0 
##$SW_h= 4990.01996007984
##$TD= 16384
##$TD0= 1
##$TE= 0
##$TE2= 300
##$TE3= 300
##$TEG= 300
##$TL= (0..7)
0 120 120 120 120 120 120 120 
##$TP= (0..7)
150 150 150 150 150 150 150 150 
##$TP07= 0
##$TPNAME0= <>
##$TPNAME1= <>
##$TPNAME2= <>
##$TPNAME3= <>
##$TPNAME4= <>
##$TPNAME5= <>
##$TPNAME6= <>
##$TPNAME7= <>
##$TPOAL= (0..7)
0.5 0.5 0.5 0.5 0.5 0.5 0.5 0.5 
##$TPOFFS= (0..7)
0 0 0 0 0 0 0 0 
##$TUNHIN= 0
##$TUNHOUT= 0
##$TUNXOUT= 0
##$USERA1= <user>
##$USERA2= <user>
##$USERA3= <user>
##$USERA4= <user>
##$USERA5= <user>
##$V9= 5
##$VALIST= <valist>
##$VCLIST= <CCCCCCCCCCCCCCC>
##$VD= 0
##$VDLIST= <DDDDDDDDDDDDDDD>
##$VPLIST= <PPPPPPPPPPPPPPP>
##$VTLIST= <TTTTTTTTTTTTTTT>
##$WBST= 1024
##$WBSW= 4
##$XGAIN= (0..3)
0 0 0 0 
##$XL= 0
##$YL= 0
##$YMAX_a= 149369
##$YMIN_a= -96790
##$ZGOPTNS= <>
##$ZL1= 120
##$ZL2= 120
##$ZL3= 120
##$ZL4= 120
##$ABSF1= 10
##$ABSF2= 0
##$ABSG= 5
##$ABSL= 3
##$ALPHA= 0
##$AQORDER= 0
##$ASSFAC= 0
##$ASSFACI= 0
##$ASSFACX= 0
##$ASSWID= 0
##$AUNMP= <proc_1d>
##$AZFE= 0.1
##$AZFW= 0.1
##$BCFW= 1
##$BC_mod= 2
##$BYTORDP= 1
##$COROFFS= 0
##$CY= 11.3945322036743
##$DATMOD= 1
##$DC= 2
##$DFILT= <>
##$DTYPP= 0
##$F1P= 16.9975609425685
##$F2P= -3.02152046262296
##$FCOR= 0.5
##$FTSIZE= 0
##$FT_mod= 4
##$GAMMA= 1
##$GB= 0.15
##$INTBC= 1
##$INTSCL= 1
##$ISEN= 128
##$LB= 0.24
##$LEV0= 0
##$LPBIN= 0
##$MAXI= 10000
##$MC2= 0
##$MEAN= 0
##$ME_mod= 0
##$MI= 1.114404
##$NCOEF= 0
##$NC_proc= 0
##$NLEV= 6
##$NOISF1= 3.799351
##$NOISF2= 2.8
##$NSP= 1
##$NTH_PI= 0
##$NZP= 0
##$OFFSET= 15.70392
##$PC= 1
##$PHC0= -9801.639
##$PHC1= 28.40086
##$PH_mod= 1
##$PKNL= yes
##$PPARMOD= 0
##$PSCAL= 0
##$PSIGN= 0
##$REVERSE= no
##$SF= 200.130013532006
##$SI= 16384
##$SIGF1= 3
##$SIGF2= 2
##$SINO= 400
##$SIOLD= 16384
##$SREGLST= <1H.CDCl3>
##$SSB= 0
##$STSI= 0
##$STSR= 0
##$SW_p= 3612.71676300578
##$SYMM= 0
##$S_DEV= 0
##$TDeff= 0
##$TDoff= 0
##$TI= <>
##$TILT= no
##$TM1= 0
##$TM2= 0
##$TOPLEV= 0
##$USERP1= <user>
##$USERP2= <user>
##$USERP3= <user>
##$USERP4= <user>
##$USERP5= <user>
##$WDW= 1
##$XDIM= 8192
##$YMAX_p= 0
##$YMIN_p= 0
$$ End of Bruker specific parameters
$$ ---------------------------------
##NTUPLES= NMR FID
##VAR_NAME=  TIME,          FID/REAL,        FID/IMAG
##SYMBOL=    X,             R,               I
##VAR_TYPE=  INDEPENDENT,   DEPENDENT,       DEPENDENT
##VAR_FORM=  AFFN,          ASDF,            ASDF
##VAR_DIM=   8192,          8192,            8192
##UNITS=     SECONDS,       ARBITRARY UNITS, ARBITRARY UNITS
##FACTOR=    0.0002004,     1,               1
##FIRST=     0,             0,               0
##LAST=      1.6414764,     0,               0
##MIN=       0,             -96790,          0
##MAX=       1.6414764,     149369,          0
$$ Real data points
##PAGE= N=1
##DATA TABLE= (X++(R..R)), XYDATA
0@%%%%%%%%%%pJ5j6J6j6K0k8L2l9M7n5O3p2Q6r8J12j28J46j67J89k13K40k70L03
34A60l38L77m20M68n21N77o39P08p85Q68r60J064j181J313j462J633j831K068
52A099k354K702l144L725m523N700p636J1541l5812J09049M9543j46915o8961
65h5986N5193O5520j0186l075O50l5717l5761M9167O6492j5552o4153j831L1819
78A6580j1667k5992L1710L9878l2030o0910N794N5134K5396k2006l1028k2250
90c1391L479M1638L9057k8319o4558m900N9107K8245l3382k5041J5759J1755j2674
103a225o055O368l602j120J6387l140l6115m061N9456L2181o4493p0064L3879
116d1604Q0159M009n7662k1004K6149J6363J406Q688q315l7173r374M4151K6903
$$ y = [0, 0, 0, 0, 0, 0, 0, 0, 0, 0, 0, -7, 8, -8, 8, -8, 12, -16, 16, -23, 24, -31, 32, -40, 46, -52, 60, -68, 78, -89, 100, -113, 127, -143, 160, -178, 199, -221, 247, -274, 303, -336, 372, -413, 455, -505, 559, -622, 691, -771, 862, -969, 1099, -1255, 1447, -1697, 2028, -2495, 3205, -4431, 7110, -28702, 80347, 129890, -17025, -85986, -30793, 34727, 24541, 21466, 22116, -13601, -49362, -195, 66297, 50745, -13408, -15239, 16580, 4913, -21079, 10631, 50509, 18479, -42431, -36637, 18497, 43893, 21887, -9141, -31391, -27912, 13726, 52783, 24464, -40094, -44994, 14113, 42358, 8976, -16065, -306, 11449, -1225, -7280, -912, -4514, -5634, 10753, 7613, -28502, -32563, 26893, 59074, -5419, -75483, -41604, 38555, 42564, -15098, -36102, -9953, 6410, 7816, 16504, 8189, -28984, -38358, 5793, 32696]
129C2696l4207k6476L1036K3454l4958k9990L4785M0904k3549m6495J045L4351
141B596J8883m193j4022k3979j0818L2436M3096j1415n4569j5804M2030L1713
153C5954j5700k3729J538R313L670L766p01j1304l988J1307k132k3114o22L8135
167B2393J7295m1882m0826K3166M6100j982l9284j6378J5068J8561J2120L103
179A7454j8690k8628M770L8645J1704l4853k1829K6383K7871j6090k5426Q988
191i701K3184k634j9342o427Q853J1160P119m333j9336j2416K0021K9121o229
204A9040l4593j2228K5964K1165j0196j9843k014J1195Q305J115m979o137L411
217B05R196l898j7780k933K3882J6200j8619k6001O508K7870Q851j9476k1295
$$ y = [32696, -1511, -27987, 3049, 26503, -8455, -38445, -3660, 37244, 13695, -32800, -31755, 2596, 21479, 17286, 3264, -20715, -31533, 903, 43999, 32584, -21985, -37789, 4241, 35954, 20254, -3475, -1937, 7376, 11046, 14812, 14111, 2807, -1181, 10126, 7994, -15120, -15742, 22393, 39688, -2194, -43020, -19854, 26246, 24264, -15020, -31398, -16330, 2231, 14351, 17454, -1236, -29864, -25094, 13551, 25255, -9598, -31427, -5044, 22827, 6737, -18689, -9701, 13483, 10849, -8493, -14920, -6067, 5093, 12212, 7879, -11457, -23873, -3852, 25269, 19040, -15553, -27781, -1817, 19348, 9152, -10691, -12705, -1510, 6795, 7910, 2931, -3206, 205, 9401, 5503, -12277, -15210, 8672, 24872, 6253, -19748, -13240, 14630, 23481, 4005, -17290]
230a7290k147J5646K1374N975k0015k3644P390L0679Q483k6578k0480J3894K1968
243A5255l614j5845n45J0550J591q694n486J545N645M983k568j3056q049J3346
257d942J9765m205k5294j0236K0220K0185o575k1111o825J1807J3253J672q604
270h90p970M319J2317L287j2452j0920Q637J6135j458j5949m773J5344J3457p553
284A1531j8064p377J0909J5164K089j5016j3196N991K0239O080j7655j6741O894
297i152J7371J580j3457o078Q565Q937l336p891k114M725N477lq614p193O030
312e153J4259K548j6150j2194J1113J9693J36j8518j0407Q522J3087J886q930
325a08q116J445J0443P655p201j3671q47J3158N913j2043j0518Q883J5438j054
$$ y = [-17290, -19437, -3791, 17583, 23558, 3543, -20101, -12711, 17968, 26451, -127, -20607, -6713, 15255, 11641, -4204, -4749, 5801, 7392, -1302, -6788, -5243, 402, 5385, 2817, -10239, -18288, -4942, 14823, 10618, -14676, -24912, -4692, 15493, 8918, -12193, -19018, -7211, 6042, 7714, -890, -8860, -4541, 7776, 11063, -1389, -12309, -3672, 12463, 11005, -4944, -9717, 5627, 19084, 11531, -6533, -13910, -3001, 12163, 14252, -764, -13960, -7969, 12270, 18350, 695, -16046, -9152, 8219, 9799, -3658, -9736, -1171, 7766, 4430, -3461, -5575, -850, 4627, 4624, -3990, -11183, -5153, 9106, 11654, -4496, -16690, -5577, 14116, 14252, -4266, -14673, -6151, 6936, 8822, -108, -8224, -6779, 3664, 11319, 4118, -9553, -10400, 2758, 8671, -3372, -13890, -5007, 10431, 9377]
339I377j4276o428Q316J0072q77r637o923M380J1821O518r215j2577K491J3854
353F896M699j1916r415O486J1552P85p648m548L106O196L060n389r536M5J1697
368F070O935j0597j3759L725J6417L797j2631r850L953R044J956n737p039j422
382i138P483Q429k606j2002k814J1303O940j0696j1072O132J3783L90j0989l939
396h796O689P289M73n573o847r57R058Q985m178j2120j155J2774O751r219j0109
411f935K716P735J187l368l298n20K905M659K29p840m983Q199R543o552j3393
426i716J596J4243N254j0285q098M450Q198J467m813n642j954M938Q700o94j0862
441c218m131J0080Q545p413j1526J733J0009J332p533l271K612L870J732j449
$$ y = [9377, -4899, -11327, -3011, 7061, 6184, -3453, -10376, -5996, 5825, 12343, 3128, -9449, -6958, 6896, 11595, -321, -9736, -3250, 8302, 9087, 1439, -3109, -3, 6193, 9253, 3864, -5672, -5627, 6070, 13005, 2408, -11351, -7626, 8791, 12588, -43, -9893, -5940, 3104, 5060, -677, -7716, -9138, -1655, 6774, 4168, -7834, -10648, 655, 7595, -3101, -14173, -8041, 5742, 6132, -4857, -8796, -2107, 5182, 5655, 82, -6765, -7722, 1336, 10321, 6143, -5977, -7132, 5642, 12393, 3174, -6935, -4219, 3516, 4703, 1335, -1963, -2483, 422, 5081, 5310, -2530, -7513, 686, 10229, 3677, -9716, -8120, 6123, 11377, 1092, -7006, -2556, 5642, 7109, 2296, -3346, -5300, -362, 8338, 7644, -3218, -7349, 2731, 11276, 3863, -7663, -5930, 4079, 5411, -2122, -5393, -2781, 1089, 2821, 1372]
455A372n339l988M025Q088j711r362k952R789O812n409q677J931N655J854k664
470e76l440j515K780N788M27p370l512P251Q440m898j0792O71J0449M140n811
485B032n212K036M825K749J77m901n241K341Q326J747r252n137P049P835m496
500D878q481J188N593L5m401j391J069J300J064J607l100m306K372P095r83q646
516e107l565Q675P124m624p193N85N597K688j388l933l401J350N759K369o163
531a227n422L815P760j265q275k446N384L106k766l065M64K146J772J091j568
546d96l471M69N621J634n522l796N138N882k239n889Q78M512J110k444k338l27
562a278R75K830J971l209m309J991P323N11p281l924N304N553k321n403o31L546
$$ y = [1372, -3967, -7955, -3930, 4158, 2447, -6915, -9867, -78, 6734, 1325, -7352, -5421, 234, 2088, -576, -4016, -5531, -2751, 3037, 3464, -3906, -7418, -167, 8273, 3375, -7417, -6746, 3703, 7843, 2032, -3180, -1144, 3681, 6430, 6607, 1706, -3535, -1194, 7132, 8879, -373, -5510, 1539, 9374, 4878, -3603, -2415, 3178, 3213, -1188, -2579, -1510, -210, 854, 2461, -639, -4945, -2573, 4522, 3539, -5107, -8672, 3, 7127, 2503, -4690, -4105, 1492, 4180, 2792, -1141, -4542, -3192, 2567, 4936, -1227, -6649, -2834, 4926, 3661, -4614, -7060, -1676, 1430, -1336, -4401, -3937, -1791, -19, 1072, -496, -3967, -3498, 2123, 3757, -1765, -5561, -423, 5459, 3220, -2669, -1791, 2721, 3831, 1387, -951, -1278, -303, 2527, 4498, 1289, -3020, -1029, 6294, 6805, -476, -4400, 904, 6457, 4136, -1267, -1898, 1648]
578A648K500l16j762l162p98L134K621l178m733R08N693R58m842l082K810L033
594A432k269l062L74J660J505k58r78j491O74L514J074l719l107K562N664r3m986
611a504j595L331K875o60k766j487K11J422K096j128l510m14L401K257k800l256
627c527K028L401j321l071P3K977J395o59r10k92K81J798J655j851m109o9N410
644C209K567m160m110K086L895J75l399j551O96J147O07j31p82j978J311K317
660A899q40l511q8L620J043l352k495L175K494q38k739l87J633%M2K31r70j364
678b447Q33K121k62k782j06L350j02k773o08K610J047j251p09N15M55R46K143
695B980k88l879j772L878L700j873m654l26M092Q91j960j166O5p70j43J960N75
$$ y = [1648, 4148, 3832, 2070, -1092, -1890, 1244, 3865, 687, -4046, -3138, 2555, 3513, -1329, -4411, -1601, 1432, -837, -3899, -3525, -1865, -360, -618, -1596, -3087, -2413, 1101, 2175, -1544, -4651, -2089, 3575, 3482, -1504, -3099, 232, 3107, 2447, -319, -1806, -1595, -173, 1923, 795, -2715, -3129, 272, 2529, -271, -3527, -1499, 1902, 581, -2490, -2417, 560, 1955, 1296, 386, 94, 375, 2173, 3828, 1977, -2132, -2201, 3209, 5776, 1616, -2494, -408, 3487, 3662, 263, -1288, -592, 555, 1162, 1031, 249, -1729, -418, 1899, 1059, -2452, -2540, 1080, 2123, -1229, -3724, -549, 1945, 1107, -1632, -2019, -386, -386, -344, -113, -1083, -2447, -1614, 507, 245, -2537, -2643, 707, 605, -2168, -2776, -166, 881, -370, -1079, -564, -109, 837, 2980, 2692, -1187, -2959, 919, 4619, 2746, -1908, -2234, 1858, 2749, 789, -377, -312, -1082, -1225, 735, 1310]
712A310k350j207K467J398k421j053K831Q08l317j571L505L007k454k818J214
727f51K085j26n09P00n88k196N55L136k5l523q66L004J225k484j481J362O71j319
745a030l02J020k31r78J143J893j981k394J660L505r06l211l78L007J40q53K57
762C61M38j403j017K162J297k352j524K349J406k238j082K692J799l515k408L314
778B79K816j923k777J142J232p13k03K206q65l426N9L588J147l697j613K486J235
795I73j873k41J842p2k618j24K668N48k145j40J935n12j893J116K780r64l219
812a939O56K669P07j972j54J490p56j095J801J481k686k447K133K772j781k763
828a884J738K021k112j766K101J475k025j169J504J220j954l77K150J31k715q8
$$ y = [1310, -1040, -2247, 220, 1618, -803, -1856, 975, 1783, -1534, -3105, 400, 3407, 953, -1865, -651, 1434, 1308, 799, 1499, 911, -1285, -730, 2406, 2381, -1142, -2008, 996, 2221, -263, -1744, -382, 289, -1030, -1332, -312, -543, -1521, -378, 1515, -466, -2860, -1200, 2305, 1399, -1812, -2190, 817, 957, 104, 361, 799, -604, -1621, 541, 1838, -514, -2038, 311, 1717, -521, -1603, 1089, 2888, -627, -3035, 279, 3095, 1172, -1605, -463, 769, 56, -147, 2059, 1194, -2232, -2173, 1415, 2562, -1135, -2748, -262, 973, -900, -1141, 701, 629, -1989, -2113, 555, 1103, -1042, -1182, 753, 241, -1652, -536, 2244, 1280, -1939, -1283, 1386, 2093, 121, -33, 1457, 701, -394, 1407, 2888, 202, -2245, -112, 2660, 879, -1884, -146, 1875, -237, -2003, 98, 1573, -452, -1621, -117, 1103, -851, -1228, 922, 1053, -1662, -1750]
844a750L391N57l276r33K814J067k916o82K619N00k624k24K657K98k577p5K309
861A155m55k369N36K982q34l114P57K247n77j834N40J716j057j825J842K442k162
878a0k364J286K727j335j746J205J569j671j162K217J176j680j997K028J490j249
894D84q31J779N0k349j45K997P40l010j033K749Q01k183n62J345L69k141Q3K705
912A848m91k626r2K481k17k216M58J861o34k183J300K116j176k859J540K222j120
929B12j862Q45J930j146j806J280J825j291j559J262J675j316j547J500J092j448
945c54q77J204J304k004o56J839R26k667o93K454N53j507j101K024P17j674k05
962g17J384J44j656m9K114k20j246j71J503j20j304j0J906p96j708Q97J949r65
$$ y = [-1750, 1641, 2198, -1078, -2011, 803, 1870, -1046, -1728, 891, 1391, -1233, -1457, 1200, 1498, -1079, -1154, 1155, 700, -1669, -1133, 1849, 1015, -2099, -1342, 905, 328, -1506, -966, 750, -307, -2132, -290, 2152, -10, -2374, -1088, 1639, 304, -1442, -237, 1332, -339, -1501, 716, 1892, 212, -1785, 243, 1733, 484, -347, 1432, 1482, -867, -1012, 1985, 2725, -285, -1318, 1431, 2232, 49, -513, 832, 1201, -940, -857, 1848, 1357, -1269, -1361, 1120, 903, -1313, -855, 1006, 372, -1811, -511, 1605, 429, -2430, -890, 1332, 212, -1650, -805, 1125, -21, -1827, -547, 1278, -13, -1572, -310, 1365, 49, -1498, 2, 1094, -354, -1231, -27, 1277, -727, -1383, 456, 1382, -1285, -1978, 476, 1029, -478, -1579, 445, 1162, -512, -717, 667, 811, -845, -894, 1220, 1000, -246, -417, 1086, 966, -338, -348, 1558, 762, -946, -49, 1900, 935]
980I35j559K19J987r91j079Q34J057p01j525Q85Q46p29j452J203J100q91j186
997a047R18N27r26m75J369J32j178p16K042K78j650q27J501P17j238o92J357O42
1015G34j576l27J783M3j438j53J196O44j690l9J432n9j357K19J755q02j607P01
1033e41J505m36j370K39J283p1j378N30J113k05j507Q17J053n75j375J027J132
1050A241j260p07O82P05m38q42R10Q13j407n48R41J310j199r30J081P12p26q87
1068e49Q42N80j425l32J266L40j169m67J111K93j268l78J417j19j169L7J518K17
1086G45j646j08J710k43j210J15J189j61j613N18J756n94j444L92J585k66j787
1103a062O28J345q89j232O79J583n85j739J224R17o04j467J372O24j315p59J362
$$ y = [935, -624, -405, 1582, 591, -488, 346, 1403, 702, -823, 62, 908, 179, -1273, -70, 1030, 139, -1047, -129, 398, -528, -1003, 366, 498, -680, -1396, 646, 924, -726, -1553, -52, 665, -573, -1265, 92, 734, -842, -1169, 614, 657, -781, -934, 262, 906, -784, -823, 609, 550, -807, -588, 1167, 365, -1242, -541, 964, 528, -842, -603, 680, 609, -769, -239, 874, 669, -838, -21, 1032, 457, -918, 109, 1241, -19, -726, -44, 661, 223, -619, 291, 1104, -303, -851, 90, 1400, 201, -729, 352, 1064, 338, -549, 293, 873, -552, -884, 382, 722, -447, -914, 197, 490, -778, -1156, 261, 142, -1027, -990, 528, 745, -901, -1009, 701, 458, -752, -637, 552, 391, -1222, -704, 1052, 458, -986, -594, 991, 725, -1062, -434, 911, 22, -1210, -531, 1052, 467, -1272, -48, 869, 265, -1202, 170, 794, -521, -1280, 82]
1120H2J053j069j202J013Q64q18n34Q64O67j383j33J468K62j187j283J500N91
1137G55o49q90J239L00j320OJ197K35j566p5J335O9p88l90J562n15j559O66J872
1156A484r49j705N57K064p93j643L77J387o96q41R84N20q83j126J240J123j502
1173d02j203J452J090q86r89Q65P03j440q1J210M60j691m58J749R15k171k12J784
1191F95j85j119m44J820k79j695J20J377J6j256O36J067n44j081Q97J289j070
1208B44j748R74J983n85j797P05J574n55j188N23O81p36q62J207J048j447p29
1225g08J128J076j558j145J473Q01j320m21R98O38j089l44J208k80j261O2J296
1242E54l10j007K48J440k36j773K51J642l54j271O7R06k87o93L25J207j096q60
$$ y = [82, 1135, 66, -1136, -123, 741, -77, -611, 253, 920, -463, -596, 872, 1134, -53, -1336, 164, 755, 106, -784, 455, 755, -565, -559, 638, 873, -693, -768, 567, 636, -152, -542, 1020, 505, -1054, -388, 1484, 535, -1170, -613, 1451, 658, -985, -608, 779, 83, -758, 226, 746, -137, -1263, -23, 1100, -402, -1605, -153, 937, 51, -938, -73, 630, -810, -891, 319, 779, -912, -1370, 379, 1294, -877, -1089, 695, 510, -609, -1053, 767, 488, -1207, -1087, 290, 306, -950, -314, 753, 209, -872, 25, 1314, 244, -1504, -530, 1453, 868, -929, -224, 1350, 795, -393, 130, 811, 75, -787, 420, 1468, 21, -708, 420, 1496, -62, -1207, 266, 1067, -253, -674, 324, 962, -127, -471, 737, 457, -804, -742, 554, 244, -763, -515, 925, 689, -1084, -833, 809, 455, -816, -749, 157, -130, -823, -498, 709, -387, -1247]
1260a247R02J084j023j369R89Q51k57j165R50O96m50r80J160N11j209l42J066
1277A67N59j411k12J503N23j358p12J448M75r11o95J076Jn25M63R27q01j062O18
1296G3R51k10j107P15L81q9j205P53P34J1j004p7O44n14k20O26j63o56l53J060
1316C50K75n95p86N52L26l16o34N49R2n92M71O93l53p03k3J136o02n43k42J099
1336A54j7o37m6Q15k05m00L51J04n76k46K52Q22k80p91M80J36k82R0j19O17j53
1357F9l10L17K64k06L04K24m83m38Q29K63k07q80K42N31L47l20k08R0Q3j0J40
1378F41k85k78J71K29J7q14L11L43j29n29n23M80O94n90k48L04j29J79N45jq29
1399d41j62N42j58r3R9o2k78L8K01N84j16j161N38N99r8q15O19N60m09p78N39
$$ y = [-1247, -345, 739, -284, -1653, -664, 187, -70, -1235, -285, 411, -39, -1019, 141, 652, -557, -899, 167, 726, -685, -897, 606, 1129, -229, -941, 507, 982, 71, -624, 452, 453, -72, 391, 1318, 517, -545, 73, 1024, 814, -293, 422, 803, 714, -491, 262, 996, 1007, 3, -74, 570, 56, -164, 462, 299, -357, -710, 350, 625, 30, -756, -204, 122, -194, -828, -279, -187, -779, -308, 385, 32, -671, -694, 442, -160, -703, -945, 154, 137, -500, -546, 269, 64, -336, 15, 119, -457, -703, -451, 371, 91, -700, -220, -84, -366, -276, -395, 222, 69, -241, 76, 340, 134, 438, 662, 179, -259, 570, 833, 626, -254, -12, 519, 866, 546, 338, 428, 511, 501, 641, 356, 78, 249, 478, 495, -319, -8, 335, 206, -323, -846, -366, 328, -262, -510, -206, -335, -156, 389, 388, -441, -603, -61, -219, -312, -213, -275, -553, -515, -314, 270, 154, -1007, -469, 130, 32, -783, -164, 396, -13, -791, -252]
1420b52Q76j19q72J32J26J58r1M20Q2p53m93J529L42j528k23M80Q29n62q11J042
1440C12O49q34n49O44K73j93m20L16q8k60L45Q30j9j517P9J021J73r11N14M95
1460H60j078l16P62O42n47j070J64J147o30q60N57P61j040q15J091J107o78j048
1478i91O03J18l95R4J043n77j059j16J924L29j648j99J121L66j295j8J455R4j080
1497b31K87O27j7p79L9R30r71o28Q26J130n89j256K22J358m13r35N01M19q28p73
1517a081J260O90o20j280J352O09j167k91P20K45j084j53J299N05j672r2R38k44
1535f6p14L45J055r9j652N34J553j68j420J77Q61l3q88L86P53q28n63L05J262
1554H00r53o56N33P99q36r36J402P56j350m71P49R72p31m38P65M80j501j3J379
$$ y = [-252, 624, 505, -367, -235, -109, 49, -42, 378, 460, -293, -786, 743, 1085, -443, -666, -186, 643, 81, -730, 312, 961, 127, -422, 222, 495, 302, -118, 198, 110, -150, 195, 1025, 1006, -511, -432, 589, 762, -149, 365, 860, -218, -534, 228, 870, 323, -747, -583, 564, -66, -926, -369, 392, -648, -1463, -372, 735, 57, -991, -388, -270, -665, -571, 472, -105, -1164, -1280, 644, 973, -675, -874, 247, 613, -682, -700, 755, 849, -231, 56, 683, 666, -113, -74, 856, -115, -743, 83, 1213, 624, -632, -410, 948, 535, -400, 101, 520, -308, -1081, 179, 869, 249, -1031, 321, 930, -237, -528, 192, 437, -647, -800, 499, 1004, -668, -760, 178, -66, -780, -435, 620, 521, -1131, -597, 956, 788, -632, -455, 406, 373, -515, -129, 624, -204, -767, -462, 800, -153, -809, -276, 523, -313, -1249, 153, 909, -441, -912, -163, 809, 78, -360, 405, 885, -616, -629, 750]
1573G50O8j659l8J545K85j402L34Q92j14j197L52J147l69j358M98J535q28j274
1591h33M61J318p74j102M53Q74n16q33O20M12m94l66M77M65o19p56J074P02r30
1610c67n88J037N91j118l39R95O13p62o20P97N18r10n0J024p21l78M84O38k42
1629F02j078K21M97L2p42M58N35j52p81L38R59m77r26L00J081m26r28N03N02j75
1649C43j019O38M91k75m47J94Q76r74L8O43l25q72J22P28M9o50k91J024L35j187
1669e59n2L44P81q15l98M85K95l78j09N98k56m60L41M04l77n51K46N98j35r06
1689i04L54O98k0o32N06N54m40m37K84L95j14n22N97N54o52k99O10L51l04k66
1709C13Q2L72n76R4L53j15l44m00L18K1k69k08L13q3k31P8M98l21k07J72q0J30
$$ y = [750, 818, -841, -879, 666, 951, -451, -117, 775, 661, -536, -184, 963, 594, -764, -266, 1269, 441, -833, -372, 946, 172, -930, -477, 397, -119, -952, -332, 80, -414, -780, -303, 162, -457, -1213, -139, 563, -367, -955, 82, 673, -445, -784, 211, 824, 62, -558, 239, 757, -153, -203, 821, 100, -278, 206, 844, 602, -476, -255, 242, 274, -468, -10, 525, 373, -408, -70, 889, 412, -514, -214, 867, 441, -487, 16, 518, 343, -676, -38, 453, 178, -269, -75, 801, -173, -135, 508, 183, -689, -567, 161, 210, -440, -731, 293, 628, -559, -611, -267, 514, -301, -699, -214, 81, -297, -406, 192, -64, -524, -183, 221, -156, -707, -461, 137, 2, -904, -550, 148, 128, -504, 2, 556, 116, -321, -37, 358, 244, -278, 319, 873, 221, -78, 532, 883, 579, 313, 395, 767, 191, 285, 638, 523, 179, -221, 97, 118, -151, -359, -46, -129, -360, -282, 216, -105, -312, -140, -220, -90]
1731i0j34k1L52r8j91ML70R0k89m19N01On50K40J04m20j07M59m3J7q6k75K33M03
1755E6n25N1O6k3j42J46O32k68l03O0L74R3o94M64R9K71l06L0L08o6j40k37K54
1778B00J28k23j4L79j19m94L37M09j02l20K57O7k83p1l3N06j50l94j0O92m91k85
1800a4K22K52n55m17P0K63m4j89K56k05l35L7L77J53l56K03J61K51o60L48N10
1821C28m07j91Q5K56K67l55m54N55L01m31j10L19K1m52J44L15k29p12O13J74J08
1842A45m51J31N86n71k91N70M50j34m62M8O27o1n05K44L82m34j64J55Q8m26m9
1863a22M36m1l04o9K45J29n86j18O55K81n80k03N04M7l96j18N00n3o28q5O04M3
1885A41q81N59N7l3k93j88M88o4n48j6M98j04m18N15M04k87o25Q36R5m05l91K69
$$ y = [-90, -224, -245, 107, 9, -182, -178, 192, 282, -7, -426, 75, 81, -469, -229, -125, -545, -652, -193, -236, -219, -305, -580, -347, 56, -469, -418, -352, -375, -517, -371, 261, -7, -310, -250, 124, 217, -477, -13, 86, 357, 51, 81, 389, 323, 183, -54, 200, 328, 105, 91, 470, 351, -143, 194, 603, 501, 181, 438, 505, 222, 151, 118, 624, 474, 80, 70, 762, 271, -14, 208, 460, -95, -512, -442, -179, -223, -412, -156, -361, -696, -659, -282, -129, -485, -282, -121, 130, -530, -182, 328, -79, -270, -185, 71, 338, -17, -471, 84, 385, -46, -156, 163, 184, -268, -124, 191, -38, -750, -137, 37, 145, -306, -175, 411, -160, -451, 119, 569, 435, -27, 21, 648, 587, 82, 326, 708, 274, 110, 265, 353, -73, -122, 314, 273, -31, -100, 145, 274, -312, -430, 225, 506, -74, -277, 227, 274, -122, -240, 260, 207, -421, -506, 98, 141, -740, -181, -124, -157, -450, -638, -150, -214, -762, -778, -280, -384, -802, -287, 117, -170, -795, 41, 136, -269, -660, -391]
1907c91J015l95k04jK45q9q4L52K35l37l72K47K26o12M8L84J42p30Q2N29jn57
1929b68P7M01J7p0k63M16p4j75J6L72r2m50r8Q46j4r04L60M21L3r96K49M85k93
1952dm26J06K50K03n08J36K74j42q71Q14K79m42j84K00L45j19k90M44k15l53M05
1973i8K20R6p05J94N49J77o76m68O37M02j63p41P17J71n72j44P82Qo42K64O55
1994F63j24m92j38P47K15j010K93N65j93m67j30K24q9m45K21O47q78m41N36M07
2014A11j40l55Q1J92k2j87P0L50j19k50L61J5j82l03O99K49p69j70P15L06n03
2035A49o78M91M64n09O8K73j99l16L22K16K0m66k28O98j60m26j85Q03o8m24k5
2056a80J74M51m47r5M85o36j7O38J71k31q20K30Q51m33o88K43P01j38l27L05N3
$$ y = [-391, 624, 229, 25, 24, 269, 180, 96, 448, 683, 346, -26, 221, 447, -165, -117, 267, 409, -321, -239, 290, 289, -268, -191, 210, 227, 157, -106, 310, 236, 61, 77, 449, 357, -93, -191, 655, 641, -263, 97, 518, 551, -445, -196, 289, -4, -430, -324, -74, 129, -379, -243, 31, -111, -982, -168, 111, -331, -515, -315, 30, -89, -379, 65, -150, -503, -98, 122, 218, -487, -293, 256, 433, -243, -711, -74, 328, 165, -576, 141, 312, -260, -404, 378, 386, -256, 8, 663, 539, 47, -91, 656, 871, -139, 154, 719, 526, 59, -71, 153, 64, -381, -160, 487, -391, -832, -296, 111, -29, -384, -303, -111, -133, -320, -250, 100, -19, -269, 92, 107, -75, -378, 321, 570, -199, -369, 346, 652, 149, -529, -38, 426, -83, -15, 258, 59, -257, 65, 281, 301, -165, -393, 305, 145, -281, -466, 337, 269, -155, -180, -6, 445, -2, -97, 388, -248, -265, 373, 544, 313, -507, -277, 574, 141, -547, -304, 397, 259, -68, 237, 290]
2077B90k44k63J47M07m35K5K47J16n88l62Q83K32m89n91L98M78l87k65O63l19
2097e7p03P29K89m10l77K49M55K59q12L31j1K72n04L28L70l45n22N26L24n49K9
2118a29N76J66n21p93N34P96n02m64N02L9j82K68L41n24l64M1O67p4o40n9O18
2139B96k4o62l19J083Jq28J92M12k45K12l16J57m23M9L79M53j37n30P4M64J10
2160C98m48oL42l06o3k7J53k72k66P17k49m14k83R83L0o41o09M24J023o58r4M40
2182A74k57K18RK12k02m77M7J072k64m89j72N32j32n56j09R07K23m41n70M38J51
2203C14L0K67m80j57m06O07P04n69j072M22O91p7l15M4k96L04k51L16n30K84l26
2224d96K75M47q59K78O97R8q39m15Q24J86k57j99l81K48q2R36K32o03p83N64P22
$$ y = [290, 46, -217, -70, 337, -98, -73, 174, 290, -298, -660, 223, 455, -34, -625, -227, 251, -136, -401, 262, -57, -760, -31, 258, -152, -529, -280, 175, 434, -378, -47, -58, 214, -290, 38, 408, 63, -459, 67, 391, -158, -129, 447, 613, 92, -701, -167, 629, 127, -337, 165, 204, 22, 290, 631, 107, -257, -216, 451, 377, -263, -322, 296, 272, -390, -709, 374, 375, -453, -261, 151, -94, 118, -198, -41, -464, -415, -36, 417, 280, -250, -176, 288, 398, -50, -56, 286, -20, -83, -110, 43, -229, -495, 222, -27, -441, -724, 259, 289, -352, -961, -537, 486, -172, -266, 174, -83, 135, 144, 356, 154, -323, -276, 796, 532, 43, -129, 403, 271, -285, -394, 513, 736, 295, -275, 163, 314, 344, 611, 131, -26, -432, 175, 879, 310, -762, -340, 351, 274, -41, 3, -293, 11, -240, 76, -454, -170, -496, -221, 226, -633, -355, 342, 440, -399, -814, 10, 196, -61, -260, -641, -393, -475, 461, 693, 90, -693, -129, 593]
2245E93L1q97J79K77K91n80m1N25L05m56k58j67j59N66j4r6r46J34R62M45p47
2266e3o05J06R19n5k20R3l87O40m8O2n04L3M25J57l50l79M21J45J05m88l67K6
2288c24M64L41p37k94J8M61M33k19q34j30O00L16j18m52j05L67M16p34K69l70
2308f32N79M06r6o00k36N02P43l34r61J35L61P03m54o48q6R20M29m68o72O6N64
2329B21M01M8p80k33P37J23Q2o08k19O53K48n40l58k20N60L40k64j89m31L82P79
2350G32l26q40n5L76J011k95r15n9M75L78j83o03k53N18N49r2l22n70K94J028
2370H48o04q34j91P69L49j79p34r4M09O13k22q15n43P46Q18n5p82k91Q03M48j27
2391C32o93L7N22L67k54o66k9M13O47l72l90n15O85M38K9m88n79M10R83m85o87
$$ y = [593, 624, -273, -94, 183, 474, -106, -147, 378, 683, 227, -31, -198, -357, 209, 195, 99, -847, -713, 249, 694, -53, -658, -552, 367, 312, 92, 185, -202, 438, 390, 452, -52, -19, 406, 563, 213, -166, 255, 400, 505, 17, -350, -324, 140, 481, -256, -550, -532, -71, 362, 143, -691, -821, -221, 95, -23, -475, -580, -213, 203, -531, -262, -632, -53, 353, 257, -343, -579, -77, 666, 332, -629, -494, -133, 570, 116, -532, -618, 302, 731, 263, -409, -343, 221, 622, 670, -110, -343, 394, 517, 599, -9, -228, 425, 673, 133, -225, -445, 115, 455, 191, 2, -429, -47, 732, 406, -434, -489, -113, 898, 603, -312, -371, 104, 482, 299, -304, -557, -39, 510, 418, 96, -474, -180, 848, 244, -590, -781, -12, 337, 158, -576, -670, -261, 352, 130, -685, -1228, -482, 336, 281, -501, -792, 11, 459, 332, -361, -324, 198, 565, 311, -355, -384, 29, 676, 304, -86, -601, 84, 522, 551, 63, -516, -106, 877, 392, -295]
2412b95l77L93P65n8m15o84Q52O59j79q39l26P55J03L41j005j30L41M29K7l94
2432c7o30O0R99J53o36r31L27J095L8q06m56N87O02j06n02j89Q7P75L46p87n58
2453e69N95O42k69q12m31O64M18r9l96k45RR73k6n95n86J97R77k4p36o52P46O36
2475D17J02n19o90M76Q05J60n24j124O70P15L92q24r30L57J245J07p45o15M98
2494b7O47R2o10q86J08J349j15o35n94J71P25N85p68o80K09R72J8m21q36K34Q14
2515C52N90o69q56m6R42L7j80r97K1J156L55o49p42L43J030J61p12p33L40M09
2535A52K65o23m94L15P81K73n71o22l6Q55J94n19p26L6R68L82l30j089M4R41J80
2556C76l04n99n0Q13N97m03j346N67Q22N47q15q10K91O93P03r90p32N24M00M93
$$ y = [-295, -672, -279, 486, 428, 13, -671, 181, 840, 661, -178, -504, 251, 354, 695, -310, -440, -99, 330, 357, -37, -667, -607, 392, 545, -91, -1022, -695, 400, 438, -368, -824, -237, 365, 259, -243, -432, -345, 430, 776, -11, -569, 26, 668, 399, -413, -844, -180, 238, 139, -257, -502, -493, 480, 454, -141, -727, -530, 447, 423, -313, -965, -219, 417, 519, 0, -690, -214, 591, 751, 227, -897, -227, 488, 880, 56, -874, -517, 728, 835, 90, -525, -27, 620, 712, 102, -784, -676, 673, 558, -77, -671, -500, 225, 810, 42, -638, -429, 543, 561, 140, -696, -462, 352, 942, 273, -583, -629, 313, 350, 170, -827, -806, 350, 705, 56, -686, -343, 687, 848, 136, -597, -257, 152, 417, -206, -700, -385, 396, 669, 98, -524, -560, 295, 489, -30, -756, -720, 248, 630, 300, -789, -745, 196, 376, 72, -527, -577, 236, 833, 430, -916, -349, 473, 1020, 205, -605, -314, 379, 1082, 92, -640, -116, 284, 777]
2576G77m11j048l29J257M49o06q55L50Q53L36o73p42L11M10O16p64m40m17J073
2595A47N90l60r59j91J003M76p20o35J14Q92K32j13r84J7P18M97l43p80l82P10
2615g1Q96n38q56J84O51N05q25q25J32J054L67m84o08j95P17O81m95j091j14R89
2635G4Q38p85o49J37L35P26j56j207J00P01K84j73l75o57O75P67j51j224r1J066
2655B35N64n51p76K7M69N68j47p55k44O76N73J49p98j005P56J003l09r96k19J148
2675C68K10k79q55k52P40O85l46n60q13R33J020k06j156k16P40N73l7r45j69P15
2695A50M21l31o30j02M35P20j20o46o86Q98N49o6j176p44J168R09m94m95l68L84
2715b24L78J24l11r66Q53Q86j96j053o18J159Q41k41q62o92P75J073o16n18l44
$$ y = [777, 366, -682, -1011, 246, 695, 89, -766, -416, 437, 773, 100, -642, -331, 79, 695, -69, -509, -926, 147, 737, 377, -582, -773, 230, 706, -14, -649, -535, 357, 589, 476, -508, -491, 227, 724, 381, -399, -781, -71, 825, 287, -569, -385, 266, 771, -54, -879, -747, 307, 674, 190, -418, -613, 104, 785, 290, -801, -915, 74, 912, 127, -522, -385, -50, 676, 520, -687, -587, 114, 398, 225, -150, -807, -132, 635, 484, -740, -831, 235, 799, 248, -528, -501, -32, 536, 389, -366, -610, 66, 639, 788, -10, -1015, -259, 744, 435, -561, -780, 368, 578, 299, -556, -808, -68, 617, 271, -289, -1102, -169, 851, 645, -511, -727, 13, 586, 549, -396, -565, 150, 571, 240, -390, -492, -57, 663, 543, -103, -789, 109, 658, 592, -584, -1328, -160, 749, 255, -240, -608, -224, 154, 278, -33, -999, -146, 740, 544, -509, -1127, 32, 873, 632, -230, -922, -147, 926, 310, -208, -552]
2734e52L77Q90k55m64q90M33J108J0p03p95Q75O86r7j087j38O86O16j33p46q02
2754i81Q03Q00L72j400m63P48R58j50r48k34O16N52k26l90r09O47N30K66o33p45
2774g87J43J213K52j046o81Q78N00P2p58m21O00L34M01p67o19K61O45N87p38p89
2794g20J65R91j91p35l7K19O48K13p82r8q4N49K61k53n67m9J111Nl25j015Q33
2815A39P31l05n87m39M17O25k5l57n62j11R35j6m00o29p0Q47L11p61l07J79R14
2836E29K03p88p25N70M20L04j13j164L08Q18N71m85j275M81O28M20n94m01o8N70
2856B09M31o84l66l75Q88N37n05n33k40R66O0m86o49N08P32k15l53m01j24J025
2876D25K60k16j005J28O90N73o68o20Q1K79R65n75p45J08L48K99k21l47j69O03
$$ y = [-552, -175, 715, 460, -4, -894, -461, 647, 657, -46, -841, 34, 720, 623, -464, -602, 84, 700, 567, -179, -981, -178, 622, 994, -406, -869, -121, 837, 687, -261, -495, 121, 673, 447, 57, -852, -205, 325, 591, -42, -787, -644, 569, 821, -225, -906, -28, 472, 544, -214, -635, -35, 299, 700, -67, -686, -425, 220, 807, 69, -720, -555, 436, 245, -490, -527, -308, 340, 553, -229, -327, -411, 138, 399, 146, -421, -470, 641, 646, 321, -694, 139, 870, 565, -22, -461, -44, 581, 556, 199, -363, -474, 461, 445, 45, -584, -654, 193, 504, -257, -564, -385, 529, 732, -56, -781, -211, 209, 513, 400, -764, -456, 362, 933, 448, -827, -346, 282, 702, 108, -293, -361, 209, 640, -44, -410, -785, 103, 640, 135, -398, -638, 328, 388, -98, -747, -239, 493, 278, -75, -476, -600, 425, 685, 469, -536, -408, 282, 855, 187, -433, -352, -73, 892, 317, -428, -320, 28, 327, 106, -241, -410, 193]
2896A93N85p99m82P1J045J30p21o71K94N60N31k72o41n06O39Q58r6j295M8N26
2916cM01n11l54j86Q78J69l20n69J89J21O90k88k93k79N19O73l17r60k25O81O62
2937F78l87l75No2N35r5k00q07O51O21m93l51k18M24M36k84m26q2O21K34j92l30
2959i7m65Q68j11L58o64n48P08N24j4j031j70O50L38k96k11J4M57k6J52n47o1
2980a72K88L40m04k42k17L42O15k62p93L15N72J8J17p28k31L71J94N1k51k38P7
3001b38Q48j99r30J4L60N80l19k97l0K27N1J04k30j78j4O34K66j098k32M17L44
3022H0J76n83k01O15K22k99J51n55L76R6p9Qo66L49O09P0p41l35Q57K04l14l25
3044b85J11K66M1L86p53k33J86N56M50q42j20M81K1k15r3l50N34J94k85M7l3l5
$$ y = [193, 778, -21, -503, -432, 613, 743, 22, -649, -355, 205, 736, 464, -177, -683, -44, 814, 718, -577, -529, -3, 398, -113, -467, -653, 225, 394, 74, -495, -306, -185, 505, 217, -76, -355, 164, 837, 520, -440, -665, 16, 678, 291, -84, -79, -141, 394, 299, 99, -708, -57, 564, 71, -280, -498, -74, 362, 78, -348, -430, 191, 425, 233, -97, -562, 306, 195, 553, -111, -659, 49, 573, 559, -472, -642, 8, 346, 50, -161, -147, 310, 284, 436, -111, -172, 116, 456, 52, -190, -407, -65, 550, 288, -505, -190, 382, 400, 517, -211, -442, -71, 123, 174, -77, -315, -238, 610, 411, -519, -505, -145, 435, 116, -181, -211, 16, 67, 171, -59, -237, -251, 383, 649, -449, -681, -264, 80, 256, -327, -528, 87, 309, 10, 161, -394, -18, 78, -1, 7, -659, -310, 299, 369, -372, -707, 150, 354, 40, -285, -174, 92, 133, 519, -234, -467, -281, 275, 725, -117, -237, 244, 265, 50, -43, -393, 141, 335, 50, 97, 64, 29]
3066B9L62l3l53n54K44J022l13m06l02L53K63J92o73P5j40N27r4k65m06K4L91
3087e7M16l72j94k40N30J92m11k91K54K75O9k60k43q6N35L58m19k27j96N69J37
3108C39l88l78J18M56l4R9n44M09o0L12k83k73M4K67R9k02n29M89K72J20o82k41
3130e90N44L70k01n3l84J62J87O5j06K5l7K27l9pj80k95N41j06l11J36m7K41k4
3153A18j36k02r3M79L07k56n00Q7M90k7m72l26K92N80j76m30L29l37N04L09o23
3174h3j76j42M25m9K07n45J64M41q2l77J14KR3k0K60m23k12K65L67k39k74J76
3196a08K58J26j82j67pJ16L6j53j42K27j45K91l19J99j71m2M79p5l56O0J27L1
3218H3J60n57K23J02L65k60k72k3O4J46j06m20N1O12J92l30k56J22O29n18j25
$$ y = [29, 391, 358, 5, -549, -305, 717, 404, -2, -304, 49, 312, 504, -169, -94, -234, 293, 199, -66, -472, -448, -57, 359, -13, -207, -447, 83, 275, -136, -427, -173, 102, 171, -89, -332, -418, 117, 475, 56, -171, -367, 202, 339, -49, -427, -309, 147, 113, 212, -332, 77, 17, 329, 46, -227, -183, 84, 183, -19, -548, -59, 213, 333, -349, -590, -46, 324, 123, 70, -314, -152, 35, 100, -6, 19, -18, 209, 170, 163, -17, -312, 229, 123, -188, -52, -99, 142, 118, -18, -220, -313, 166, 473, 217, -283, -196, 294, 267, -205, -531, -239, 341, 165, -265, 64, -273, 231, 540, -83, -259, -401, 24, -25, 182, -363, -199, 242, 160, -217, -103, -101, -8, -28, 232, -191, -403, -138, 229, -10, -284, -108, 150, 276, 94, -73, -80, 36, 72, -81, -223, 4, -141, 150, -169, 30, -141, -183, 296, 221, -135, -75, 52, 83, 243, -314, -91, 11, 376, 116, -156, -179, -115, 31, -75, -495, -444, 168, 360, 30, -226, -104, 525, 7, -118]
3239a18N8J4J4M8k1K32n05j6K28K62l12j69K66K98m12J74m03M32j04ml21K35J31
3262GL8M4k55L99k62L08m33K10k11M9J77j47k6j57P7K11J19Ok50J44J30J53n64
3285b33l68L89K62K66n93J81K37M1k55K2r2L36j44Q6j24q3M2M01k22j18k57Q3
3307a43K63K8l36M25l38Or4L31k08J21l1j7JK2k05J72J20k75K8J38j55R6K02j33
3331A8J02K36l7k51l55O9M98k39l33L67k72M08j28J22l39K95J8k17nj92J70P8
3353A3K54k61j35J47Ol33M19rj3j27j71J49L6j34K42k21J05j29j07M08ok79K17
3376G1k05L59k86j5J83l02R0J80K63n36N89j7k04j85n0j91K55j27K44l9j88M15
3398C04j2m04j28L52P8J08j96l56L12J5Q5p1j17RQ4k91q5N03l73N11j97Q3l39
$$ y = [-118, -60, -46, -32, 16, -5, 227, -278, -294, -66, 196, -116, -285, -19, 279, -133, 41, -362, 70, -34, -38, -359, -124, 7, 45, 89, -166, 233, -29, 279, -154, 56, -155, -106, 71, -76, -102, -259, -182, 29, 148, 154, -96, 48, 178, 331, -233, -601, -212, 50, 316, -277, -96, 141, 182, -73, -51, -143, 193, 49, 135, 11, -72, -30, 371, 149, 31, -226, -143, 120, 148, -188, 237, -101, -95, -189, 142, -66, 55, 24, 7, 8, 30, -175, -3, 117, -158, -130, 8, -147, -51, 151, 18, 120, 356, 319, 68, -287, -218, 280, 41, -292, 75, -197, 211, 83, 205, -134, 161, 179, -38, -43, -235, -65, 13, 267, 6, -129, 18, 24, -309, 110, 101, 88, -39, -210, -61, -25, -159, 83, -138, -33, -162, -269, 139, 133, -146, 71, -134, 225, -61, -76, 107, -195, -105, 75, 338, -198, 391, 374, 170, -15, -65, -256, -1, -128, 116, 77, -111, 304, 292, -112, -240, 112, 190, 298, 102, -254, 58, 73, 158, 87, -30, -21, 63, -228, -313, 190, -183, 328, 131, 214, -125]
3421a25M4J17k6k0Oj21k02N77o21M21l7j53J68l33N25m51p4K19K75j15k04p0J00
3444a00J09k29M83j10j56J03j80K29R1k71P6J89p8m91M91n3k02K90k08P4K3q4
3466dL28m36Q9J61k38K41j17m4J00k43j97L33K09l80J57N1L38l94J32l15J64L32
3488B67j76l8l7M2k21M49k99m9p3Kj71J70L54j65j67l0K51M3j42k4K32l18J92
3511I2m27N22J20j70k92p7L32n3j89M01l55J93J06J25k71l6j54r2O39n07n6K72
3533A23O9Qj69J92K23n36L6n2M9J14J44O7j6l94L9J47j12JJ5J36j27J86J2j95
3557d0J70m82K90j25k3L2J38K43m89J79J40Q4k72J39r6J65j93M0J25M8N0l73M60
3580B10R5n36j90L22l6k7r8K05k26j48L15L17J12m42j44J21J76l6L72m91O4l82
$$ y = [-125, -81, 36, 10, -10, -4, -125, -327, 250, -371, 50, 13, -140, 28, -305, 220, -231, -305, -86, 189, 74, -130, -200, -100, 9, -220, 263, 153, -3, 100, -80, 149, 240, -31, 45, 234, 156, -335, 156, 103, -99, 191, -17, 57, 80, -4, 324, -112, -23, 138, -100, 141, 24, -20, 80, -163, -360, -27, 182, -198, -41, 10, 348, -46, 86, -229, -65, 267, 91, 53, 16, 58, -163, 286, -13, -62, -135, -133, -304, -134, 220, 55, -112, -142, 109, 152, 10, -14, 218, -100, 92, -335, 187, 307, 137, -155, -232, 100, 47, -142, 259, -96, 97, 203, 328, 57, 21, -133, -225, 414, -93, -149, 123, 192, 200, 31, 223, 446, -90, -54, -106, -57, 57, 201, 268, 252, -142, -103, 44, -68, -67, -52, 84, -43, 143, 155, -40, 130, -352, -62, -187, -210, -178, -40, 203, -286, -107, 33, 117, -155, -16, -112, 53, -140, -100, 25, 73, 123, -250, 210, 305, -231, -421, -99, -135, -162, -260, -55, -281, -429, -114, 203, 315, -127, -271, -150, 26, -10, 362, -129, -65, -447]
3602d47M06M52m95j19J62M03l33n5M20l71k38OJ93K67k46J86j5M2m72L34J04j17
3624F7j13q6P0J3j74O19m10L6k19L86J71l21j74K15j3k38J02n8L84l6k40n1J4
3647e6N7L8j55Qk3P1L12j98j14j24K76L4j35k32L54k23J87k95M06K03n02K54j46
3670cK53o5j83J58l62J21qK1J94o49M51j1j16L38j08L2k00l7N92j36m31K42k29
3693a36M41k74k38O32j02n64K16L19l56J12l00K12j36J95J3N26m81j72K85k28
3713c6j14R8q9K08j16kN8k13K81p3j81J96J29k66J4J4QJ63k3M1k02M5l61M13q5
3738i3j41K5M39k52j71J55j55PL6K65m4o0J37k14K76k13k6n6K25k79K05j9k50
3761b03k03M47J10K51l27n5Q0J72j82k3J54j41k05J88k42N4n3J05J97Q6l75M4
$$ y = [-447, -41, 411, -84, -203, -41, 362, 29, -26, 394, 23, -215, -209, -16, 251, 5, 191, 176, 218, -254, 80, 184, 67, -46, -132, -62, -49, -223, 396, -14, 22, -197, 189, 360, 39, -135, 80, 67, -171, -69, -127, 257, 221, -19, -70, -56, 1, 39, -116, -108, -131, -60, 252, 54, -60, -184, 92, 126, -9, -241, 113, -110, 77, -218, 188, 391, -111, 143, -3, 250, 185, 2, 160, -202, -81, -89, -68, 126, -523, -72, -83, -199, 139, 31, 63, -137, -174, 418, 282, -149, 93, -136, 305, 31, -207, 425, 323, -241, -25, 294, -62, 50, -250, -38, -174, 21, 34, 560, 79, -93, 192, -36, -150, -52, -141, 67, -49, -51, 7, -206, 75, 2, -179, 17, 146, -120, -106, -92, -84, 79, 56, 97, -105, -60, -421, -8, -93, -234, -209, 230, -22, -193, -38, -193, -186, -150, 115, 71, 11, 148, -66, 210, -3, -29, -85, 140, -139, 66, 47, -203, -406, 41, 151, 402, 75, 20, 100, 272, 90, 67, 221, 80, -125, 63, -179, -125, -178, -73, 124, 210, -165, -121]
3783a21J25j25J43Qo3j87Q6M25k78j56R1j78M43j75p3J4J85m79lM79j85J90k6
3806A40m71N32n3j81J69j67o1L21p5mK15m67N07n10K25j52L51o07J16N3n0J25
3828d4j98M21j35K01j42K8ok4k28n8R0p8K97j19k50j5P6J67J62K38k81j44P6r6
3852f2m6O5J09p3j55m4P7k1K95k73Q6k2K04L3k95K19q1K54j82O4o6N1o4l53J64
3877a16P6k2QR1j23j0K71k31Q5J09j71r4L08j40p4O9J03l33J45J06j18q2j17O8
3901a92Q1J97k08J81Q5J05J24j12n2j88L6j19j31J77j20J58k13k75O64K82j13
3922C67m16J55k04n3n6K2J52k05M49k39OJ5j65O6OO9R2R6o4K17ro7q1pl08K6j8
3949a54L49k84J60r4N1l3J96l32R2L66j33k6k57r2J50P5n1m2K05k98m4J17k04
$$ y = [-121, 4, -121, 22, 30, -33, -220, -134, 291, 13, -143, -52, -230, 213, 38, -35, -21, 164, -315, -318, 161, -24, 166, 140, -331, 201, 148, -33, 136, -31, -92, 229, 154, 150, 365, -102, 405, -105, 120, -32, 319, -288, -172, -119, -169, -44, -242, 179, 44, 245, 103, 131, 125, 101, -127, -185, -95, -173, 124, 5, -245, -260, -184, -17, 145, 383, 102, -42, 34, -62, -108, -43, 66, -7, -162, -206, -129, -150, 145, -128, -42, -64, 140, 173, -122, 97, 16, 270, 88, 152, 86, 137, 73, -280, -116, -40, -62, -54, 37, -86, -96, 175, -56, 29, 138, -33, -127, 181, 41, -33, 36, 139, -194, -49, 57, -61, -143, -260, -192, -111, 86, -122, 59, 144, 249, 373, 261, 209, 21, 57, -62, -193, -16, -136, 22, -191, -466, 198, 480, 367, -49, 106, -98, -151, -207, -185, -33, -238, 211, -28, -22, -7, -172, -106, -100, -31, 61, 157, 93, 310, 301, 234, 153, 146, -162, -136, -154, 195, -89, 71, -23, 28, -5, 191, -141, -49, 317, 184, 158, -99, -191, -41, 34, -17, -59, 146, -152, -196, -79, -283]
3972b83P7J80qM15j78j58k70K18M9r1O7J17N1l0j9o4m3l57K61K12l05O2o3N20
3996C60l71K10l78M27m1l68L25l04K30r3J04k57J22k11M12l97L90k37j72L87m36
4017b98L02L3j74J14J65l16K9J58K26q9j93L87l40J7K13Ol2k03K51m3l07K57j18
4040D5n0j64J00l48K67L11j13k29J45j12J31J94k29O7j66J39j87K04R3p5M1n0
4062A4j73K78j02Q8j10j2k65J99o3M7J24mQ0j04k2R1P1o2j45j53M67j98k05MK07
4087E2J79l19k72L21K28j87k18K10J85l65q8J61K47K2k68R1J81l37K31K40k63
4108C1j44j7L78k35j53K26P4j50j0M8k44K42q0k78J45K98Ok36q0M5K92l57K90
4131I1L9k31K36q6k46kJ54K30l36j61M21k04q7N3k0J33lj63L80K50l10l19K14
$$ y = [-283, -206, -26, -34, 381, 203, 45, -225, -7, 42, -49, 18, 135, 186, 156, 137, 73, 30, -327, -66, 146, -159, -97, -160, 360, -11, 199, -179, 248, 207, -161, 164, -140, 90, -3, 101, -156, -34, -245, 167, -230, 160, -77, -249, 138, -298, 4, 37, -137, -23, 142, -174, -145, 13, 239, 150, -43, 344, 4, 21, 234, 240, 208, 5, 256, 213, -94, 163, 45, -5, -169, -69, -417, -150, 161, 48, -181, -36, -148, -17, 177, -52, 15, -151, -12, -199, 5, 98, 23, 64, 14, -159, 119, 17, 105, -5, -17, -282, -83, -146, -99, 25, 21, 101, -3, -25, 66, 137, 75, -70, -223, 244, 46, -159, -155, 52, 231, -88, -360, -39, 189, 2, -216, -6, 179, -186, -274, -113, 134, 156, -112, -21, 160, -177, 54, 294, 31, -113, -130, 248, 13, -140, 86, 160, 10, 0, 48, -196, 46, -34, -312, -167, 131, 137, -99, -179, -134, 158, -199, 91, 130, -101, 135, 49, -197, -199, -45, 185, -151, -312, 109, -95, -182, -129, -149, -16, -19, -182, 198, 448, 138, -181, 33]
4154C3j26K24J27j49M6k09K13J45k73m9K79j03o5l13L40k28J18k22J65j09K02
4175D6j58n0K62L0l68L61l11J15l3q7M83l04k01K15j68m1K06MJ72o66N13J77K3
4198B20k52O8Q0j35J2j19J20J8m28N89n6k02KK50j38M4k03K66O8j89k36J20L86
4221B85L3m51K22k55j48R1N96n28J30K56j86J31K1l18M64l16J57l38K13p4l2k50
4243b97K92p4K84k29J33L9j96q8L96l00o2M33j73j32j52K47k7K5k83M01l57J03
4265a7k70K18N13m33o6J39q1j36J91l06L5n6J55J13J14j44j11J05J52k01j68K87
4287C3p4p0J75K61k92r0J80K07k24j02J53J51j54k22K99l5k62j81J70J78l01L75
4309A75k13J82j21l37j31K81J82k09j71K82K75l27K03Q7j22k07J90J5k73K42l3
$$ y = [33, -93, 131, 258, 109, 155, -54, 159, 304, 31, -18, 261, 158, 93, -220, 120, -108, 10, -212, -47, -156, 46, -112, -162, 100, 130, -238, 123, -188, -73, -106, -193, 290, -14, -215, 0, -168, -209, -3, 1, 173, -493, 20, 197, 220, -32, 36, 116, -19, -7, -126, -6, 12, -416, 173, 117, -85, -83, 167, 29, 73, -130, 136, 204, 15, -221, -101, 285, 318, -133, 89, -166, -314, -223, 373, -155, -25, 231, 45, 176, 197, -121, 343, 27, 184, -154, 59, -15, -47, -297, -5, -79, 205, -24, 109, 148, -48, -136, 260, -40, -102, 331, 158, 26, -126, 121, 94, 119, -164, 237, -120, -17, -287, -69, 444, 11, -55, 84, 3, -133, 58, -248, -213, -269, -114, -1, 113, -31, -142, -37, 115, -86, -254, 33, -41, -111, 64, 325, 33, -57, 123, 330, 106, 4, 157, 308, 154, -68, 231, 196, -66, -247, -77, 101, -200, 175, -38, 144, 23, -314, -445, -164, 18, -191, -362, -80, 195, -132, 71, 158, 36, -171, 19, 34, -239, 3, -30]
4330c0k38M05L3J36n20L38J6K99j73m35L37j17k89K38P6k49J56k39JL15K34m54
4352a60O5j18O9J20L61k96P8k17j24kK71nj63L5K03k27M75j49j70j80k07K91J50
4375A00k4m29L1M38rM8p8k55R3L9j33K67J36k1j13m86N33q7j35k2L93k64j95J38
4399c5J77L03n27L01j06j32k31J78J89k58J65O0jJ06j0k45J68j68j53L66p7j99
4421a29j83L22q3j10J71j94j1J43J3J2K02o3k24K20j01J70k80J4L55l60N0K31
4443A65k27j17K59Pj54N6K1K15N0l59j52K01j15Q2L33m39p9K49M4o9J17k16K09
4466H1k0L4k32OJ42P2l1j43J93r6r9J26N2k23K17j24J00K19J3m56N95o24oM32
4490B28p3k84p5K27K22j47%j50K29k77j03j1OP9L35J37N1m58j16L64M0j91k31
$$ y = [-30, -268, 137, 170, 306, -214, 124, 140, 439, 266, -169, 168, 51, -238, 0, 76, -173, -17, -256, -255, 60, 294, -160, -95, -213, -144, -24, 337, 41, 119, -98, -222, -224, 47, 42, -121, -86, 117, -110, 365, 216, 46, -134, -341, -50, 100, 76, -353, -322, 116, 107, 155, 77, -178, -85, -46, -179, 88, 224, 203, 90, -396, 137, 50, -85, -107, 286, 22, -173, -35, 142, 445, -82, 219, 113, -19, -250, -72, 117, -141, 24, 84, 83, 189, 179, -66, 102, -66, -219, 147, 70, -129, -312, 10, -73, -183, -12, -206, -217, -74, -61, -49, 153, 90, -134, 86, -15, 155, -125, -111, 244, -116, -66, 165, -62, -179, 80, 87, -67, -11, 10, 225, 275, -84, -236, -35, -150, -68, 265, -174, -253, -4, 40, -29, 88, -128, 81, 61, 95, -137, -131, 11, 83, 52, -91, 102, 6, -93, 33, 85, -138, 79, -45, 55, 274, 287, -169, 426, -198, -204, 228, 155, -129, -204, 23, 245, 98, 98, -52, 177, -100, -203, -214, -208, -129, 206, 343, 394, -64, -180, 184, 224, 33, -198]
4513a98M91m78K20k44L25J63l93L05o3m05K53N6l29J55K8r9J64rJ85j47j71J2
4535a79m0O69o40K80k44M4J58j24r8L23j76r6J67o47O79K0k09J91k19J91j38J43
4557E5k55J16L52k89l59K49j14M19k11j25K97p1qJ33j18J98l43j27Q7lJ61k01
4579a57K2K73P6j1j58m15M43L39n08K57j34P5l00k2L39j63K62k24K02l33L08j41
4601C0l16L00j37R7m1J71J50m02J97o3M47k96k65K42r2l06L40m4K76o05L82j93
4623a28K7N23k08k25K17j02o9L89n97M30j53J25k19j56M08l01j08J83j79K21J20
4644A98k2j74m2o9j3L38o44L27J86j87L35j36k14K54o4j36k17K98J00Mk42j5k09
4667c44L65k41J97M38l22r3m1K06J1k51k0J36l11K79L45l05P3r7K8N3r1j36j35
$$ y = [-198, 293, -185, 35, -209, 116, 279, -114, 191, 128, -277, -24, 32, -297, -142, -114, -213, -49, -58, 127, -20, -191, -179, -219, 450, -190, 90, -154, -110, 48, -76, -174, 149, -27, -123, 44, -603, 76, 96, -113, 78, -141, 50, -88, 55, -200, -84, 268, -21, -380, -131, -245, 174, -37, -162, 135, 64, 56, 189, 71, 269, -74, -201, -114, -117, 44, -157, -135, 138, 214, 203, 45, -370, 73, 412, -96, 161, 27, 102, -198, -220, 119, -44, 218, -6, 196, -137, 171, 30, -286, 14, -123, -26, -67, 104, 254, -148, 49, -14, 433, 137, -128, 114, 22, -284, 56, 12, 288, -317, 65, -128, -101, 422, 214, -11, 206, 104, 35, 424, -173, 257, 104, 229, 10, -146, 262, -39, -147, 36, -143, 78, 198, 176, 2, -40, -109, -122, 216, -428, -101, 85, -102, 233, 97, -117, 137, 73, -63, -280, 18, 118, 122, -120, -135, -344, 21, -220, -23, 415, 93, 0, -41, 165, 176, -75, -95, 41, -270, 9, 354, 49, 122, 25, 53, 106, 15, -121, -256]
4690b56J93j21L18l0j53j23j20J63L82k56p9oL02n32K81q4k05L41k08L95l33N65
4712D34o35J94l14L15J03J34k07N1j13K42j53r2j91J75K7j4J36j55j57O8K66j97
4734h3K45J50m86J58K08k75J10j50K40j6l8l1j09K0J91k12J47j37J98l47J25R5
4756Cj64j77K48J55J38k15j38M88n01l4K26j00k0j70L69n0k89L16j85K26j34j48
4778a56j68J24NK56J85l11j48J82n5K71k93J03Q1q8L2j4o4k20k5M79k29j65L57
4801A39j29M2L3k68K1J21O8O0j87N2kJ3k42K68j77L5M60l71k5J25m2j45Q7j08
4825a72j03K92j58L19r4o4j73K26N2l50K41k6J04j31P1j33p0J80j28j35L36j81
4847i7J65j94Q1Q3j9k30M24m01k80M44j20J30K56J08k39j81J1l66L88N6Q7l39
$$ y = [-256, -63, -184, 134, 104, -49, -172, -292, -129, 253, -3, -82, -88, 214, -318, -37, -121, -326, 15, -193, 202, -131, 434, -201, -7, -321, -6, 97, 231, 24, 75, -38, 204, 51, -41, -232, -57, -30, -44, 92, -63, -220, -152, 114, -83, 162, 312, -174, -16, 192, -83, 27, -123, 117, 101, 63, 32, -77, -57, 134, -78, 69, -68, 130, -217, -92, 3, -161, -338, -90, 65, 203, -12, -150, 338, -163, -197, 29, -71, -91, -261, 108, 58, -231, 85, -100, 126, -8, -156, -324, -200, -195, 61, 246, -65, -213, -31, -86, 185, -108, -5, 76, -12, 20, 6, -58, -278, -303, 176, -53, -218, 139, 10, 52, 85, -183, -162, -41, 27, 87, -100, -48, -50, -37, -279, -11, -188, -153, 307, -64, -89, 36, -6, -151, -64, -172, -275, 17, -141, 178, 84, 20, -153, 73, 125, -225, 16, -10, 94, -37, 34, -99, -169, 11, -117, -252, 84, -97, 68, -126, -45, 38, 19, -211, 213, -188, -468, -24, -144, -14, 242, 350, 111, -70, -59, -425, -37, 19, 106, -233]
4869b33R2ML21l3n41N75k92J40n8j53K03Pk15L72O9l17j31J44Q2j5j38lQ9J09
4893G8mR0k58R2L0k66N8K61m39N42l01J0K2N06k47j59k80L03J46k74J86j32j76
4916b12J91J53J26p8k62J83l18L15J55j93qJ92n1o23O88k43K44k7m76J17o6L38
4938A45l3j32K56j47n8K17n65N1M83k97K79j68J18j48K07l26L64n05K38J25K70
4959C74n38L52m78J67L23m27J13J0R2M3k3l81L44m3L26j13k53J82J75l51M6j56
4981b16J07J98K12K4m13k1O7J91j63k46J94K53r7Q5k44n6K10rn4j87J72mJ67j50
5005B0j17m5L50j4j68r5j52L4L14r9j75K97J34k05k76L0n1L52J82n24l8oJ19J41
5029Hq9q3K0j2N27l16r1n0L72k25j06O8j42j57K72L2k1K94k07L0p4l42m6L27L6
$$ y = [-233, -141, -137, 184, 151, -390, 185, -107, 33, -25, -178, 25, 32, -183, 189, 258, -59, -190, -46, 36, 21, -117, -120, -31, 78, 74, 164, -94, -2, 28, -238, -180, 81, -358, 184, -117, -107, -85, 421, 174, 15, -265, 38, 184, -90, 96, -36, -212, -21, 132, 258, 180, -82, 101, -217, 98, 253, 60, 52, 244, 193, -430, 258, 15, 259, 232, -244, -127, -193, 145, 112, -20, 236, 89, 31, 248, -317, -266, 217, -80, 199, 31, 149, 1, 208, -118, 246, -259, -21, 104, 374, -164, 188, -290, -123, 200, -227, -114, -104, -12, 31, 8, -373, -29, -72, 254, 141, -112, 70, 245, -106, -60, -216, -109, 89, 301, 325, -88, -109, -42, 149, -14, -260, -66, 187, 90, 175, -69, -125, 85, 76, 22, -165, 7, 3, 170, 20, -97, -142, 208, 194, 26, -69, -221, -187, 127, 28, -147, 150, 284, 79, -197, -167, -218, 134, 316, -208, -246, -252, -133, 8, -81, -164, -144, -156, 371, 55, -36, -86, 286, 61, -45, 23, -119, -276, -4, 28, 7, 301, 94, 124, 50, -292, -338, -11, 25]
5054B5k31L13j27Q2k41J62j10K96p0N4k7q3J06m22O58o68L9K49L8j74K05k16o
5077a48K09M8K05m76O7J52k83L83k78K7M49k17o7j77J23o0k05M65l87K54O6P2
5099B22m55q5O29n9k57O9q2j28K7L9N9K6jn2J70j42N4l76M15R7m2K5K18l52J99
5124B18k60j40J77j27L30k4J67k96J14l3J56o08k3N86j17l80L26q1K37Pn96Q9
5146b78m7J83N39n77L51l62L80K61o18P3K71o1J33l16R5j95R2O4J19k11J13j47
5168a38M80m62j31Q1K89ml7j61J49J80m81M76l81rN51j42j00p5k52j37L77n5j44
5191a26K73p7l82L99l80J50R0L95l75J95r3j46K26k00J61j96J26j6O4q2J14l42
5213b22L05J30k11j16J09L7J34k59KQ0K29k3l14K48P6J00k11j26j97R2J4J98J4
$$ y = [25, -206, 107, -20, 62, -179, -17, -127, 169, 99, 153, 126, 43, 149, -273, 385, -283, -244, 5, 43, -131, 74, -142, -148, 61, 109, 314, -162, -95, 57, -226, 157, -121, -94, 355, 138, 71, -106, 17, -43, -248, 217, -170, 84, 150, 222, -233, -318, 311, 252, -5, 64, -18, -146, -119, -80, -21, 5, 4, -48, 122, -20, 34, -342, 73, 170, 128, 153, 371, 19, 218, -42, -182, -5, -132, 198, 174, 341, 45, 159, 126, 282, -326, -349, 237, 120, -260, 66, -15, 222, 229, -367, -278, -325, -142, 397, -180, 171, -191, 189, 450, -168, -95, 176, 115, 248, -68, 27, -168, -76, -12, 107, -104, 9, -138, 342, -120, -251, -170, 119, 115, 78, -83, 66, 246, -235, 241, -140, -149, 402, 260, 160, 85, -167, -304, 73, 18, -126, 147, 70, -312, 87, -293, -143, -53, 342, -33, 162, 69, -77, 149, -51, 110, -86, 40, 24, 88, 6, 120, -222, 83, 213, 2, -114, -5, 32, 166, -93, -91, -11, 218, 195, -119, 129, 205, 305, 94, -32, -229, -137, -123, 75, 89]
5236H9l41L28k97J16j53l1L05j21k4L34l25Q5m7J41l4m6l18N85j37%k14o9J92
5259A8m2l12K92K9O0k4j06J21J74j73j24N0o4J68k30L05r8N0P0M7J11k13k61O0
5283i2K34j12j00j14J71R7J10J14l77L49j68O7j63k89J00K92j46K31k27n5K50
5304A72l27J28m58N15l4K06j22n65J96K92L22m42K11j83L70l25r4J14L7J34j30
5325A7j4Nk62J55R7K4L1n1j60J35j90J1O4R0K97l21p3L68J06k03O6m14R7O3J05
5350D3J07k35K24k62L99q9l80J7J16M85o06m03L92M48j19k91o8K25j77j57N99
5371B68k64l0l6K17k98J64L3r4J40j12J30m7J96l73K46j21J19r7J94l07j16N08
5393C20J7m93K69j16R6K07k16j57J51j23n5K51r4J59k0j51J16k15M8LO4j75o9
$$ y = [89, -252, 76, -221, -105, -258, -289, 16, -105, -129, 205, -120, -35, -82, 59, 25, -21, -339, 246, 109, 109, -105, -174, 18, -24, -336, -44, -15, 45, 21, -85, 36, 210, 37, -87, -37, -101, 67, -163, 142, 44, 94, 164, 211, 322, 109, -152, -92, 142, 30, -70, -184, -13, 84, 194, 308, -69, 280, 112, 179, 16, -273, -173, 119, -27, 204, -23, -78, 172, -155, -27, -485, 30, -4, 202, 80, -485, -289, 3, 325, -117, 94, -89, 281, -44, -138, -24, 13, 147, 17, 3, 8, -254, -99, -2, 22, 53, 2, -158, -23, -213, -202, -138, -48, 249, -72, -145, 223, 329, 126, 192, -222, -125, -62, 43, 150, -85, 139, -123, 276, 187, -193, -176, -60, 425, -181, -584, -192, 256, 137, -154, -222, 3, -174, -331, 268, 4, -26, -62, 155, -143, 21, 54, -40, 100, -12, 118, 71, 267, -106, 140, 19, 138, 41, 235, -72, -188, 320, 337, -156, 113, -3, 93, 300, 84, -73, 78, -45, -100, 151, 57, 216, 196, 45, 161, -54, -6, -3, 61, -114, -183]
5416a83NQ8K24ol10OJ98k3R7o5k91L37j90K64O8j88J65j97J9q3J64j36J55l9k57
5441a78K51l62M44j79N45p28J80m9M08j46j46n1P7j45QJ19n5K63j33j13j11L82
5463B81k92J59pk59j20M05k57N2P2M8k81L10J68m13j24N82m31L72j99l33L52L10
5485C95k97K52l82K5L33m14j03J40P0J16k17O0o7k11N19l20Nm8L96j16j54K7q7
5508g8j02L24q6Q7l37J75J04k07J11m4K18K4l9m1j99KJ06l5k59L96j53R0p5J26
5532A08k27O1ML41l95L67n2J9m75K72j69J70J21j14j00r8N2j69L50J96j10k36
5554h4J76j39j15J24J8j6j97J05j37K16P4RK4R3m87M59p5M50l55l10L38k08J04
5577F7j47K13p5K18o02K99kM4L16j04p02N21K62j36j80j07J84Q7j72r8J90k1Q4
$$ y = [-183, -178, -90, 134, 128, -182, -176, 22, -1, 96, 31, -260, 77, -113, 151, 219, 31, 196, -1, 18, -65, 99, -37, 118, 79, -178, 73, -289, 155, -24, 521, -207, -27, -76, 332, 186, 40, -11, 66, -79, -71, 48, -7, 256, 123, 10, -101, 281, -11, 148, 141, -118, -238, 167, -90, -38, 34, 82, -199, 111, 279, -134, -258, 324, -107, 265, 66, -267, 85, 395, 98, 350, -32, -7, 326, -88, -191, -51, 19, 135, -82, -22, -89, -300, 219, -101, -96, -144, 252, 136, -18, 9, -78, -180, 144, 58, 145, -192, -17, 87, -120, -9, -53, 165, 189, 150, 109, -90, -88, 18, -17, -276, 120, -33, 57, -18, 108, -119, -58, -54, 287, -108, 259, 207, 226, -249, 23, -146, 24, 145, 31, -69, -167, -115, -284, 66, 262, 152, -84, 92, -47, -162, -38, -20, -36, -233, -128, -265, -49, 25, 34, 58, 151, -336, 123, 48, 498, 143, -167, 171, -37, 67, -80, 133, 58, 276, -326, -27, -29, 15, 331, 227, -475, 46, 308, 172, -8, -115, 69, 156, -16, -114, 76, 55, 139]
5600A39j4l33J05L1RK11q2l62L2J52K85l01r2J39P5j44p9M72m31L93j73J27j91
5623c2K4L64j78l67L16j50J93j14m3mk05M83k55J56j66M4k32J06K06J26m45K24
5645E1m6j07J12J13k2l6j78P2J08q0k58M03j92j57K56rJ0o2p8L2r7k13M09J90
5669B21m00L78r2j35K4K25J56j46J5j95R8J11k02k19M1K96k30J89m66N39K51o21
5691a62L3J07K53o09M13R2j75K47rj02j65R3N3k16L34k4m86L85l20NK58J54l83
5714b24M35k02k87J08J91K27j30j12j69L13j49J1n2Q3l5K7J97l34j37Q3L41k16
5736c1K46l67j71L55J0p0J80k2l32L87O8l54j55p8K75J84j73R0j27j2N6p8j6K2
5760a13J02K26N5l67K96l93K71k72M2QN9J92j48M77m98J22l72K37J95ok81j01
$$ y = [139, 125, -208, -103, -72, -63, 148, 66, -296, -264, -112, 173, -128, -220, -81, -6, -150, -229, 243, -188, 205, 32, 159, -32, -8, 356, 178, -189, 127, -23, 170, 56, 13, 9, -196, 287, 32, 188, 22, 66, -166, -60, 146, 272, -173, 51, 5, -102, 10, 123, 101, 65, -113, -41, 67, -13, -271, 132, -60, -217, 39, 30, 40, -22, -100, -68, -165, -378, 31, 221, -179, 199, 107, -28, -4, 221, 377, 231, 246, 51, 149, 260, 58, -161, -120, 176, -54, 135, -331, 208, 459, -162, -129, -22, 231, -378, 35, 127, -48, 199, 190, 88, -77, 16, 69, -147, 187, 163, -323, 62, -258, -253, 5, 159, -224, 211, 9, -278, -170, 21, 248, 118, 6, -163, 150, 1, 12, -40, 43, 8, 35, 232, -102, -239, -156, 185, -31, 215, -152, -323, 32, 42, -28, 152, 130, -202, 185, 253, -101, -256, -334, -59, 125, -48, 42, -85, -97, -41, -119, -135, -113, -11, 215, 270, -97, 199, -194, 77, -195, -153, -145, -86, 106, -42, 435, -63, 59, -313, -76, 119, 113, -168, -269]
5782b69K15j12L11q2j11K75o40L54R4J04l86M81j09k19M25m46J1K34J28k65j78
5803a85m5J68M84l93k25M69k94K63j0k78K44k30q1K74j36M5mR2k24K18j91Q7j61
5826a13J23L5j1q4k9J67j38k10K84RJ08J53l10M7J51j32k3r3k65L44k8J09j6q8
5850a0j82L04O7p9K4Q6j93k20J59K64L1m29j72L66p4M28o21M98j92k20j5KM7J20
5874a1k73J16O0L9j66L30k4j20O6J0l11P4M76l55p6K97j23J47R2j93k5L8rN5q8
5899B6J2L97l08R9k01K46l63K54k77K61l45J32J55j40j11qR5J39j87N0K24j03
5921D7J50k34PK5K50Pk21r8j24L63r6P0j4M0l28NL2K19q9O5j5j26P3K1Pk71N23
5948B88k68O6Q3k92J00J7j9o2K49j82J4l4K23j84Q7qq3PK61n06K26LN2k92M09
$$ y = [-269, -54, -166, 145, 63, -48, 227, -413, -59, 35, 139, -247, 234, 125, -94, 331, -115, -104, 130, 258, -7, -185, -230, -62, 422, 29, -196, 273, -21, 242, 232, -46, 198, -32, -113, 161, 25, 70, 66, 158, -66, 152, -39, 48, -113, 10, 45, 34, -50, -79, 88, -50, -260, 24, 33, 141, 294, -16, 31, 182, 50, 27, -66, -331, 13, -15, 94, 78, -10, -192, 112, 179, 100, 124, 210, 17, -203, -44, 220, 251, -178, -350, 16, -58, 370, -251, 247, 55, -165, -180, -178, -131, -11, -284, -168, -108, -69, -235, 95, 71, -49, 17, 27, -284, -210, 266, -89, -165, 132, 9, 156, 248, 55, 30, 68, 59, 114, 26, 38, 435, 127, 226, 25, 271, -92, 162, -115, 146, -199, -67, 88, -52, -163, -171, -76, 63, -124, -74, 150, 47, 197, -37, -30, -5, 245, 252, 31, -67, -191, 172, 76, 146, 132, 172, -156, -151, -119, 100, 11, 76, 61, -65, 8, 29, 36, -235, 288, 20, 86, 169, -123, -23, -6, -25, -87, 162, -20, -6, -40, 183, -1, 86, 78, -5, 2, 263, -243, -17, -14, 38, -254, 155]
5973A55J8k46K36m6j6l73K46l8J00j02J14J69j97N4k39K67j63j30N52n36M00k39
5995a4j15L57mk69P0J20J81k64j11N1R6n2n4J80l79M47l99J34K8k06L1M65j03
6018A90j98j45P7J68j08o5m5kK94J7j28p6L11k51J00k87L26k76o6J57j14J4J48
6041D1J27l02J22K5P5p2P1j61J8m5K45o5j88L16k16Q8MQ9J2k86J33j7L35k87K46
6066C08k36j63M3N9Q8j06k98K55k6l7n7M44M1l54j44K32j42J45L4J04l07K66k03
6089e4K26l60O4L7J17j97o8J76l55N23M3j40m01O43k73K3q5j44K16j10K22Q9m24
6112b32L55J1k73J00p0L27j43j46Q7j41L58k34n06O88q7k48q3J28L10l74L09N0
6134A86k75J19j8m6J33k67L90j02j67K92l06O7O4j78J61j84L17n88O28j92K75
$$ y = [155, 173, -73, 163, 117, 101, -272, -26, -64, 36, -66, 48, 217, 20, 74, -165, 102, -61, -191, 361, -175, 225, -14, -129, 228, 224, -45, 25, 145, 326, 62, -49, 2, 98, 46, -8, 172, -207, 240, -159, -25, 3, -203, -172, 293, 190, -8, -153, -76, 92, -16, -81, -126, -128, 166, 183, 55, -21, 290, 39, 139, -148, 178, -98, -164, -7, -121, -107, 41, 168, -134, -12, 13, 88, 16, 87, -74, -56, -101, 144, 79, -109, 207, -9, 79, 83, 172, 184, -102, 31, 14, 349, 62, 308, 72, -91, -48, 11, 99, -7, -305, -50, -76, -113, -170, 274, 315, -39, -183, 49, -93, 52, 86, 190, -117, 149, -54, 172, -188, -124, -87, 30, -167, -235, -59, -414, 109, 152, 12, -389, 254, -19, 4, -81, -225, -9, -119, 103, 192, -232, 123, 134, -139, -39, -109, 218, 75, -71, 16, -125, 233, -1, -507, 181, 94, -154, -237, -109, 201, -173, 136, 186, -89, 30, 12, -34, 99, -168, 222, 120, -47, 245, -61, 6, 70, -108, 53, -131, 186, -402, 226, 34, 309]
6155C09m98M22k27J03J97k29j31J82q0j33L38k88J22o7j95J87n9k4Q8J93j26M4
6177A28jj47K1j21L36j70pj27J40L03k59J39l46J92K0j07k27J22l8K70P4n9J30
6200B66k81o5K09j66J16k57l2K24K92k41J10o0j72j60Q4L71k15J26j06lJ03L7
6222A80J19l4j95k74K50J86l43m3J48J62R1l03K7K18j40l36N18k37j59J89j6k53
6244b45L4q1J16L75j35j66L06k61r2K05J37N3J04n79M51l75L98o8q2L3N0m8j13
6267A7l59O50n06L49k57J54M7L9p8j2q3O0J8l45J28J77N6J3q9J12K23j90k39K43
6291A28r3K38m4j62l1J16k17O2L0j39K19J05m65J37L35L1j91j94Q8K31l92M37
6313B29n13L83k12R4j88K16r0J07J04j12n3J79k94r8J39k93N53J2Q5K27m83L5
$$ y = [309, -189, 233, 6, 109, 306, 77, -54, 128, 48, -85, 253, -35, 87, 20, -175, 12, -47, -71, 17, 210, 84, 128, 127, -20, 1, -120, 216, 46, 39, -88, 52, 355, 96, 235, -111, 81, 101, -6, -233, -111, -149, 121, 195, 136, 266, -15, -80, 129, -37, 79, -178, -210, 14, 306, 65, 175, 115, -57, -217, -133, 238, 23, 149, 43, 40, 143, 180, 299, 265, 70, -204, 46, 232, -111, -154, -6, 156, 247, -56, -29, 189, 49, -287, 231, -6, -165, 24, 8, -245, -211, -292, -176, 199, 64, -102, 204, -57, -149, 56, 193, 246, 350, -229, 222, -153, 245, 177, 95, 128, 178, 130, 17, -342, 308, -198, 151, -106, 48, 95, 134, 56, 44, -39, 21, 39, -306, -178, -1, 55, 68, -21, 91, 314, 124, -115, 128, 35, 273, 229, 67, 36, 152, -65, -3, 27, -112, 107, 212, -253, -116, 219, 250, 59, -135, -47, 184, -208, 229, -284, 99, -113, -19, -207, 9, -81, 26, 130, 18, -35, 144, -150, -248, -109, -402, 151, 163, 248, 475, -8, 27]
6335B7n0O3J56k60o6K95l37M48k12p2l36O88k37j69M63o25K27Q3l47N06n28L34
6357E1K73k31j65N02m06k8j52L62k44o6J19j30q9L0K79l85L65j19J3J00J9m7k28
6380a77R6K54k17P2j29j46L44k08K68L2j23j12J7Qk43J31J87J48l07P8j31K90
6402A32j46k43R9K73Q3j28l10m3L77k4l66K64J1nl8n0L56m90M1r5N28m23j48J40
6426b05L14q7j23j85M44j75k9L21l03q4J37Rr5L4K21j72J29J18j63j32L3j93k2
6449b08K40n0k39K67k19M7K96k8j37L9q4L6K22j45j32j23N3O5K31J04l24P2N5
6472C8l31K98J95k56k78N64j99L7k01P6j66%J97q8Q1p3L73j71r0M4m53N22k79
6495a60J68j93K73O3k96P9J52J18n1p8l13K54k42K52M4j33J29q3J59k5mj26J79
$$ y = [27, -23, 40, 196, -64, -130, 165, -172, 276, 64, -8, -344, 344, 107, -62, 401, -224, 3, 86, -261, 245, -283, 51, 324, 93, -72, 430, 24, -4, -156, 206, -38, -104, 15, -115, -204, -174, 105, -280, 85, -34, -21, 79, 98, 51, -177, -81, 173, -44, 28, -101, -247, 97, -111, 157, 189, 66, -46, -29, -21, -264, -133, 54, 202, -105, -27, -158, 132, -14, -257, -158, 115, 198, 70, -240, -283, 94, 70, -296, -32, -21, -26, -64, -114, 242, -248, -207, -302, 226, -197, -345, -205, 109, 22, -101, -286, 158, -17, -46, 275, -28, -112, 25, 34, -61, -27, 194, 22, 151, 269, 106, -26, 7, -186, -208, 32, -18, -257, 10, -209, -162, 134, 106, -31, 8, -76, -40, 182, 37, -95, -218, -165, -100, 131, 235, -89, -17, 38, -293, 5, 200, -56, -334, 230, 31, 68, -133, -57, -223, -223, -26, -114, -33, -106, 267, 96, 6, 50, -403, 119, -160, 8, -185, 88, 151, -145, -66, 86, 204, 153, 75, -238, 16, -226, 26, 70, -63, 66, -17, 142, 117, 113, -13, 166]
6518A66n08N11j39j70L43j61m31M18o4K53m40K66J08Kj69K4r1L61j52j79J21j71
6540a02L45Ql61nM06n23L16r1oM05k07l02M2%R4k67J56K4Q6M6P9j37J88j41k7
6565B6k85K14j05J23K53n0n14P9M89j63K9Q2k16K47o5l39q6L09l82L08J74J88
6587C16l93m7K88J08k22p9J44j85j9K00O2k50P6K3r2q7J06P9J24j4k79j48L41
6610E2j55j61L42K73l06k24K05J61k45r1J43J33L3P8j31n3k04L03p1K03l55J24
6632E4J14j31l21L46j41N5M6k09N6k79N28k03K07n2J13j80j62M40k51j96L44j98
6654b0k08K46J1j88n8L74R7k57l4J66k58j3N3m3L4J8K80n39K67K37r2J10m60K94
6678A7k54K30j77K27k8J20j80L75l37J34j70K5J39j76j0q7J52P1L6J03j65O1k5
$$ y = [166, -342, 169, 30, -140, 203, 42, -389, 29, -35, 218, -222, 44, 152, 154, -15, 9, -82, 279, 127, -52, 69, -102, 243, 251, -110, -115, 291, -232, 84, -7, -13, 392, 185, -117, -75, -75, 19, -248, -92, -68, 18, 64, 143, 6, 194, 53, 26, -259, -45, -150, -27, 226, 176, -338, -259, 230, 67, 96, 178, -38, 209, 144, -195, -281, 28, -354, -46, 128, 316, -77, -124, 164, 272, 50, -29, 115, -70, -89, 111, 173, -77, -1, 22, -70, -157, -51, 28, 152, 138, -141, -289, 52, -103, -264, 78, 351, 45, -179, 26, 187, -58, -149, -6, 127, 160, 238, 107, 54, -150, 153, 82, 285, -70, 54, 168, 37, -284, 62, -79, -24, 22, -187, -131, -410, 118, -85, 122, 70, 183, 3, -159, 281, 30, -166, 178, -20, -228, 18, 29, -159, -217, 157, 254, -3, -37, 129, -129, -142, -89, -132, -98, -80, 200, -339, -72, 165, 73, 183, -277, 17, -237, -7, -184, 43, 15, 135, -45, 330, -7, 127, -43, -18, 121, -55, -65, -152, 0, 71, 107, 210, 45, 106, 81]
6701H1k97L54p5k16o4j15M66o6O6k37O3K85l30n3J51k56j12M69j31k54K63J85
6723A77k52J07k35Q3p4j01L11N9j69J10j3J92l03J90k85M8K67Q3j42r6M7k66L82
6746A20k6r5R1l62L53j05m7p4K38J48n5r5k6j76L3K20j09m7J8J0J47q7rj86L14
6771A93k70p8J72k01m6K57Q8o5j91J12K88k7l07L43l10mo6k96L39J03j66L34r9
6794A03j62K67k79l05M37j55j04J91K06k17K26l10NP3L7J10k7j56L02p7N2l44
6816a27j12L07J62k13o8n7k02N36j20j39L6J40p9qj17P0n1M4k47L00M0Qm6J73
6840B30j4k29j80J25j42j7J10l0K93j68pr4J32P9j29N2K10j15r7J16j93K88j09
6863A11k41N5q1K53J27j83j5j90n5M25k42J94P6m00j3J98J66k10O3j33J56k12
$$ y = [81, -216, 138, 63, -153, -217, -332, 134, 68, 134, -103, -40, 245, -85, -138, 13, -243, -355, 114, -17, -271, -8, 177, -75, 32, -203, -120, -194, -295, 16, 75, -94, 16, 3, 195, -108, 82, -203, -155, 112, 195, 53, -43, 4, -262, 120, 94, -1, 90, -272, 81, -24, -71, -145, 93, 241, 186, 91, 65, -111, -78, 142, 33, -14, 4, 14, 161, 74, 65, -121, 193, -77, -155, 17, -184, -230, 27, 115, 50, -141, -29, 259, 232, -75, 268, -42, -46, -112, -408, -69, 34, -132, 202, 103, -59, 208, -71, -376, 61, -94, -198, -7, 199, -18, 208, -102, -97, -24, 13, 123, 96, -60, 242, 165, 217, -127, -239, 68, 230, 17, -51, -108, -310, 226, 106, -33, 3, 143, 64, 56, -61, 9, -42, 2, -245, 55, 95, 103, 57, 230, 216, -13, -193, -68, -210, -227, -117, -147, 146, -22, -29, -123, 9, 88, -41, 11, 221, 106, 9, 125, -68, 220, 111, -130, -75, -156, 97, 224, 41, 26, -164, -219, 206, -36, 158, 234, -166, -179, 19, 185, -25, 38, -95, 61, -151]
6885a51L46j37k39J85J36p2pM4k74L64l29K6k24J33J42K17k1k5J98l75k3J25j52
6908a13K29k20j3o7K69N6Q6l08q0J52J2k61K79j21K05j22Jj80P9l7O7Q8l30M46
6932A17j95r8J89k15J19M5lK46k48m4j65J73K11j62K81l70j52L62K77l73j98L47
6954A44j06J9j63J39j50L97j90M3J49j72q9L35k79N5J76l09M48m87J89k13L12
6975B48k77r5J61p4L9J21k37M11l17K48j35l0k94J13K49j86k27J52K61K35l62
6996Dk78K92P7r0j91L63l39K45O4k25J66k12K24j8k39J80m1J70q2j67j6P4j25
7019a64J41k2j78J32J43m15J83J46j05J70K34l12J87j66J17L29k54k03J53k58
7039a42K46q0K1K05N3j15q4K00m57R7P1k51L56l64M15J79k48k0k85L78k02K45
$$ y = [-151, 195, 58, -181, 4, 140, 68, 61, 105, -169, 195, -134, -108, -332, -199, -57, 160, 139, 114, 312, -63, -86, 39, -113, 116, -104, -117, -184, 85, 141, 227, -81, -161, -9, 3, -258, 21, -100, 105, -17, -16, -196, -117, -154, -87, 1, -329, 117, -78, -176, 13, -202, -83, -38, -41, 205, -43, -87, -252, -79, 132, -30, 251, -119, -271, 91, 368, -5, -203, 144, 38, 57, -106, 33, -117, 280, 90, 133, 282, 110, 21, 356, 77, 132, 308, -1, 447, -40, 149, -64, 248, -29, -124, 37, -37, 2, 123, -114, 297, -20, 228, 93, 63, -231, -118, 131, -55, -282, -130, 131, 366, 4, -274, 18, 95, 5, -186, 177, -162, 83, 147, -78, 88, -124, 100, 82, -157, 23, -18, 152, 70, -97, -113, -39, -164, -23, -45, -223, -91, 52, -363, -180, -34, -139, 31, 265, -47, 140, -26, 91, 420, 166, -37, 116, -142, 104, 24, 45, 250, 303, 188, 104, 304, -153, -56, 15, -236, 120, -244, 171, 350, 102, 82, -203, 175, -27, 218]
7061B18l07l1K4j51K97K02l28r3L0K45l88M62j65J66k15PN2k3k60P41k67k95K32
7084A53k00K98l60j4j19K42Q5k44K71k02J75R5k92J57k12K36j71J46l06L24J8
7105H0j17Q6j6LJ08j56j07J98j41L7K71k6k78O0J0R8Pk44J79k34P1L31R0m56J88
7130D2l5J25q5j09N9j97L64o1J20j39O2j08k74K89L8R5k00k17N2L22n69N60k30
7153i6J59j19o5l30O39k42K12j97J54j28K72J58k91m84N87pl19K45m42M8J41j64
7175b69K27J18j23p8K55L15k99j25J02L07m31J05k35J78j81R8j77K4J83m22M01
7196b7O3Q6K13l08PK51k13O0j73n4J50J19n21M64m6j80m1K14J23k98O4J45j48
7219e0R2P8j08Q6k3j07L26l60P9O0j26o0J77n00N61j41q5K14J86j4o31M68q2K7
$$ y = [218, -89, -120, -96, -247, 50, 252, -76, -169, -139, 106, -282, 180, 15, 181, -34, -27, 25, 2, -258, 483, 216, -79, 153, -47, 251, -109, -123, -242, 0, 85, -159, 112, -90, 85, 180, -112, 45, -167, 69, -102, 44, -262, 62, 80, -37, 49, 33, 36, 144, -12, -119, 79, -62, -25, 246, 220, -58, 2, 12, 110, 117, -127, 52, -182, -111, 220, 310, -146, 42, 7, 132, 47, -62, -3, -200, 164, 103, 223, 84, 146, 38, -236, 53, 91, 186, -14, -231, -179, 143, -426, 134, -96, 63, -56, -121, -451, 188, -54, 158, -39, 115, -13, 259, 417, 126, -358, 229, 222, -97, 148, -294, -246, -105, -269, -42, 76, -47, -125, 130, 445, 146, 21, 123, 430, -1, 104, -131, 47, -134, -36, -213, -189, -6, -428, -27, 36, 122, 335, 27, 34, 285, 72, 132, -41, -95, 55, 174, -347, 117, 71, -109, -150, 64, 187, -111, -47, 98, -50, 42, 120, 12, 98, 75, -32, 294, -66, 13, 73, -53, -113, 64, -436, 125, -16, -101, 113, 299, 285, -346, 122, 40, 67]
7243F7o0J50J88m01m1J93J26mj85j14k9K37K30j94j83k3J82m59N58J5n20N30j19
7266A44l69N73n38K60mK3J89k93K27k26J10q1J79m3j70K2j39L1K47l40j01J71
7288a28J39n1J29J14L23m96q6J05j69K74J13m53j1L19Q0k56m0K32l12J20K47j31
7310F2j77R4j91K64j05K6P9m7Q6q8O2k08J06r4j37L79q0m7j30J23j95K20N51o53
7334a00K23P5j02j43J25J10L3l16M6M24m32J09j42j03K21Q3j45j12J72j02l8J40
7356B6L2j58J23J92k92Q2q8r5L67k48k65J69K61J22r8J24k38j56J24J49J6k77
7378a28L3Lj65M68j22k3r0j42M01m48M47k79M81m21J23K0q6J96j29k05N9P3j66
7401a00L79j73l05j36K83Q9N3p7k00r7L64n9k21P4L10j77K31l99M5L06k11q7j
$$ y = [67, 7, 157, 345, -56, -97, 96, 222, 218, 33, -81, -110, 127, 357, 163, -20, -43, 139, -320, 238, 253, -267, 263, 144, -225, 348, -190, 70, 66, 89, 278, -15, 212, -14, 96, 15, 194, 151, -19, 3, -136, -105, 142, -198, -299, -128, 11, -40, 89, 203, 526, 30, -56, 49, -120, 154, 267, -186, -197, 122, 202, -54, -94, 138, -174, -54, 193, 62, -115, -21, -212, 52, -53, -27, 52, 5, 91, 3, 65, -143, -37, -131, -268, 111, 31, -16, -146, -23, -218, 2, 553, -100, 123, 198, 96, -47, 78, 188, 221, -95, -49, 375, -57, 52, -90, -193, 28, 111, -34, -146, 26, -76, -114, 26, 58, -100, 23, 215, -77, 5, -83, -178, 189, -59, -324, -155, 106, 228, 130, 254, 16, -140, -16, 133, 149, -128, -95, -92, -257, 211, 89, 66, -24, -166, 235, -213, 234, -45, 436, 15, 138, 158, 72, 268, 139, -66, -7, 66, -100, 279, 106, -199, -335, -52, 37, 90, 13, -187, -284, 80, 21, -200, -126, 184, 7, 238, -161, -116, 190, -21, -108, -109]
7424a09QK61k02kN4j24K38k60M55l53K6j27O8J83M2k38O6J56k6k2j27k78J61Q9
7448f1J52j05J71l64J82pJ44M7k44j69K23K81k34k15k14L49K99k24K55l10J89
7469A45l40J86p3K2K98j53Jl18Q7J95jR2j36k82J93J39J74k80M3K29k14N4J6j08
7493c1q6L36k93L5K02k45m3J32o2j67J29j23K70j00K32j27k4o4J90k60M82n12
7515a29P2K60l39Q6J51j30k48O38n29q0K02K62m49J38K0K14n79M10K80k35Q2k52
7537a55K0r2K80j29J0Q4K38j84P5k56M2J45J01n9M36o44J11O5j27l8J74j05Nk58
7561b61L20j03m51K21J29J37j79L13j31L0n5L26l35k6J56r0j6K45k70m9J03l3
7583a9O2j63Q7J61j53K5j48O2K14l78L84j73l3j63K26j06K61OJ2R9l26J78j06
$$ y = [-109, -101, 160, -42, -44, 10, -114, 124, -136, 319, -34, -8, -135, -67, 116, 158, -80, -14, 142, 116, 94, -33, -311, -150, -61, 91, -14, 157, -207, -25, -32, 112, 159, -85, -254, -31, 250, 16, -199, -413, -64, 235, 11, 266, -44, 145, -195, -9, -82, -60, 238, 85, 86, -232, -145, 50, 49, 141, 5, -277, -84, 55, 229, -51, -8, 221, 7, 61, 77, -31, -117, 219, -74, -39, 163, -82, -125, 7, -55, -222, -93, -216, 54, -46, 186, 59, 35, -29, 161, -99, 383, -129, -57, 203, -136, -50, 101, -29, -277, 361, -168, -248, -46, 216, -233, -95, -75, 139, -440, -30, 250, 15, 97, -155, -135, -227, 53, -76, -66, 18, 256, 72, 147, -109, -67, 78, 179, 120, 556, -88, 23, 88, -39, -77, 97, -8, -3, -261, 59, -44, -495, -274, -145, -8, -187, 126, -5, 25, -30, 296, -39, -65, 91, 1, -15, 230, -40, -89, 14, -19, 43, -120, -33, 128, -25, 0, -148, -86, 128, -250, 134, -39, -72, -235, -9, -115, 146, 152, 164, 263, -63, 115, 9]
7606Ik20p8J5L10K8l36J0J99J48j89mJ6L13j84oJ32l56K12K09j87j89O7J57K53
7630C29m03k40M59j04k10K85R2m3l20L34r3k42J3J85rk34k7J18K47K33L33p39
7652c6l7k6J28k13K90l78J12K50m04K75Q4k07L32j83M8j16L4K8K02k58k45M99
7674A79Qj72J76n2k41j36M36r6k8k39K55k42K21q3J09k35k26O88k77mj61K60l81
7697b41L29l44M00ok0j97L03k85K18k3k9k11J19K73l04J74m08K65l21L94m60K72
7719a02J6J6q1K67o3J76O2l04J25Jq0J87k49L06j92qL47j86j73L0l6N1K75m94
7743a09L02l10J37J94K4n29K75Q0J0L0L75m59j22J19M8j0N1k57K50k28P1N3k68
7766b73J2R1K57J44k48k29O3j2o0p2M90k84J15j38J45j09K05m12N48j63J01j76
$$ y = [9, -211, -289, -274, 36, 64, -272, -262, -63, 85, -104, -108, -92, 221, 37, 31, 163, -193, 19, 228, 41, -148, -81, 76, 329, -74, -314, 145, 41, -169, 116, 208, 165, -155, 179, 86, -156, -143, 42, 33, -201, -228, -110, 137, 370, 703, -36, -73, -99, 29, -184, 106, -272, -160, 90, -314, -39, 45, -162, 170, -13, 35, -81, -47, -19, 183, -75, -320, 179, 187, 15, 191, 139, -102, -238, 198, 102, 74, -165, 90, -152, 69, -14, 95, -140, -366, 322, 45, 41, -120, 140, -241, 88, -256, 144, 138, 118, -79, 224, -61, 157, 134, 105, -106, 13, 286, -18, 156, -252, 13, -308, 86, -374, -102, -86, -70, -151, 116, 53, 229, 291, -13, 112, 113, 33, 220, -29, 277, 85, 77, 424, 238, 65, 95, 59, 110, 385, -109, 193, -117, 20, 214, 238, -291, -16, 64, 74, 104, 479, 20, -102, 17, 65, 55, 106, -151, 99, -129, -58, -5, -273, -261, -170, 87, 231, -17, -246, -183, -195, -255, -327, 163, -121, -6, -144, 1, -108, 97, -315, 233, 70, 171, -5]
7788en9Q1N3k5k00J49k55K85K78m68L40pj62J21j2O5m1j64N3K35j84J0Q1k77R2
7813a6n2K60k97M36j23k94P2J8N8j54L83n00J84O3l41K57J25n5O1r7Q5o4j5M1
7837C5P5k46K14J62l72K80P9m70N2J41O5p5J30rr9J06Q0QJ9l05RLP8j00J79j25
7863h6p1J40J26K9k54j04L11K42n25J08K07j87L07k29o5k05J61J21k51L21J92
7884B88j17j53k25O4K51q6R3R3l09l7K8J46o0K3M7J71RJ96o28J53K28k11j5J53
7908A02k5k8J58m53K1j2K74j57j75L58j45N3p9J19r6L70m18j7M39l43J37j52K73
7931B04q7j07R7p8j10j21M95k53k60K22k6l08M84m7p0K3k40J86p2j37K59O7n3
7954F8K30m29ro5L66j77k64L54j42J19k20j38N28l75J41K45j26J48j22j41P4m6
$$ y = [-5, -64, 17, 70, 45, -155, -6, -261, 24, 302, -166, 174, 167, 5, 126, 114, 179, 138, -26, 27, 262, 78, 88, 169, -108, -16, -68, 192, -105, 331, 208, -86, -14, 4, 62, -92, 291, -209, -25, 38, -303, -46, 79, 24, 85, -12, 73, 9, -6, 35, 110, -136, 78, 240, -132, 148, 227, -243, -191, -50, 15, -60, 70, 61, -38, 68, 148, 156, 175, -130, -121, -118, -40, -140, 39, -86, -157, -17, 109, 138, -116, -220, 91, 333, -192, -84, 123, -64, 243, 14, -51, -256, -95, 26, -225, 96, 288, 171, 18, -207, -143, 108, 22, 115, 208, -101, -138, -110, 36, -24, -1, 46, 217, 226, 422, -206, -53, 175, -36, -51, 102, 77, 49, 207, -246, -225, -237, 37, -120, -295, 63, -82, -29, -108, 11, -85, 285, -133, -150, 289, -54, 83, -69, 204, 117, 10, 107, 29, -81, -202, 293, 40, -220, 2, -24, -332, 152, 105, 35, 58, -182, 4, -68, -205, 54, 121, 68, 298, -131, -140, -205, 161, -16, -280, 74, -68, 51, -169, -307, 221, -154, -13, 232, 106, 254, 132, -9, 65, 19]
7976A9k29J69J36k40J22K19Q9m24K9L53m18M59l98L67j39m3j15J56k29J27K58
7997B68l90j76K59J68l70K37K45L7k92n2M63l96N9k20M01l33J24j96J54M41n15
8018h4R9j49J87j24L62l13O9l69M18k47L19j04r1k9J06j82J12P6k00K48k58P8
8040g6K18kL7J89o7m55L19o6Jn8j19j28L02p2n01K66m1J49n0q8M63k07m8j46J73
8065gL5J60r1j82j92R2R5J54K19m29R5J10K62m41Q6j83J56K19Q2j88l18M28k09
8088d7J7K14l40L21j00j80K38j67RM40l52j56J33j53r6J89j72J57K49k97Q5J92
8110A84l57J37N3L30m78K91k75R5J43J73k66k6j5J18j89N4J03l6J24j31L78n73
8132a63K51J83k42q8K80n4l51K41J67k35Q1K44n58R5j2J90L42m52M02N4n01J59
$$ y = [19, -210, -41, 95, -145, -23, 196, 285, -139, -110, 243, -175, 284, -114, 253, 114, 71, -44, 112, -117, 10, 268, -122, -298, -39, 129, -241, -4, 241, 278, -14, -66, 397, 1, 60, -160, 241, -92, 32, -164, -10, 431, -84, 15, -134, 53, -71, 291, -22, 47, -322, 96, -151, 168, 64, -27, -56, 50, -132, -20, 56, -144, 104, -154, -76, 142, 140, 177, 366, 299, -156, 163, 97, 98, 40, -79, -207, 95, 23, -478, -212, -253, -104, -154, -242, 221, 14, -34, -180, -7, 28, 188, 97, -85, -277, -185, -90, 64, 283, -146, -51, 59, 321, -120, -34, -217, -61, 158, 240, 52, -266, 162, -47, -30, 184, -156, 165, 65, -115, 123, -44, -35, 405, 53, -103, 30, -123, -219, -30, -202, -45, 204, -93, -8, 184, -173, -36, 17, 347, -131, 160, -115, -20, 123, 296, 30, 4, -11, 107, -82, -28, 75, 39, 163, 32, 410, -163, 88, 271, 29, -59, 221, 167, -184, 57, 224, -11, 70, 314, -244, -149, -161, 29, 371, -81, 321, 375, -126, 33]
8154C3j87N07m10J11j8lk11L11l56K17q9J20L2j54j09O8J48k09L04l39K44R0Q2
8177A82l12K66Rj12j3k22K0K14J16Pn1q8j10J25
$$ y = [33, -154, 353, -57, 54, 36, 33, -178, 133, -223, -6, -95, 25, 57, -97, -206, -138, 10, -199, 105, -234, 10, 100, 182, -130, 136, 145, 33, 20, -202, -182, 32, 148, 155, 104, 16, -94, 31]
8191C1
$$ Imaginary data points
##PAGE= N=2
##DATA TABLE= (X++(I..I)), XYDATA
0@%%%%%%%qJ6j6J6j6K4l2L2m0N2o0P2q8J03j19J36j55J80k07K35k68L04l44L89
31B06m37M89n48O12o82P60q43R34j035J148j272J409j561J729j917K126k364K641
49A395k961L333l777M321n004N882p065Q764j1418J6176k7349J00926O6146j96981
63d7612m9178Q7119Q3829l4979k9305p552j6057k1128N0511N0426l2122p2889
75c8937M785M4773j032k8446K3571K9295l3753n2087K2374O1038J0973m3762l2907
88c4115j136K1547L6664J9127l9065n5276J1260O5696J9577m5832k8744K2700
100g597J7287j4614r731R518J814k346R823j095k5593Q90M7710J5029o5544n1045
114g5494N4398Q0484j2890p1713j5734M2016K2446j0325n192q137k4899O61M3500
$$ y = [0, 0, 0, 0, 0, 0, 0, 0, -8, 8, -8, 8, -8, 16, -16, 16, -24, 28, -32, 40, -48, 55, -64, 72, -83, 97, -110, 125, -143, 161, -183, 206, -231, 258, -290, 322, -360, 400, -443, 491, -544, 604, -668, 741, -820, 909, -1008, 1118, -1246, 1395, -1566, 1767, -2010, 2311, -2693, 3189, -3876, 4888, -6530, 9646, -17703, 83223, 149369, -47612, -96790, -9671, 74158, 39179, 9874, 2322, -13735, -34863, 15648, 66074, 33952, -38937, -34152, 10621, 9589, -18857, 4714, 34009, 256, -51831, -29457, 31581, 42554, -1208, -34115, -35251, -13704, 22960, 42087, 3022, -52254, -40994, 24702, 44279, -1553, -30297, -7597, 9690, -4924, -14655, -5137, -3323, -5669, 4154, 3059, -22534, -21644, 26066, 41095, -24449, -75494, -21096, 59388, 46498, -25215, -40949, 1067, 23513, 13188, 7996, -141, -25040, -24379, 19121]
127A9121J9398l9108k7690L1561K4333l3307k5866L5978L5577l0288m3719J3855
139b0155M4426J0655k0625k0265j1469M111L2001K8377k4679n3094l666N0027
151A5644K5963k8399k9574O670J5859R53l663m088r302k303J1080J497j6275K069
165a3869L0625N633m3379k9275L4789M6156j2622m4516p864K8998K1360M58q503
178G991j7921j7082J3748L5540M058l7174j6859L1657K5993k1594k7745J1352
190h036K3678n992k1762j938J6111R974j377r316j4351k864K2049K2061j3964
203A4273l4617l266L1536J7849j7681k1521L845J6164O258n275q084m835L163
216b191P675l206j2904K104K1705Q906k2701k1775J3359K8134Q16k5714j6684
$$ y = [19121, 38519, -589, -28279, 3282, 27615, -5692, -31558, 4420, 39997, 9709, -34010, -20155, 24271, 34926, 14301, -5964, -17433, -13322, 18679, 47056, 22377, -30717, -34383, 15644, 41607, 13208, -16366, -9696, 6163, 7116, 3453, -635, -9937, -12240, -1160, 337, -15938, -13869, 16756, 22389, -20990, -50265, -15476, 30680, 18058, -26458, -34322, -5324, 16036, 16494, 7991, -9930, -27012, -13264, 22276, 26334, -10840, -27699, 3958, 29951, 8357, -19388, -8036, 15642, 9650, -12112, -14050, 2061, 12035, 10658, 1342, -13009, -15873, 6176, 28237, 14273, -20344, -23610, 7926, 25775, 8094, -13427, -9582, 6582, 12840, 7565, -519, -5354, -2191, 5484, 2278, -10626, -8522, 13183, 22089, -612, -22387, -9028, 19106, 19922, -5792, -22476]
229b2476Q742K1301J3984n623k2813j6212J3754K8092L25l0311j5562K1299K3066
242A7566q060j9101n58J2263Q17j0169l289N527O136J301m803r534k058J4977
256A015J5053r290k3027k862K4361J6293j3816k1106J20J8407J1734m398j2038
269D46n747O219J0117p78j2551p874J0860J4103n802j6440j539J6574Q801j2840
283C549j7447q20J5584J2671m383j5952q211J1095J7260r82k0482j2628J3043
296g703J8680j885j5440m294J0993P508n776q102P66O555L875k943p420l563Q079
311f70J1662j959j6581p296J4354J6021o172j9879n976J4386J3391k757j1985
324c461n838N521J0308L430r470j1563K897J3926L400j2480q246J1544J3500m864
$$ y = [-22476, -13734, 7567, 21551, 15928, -6885, -23097, -9343, 18749, 19074, -11237, -26799, -5500, 17566, 9506, -9595, -10153, 2110, 2927, -7242, -10531, -5004, 1132, 2433, -2370, -11904, -13962, 1015, 16068, 6778, -16249, -19111, 5250, 21543, 7727, -13379, -13259, 5148, 16882, 12484, 446, -5301, 918, 11035, 10257, -2294, -10168, 692, 14795, 8993, -7447, -8986, 7588, 16389, 3549, -13898, -14718, 866, 13537, 9154, -6798, -15009, -3914, 13346, 12364, -8118, -20746, -7703, 10977, 9092, -6348, -10642, 351, 7859, 2083, -6019, -5253, 1302, 5177, 2234, -5186, -8749, -670, 10992, 9033, -7548, -14844, -490, 15531, 9359, -10520, -16496, -2110, 11281, 8524, -3461, -9299, -3778, 6530, 9960, 490, -11073, -8176, 5750, 9150, -3330, -11576, -32, 13468, 8604]
338H604j6237l557J1807Q986m388r762k652Q085J0558J114j2092j0172N778J4186
352A0258R44j3792p493R369J0484k656j0002l453N392N682m6p008p020K674J1442
367D775L799j1680j0488P432J4785Q0j5578p884Q617J0871j091q090m579K684
381f347Q147N646n225j0045l79J2140M931j1184q577R477J3551k494j2748l076
395f183R033N802l141o977l813K903Q807N295p638j1165J395J3271L923j1853
409c41q945N475R438n52n888k487J560L170K873k178o571k900Q256P682p527j0948
425i883L915J4789J786j2836p223P905Q683j727o981m359J158N797N514k992j0073
440f527k159R886O594r344j0507M838J1513M7q477k546N302L443o86k643l529
$$ y = [8604, -7633, -11190, 617, 9603, 5215, -4547, -7199, 886, 11444, 12558, 466, -9706, -3928, 10258, 11202, -2590, -10083, -714, 9770, 7114, -2888, -6341, -949, 4733, 4687, -2321, -9341, -6667, 4775, 8574, -3106, -13594, -6162, 8623, 8703, -6875, -14759, -6142, 4729, 3638, -4452, -9031, -6347, 1800, 7446, 2221, -7824, -8203, 3937, 8868, -2316, -10893, -1416, 12135, 9641, -3107, -6183, 2850, 8652, 5511, -1466, -5279, -2376, 6431, 11726, 4088, -7077, -5682, 7589, 11512, -341, -9286, -3811, 5627, 5075, -813, -3300, -1740, 1430, 4303, 2125, -4446, -7346, 910, 8592, 1065, -9883, -5968, 8821, 10607, -2229, -9452, -1547, 7136, 5409, -1572, -5931, -4773, 1024, 6538, 3546, -6527, -8686, 1200, 7794, -1550, -12057, -7219, 4294, 4341, -4136, -6682, -1380, 2063, 1377, -1266, -4795]
455d795j174M971O120k461r141m79J0422N133p794p654L283P197Q59m306k467
470b286J279L739L512q47o965k432P823N933o315j0051L470J0852J802q641m885
485d012L905N531L44k989m586k979L408P605j099r060l668Q578O000o511q637
500h170K135P295k78n213m77K977J328Q48K25k494k656L174N779j978q125o02
516f232R369M855o390p799K459O672Q48l853m275l63K623N294M86o339m372N287
532a730P194k700q208n21P243K835l774l151J729K956J130m0k199k185Q83N141
548D603L31n552k291N756M712l994n759J037N354P4l896j757Q53J487J671N33
564C162l120l556K761N618q10p619k517O664M828l752n615O87M422J376k202k487
$$ y = [-4795, -5969, -998, 5122, 2661, -6480, -6959, 3463, 8596, 802, -6852, -3569, 3628, 4487, 181, -2286, -1007, 2732, 6244, 5397, -1568, -4000, 3823, 9756, 3441, -6610, -3140, 7712, 9514, 873, -4012, -107, 5424, 5768, 2779, -1807, -4786, -1378, 6227, 5128, -3932, -7600, 978, 6978, 467, -8170, -6035, 1260, 982, -4231, -4708, -1731, -403, 445, 670, -1824, -4480, -1306, 4473, 2495, -5630, -6232, 3137, 7992, 1602, -6197, -3738, 2934, 3782, -71, -4346, -4709, -2086, 3208, 3694, -2645, -7017, -1730, 5464, 2764, -5444, -5965, 1278, 4113, 339, -2812, -1083, 1873, 3003, 2963, 764, -1421, -538, 4603, 4934, -618, -2909, 2847, 7559, 3565, -2194, -1157, 4197, 4271, 375, -1382, -529, 958, 2629, 3162, 42, -3514, -753, 4865, 4055, -3564, -6081, 583, 5411, 1659, -3956, -3269, 1153, 2529, 327, -2160]
580b160j769K51L281J481k942m230J925N777J02n221k084M170K852k021k937J424
596b101K905J314j167r15m87M22K955L02l686k691M145M389j569n796j196M377
612A201K671k289l071n35J291J837Q91j309k879K64L635J379l151k493K348K983
628B773j231k794Q66K912O69j440j347l4P08J381O92k691k836Q76M355J201m862
645h02l533K691M384j440m305n90K027J604j14l34p49q43J056J909r32k859K81
662b549L603Q23l666j995K995L230k201k893M61K026O2n90R3l18o00J452K029
679A962p67k205L22K628k07k542KK711J019j976j261O87Q10N45P04o30l646m56
697b300L489L123l134m729J440M220M14l329j553R31L55J89J734J29k352o39K621
$$ y = [-2160, -3929, -3678, -397, 1084, -1858, -6088, -4163, 1614, 1716, -3505, -5589, -1419, 1433, -588, -3525, -2101, 804, 2118, 951, 36, -451, -29, 2926, 3228, -458, -3149, 996, 5385, 3816, -1980, -3176, 1201, 3872, 1583, -1488, -2023, -732, 1105, 1996, 687, -2192, -1928, 1707, 3086, -65, -2558, -210, 2773, 1542, -1252, -386, 2526, 3195, 1755, 408, 374, 1082, 2463, 3155, 464, -2372, -1496, 2859, 4060, -802, -4335, -1644, 2740, 1300, -3005, -3595, -1568, 36, -78, -412, -1161, -2004, -948, 961, 29, -2830, -2549, 1054, 1877, -1789, -3784, -789, 2441, 240, -2653, -2192, -166, -104, -694, -601, -919, -1519, -67, 1962, 1195, -1010, -688, 1940, 1733, -809, -807, 1904, 2923, 947, -314, 373, 1183, 1728, 2432, 1802, -1844, -2300, 1189, 4312, 1178, -3551, -2111, 2109, 2523, -806, -2359, -1428, -1073, -884, 850, 979, -1373, -2012, 609]
714F09P51j840r87K563J139k711j645L731K236l293k681J215K848p78j662M02
730a03l70j338Q53K661p71l502l98L546J227k807j355J599J321j135l90Q03M80
747C21j033R69J100j398k396J761L377j619l262N98L066N68j894m22Q03j012o35
764a108J948J240k379j263K050J241j798j426K721J003l034k012L244K778k753
779D52k712J323K470j112n98P33n56k412L62L425O51l798j581L112J936k343o23
796a271J796J85k470M60K882M43k780j55K448N0k232Q15K234r89l325R75L225
813B291k64k368k83J181l93r70J145J240k246k006K687K056j747k732J585K230
829A406j664j644J842J755k190j795K191J230j593q42J789L42k146j05L214M50
$$ y = [609, 1360, -480, -1467, 1096, 2235, -476, -2121, 1610, 3846, 553, -2128, -913, 1935, 1157, -505, -103, -473, -1811, -958, 1703, 932, -2570, -2968, 578, 1805, -1002, -2357, -758, 563, -572, -962, -159, 321, -712, 257, 1357, -41, -2437, -676, 2701, 1082, -2180, -1582, 1484, 2052, 158, -264, 539, -473, -1108, 840, 2080, -299, -1562, 488, 1729, -69, -1495, 1226, 2229, -805, -2817, 427, 3205, 452, -2260, -937, 1533, 421, -177, 556, 0, -2412, -2050, 1375, 2026, -1772, -3353, -241, 1695, -648, -1271, 525, 710, -1760, -1300, 1582, 2025, -755, -910, 1538, 1588, -644, 171, 2405, 1416, -1909, -934, 2291, 2027, -341, -624, 557, 164, -806, 339, 1579, -667, -2673, 14, 2070, 323, -2409, -824, 1406, -258, -1902, -60, 1695, -495, -2290, -99, 1131, -462, -1304, 485, 827, -1319, -1424, 1790, 2240]
845B240l612o57L079O55k283j316K772N85l139J28K684R7k651k22K521k54k156
862a529P79K614q17k780J42L074k64j896K8K072j181j357J718J618j905k652K405
879F9K377j503k138J347J621j369j249K054R79k049j492J792J712j759j194J748
895I46pk200j36K671M10k857j413K927J653k783q40J704J80j586J71K128m20k450
913a902oK582j3k063R5J767n05j782J060K286q92k445J055K077q64j804J026J754
931A426j165j778J696J522j595j442J260J617j674j107J505J376j985n43J404
946E17J139k215m66J880N93k293o41K214Q08j991q17K051N72j552q67J829K35
963I96j534k9K194o15j286N4J419J4j595M9J461l24k154J387J477j029j894N83
$$ y = [2240, -1372, -2029, 1050, 1705, -578, -1894, 878, 1463, -1676, -1548, 1136, 1233, -1418, -1640, 881, 627, -1529, -750, 1864, 1047, -1733, -1591, 1483, 1219, -677, -649, 1423, 242, -1115, 603, 2221, 316, -2336, 69, 2446, 943, -1195, 152, 1773, 404, -845, 1209, 2188, 139, -1353, 439, 2151, 392, -802, 946, 939, -1261, -1397, 1274, 1684, -1173, -2586, 341, 1994, -789, -1629, 75, 255, -1331, -1160, 968, 548, -1902, -1908, 674, 661, -1402, -1307, 460, -45, -1827, -767, 1519, 627, -1818, -763, 1314, 450, -1354, -328, 1426, 261, -1517, 179, 1701, 106, -1336, -76, 1541, -133, -1240, 265, 1641, -344, -887, 517, 1656, -559, -1025, 855, 1448, -845, -1486, 728, 1536, -455, -1272, 779, 1351, -201, -1068, 761, 996, -538, -567, 1627, 1012, -274, -220, 1199, 1213, -382, -333, 1128, 804, -1350, 37, 1514, 485, -1409, -826]
981h26J848p72j251M25R74n67j520R93J280q46j186P48J279q28j028J027R10j429
999g69n92J404Q33j441n21J779P20j805p68J664N97j648n18J460O45j579l26J354
1017D89N09j565k28J797j48j296l09J715o2j393K88J419o61j340N87J421m4j875
1035f96K20J429j85j538L44J488o85j170M45J441n96j399L26J618j60j392P03
1052A93P53p42q67Q42O12j233n67J112R89j566p13J280Q07j214r03J259N13j036
1070d81n09J333O52j653k64R85M56j239j04R56M49j350j34J714K65j686k88J342
1088D44K32j118k87J692k80j358P52J294m76k037O30J394k77j471M0J614l86j284
1106h82O26J335p52j267J95J744r34r98R77Q17j168n91J080J056j353r84R30J188
$$ y = [-826, 1022, 250, -1001, -576, 398, -169, -1689, -696, 584, -262, -1448, -700, 579, -249, -1277, -250, 660, -769, -1361, 43, 876, -565, -1086, 693, 1413, -392, -1160, 504, 1101, -547, -1065, 395, 1040, -539, -865, 489, 998, -567, -795, 1002, 854, -442, -751, 964, 902, -491, -203, 1216, 555, -785, -198, 1223, 1179, -696, -476, 953, 768, -770, -426, 1062, 377, -793, -348, 1093, 497, -902, -576, 1042, 882, -510, 193, 946, 204, -663, 179, 791, -442, -1009, 103, 1092, -474, -1187, 93, 900, -314, -1217, 42, 555, -481, -990, 343, 995, -658, -922, 63, 519, -720, -824, 132, 581, -769, -903, 811, 1076, -610, -898, 444, 676, -442, -729, 963, 683, -675, 77, 1371, 895, -1142, -512, 882, 605, -866, -826, 788, 402, -882, -256, 1079, 327, -940, -745, 999, 65, -933, 44, 861, -307, -898, 182, 1238, -115, -1099, -169, 1019]
1124A019j300m21R82K87m25r28J382O03j710l75J610J67j192n27J354N19j753
1141g08J82J336j47j697K32J317j36j288J43J722o07j353P66J323q13j719M63
1158i84J971m61j935M21J489l30j123N34J099j064j173J410J292j693r78J525
1174@J368j301q43R71L57j200m55J460P20j849k69J623M62j557m62J448Q1q84
1192c30l49J640J37j880K15J452J89j319J39Q14l69r55N31J395j221j311J229
1209GJ550q53j629N67J892j200j185N03J158m89j163J470O28j491p61J234Q91
1226A129k028o16J229R22j021n54J132M96j444k09J497k07j242k41J580K39j636
1243i74J93J477l16j416K06J387M4j749K18J208J02j139O60R34q90p54Q20J011
$$ y = [1019, -281, -702, 280, 567, 142, -786, 596, 1199, -511, -886, 724, 891, -301, -828, 526, 1045, -708, -526, 810, 663, -1034, -802, 515, 379, -909, -766, 956, 349, -1004, -238, 1085, 272, -1447, -984, 987, 526, -1409, -988, 501, 171, -952, -418, 681, -383, -1556, -146, 1146, -547, -1525, 0, 1368, 67, -776, 195, 552, -648, -1103, 357, 1077, -772, -1041, 582, 1044, -513, -975, 473, 554, -330, -679, 961, 1098, -782, -567, 885, 1074, -245, -106, 708, 339, -616, -85, 1310, 89, -1222, 7, 1557, 704, -925, -358, 1534, 334, -851, -348, 810, 321, -842, 628, 1256, -235, -996, 238, 1129, -899, -1515, -286, 636, -385, -939, 193, 689, -755, -964, 533, 326, -916, -1157, 423, 662, -974, -781, 696, 380, -1036, -830, 557, 601, -1148, -930, 278, 380, -759, -99, 835, -55, -809, 11, 1022]
1261A022j146r59P99J193o51j054O24J317r79p94J143L91r45m84J214M43r05l38
1279a09J327J55j174o79Q92R60j391n19P47L37p24L00N04k12j273L54J338m69
1297C64j189L80J044k35p69L12Q02p97q07K13Q79p47l84L87O11o83k20Q34K16
1316B11m74j047J012L46m07n18O22K58n22k8R66l91n18q8J011n36o01M72J066
1335H34j47j371K45Q41J89q15N1L28q4l47R39o8m03j41j6N90m27j05K55M8k59
1356A37m2K16k01K54j4J81K1l69J68N93m06p05L8R14j87n80k77M3N1k21K64k57
1378c79l69M92J56J3n34O0N30l02j27k78O66K90m61m04J88K51J35N00n76m33p6
1399f58P29L70o33N6J75p0j85L97Q8k64o12L13Q31l11l01N9M81l7p81M35O79L1
$$ y = [1022, -124, -1083, -284, 909, 258, -796, -172, 1145, 166, -628, 515, 906, -39, -523, 691, 1134, 229, -109, 1218, 1373, 199, -480, 412, 1372, -19, -538, 209, 546, -178, 122, 626, 414, -859, -505, 833, 364, -825, -445, 599, 364, -405, -93, 709, -88, -895, -682, 197, -550, -934, -547, 64, -619, -839, -5, 211, -263, -1310, -298, 48, -359, -877, -255, 3, -519, -547, 419, 28, -490, -578, 433, -103, -704, -232, 834, 687, -684, -439, 402, 591, -224, -173, 155, 71, -276, 663, 595, 192, 51, 35, 625, 198, 93, 348, 396, 137, 95, 311, 110, 364, 350, 531, 552, 183, 351, 944, 538, -167, -129, 785, 598, 18, -259, -216, -165, -386, -122, -379, -748, -256, -100, -87, -621, -561, -31, -333, -460, -738, -72, 218, -243, -647, -459, -208, -73, 427, -149, -582, -658, 71, 441, -192, -136, 39, -31, -216, 181, 269, 5, -607, -294, 537, 226, -75, -16, 465, 428, -353, 82, 761, 792]
1421G92j176J61L09M68k5J57m90l98L42L86M03j119n59Q21O53p80j57Q15J33q45
1441a09l36Q02N7O1m53K70l46k36O39M18m52j235J62J183L6q84k1L65l49l13P11
1462c0O25r34p18O10R34l60j452R59O50n15p37Q58Q22q73m86J19O53k88J08P82
1482G27k38j257N17J450j5j578l82J298O35j076o10J412k20q65J2J128Qj671L45
1501c80J039p28m95N45J169j189o65K49J360n30j422M56P34m97m04J147N17j238
1519c32p97J272Q89j268m83Q27N52r07m39J393K26j150m22J112oj040L72Q91p01
1538a1j227O09J557l06j541K1J195M3r22J49J021m97j168J367P41r18p26P49O56
1557G92j041p53J415K36p65j035J435Q17r53o01O79M79r98q7J094K07j359K8R84
$$ y = [792, -384, -223, 86, 554, 529, 686, 196, -202, 140, 526, 929, -190, -749, 72, 725, -55, -212, 603, 736, -109, -445, 357, 414, 475, 22, 292, -54, -290, 349, 767, 315, -920, -758, 425, 461, -423, -444, -79, -428, -741, -30, 595, -339, -1057, -447, 487, 127, -1325, -366, 284, -231, -968, -110, 712, -161, -647, -528, 125, -163, -55, 727, 489, -768, -251, 1199, 1184, -394, -776, 522, 1157, 81, -529, 883, 663, -202, -190, 938, 946, -725, -380, 659, -69, -564, -19, 1150, -39, -704, -455, 905, 375, -1047, -591, 143, -354, -758, 389, 906, -332, -1129, 143, 1032, -236, -719, 108, 660, -247, -686, 707, 933, -217, -639, 473, 467, -573, -201, 690, -11, -1238, -629, 928, 622, -919, -898, 297, 340, -582, -433, 588, 91, -1077, 290, 1031, 113, -613, 136, 792, -249, -1002, 413, 649, -116, -1151, 284, 1101, 148, -453, 226, 705, -293, -380, 714, 921, -438, -410, 574]
1576E74J12r25n16J009j18q42k47J808n58j054K60J057k32j127K04J113n46j396
1594a424P05J462l85j134M09P80n77l59O54M66j014n08J218O13p65m73P71O16
1612A055j146l21P97N41j099m55Q26R13r82l65K95M9j40j37P34j88j087L4R64
1631B88J06o09j31R33m71q21N04P07k10r17O54P51m66p16N36M51n39o60L62J005
1651G57p48n37K04P51p85j70O46j74o67j17P64M92p84k04N50K79q60J33P65L03
1671E98o08n68Q12K6l24pO86k29p74M43L52k00n62K70K56J71o03M27P15n62o4
1692B55J23N51n43k76L07J99J34o69J58P23o35n50J84O20o69l95J76M54k98m81
1712f32L06J34n88q4K09N97m92O3n2P89o22j37N03J76l30m23P19o3j91j7M73j46
$$ y = [574, 686, -239, -755, 254, 136, -706, -953, 855, 297, -757, -497, 560, 328, -799, -595, 518, -28, -1424, -719, 743, 358, -776, -367, 413, -164, -523, 131, 597, -417, -925, 293, 906, 141, -332, 439, 1055, -91, -412, 385, 926, -173, -628, 198, 1111, 129, -236, 59, 108, -32, -169, 565, 377, -710, -676, 288, 394, -215, -346, 587, 116, -705, -201, 506, 296, -621, 33, 784, 318, -398, 138, 589, 50, -610, -248, 757, 9, -528, -324, 427, -358, -528, 118, -56, -723, -840, -76, 416, -368, -572, -22, 257, -603, -470, 295, 598, -10, -578, 234, 260, -64, -71, 615, 386, -388, 55, 407, 207, -355, -85, 171, 342, -261, 166, 881, 319, 255, 378, 929, 386, 110, 417, 616, 750, 81, 239, 962, 327, -223, -39, 581, -88, -483, -307, 147, -151, -632, -326, -192, -780, -864, -655, -58, -550, -487, -539, 250, -372, -509, -6, 170, -160, -583, 136, 73, -118, -135, 338, 192]
1734A92k84j76N06j60k12kJ59K87o07j05L89j44j68K0N30k39j24J82l4K38l77
1755a29O02j82L40m30K15R1J07p93M23M9L84o48j53Q09k74p48K88M83l32m27O96
1776C71J68m15k4o8N34l43m30N00J69m99n5J87P3m54k58L83J51Om77K77J64l71
1798d11m20M80L40m47m46K09M51r1l39L85J75m61L31M59O2m06N1L64kj09j70K77
1820B82K11n99K40N08k22l43l08L88l28J17K12nj90k73K7L11K7k19K94K19K13
1841E62p29N41M4k91m80O57M31o44J3QN01n5m09p9K49j80n80M25N36p69o0O8L54
1864A13m73r1J23L22n38O2N37j28q5l12L80K41q23L2P59J87o12l19N71J17o45
1885e82j03O53k42l19L67K48j43k13K72M66j80n80O64N50p03R4K70K22k02m52
$$ y = [192, -92, -268, 238, 78, -134, -136, 23, 310, -297, -402, -13, -157, -325, -305, 225, -14, -138, 44, 10, 248, -129, 473, 291, 631, 201, 416, 507, 614, -179, 244, 293, 677, 29, -124, 685, 411, -337, -49, 434, 102, -325, 371, 539, 124, 100, 32, 566, 223, -207, 293, 462, -37, -92, 95, 168, -286, -544, -161, -10, -4, -481, -204, -40, -411, -831, -351, -11, -458, -904, -695, -244, -335, -674, -289, -114, -575, -244, 215, 277, -129, -78, 286, 284, 175, 5, 282, 493, -106, 134, 642, 420, 77, -231, 157, -171, -54, 158, 153, -37, -310, -283, 28, 55, -164, 130, 349, 562, -167, 374, 418, 127, -353, 304, 735, 91, 104, 112, 613, 558, 149, 70, 319, 139, -441, -16, 520, -249, -309, -241, 113, -360, -451, -328, -6, -544, -482, 55, -73, -158, -470, -90, 151, -672, -640, 119, 306, -306, -625, -54, 63, -582, -685, -32, -274, -593, -226, 22, -121, -334, -62, 404, 224, -356, 308, 858, 155, 249, 519, 741, 539, 87]
1905H7L42L32k61k47J14J38k2n74K94J87n13l8J81L27m21l47M49K71o78r7P13
1926B37L16r44l4L54L35m80K75J72j08k95P4M67J1p33J11N08j6j191N73L14J62
1947A08p12M66j04R2k44J01N31m71n67N28M94m78k39O7N51r8n57N21O33k19o57
1968b54K77J66j35R6P7L95o10k80P85K24p58l61M21L26j3n90M77J19l10k72P75
1989E55J21r35m5O73j1m70j41R79o30n07m1M28J20m13j66L75l9k29rM53k90o49
2011h71O27P97o14k26o7L91L06n30L33L12m59l79M67K59p25K45L78J23m05k62
2031c00P32K20n90o23P47L33l61m80M42j55k64M71K7J60r67M28M11n6n27J95P75
2052F18j82q25K89N66k82o52J84O17k62k05L87K72k40q90N52N97j45p37J03O96
$$ y = [87, 429, 761, 500, 253, 367, 505, 483, -91, 203, 390, -123, -161, 20, 347, -74, -421, 28, 299, -379, -476, 237, 553, -391, -425, -71, 264, -216, 59, 231, 123, -172, -98, 369, 380, -353, -242, 266, 250, -941, -368, -54, 108, -604, -138, -242, -150, -394, -293, 238, -233, -800, -272, 222, -256, -495, -428, 123, 25, -532, -11, 622, 403, -254, 23, 189, 54, 150, 227, 622, 12, -268, 517, 741, -17, -378, 43, 369, 356, -234, 243, 362, 52, -220, 555, 676, -259, -304, 369, 358, -112, -253, 726, 96, -411, -452, -24, 96, -317, -483, -108, -147, -376, -385, 68, -222, -871, -244, 553, -61, -287, -354, 37, 343, -187, 146, 458, -1, -380, 87, 346, -379, -134, 244, 367, -38, -300, 432, 652, 62, -561, 186, 519, 158, -322, 120, -35, -299, 172, 199, 359, -608, -180, 231, 175, -352, -157, 618, 436, -389, -100, 466, 184, -468, -284, 333, 71, -134, 253, 525, 285, -605, -53, 544, 399, -338, -235, 461]
2072D61l74n25K11L54m54q0K32N59q14J65N98m53n85N3J209o9o14n73O12N07n94
2093a74o5O04l61r4l0N36p4q42N53O34k74m01k47R09j36r47N59K80K7p64M46L20
2115D59l80n65Q83K69r88l38P38O07p28n48J66K52Q6m33P33j44n36K27K39K83
2135B82q77J42L29N11p74j08R78J40j074j70P58J07k1l66L28n84mM92Q30q86o51
2156f18P6J270m60p27%N39J24o72QP14j18l57K55L62q75MJ137l98n67l64Q86L88
2178F07l16m08N4O65j44L1l52j09n18M25P08r9j031M95P20l92k20m65L78L25o21
2199b67j86L54J70k66K96j90k79l19Q83J66p34n50N58Q33O0p07k2J76J7k9l15
2220c51J16l34K20L56r5m26K05N88J74p69m28R16L75r4m53k12M33J19J33J45n48
$$ y = [461, 87, -438, -227, 127, -327, -407, -175, 384, -430, -265, 333, -120, -705, -652, 557, 488, -126, -699, -87, 420, -174, -239, 365, 4, -90, -120, 416, 342, -500, 53, 687, 413, 12, -235, 674, 538, -409, 150, 430, 457, -307, 139, 459, 79, -486, 397, 666, -322, -660, 78, 685, -43, -591, -425, -173, -87, -520, 213, 69, -467, -240, -1, 282, -595, -453, -124, 387, -387, -495, 483, 623, -451, -621, 137, 244, 223, -143, 185, -399, -403, 89, 919, 33, -618, -542, 728, 268, -459, -459, 80, 204, -468, -460, 254, 136, -221, 34, 396, -479, -475, 662, 264, -303, -667, 219, 607, 291, -117, -63, 602, 458, 489, 137, 28, -490, -65, 643, 544, -487, 8, 728, 336, 116, -349, 29, 354, -267, -453, -99, 71, -195, 101, -89, -368, -687, 196, 362, -372, -922, -364, 469, 529, -178, -200, -24, -7, -36, -351, -235, -569, -349, 7, -88, -514, -309, 279, 453, -316, -744, 172, 547, 453, 0, -212, 221, 340, 473, 618, 70]
2241G0o06N49P60m29r30J08Q06j38l79l46K97J84K49l30l12N27Q4k9Om93j86R38
2263D00L57p62p60O79R43j24o80n45O01J29jN4o58j44K72P48n46p52L72L27L32
2284B42o11m67P13k52K44j79k84j9N88K86k20p30K09N16M51j40o47j06Q11Q6l41
2305A50j79j15L73m1j39m55J08O92M38p22l90L39N86J62n33n69J35N55J84k68
2325C11n06L05J64M96k12o97J7M37J57n69n81K93P37M4o35j23n9O84j14k36m20
2346e07K04O20Q0m9q20j48Q92K16l35q18K36P35n2K46p52l87M50M93k52m64j43
2367e55N93L34j26r97K62L41P71p97m68J17O09M27m84m39K0O99N89j54o50l12
2387b20M93M34l75l96j16P26M21p28o40K50M48R2l4j038K01R95L9j83o48k19L88
$$ y = [70, -536, 13, 773, 344, -586, -478, 328, 190, -189, -535, -238, -54, 195, -135, -447, 80, 164, 135, 141, -352, -538, 400, 757, -5, -765, -86, 857, 733, 53, -492, 109, 238, 237, 291, -367, -511, -239, 509, -37, -789, -417, -90, 242, -369, -836, -123, -375, -131, -310, -594, -613, -25, 261, 41, -689, -480, 36, 487, 347, -300, -406, 405, 491, 150, -29, -144, 229, 188, 49, -406, -298, 394, 832, 110, -280, 59, 645, 807, 274, -295, -160, 395, 579, 311, -195, 110, 274, 770, 558, -139, -122, 315, 472, -97, -678, -385, 352, 396, -239, -362, -421, 263, 149, -87, -507, -303, 317, 397, 348, -472, -620, 272, 488, 153, -665, -429, 306, 254, 500, -252, -639, -189, 304, 52, -412, -555, 38, 372, 246, -751, -489, -148, 623, -174, -642, -525, 84, 511, 27, -412, -392, 307, 896, 742, 92, -220, 273, 707, 332, -64, -180, 546, 967, 239, -401, -151, 297, 389, 355, -683, -482, 513, 552, 369, -279, -498, -110]
2408a10Q55n16m74l17L29J151k36j152k0L77N01l38m32j5J55N65r8n86k66K61
2428c66P64k73k98n74N40Q22j36q51j03N80N05k50o48n22R58N63k17p01m25O61
2448B9N44k77p64k45O16Q24n07q89j11R08K24j21m36o57O36R95k97m35r88J259
2468C08M96k09n33l64M26O20m69k63o44Q81N43l02n18j82M82j4n6m66n66L21Q65
2489C56J18p50n43O35Q83k96q99j67N12Q67j85r46r6J71Q41j32p45m29O96N31
2509D22M8m19r92R19N40K1p95l77L31R44j61q98k16K3R22M02j173l38M86J005
2529F94J67j113m22L24J039m45k61p34M72P66R3r94l67j7J267M00j202n01M25
2548d09P16M49o36p93K11N29M22p05l10L03R32j0q18o90O08R66J26r89o41J38
$$ y = [-110, 745, 229, -245, -562, -233, 918, 682, -470, -490, -113, 388, 50, -382, -397, -242, 323, 225, -361, -627, -366, 398, 125, -173, -747, -207, 615, 479, -372, -475, 105, 610, 360, -288, -810, 148, 711, 494, -207, -632, 29, 573, 296, -468, -713, -97, 727, 220, -669, -780, 128, 352, 231, -205, -862, -226, 769, 472, 37, -951, 308, 804, 595, 62, -302, 124, 744, 275, 12, -632, 249, 792, 490, -28, -210, 272, 258, 202, -264, -830, -509, 356, 474, -276, -819, -184, 699, 403, -496, -663, -151, 716, 531, -415, -511, -340, 501, 369, -376, -805, -109, 422, 470, 51, -941, -22, 518, 539, -256, -633, -302, 642, 481, -417, -633, -610, 312, 714, -459, -797, -311, 694, 861, -252, -674, -350, 689, 244, -17, -751, -279, 487, 580, -414, -781, -798, 469, 869, -333, -834, -409, 307, 756, 120, -673, -462, 67, 489, -216, -526, -223, 709, 699, -119, -809, -201, 765, 891, -98, -739, -601]
2568f01J154K03j060o35O30M32M55p23o94K72Q92J72o81n35J30Q22K83n70n01
2587e55JP89N73r65m41L04J001J36n01j007K63J073M37r30p98L58Q78K06j125
2606c03k14m2R17M60j057q74L51J054N75q52o88Q3Q72O93j156m32J14Q67J32n83
2626h3m20j98Q83M17o83o47K74N51P03p76p77K60R62K5l74o97L41M93M56n52o54
2647d96j44R40M67l41j395K94J227Q66j385r19L58J036J8m86n54j08Q92M72m10
2666C32n64l63O86Q80o24j193K39J133j7k75p04rR54K63l07r51j74Q30N28k79
2686C85q08m22J074R06q84r49M75M81M1q1o76J40P72N7j60n16q66R74J113q34
2706B22r95n5J111L52n19p04M37K94M81l25o73M9K41N49o7q51k13R72P27q04q41
$$ y = [-601, 553, 756, -304, -939, -309, 123, 578, -145, -839, -567, 325, 497, -184, -719, -589, 233, 516, -54, -555, -554, 235, 808, -157, -598, -294, 707, 843, 342, -665, -402, 671, 1108, 178, -620, -262, 616, 822, -303, -517, -559, 358, 818, -239, -1113, -762, 292, 867, 15, -673, -590, 282, 975, -181, -613, -499, 368, 500, -83, -503, -701, 182, 599, -84, -731, -457, 94, 797, 21, -756, -496, 466, 491, 117, -580, -239, 254, 710, 158, -496, -640, 300, 767, 426, -969, -675, 552, 1418, 33, -886, -528, 508, 526, 40, -514, -622, 270, 742, 332, -232, -595, 91, 971, 347, -846, -607, 526, 509, 234, -470, -479, 475, 738, 431, -520, -694, 136, 664, 385, -423, -845, 229, 1135, 251, -698, -223, 258, 299, 218, -458, -318, 454, 511, 351, -165, -1031, -57, 1056, 222, -773, -828, 283, 635, 116, -588, -151, 143, 624, 299, -374, -325, -84, 465, 398, -453, -666, 306, 1033, 229, -612]
2727f12M1P77N48l66j219K38O93K36M12q77m72M76R35l40j122j27P66N57m90m44
2747c90pM84N90k64o37l19M97N68r1r59l56R07Q05n75q23k04J111P15p90p77n4
2768e69M82J69M18o03l89J98J207m41n80n92O20Q82l55r99l35P26O96m61l83j16
2788d25L8R35k6p61n23O39P01j59q53k98N81P79j14n72l91M32O81n3o06o18M03
2809b10J007k28p02m91Q11J059p86q50l45P16N37O7q78m31M71M51N64q15j064
2828a117Q23Q67j17p91k23O12K93J12q99j99O48K46r3k91m71J46R44M45j100o78
2848h43P80O67n2o49k30K53L84L92o58o35L16Q94k01l41o95K61J060k60q60j25
2868e42J92Q98J79r44n66O48N13K37q99n76K34J170L42p96q53M00N92j8M2o31
$$ y = [-612, -571, 206, 754, 388, -831, -593, 100, 336, 748, -129, -601, -125, 810, 470, -652, -779, -13, 544, 54, -390, -397, 87, 677, 413, -224, -543, -46, 522, 431, -528, -884, 23, 828, 253, -570, -774, 337, 1052, 262, -515, -569, -87, 82, 500, -103, -492, -294, 913, 472, -108, -700, -80, 802, 447, -552, -887, -161, 535, 74, -309, -425, -387, 548, 522, -239, -762, -123, 578, 419, -434, -732, -151, 628, 514, -58, -449, -17, 664, 611, 5, -613, -210, 797, 569, -133, -624, 187, 1246, 460, -390, -735, -19, 518, 585, -293, -724, -253, 198, 762, -53, -1117, -294, 573, 456, -335, -558, 54, 347, 459, -440, -639, 9, 255, 162, -129, -600, -454, 490, 935, -165, -843, -63, 604, 552, -97, -327, -74, 310, 702, 44, -591, -275, 619, 418, 77, -618, -357, 703, 443, -417, -542, -350, 548, 727, -217, -783, -135, 378, 615, -284, -860, -626, 544, 886, 90, -763, -363, 229, 211, 253, -378]
2888c78K17L47K44k95k78j92O36K28l42o04M58N24L99r61o22K03J011p3n90l43
2908d11j6P05L47m99o68k05J343L13p91o00NQ80j7o35l39L98N23J76n12n42L06
2929b39M14N60o66o00K32N42M50n66o59J00L34K46j84l01k69L76L22m2o74L09
2949c15P07m16K53o52J03M78J85k60k64j3N76M07k06q62l10Q54N35m45o00l8M86
2970B03N14n41o49K72M59K33k57l14k19J52O65k99r64L28O29N24o83p66M71L69
2990A27l7l31j34l9J60N63q1j77l92K07M70m8o38J32L52K28n96k03j00Q73K37
3011E73n51R1k92K3N68Q3p63l93N29P63l11o85j73M68L14r1n43K12j55O28k67
3032B8j46j48M09M18n11n56K45L56N37k06o35K3M15J25Q4o68r6Q5N32r0l23o15
$$ y = [-378, -161, 186, 430, 135, -143, -335, 301, 529, 187, -417, 41, 565, 964, 3, -619, -416, 595, 522, -68, -411, -427, 278, 625, 126, -542, -747, 596, 909, 118, -482, -477, 403, 386, -249, -588, -190, 333, 509, -3, -545, -239, 175, 735, 69, -531, -299, 243, 693, 127, -532, -432, -98, 148, -36, -337, -606, -230, 92, 50, -624, -315, 392, -24, 229, -423, -320, 158, 343, 83, -181, -194, 382, 789, 583, -279, -589, 265, 800, 355, -245, -283, 203, 717, 176, -473, -201, 258, 491, 234, -80, -299, -147, 518, 219, -745, -417, 212, 736, 53, -713, -242, 127, 90, -241, -375, -414, -254, 309, 228, 51, -341, -134, 336, 288, -350, -218, 134, 362, -234, -437, -537, 336, 573, 22, 113, -179, -156, 412, 495, -268, -661, -132, 631, 320, -365, -538, -70, 244, 153, -390, -178, -333, 295, 28, -118, -266, 143, 561, 50, -506, -261, 95, 632, 426, -209, -186, 229, 354, 438, -230, -326, -241, 291, 201, -122, -737]
3054g37P35Q03l23p98K17m0N88l06k75l01M02J72J5n01k44L68N75l03l62l57P53
3075H1N18o73j21k41K46J06N15l39j94k49O01K12l02m72L44M92k97l05m57N30
3095eR4j0k07l35M96K15k64j54l07K81O63p7m05m92K64R30n10m38K70K02k26L19
3117C04o04K86K0M01k26j82m63L95L94k80l6m36L36M89l18m6k96J75L54k3r7k39
3139i2R9K49P6n32j58K97K05j04j74l15M51K92J5l81j3j50N84j76j86l63Q2M14
3161A20L53p06O2N2K41o9l46j52K34M00M6l77j87M42j59L67m78k19L79K37m3n
3183A92k90L38P9j66j88K5J0J8L35k30k72K64M2L17l85n61R3Q02k25m24J57p8
$$ y = [-737, -2, 801, 478, -320, -103, -143, 445, 139, -136, -437, -35, 137, 152, -349, -593, -225, 350, 47, -315, -672, 81, 599, -74, -195, -436, -190, -84, 431, 92, -102, -351, 250, 462, 160, -312, 32, 524, 227, -78, -535, -5, 89, 79, -128, -463, 33, 248, -16, -170, -477, -196, 467, 390, -15, -507, -243, 687, 177, -261, 9, 211, -15, 304, -300, -14, 6, 407, 181, -1, -464, -69, 325, 45, 9, -427, -91, 398, 80, 34, -262, -87, 267, 244, 147, -92, 7, 256, 332, -200, -358, -61, 144, 40, -134, -449, 2, 294, 309, -72, -85, -235, 349, 173, -13, -376, -294, 120, 473, -233, -171, -119, 122, 53, -293, -445, -211, 189, 235, -142, -329, 113, -46, 321, -157, -376, 3, 240, 197, 192, -98, 240, 319, 153, -35, -10, 0, 18, 353, 123, -149, 115, 157, 474, 89, -472, -379, 423, 198, -226, -69, -147]
$$ [...]
8191c26
##END NTUPLES=NMR FID
##END=
