##TITLE=1H_SAV-55(6-07)A
 DMSO-d6, 8 sc, 
 7.7.2020
##JCAMPDX= 6.0         $$ Bruker NMR JCAMP-DX V2.0
##DATA TYPE= NMR FID
##DATA CLASS= NTUPLES
##ORIGIN= UXNMR, Bruker Analytische Messtechnik GmbH
##OWNER= root
$$ XWIN-NMR		Version 3.5
$$ Tue Jul  7 10:12:22 2020 Russian Standard Time (UT+4h)  she@DPX200
##.OBSERVE FREQUENCY= 200.1315
##.OBSERVE NUCLEUS= ^1H
##.DELAY= (6, 6)
##.ACQUISITION MODE= SIMULTANEOUS
##.ACQUISITION SCHEME= undefined
##.AVERAGES= 8
##.DIGITISER RES= 18
##SPECTROMETER/DATA SYSTEM= spect
##.PULSE SEQUENCE= zg30
##.SOLVENT NAME= DMSO
##.SHIFT REFERENCE= (INTERNAL, DMSO, 0, 15.7039)
##AUDIT TRAIL= $$ (NUMBER, WHEN, WHO, WHERE, WHAT)
$$ ##TITLE= Audit trail, XWIN-NMR		Version 3.5
$$ ##JCAMPDX= 5.01
$$ ##ORIGIN= Bruker BioSpin GmbH
$$ ##OWNER= she
$$ F:/spectra/data/she/nmr/H-F/1/audita.txt
$$ ##AUDIT TRAIL=  $$ (NUMBER, WHEN, WHO, WHERE, WHAT)
(   1,<2020-07-07 10:11:15.57 +0400>,<she>,<DPX200>,
      <created by zg, POWCHK disabled, PULCHK disabled
       configuration hash MD5:
       00 E9 B6 7A A2 85 ED C7 34 08 36 98 17 FE 4E 26
       data hash MD5: 16K
       E8 D0 58 42 D6 18 9F DE 47 61 26 D4 54 FF F3 6B>)
$$ ##END=
$$ 
$$ hash MD5
$$ B0 F5 14 6F 92 41 F1 C6 5A D1 6D 0D 11 E0 42 30
##$RELAX= 
##$RELAX= 
##$RELAX= 
##$RELAX= 
##$RELAX= 
##$RELAX= 
$$ Bruker specific parameters
$$ --------------------------
##$DU= <F:/spectra>
##$EXPNO= 1
##$NAME= <H-F>
##$PROCNO= 1
##$TYPE= <nmr>
##$USER= <she>
##$AMP= (0..31)
100 100 100 100 100 100 100 100 100 100 100 100 100 100 100 100 100 100 
100 100 100 100 100 100 100 100 100 100 100 100 100 100 
##$AQSEQ= 0
##$AQ_mod= 1
##$AUNM= <au_zg>
##$AUTOPOS= <>
##$BF1= 200.13
##$BF2= 200.13
##$BF3= 200.13
##$BF4= 200.13
##$BF5= 200.13
##$BF6= 200.13
##$BF7= 200.13
##$BF8= 200.13
##$BYTORDA= 1
##$CFDGTYP= 0
##$CFRGTYP= 5
##$CHEMSTR= <none>
##$CNST= (0..31)
1 1 145 1 1 1 1 1 1 1 1 1 1 1 1 1 1 1 1 1 1 1 1 1 1 1 1 1 1 1 1 1 
##$CPDPRG= <>
##$CPDPRG1= <>
##$CPDPRG2= <>
##$CPDPRG3= <>
##$CPDPRG4= <mlev>
##$CPDPRG5= <mlev>
##$CPDPRG6= <mlev>
##$CPDPRG7= <mlev>
##$CPDPRG8= <mlev>
##$CPDPRGB= <>
##$CPDPRGT= <>
##$D= (0..31)
0 1.2 0 0 0 0 0 0 0 0.06 0 0.03 0 0 0 0 0.0002 0 0 0 0 0 0 0 0 0 0 0 0 
0 0 0 
##$DATE= 1594102274
##$DBL= (0..7)
120 120 120 120 120 120 120 120 
##$DBP= (0..7)
150 150 150 150 150 150 150 150 
##$DBP07= 0
##$DBPNAM0= <>
##$DBPNAM1= <>
##$DBPNAM2= <>
##$DBPNAM3= <>
##$DBPNAM4= <>
##$DBPNAM5= <>
##$DBPNAM6= <>
##$DBPNAM7= <>
##$DBPOAL= (0..7)
0.5 0.5 0.5 0.5 0.5 0.5 0.5 0.5 
##$DBPOFFS= (0..7)
0 0 0 0 0 0 0 0 
##$DE= 6
##$DECBNUC= <off>
##$DECIM= 24
##$DECNUC= <off>
##$DECSTAT= 4
##$DIGMOD= 1
##$DIGTYP= 9
##$DL= (0..7)
0 120 120 120 120 120 120 120 
##$DP= (0..7)
150 150 150 150 150 150 150 150 
##$DP07= 0
##$DPNAME0= <>
##$DPNAME1= <>
##$DPNAME2= <>
##$DPNAME3= <>
##$DPNAME4= <>
##$DPNAME5= <>
##$DPNAME6= <>
##$DPNAME7= <>
##$DPOAL= (0..7)
0.5 0.5 0.5 0.5 0.5 0.5 0.5 0.5 
##$DPOFFS= (0..7)
0 0 0 0 0 0 0 0 
##$DQDMODE= 0
##$DR= 18
##$DS= 0
##$DSLIST= <SSSSSSSSSSSSSSS>
$$ [...]
##$SUBNAM2= <"">
##$SUBNAM3= <"">
##$SUBNAM4= <"">
##$SUBNAM5= <"">
##$SUBNAM6= <"">
##$SUBNAM7= <"">
##$SUBNAM8= <"">
##$SUBNAM9= <"">
##$SW= 24.9337058887773
##$SWIBOX= (0..15)
0 0 2 0 0 0 0 0 0 0 0 0 0 0 0 0 
##$SW_h= 4990.01996007984
##$TD= 16384
##$TD0= 1
##$TE= 0
##$TE2= 300
##$TE3= 300
##$TEG= 300
##$TL= (0..7)
0 120 120 120 120 120 120 120 
##$TP= (0..7)
150 150 150 150 150 150 150 150 
##$TP07= 0
##$TPNAME0= <>
##$TPNAME1= <>
##$TPNAME2= <>
##$TPNAME3= <>
##$TPNAME4= <>
##$TPNAME5= <>
##$TPNAME6= <>
##$TPNAME7= <>
##$TPOAL= (0..7)
0.5 0.5 0.5 0.5 0.5 0.5 0.5 0.5 
##$TPOFFS= (0..7)
0 0 0 0 0 0 0 0 
##$TUNHIN= 0
##$TUNHOUT= 0
##$TUNXOUT= 0
##$USERA1= <user>
##$USERA2= <user>
##$USERA3= <user>
##$USERA4= <user>
##$USERA5= <user>
##$V9= 5
##$VALIST= <valist>
##$VCLIST= <CCCCCCCCCCCCCCC>
##$VD= 0
##$VDLIST= <DDDDDDDDDDDDDDD>
##$VPLIST= <PPPPPPPPPPPPPPP>
##$VTLIST= <TTTTTTTTTTTTTTT>
##$WBST= 1024
##$WBSW= 4
##$XGAIN= (0..3)
0 0 0 0 
##$XL= 0
##$YL= 0
##$YMAX_a= 261668
##$YMIN_a= -178054
##$ZGOPTNS= <>
##$ZL1= 120
##$ZL2= 120
##$ZL3= 120
##$ZL4= 120
##$ABSF1= 10
##$ABSF2= 0
##$ABSG= 5
##$ABSL= 3
##$ALPHA= 0
##$AQORDER= 0
##$ASSFAC= 0
##$ASSFACI= 0
##$ASSFACX= 0
##$ASSWID= 0
##$AUNMP= <proc_1d>
##$AZFE= 0.1
##$AZFW= 0.1
##$BCFW= 1
##$BC_mod= 2
##$BYTORDP= 1
##$COROFFS= 0
##$CY= 11.3945322036743
##$DATMOD= 1
##$DC= 2
##$DFILT= <>
##$DTYPP= 0
##$F1P= 16.9975609425685
##$F2P= -3.02152046262296
##$FCOR= 0.5
##$FTSIZE= 0
##$FT_mod= 4
##$GAMMA= 1
##$GB= 0.15
##$INTBC= 1
##$INTSCL= 1
##$ISEN= 128
##$LB= 0.24
##$LEV0= 0
##$LPBIN= 0
##$MAXI= 10000
##$MC2= 0
##$MEAN= 0
##$ME_mod= 0
##$MI= 1.114404
##$NCOEF= 0
##$NC_proc= 0
##$NLEV= 6
##$NOISF1= 3.799351
##$NOISF2= 2.8
##$NSP= 1
##$NTH_PI= 0
##$NZP= 0
##$OFFSET= 15.70392
##$PC= 1
##$PHC0= -9796.545
##$PHC1= 20.60086
##$PH_mod= 1
##$PKNL= yes
##$PPARMOD= 0
##$PSCAL= 0
##$PSIGN= 0
##$REVERSE= no
##$SF= 200.130013532006
##$SI= 16384
##$SIGF1= 3
##$SIGF2= 2
##$SINO= 400
##$SIOLD= 16384
##$SREGLST= <1H.CDCl3>
##$SSB= 0
##$STSI= 0
##$STSR= 0
##$SW_p= 3612.71676300578
##$SYMM= 0
##$S_DEV= 0
##$TDeff= 0
##$TDoff= 0
##$TI= <>
##$TILT= no
##$TM1= 0
##$TM2= 0
##$TOPLEV= 0
##$USERP1= <user>
##$USERP2= <user>
##$USERP3= <user>
##$USERP4= <user>
##$USERP5= <user>
##$WDW= 1
##$XDIM= 8192
##$YMAX_p= 0
##$YMIN_p= 0
$$ End of Bruker specific parameters
$$ ---------------------------------
##NTUPLES= NMR FID
##VAR_NAME=  TIME,          FID/REAL,        FID/IMAG
##SYMBOL=    X,             R,               I
##VAR_TYPE=  INDEPENDENT,   DEPENDENT,       DEPENDENT
##VAR_FORM=  AFFN,          ASDF,            ASDF
##VAR_DIM=   8192,          8192,            8192
##UNITS=     SECONDS,       ARBITRARY UNITS, ARBITRARY UNITS
##FACTOR=    0.0002004,     1,               1
##FIRST=     0,             0,               0
##LAST=      1.6414764,     0,               0
##MIN=       0,             -178054,         0
##MAX=       1.6414764,     261668,          0
$$ Real data points
##PAGE= N=1
##DATA TABLE= (X++(R..R)), XYDATA
$$ [...]
2274B248l140j965R24K986J265j326j809l50N79n4J065K090r09l226j981K779
2290h24L561j95l536j394N69J825P02k27n22j031l90M8J197J716M94k448k706
2307c161N35L805K995k345m369l18L692J953r93k001m29O52l56M4J285J186j033
2324A142k384j286K255K753L46k693l527R86L570K105k040k611m17J400N32M86
2340F17J040o50k018j591J537K881N05k318k186NJ750J973j60j947j102J35J263
2357b66N03K98Q46j418k509l05L403L200j989m491q71L520K696n09k348j526P12
2374a054J404L27m17J9o4o48j407L30K917J723k762l411N5L789K306j457l263
2391a613r63J657K187K69o72p02q31mM28J571R11j124k234r11J965K460J58k703
$$ plain form
2274 2248 -892 -2857 -1933 1053 2318 992 -817 -1167 -588 -642 423 2513 1604 -1622 -3603 -824
2290 -824 2737 2542 -994 -2388 -1819 6 708 481 -41 -1072 -1462 -1414 -217 1499 1993 -455 -3161
2307 -3161 -2626 1179 4174 1829 -2540 -2858 834 2787 1794 -207 -636 16 -340 -296 989 2175 1142
2324 1142 -1242 -2528 -273 2480 2826 133 -3394 -2408 1162 3267 1227 -1384 -1801 -401 131 617
2340 617 1657 1007 -1011 -2602 -1065 1816 2321 3 -2183 -2178 -428 1545 1385 -562 -1664 -1529 -266
2357 -266 237 535 1381 -37 -2546 -2851 552 3752 1763 -2728 -3599 -79 2617 2108 -240 -1766 -1054
2374 -1054 350 677 260 279 215 -433 -1840 -1510 1407 3130 368 -3043 -2988 801 3107 1650 -1613
2391 -1613 -2576 -919 1268 1537 865 163 -668 -672 -244 1327 2238 1114 -1120 -2031 -66 2394 2552 -151
2409a51j530R27J056P17p2j83j158j316O3J873K122n61l860j608K129L514R77
2426B939l125k470O91K410J179j039j042k2O09q38o60J826J726j247l199j153
2442c415L181L237o37l517j966J963K610N92j369j956l00J733P7L26O42p23j291
2459h13r93J068K378R15k171k277L50J982J068n17o49r85m02q1J489J374l80k446
2477a090j573J028L460J587k748l366k7K946K224j169j903J19P30J09o52O07J167
2494A449l1k569j147J768L111M07l621l109J287L647J571k093l068M15J393J227
2510F37J1o29k26m64q90O81J924P51j166k409j53J641K268l32j897p56j2O78J270
2529I27P67o49j683j327O13K282J771j322l138q64K529K331l27k671j074J154
$$ plain form
2409 -151 -1681 -754 302 1019 947 764 -394 -1710 -1647 226 2348 1787 -2073 -3681 -1552 1962 2939
2426 2939 -186 -2656 -1965 445 1624 585 -457 -479 130 -708 -1368 458 2184 937 -2262 -3415
2442 -3415 -234 3003 2366 -1151 -3117 -1154 1456 2048 679 -1277 -1577 156 233 559 1201 478 -813
2459 -813 -1806 -738 1640 2555 384 -1893 -1543 439 1507 990 341 -644 -1046 -1127 362 1736 1356 -1090
2477 -1090 -2663 -1635 1825 3412 664 -2702 -2729 217 2441 1272 -631 -512 218 327 -325 282 1449
2494 1449 1418 -1151 -2298 -530 2581 2988 -633 -3742 -2455 1192 2763 670 -2398 -1983 -590 637
2510 637 648 19 -207 -671 -1561 -880 1044 1795 629 -1780 -1933 -292 1976 1644 -253 -1009 -1021 -343 927
2529 927 1694 1045 -638 -1965 -1352 930 2701 1379 -1759 -2623 -94 2237 1910 -761 -1835 -681
2545f81J701k48q46O68L49j395j535O61K850J229k392l316K10L348L035k083l530
2562a975p42K312K347m45j470q64M89J50j77Q79R57p71j442j097J092K500M94
2579B237j815k082K79J779P61k5j008q94n93Q1J937J498j423k131j243J764K551
2596A673K75j762k105K99K347M01q04j027O78L23r93o5J482J678j345l181o22
2613b748L041K696n35l750j639J828L190K05k001j729P74J211j23k80J99k0j212
2630h93o35N40J657J240j272k380l52K088J497M2j606j350K89R43M87J199q06
2647F88j406j428J307K360P77j891k102j37J901J971j156j236k35P69J92q30K01
2664b55J471L06k514j422J602L389m8l023k513J628K904J349k736j917J16J977
$$ plain form
2545 -681 1020 772 -74 594 943 -452 -1987 -1326 1524 2753 361 -2955 -2745 603 3638 1555 -1975
2562 -1975 -2717 -405 1942 1497 27 -837 -348 -198 -375 504 1461 690 -752 -1849 -757 1743 2237
2579 2237 422 -1660 -1381 398 1159 1134 126 -768 -1361 -1280 657 2155 732 -1399 -2642 -878 1673
2596 1673 1948 186 -1919 -1620 727 1128 324 -703 -25 298 -695 -760 722 2400 1055 -2126 -2748
2613 -2748 293 2989 2454 -1296 -2935 -1107 2083 2288 287 -1442 -668 543 420 140 339 319 -893
2630 -893 -1528 -988 669 1909 637 -1743 -2095 -7 1490 1532 -74 -1424 -1135 -192 295 1494 688
2647 688 -718 -2146 -839 1521 2298 407 -1695 -1832 69 2040 884 -352 -587 182 374 -456 -255
2664 -255 1216 1522 -992 -2414 -812 2577 2529 -494 -3007 -1379 1525 2874 138 -1779 -1663 314
2680C14R16j099n70M69L34j419Q1J323J196l87k694n67J984J922k92j755j121
2697a365kJ510R14q9p46j187m75P27J537R12j207j975m06J764J704l77j979o26
2715a366J229P79n54k20O00K44j629j047J079K190Q71k396k262L23K694K387j309
2732A613l480q37K696J998j050j895L39R72j41p46O52J310j94j996j139J292K017
2749A411N08j221k075j36J962J111m60j712m74L82N04P35M42m28j532j019J268
2766g34K344j84j506j359P35R42J61l57K09k00n22o1K75Q10J010q72k091n82K030
2785D8K597o71l692q58K444K116m43k567k90R62O34k75J34k87P73o49r23l23J960
2804F90J178j113k247n72K327J767o32k287o54J380P39o7O2j15p15r08P28J279
$$ plain form
2680 314 1230 131 -439 30 364 -1055 -974 349 1545 1158 -1536 -2103 -119 1803 1511 -244 -1365
2697 -1365 -1367 143 1057 968 222 -965 -1440 -713 824 1736 529 -1446 -1852 -88 1616 1239 -740 -1366
2715 -1366 -137 642 88 -132 468 712 -917 -1964 -885 1305 2176 -220 -2482 -2159 535 2922 1613
2732 1613 -1867 -2704 -8 1990 940 -955 -616 356 215 -531 121 1431 1237 -759 -1898 -606 1411
2749 1411 1919 698 -1377 -1513 449 1560 1100 -612 -1086 -704 -200 535 977 549 -983 -2002 -734
2766 -734 1610 1426 -80 -1439 -704 238 399 42 251 51 -471 -532 -257 553 1563 691 -1400 -1982 48
2785 48 2645 1974 -1718 -2576 -132 1984 1541 -1026 -1316 -354 280 5 139 -148 625 -24 -947 -1270 690
2804 690 1868 755 -1492 -2064 263 2030 1398 -889 -1543 -163 576 509 571 456 -259 -1167 -439 840
2822H40J016j522j139J22P25J053l00n06q45L15M80j7k20Q18L03j783j396J634
2840d22K505j90l127j299J756K605m91j835j010Q33P26O72p61p46N34O09p21p66
2858a128Q89J626L7k576j341K217K243l64k259o85P53J035M1M29q39p49P8O85
2876I2L28J07l33k93j163K96J825M34j459j425J036J193l23q05Q12M36j063q44
2894a149Q72J868L1j810j267O47J984N51q92k165k54J795J430r98j928Q03J164
2911F82m73j137O62J418O69k382j311J222J854L96j959j286O83J385J031o10j653
2928h09l17R86K25l7J20P6k66r71j91J644R61r00j804J83J405L90q02k9K87m21
2948b70m57O29J137M4q77j276r4J064J822m75k040j251J783J835o13j785l35J284
$$ plain form
2822 840 1856 334 -805 -683 42 1095 795 289 -556 -241 239 222 2 820 1123 -660 -2056 -422
2840 -422 2083 1893 -1234 -2533 -777 1828 1337 -498 -1508 -675 51 723 -38 -784 -250 359 -362 -1128
2858 -1128 -239 1387 1424 -1152 -2493 -276 1967 1603 -656 -1341 -588 447 488 917 78 -671 -593 92
2876 92 420 527 194 -99 -1262 -966 859 1293 -166 -1591 -555 638 315 -490 322 758 -305 -1149
2894 -1149 -277 1591 1622 -188 -1455 -808 1176 1727 835 -1330 -1584 211 1641 643 -1285 -482 682
2911 682 209 -928 -266 1152 1821 -561 -1872 -650 1204 1600 -359 -1645 -962 423 1454 844 -809
2928 -809 -1126 -140 85 48 168 244 -22 -993 -1184 460 1421 521 -1283 -1100 305 695 -107 -136 151 -270
2948 -270 -727 -98 1039 1083 206 -1070 -1164 -100 1722 1247 -793 -2044 -261 1574 961 -824 -1159 125
2966A25M94r91k38J300L26j182j323O92J506Q04p27j760p49J684J862q21j837
2983h35m40J191J082o39k84pN46j376j75J520O12o86j399l04Q32J058L52r70n90
3002e12k70Q39K54J49l85J13q87m70P53J734K4j894j432J301K060j53j626r84
3020a386J015N41j0m04N5N72n78m48k99J081R81j44j853j127J487K402n49k206
3038h70p26J246J363k16j087O13k12l80k82N57Q31l48n10r30J80J000Q80p34j380
3057a005P9J225M94l54k14k06k28o28L16J419N96j825j193P19J782N28j448j015
3075i58j60J335Q24l38r14l0K82o1m58kJ332M92j860j473J250K377o4j915j619
3094a960J061J670M32o78j228k32P63N47l96L03O8k39q26k93R44J039qj919l38
$$ plain form
2966 125 619 -372 -610 690 1016 -166 -1489 -797 709 1513 786 -974 -1723 -39 1823 1002 -835
2983 -835 -1275 -84 998 359 75 68 614 -762 -937 583 1195 509 -890 -1194 -362 696 1048 78 -512
3002 -512 -782 57 311 460 75 188 -699 -1169 -416 1318 1342 -552 -1984 -683 1377 1224 -402 -1386
3020 -1386 -371 170 160 -244 -189 383 -195 -643 -942 139 1120 976 -877 -2004 -517 1885 1336 -870
3038 -870 -1596 -350 1013 797 -290 323 111 -269 -551 6 837 489 -21 -951 -771 229 1109 375 -1005
3057 -1005 -926 299 793 439 225 19 -209 -837 -521 898 1494 -331 -1524 -805 977 1505 57 -958
3075 -958 -1118 217 1041 703 -211 -241 41 -20 -478 -480 852 1344 -516 -1989 -739 1638 1574 -341 -1960
3094 -1960 -899 771 1203 525 -703 -935 -172 375 -21 282 350 111 -715 -1008 -64 975 967 -952 -1290
3113a290J149J073l3r03m82j55N93J54K02N77q58o08j55J216Q20l67j439p66R96
3132b76J324j23r37n87L13Q34n08j98N17L90n97j660M36J749J146j289k066K69
3150a263J496J200o92j494j72O53R83j63n34J05Qk61o38Q74J176j84j874l52L69
3169g63J984j61r45p33j40O91M82k09J80m68m56n18P90J011M58j362j144M27J558
3188F82L96j065r14O9J187P7m46p0K33r7o19j6R09R71p51j417n15J499J493k76
3208A330k010m93O86J301k84p29k28M76p1l09J26O31L87j019r32L61J460K11p78
3227A16j353M08J011P67k88q25k86K80n8J52J62N76m90j110M1J283R68o65j505
3246h16k55R63J007k30p01k51K42J34k52K11N94m28p56n86P31J656J0j770q66
$$ plain form
3113 -1290 -141 932 899 -4 -486 -641 -48 106 308 885 27 -581 -736 480 1300 933 -506 -1272 -276
3132 -276 1048 925 -12 -599 -286 548 40 -158 359 749 152 -1508 -1072 677 1823 534 -1532 -1263
3150 -1263 233 1433 741 -753 -925 -272 711 548 14 119 127 -134 -772 102 1278 1094 -780 -1132 -763
3169 -763 1221 1060 115 -618 -758 -67 415 206 386 -82 -538 -1056 -266 745 1203 -159 -1303 -876 682
3188 682 1078 13 -901 -832 355 432 -14 -84 149 52 -567 -583 326 1297 546 -871 -1386 113 1606 1330
3208 1330 -680 -1173 -487 814 530 -199 -427 49 -22 -331 -205 426 813 -206 -1138 -777 683 894 116
3227 116 -1237 -829 182 949 661 -164 -450 -170 -228 -76 86 662 172 -938 -897 386 1354 689 -816
3246 -816 -1071 -108 899 669 -32 -283 -41 93 -159 52 646 218 -538 -1124 -393 1263 1273 -497 -1363
3265a363O53J074M08o68j066O78O27k73k57J60O81p04p39R8J019Q69o20j194o95
3284a312J092J342l22r73k62L86K03k3J30Q6m89n89k83Q40P35K78j287p73N74
3303f47J605j27r79l90K17N84m22L25K13J02m08j032K56J146P13q81j230k15J680
3322E10J004q45j279l37J000K86j26j49J49l3q4q63P30Q40K32j393q88P21J360
3341H35N36j486q47K22P57O47n75J7o5m1m56M21O28J43p25r45J3J133Q67p28j226
3362h75Q1P86O27m86k26j74L07j57m31P87L37K7j493k31J438O34J2j447m30M34
3382d80J153K47j236j60O97L0n03J47O57M78q32j261N38J641Jp56j032l77J282
3401B34P01k92o86m20K73j8O7QP03j36j136l45J190P60m65j049l40O22J239j17
$$ plain form
3265 -1363 -710 364 772 104 -962 -284 343 70 -187 -27 654 -50 -789 -691 328 1197 577 -617 -1312
3284 -1312 -220 1122 800 -173 -435 -49 154 131 261 347 -142 -731 -1014 -174 561 839 -448 -1221 -647
3303 -647 958 831 -148 -538 -321 263 -159 166 379 481 73 -959 -703 443 1156 275 -955 -1170 510
3322 510 1514 669 -610 -947 53 339 213 64 213 180 96 -767 -37 803 1035 -358 -1246 -525 835
3341 835 1371 -115 -962 -740 17 664 89 106 41 0 -456 -35 593 736 11 -934 -921 212 1079 351 -875
3362 -875 -794 -8 619 133 -93 -267 40 -117 -548 239 576 603 -890 -1121 317 951 963 -484 -914 -480
3382 -480 673 920 -316 -476 221 251 -252 -105 552 1030 198 -1063 -525 1116 1117 361 -671 -1048 234
3401 234 935 643 -43 -463 -190 -208 -141 -133 570 434 -702 -1047 143 903 438 -611 -951 -329 910 793
3421G93r91j43J18L67q7M6L35k09n24m83N71O18P13q97j473J62J410O83j070n29
3441e90O8M43k3l02O73J68n28o00M03K50R07p06j084QQ49J132m17r69o70N35P48
3462B95k40m65O31J03n76m53O17J111l56j222l92P44R18J85o14j020M89N22L79
3481F56m28l00J44J72o46k2Q35O03q84j208J20J404N25o61r55r2L61P11k20j9
3501I6j79k10l8k89P15O74j17r21p84N60J676k68j200o29R01O46k03n39j53K87
3521B5j55r2o3P72O3o61o53P4J075N03n25j163l93J360P80n32p73J37K97j89m01
3542e14M03R01k37j107q2J074K87l86o55n46M78O35M53o97n86PO39Km58M98N66
3563F75o24o61Q0J301J57j087o14O07L41J63r7n61j03M30j8K95k19J35p6m25k77
$$ plain form
3421 793 -198 -341 -223 144 57 103 438 229 -295 -778 -207 411 1124 227 -1246 -1084 326 1009 -61 -590
3441 -590 -522 -79 -102 -404 269 437 -91 -691 -288 -38 869 163 -921 -913 -64 1068 651 -318 -988 -453 295
3462 295 55 -410 221 324 -252 -705 -88 1023 667 -555 -947 -203 715 900 286 -734 -245 277 656
3481 656 228 -72 72 244 -402 -424 411 1014 130 -1078 -958 446 971 310 -645 -737 -376 335 115 96
3501 96 -83 -293 -331 -620 95 769 652 -269 -1053 -493 1183 915 -285 -914 -13 633 430 -109 -262 25
3521 25 -130 -222 -285 487 550 -111 -764 -690 385 888 363 -800 -1193 167 947 415 -358 -221 76 -113 -514
3542 -514 -111 790 553 -554 -636 438 725 339 -316 -862 -384 251 704 7 -579 -572 67 69 -389 109 675
3563 675 51 -610 -530 771 928 -159 -773 -166 175 338 241 -320 -423 7 -11 284 65 200 124 -301 -578
3584e78K97J225m66j015n43J375O13m98j048N4P39o5n9RO0j32k56j8K5P99o9l20
3606A29m67l36J164J55m86q89j6R69L46j191K23M77J08o83l3J004L72l67j015
3625e36q4L23O92L07j151k11O48M94K3n64j2K43j98k56j00J215j16r38p39P68
3645a92R73j66r30r5J68N86K1j72n39j39M58j57j27M27M29l93m79o48J244Q13
3665A082n25r37j09N41Q4p3j82K0K4j5k7J50K46K10o19o17K98J101K72j057q53
3686i86N30Q46K69n67m37M05Rl88j37N74N40r66j92K88L58N03n72l92m19R85N69
3707H20k45j051j11Q11m8p50K39P14K14q69m75P54Q07k95j015o42R69N22N3l32
3727G0o08J23L66N3k04K07M70j68p32l63Q53P73n39q28R8M53P38n00p15K97J16
$$ plain form
3584 -578 -281 944 478 -537 -1080 295 908 410 -638 -584 155 90 31 40 100 -32 -288 -306 -281 518 449 129
3606 129 -338 -674 490 645 159 -730 -746 223 569 -622 -399 78 186 -497 -530 474 846 479 -536
3625 -536 -620 -297 395 702 -449 -660 -12 482 505 -59 -71 172 -26 -282 -382 833 717 -221 -960 -192
3645 -192 781 615 -315 -410 -242 344 365 193 -346 -485 -27 -184 -311 116 545 152 -327 -975 269 1082
3665 1082 557 -380 -489 52 136 63 -119 -99 -75 -90 -117 33 279 489 -130 -747 -449 652 924 -133 -986
3686 -986 -456 390 659 92 -345 60 69 -319 -456 118 658 -308 -500 -212 146 649 77 -315 -734 251 820
3707 820 575 -476 -587 224 176 -574 -335 379 593 -276 -751 3 810 515 -500 -1142 -173 349 402 70
3727 70 -538 -415 -49 4 -200 7 477 309 -423 -786 67 840 301 -527 -429 24 762 262 -453 -156 -40
3748d0o8L81m77L79l9l07k02L59K48M76o71p61N91P29k38o90j45N06J56j44k7
3769A6L6L55l79m18L15O35j47k19p23j38J268J9l56o94K20L49K16J10n07J08J63
3790B29n30j17K49P90l79p39j40L59P20j20l48m86K03M45K71o71J57M52m15k44
3810c14P8N95N08q89r05N11R34J77o06n64L18L01N0j65K3M1k8k68l02N05N18k2
3832D96j199l83J385K70J18j165r7L99K99j47j32q1N35l27n51P04O0Q9k09r21
3852h57M02J003P0p21n03j4Q04L33n57o06N89J95n41K56j21O44o04m68J83M62
3872e1N94j25q25k41K87R26l23n59J37R4J46J10k32M29l5o35l55O42N98M9p98
3893a67n28N00M23J04k29n18M26j76K28k72M19P0m49m76K14M84J57J46o59m12
$$ plain form
3748 -40 -108 273 -204 175 136 -171 -373 -14 234 710 39 -722 -131 598 360 -330 -475 31 187 43 16
3769 16 52 407 28 -390 -75 560 413 194 -529 -667 601 620 264 -430 -210 139 355 465 -42 66 229
3790 229 -301 -418 -169 621 242 -497 -637 -278 442 322 -26 -512 -309 136 407 -264 -107 345 -70 -314
3810 -314 -236 359 867 -22 -927 -416 518 695 89 -475 -157 144 194 29 52 93 65 -203 -505 0 518 496
3832 496 -703 -1086 299 569 687 -478 -575 -176 123 -24 -156 -237 298 -29 -580 124 184 273 64 -857
3852 -857 -455 548 618 -103 -606 -620 184 517 -40 -646 -57 138 -403 -147 -268 376 -228 -696 -513 -51
3872 -51 543 418 -407 -648 -361 565 242 -317 -180 -86 60 170 -62 367 332 -303 -658 -16 582 631 -167
3893 -167 -695 -195 228 332 103 -415 11 -165 63 -209 210 280 -169 -645 -431 53 210 356 -303 -715
3913g15J036N83j057o7k94P46J20p55K39J84K14k13l23o8R34J50r37l53K31Q43
3933D98l1p58n5K51M04j65m52M31J26k21k14l98Q44L58l05j073L88O11N60p16
3953H3p10J65N97Q2k62j27M56k21q8j77K35M42j82p92m06R69M23q6m97k99K77
3974a18M70l17n0J0K42L8l99j05N64M88p09p79J52P03O44m37q96m0O86N35n53
3995A29l62J79L36k43k65L54K67k79n08l19P64N35k69m89k84M41N73k23m61j5
4015a39o6J43K5r0J56M02m77m40J92P74J93p02m70J57P91k3n36l03J23M17n9q4
4037a6J63K54l10n30n7M38Q85l44q63r0N50L30j62n84J20Q9N35m14J10K53J83
4058E40n28o72M20P56k94k10p22N31L65L47k98l93P3L6J30l9J06j14q8j85k99
$$ plain form
3913 -715 321 904 -153 -220 -514 232 352 -403 -164 20 234 21 -302 -370 564 714 -223 -576 -345 498
3933 498 467 -291 -346 -95 309 144 -308 123 249 28 -186 -584 260 618 313 -760 -372 239 799 83
3953 83 -627 -462 135 217 -45 -172 284 63 -25 -202 33 475 293 -499 -905 64 487 401 -96 -395 -118
3974 -118 352 35 -15 -5 237 275 -124 -229 335 823 114 -665 -513 190 834 397 -499 -539 147 682 129
3995 129 -233 -54 282 39 -226 128 395 116 -392 -711 53 588 319 -170 -454 -13 560 337 -124 -139
4015 -139 -205 -62 -37 -127 29 431 -46 -486 -294 480 673 -29 -499 -342 449 426 -110 -413 -290 127 68 -16
4037 -16 147 401 91 -439 -496 -58 827 483 -380 -470 80 410 248 -336 -216 -127 408 -6 104 357 540
4058 540 12 -660 -240 516 222 12 -710 -179 186 533 235 -158 -85 -49 81 42 148 34 -54 -239 -538
4079e38O94L75l47o23k83P59J89p7l21k07L82j17K57j68M5J43l21j98J27O20l59
4100C2n20k98N21O76K27n84l38j8O17M0p22L54J99l88kj50N01J01J29q43J12M57
4122A03P19n03m70k78N92J78m4m29j42L01K50m75J49N82l59j07r99O84O86k38
4142B00o21o3M41M31R5n42m5L17l50K68l0P9J58m28j59j73Q49j15j0o07k0O69
4164C44k51n0k26KR8j00r3N57Qk20j37l70L72N56k00o11j31m7R44M6m99m65O20
4187A47qr1k69L92J56m78k80L59M73Q3r05j9k6L40M62j37m45R2J46J32M4k47j1
4210i0p4q1m11N68O73m23o15q2O87J08J40p54j00L05L18r5P3J54n20K27P5k31
4232a48N01Jl35m51J25L24O58n49m05K32J31M4l58M60j4j80l48M2J04L78M9n62
$$ plain form
4079 -538 156 531 184 -439 -722 37 226 149 -172 -379 3 -114 143 -25 20 163 -158 -356 -229 391 32
4100 32 -488 -786 -265 411 638 54 -284 -302 315 355 -367 -13 186 -202 -204 -354 147 248 377 -466 -354 103
4122 103 822 319 -151 -429 163 341 297 -132 -274 27 277 -198 -49 533 174 67 -932 -248 438 200
4142 200 -421 -484 -43 388 483 -59 -104 213 -137 131 101 180 338 -90 -249 -422 427 312 302 -305 -325 344
4164 344 93 43 -183 -181 -83 -183 -276 281 289 69 -68 -438 -66 490 290 -321 -452 -499 445 491 -8 -473 147
4187 147 139 48 -221 171 327 -151 -431 -72 401 484 -421 -440 -466 -126 336 199 -246 -154 -8 124 168 -79 -90
4210 -90 -164 -245 -656 -88 585 162 -453 -535 152 260 400 -354 -454 -149 169 74 147 301 -219 8 83 -148
4232 -148 353 354 19 -432 -307 17 675 126 -279 -47 84 128 -230 230 216 36 -312 -270 -166 212 261 -301
4254c01k50M83L64j31l95j75N58K23j42n56K67L61m97p1J98O05k4q95l06O41O37
4275E94l42rm97K5L95j14j92K52l0k0R1m78K85M96m03m68q5N12M97m45m53N0N57
4298B18j52J25k15j73M94n62K74j0j25N00o29k28K39O85K49r05m53K04N87K65
4318C88o03O9L16l96j20J89J50l3k8J47JM9J18Nn55j5K12N10l85l16K99j50M91
4341C43l73j46M65l4n38j62N87j39J39k35n19P34QM33n54p51P45j23K36m12K73
4362b3J05k79j14l30N93M48m13l56M34l7J31M9l20J61j25jJ98n63N23K0k47m76
4384f22M41O17l05k4p49K63R59j97n52j86N68m06J49RJ88l32L7J52j00K52J38
4405C00M4p87L25P9N35k35o00J82M83l45m96K74M23r1k22J02K66J56j83n18K41
$$ plain form
4254 -301 -551 -68 296 165 -230 -405 153 376 234 -322 -55 306 -191 -262 -64 541 517 -378 -684 -43 594
4275 594 252 243 -254 -229 166 52 -140 112 82 62 153 -325 -40 456 53 -415 -500 12 509 64 -389 -339 218
4298 218 66 191 -24 -197 297 -265 9 -1 -126 374 -255 -483 -244 441 690 -215 -668 -464 123 388
4318 388 -215 -146 170 -226 -346 -157 -7 -40 -68 79 80 129 247 252 -303 -318 -106 404 19 -297 2 -148 343
4341 343 -30 -176 289 255 -283 -445 142 3 142 -93 -612 122 130 563 9 -742 3 -120 116 -296 -23
4362 -23 82 -197 -311 -641 -48 400 -13 -369 65 28 159 208 -112 49 -76 -77 121 -442 81 101 -146 -622
4384 -622 -181 436 131 107 -642 -379 580 383 -169 -355 213 -193 -44 -35 153 -179 -142 10 -90 162 300
4405 300 344 -443 -118 -39 496 261 -339 -157 326 -19 -515 -241 182 91 -131 -29 237 393 210 -308 -67
4426f7j49N33Q4o17k48K34N91j03k21J51L7j57k64Q4L06P8l03m60L57L03R3j74
4448H8j02J20L9R1Q9l70Q0O2k97J3L82J59o8m97m53P25L28k80n25L34K89K38j99
4471B46m83K91n6J28qj2R8J10l45l08l2P70j52k49j96M8N54l78R8k43J45J22j05
4494D3q5L1Q3k51o8K52Mk8o1l25J71j6N35k73K9j90L08o7l98M37l63M86l29k83
4518c58M93K32j93j33p15M80N49J6k87m03O91l11l3j78J63K85k2m55J06L72R0
4539C89k02n15J17J81K73l58j2J01J11J90l54L34k38J37j40j73k3P17k49k67m85
4560d66J08P78r1m53l8J94R3q0R9m38K84J29k94K10r3M14l08n21L19K68J04J39
4582C57n68R5L49nj2k51j41K29Q8m69L18L07n08J1n2K46M52k57k62k56P4M52q8
$$ plain form
4426 -67 -216 317 401 -216 -464 -230 361 258 37 188 225 68 -196 -112 194 272 -31 -491 -134 169 262 88
4448 88 -14 106 145 236 325 -45 35 97 -200 -187 195 354 286 -211 -664 61 389 109 -416 -82 207 445 246
4471 246 -237 54 -2 126 118 106 204 314 -31 -339 -371 399 247 -2 -198 -150 404 26 124 -119 26 148 43
4494 43 -42 -11 72 -179 -247 5 9 -19 -80 -405 -234 -250 285 12 41 -149 159 92 -306 131 -232 254 -75 -358
4518 -358 135 367 174 41 -674 -194 355 371 84 -319 372 61 28 -150 13 298 276 -179 -73 299 389
4539 389 187 -328 -211 -30 243 -115 -127 -26 85 275 -79 255 17 154 14 -159 -182 535 286 19 -466
4560 -466 -358 420 329 -124 -162 32 125 45 144 -294 -10 119 -175 35 -58 356 48 -473 -154 114 218 357
4582 357 -211 -116 233 228 216 -35 -176 53 141 -328 -10 297 -211 -200 -252 -6 446 189 -73 -329 -255 197 109
4605A09q0l2K95p8m86J56K9K54j4n12J44K57Q7L1o18J25M79l73J98j41L0P4J35
4628F9k37J0K35j83n0KR6K77j84o7l52L43L93k34n11J69J33J62j40MK86N4l57
4651h2n13K33M32l1k86j19J07N54j56l07P1J53J38l80N0O6K35J11o93p8K66M92
4673B63k42k02m2Q8N13p1m36j1j12K65K62k42r5L60K1m93R3K61L1k83k47l4N85
4696B32J99n45j75L09j30J23k32K60J52J27j91k09K72J73j67m90J29J3M47j22
4716A75k46k20M55k16j00J24q8J64J97l50L6Q5L01l17j48q4K27J59n6o9K14l10
4738f7J64m15K36J77j57Kj90L8N92m98k63R0J69K28j2o2q9K07N0l81q9Q8K7K50
4762I5l1j81K12K14m36j10q1Q38l44m18L6J74k8K86k39n18N12K76j74j99J40K32
$$ plain form
4605 109 29 -3 292 214 -272 -116 -87 167 153 -359 -215 42 129 160 -458 -333 146 -227 -29 -170 -140 -66 69
4628 69 -168 -158 77 -106 -156 -154 -58 219 35 -32 -384 -41 352 118 -393 -224 -91 71 -69 -65 221 275 -82
4651 -82 -595 -362 70 39 -247 -366 -259 295 139 -168 -97 56 194 -186 -136 -70 165 276 -417 -495 -229 263
4673 263 21 -181 -223 -135 378 307 -129 -140 -252 13 275 33 -62 298 319 -174 -81 180 211 -72 -319 -353 232
4696 232 431 -114 -289 20 -110 13 -219 41 193 320 129 -80 192 365 198 -292 -163 -150 297 175
4716 175 -71 -291 164 -52 -152 -28 -116 48 245 -105 -69 16 317 0 -148 -232 -5 154 98 29 243 -67
4738 -67 97 -318 -82 95 -62 -60 -250 -212 380 -118 -381 -291 -122 106 94 32 -57 150 200 -181 -270 -182 -155 95
4762 95 64 -117 95 309 -127 -237 -318 520 176 -242 -206 -32 -60 226 -13 -531 -19 257 83 -116 24 256
4784B56o08NJ56K83L55m92k56L8K51J98l41J38N14l61j56K5jL88l09l5m84L64
4806g2K65J70o2m55J41q6L63m96P9P6K25k30m2J62k7k07Q3M3r1M84n10l17K99
4829b05P93m43k37K6J05J04j01j71J61L03k76l23K11k0M52j69o27L41L20p0J45
4850C19j37l31J77P1j77J85l98K32P7k84K15p0K08j01m62J84N38J28k76l53P4
4871a81M1J83j48K75k15K78m44J03q2N18k39r1j45N3N05l95l53J60K20J03M7l99
4893b06J50k68M23o52M19K62K02k01j73n4J14J86k71j36p3L50M07p20K38nJ43
4914A35k70k58L88L32l62k24O0K57J84k71J22l56J89K38j96j65J87K11j61k47
4934b07K95R6K05m11%J00K60j04m75qL93O0J20l27k70N21j73j39j05j68J60L5
$$ plain form
4784 256 -352 -347 -191 92 447 -45 -301 -263 -12 186 -155 -17 497 136 -20 5 4 392 83 48 -436 -72
4806 -72 193 363 301 -154 -13 -99 264 -232 -153 -77 148 -82 -124 38 11 -196 -113 -70 -161 323 -187 -504 -205
4829 -205 588 145 -92 -66 39 143 42 -129 32 335 59 -264 -53 -73 379 210 -417 -76 244 174 319
4850 319 182 -149 28 99 -78 107 -291 -59 18 -266 -51 -121 87 -14 -476 -292 246 374 98 -255 -181
4871 -181 -140 43 -105 170 -45 233 -211 -108 -190 328 89 -2 -147 -94 411 16 -337 -177 43 146 193 -206
4893 -206 -56 -324 99 -553 -134 128 330 129 -44 -98 16 202 -69 -205 -278 72 479 -241 -3 -8 135
4914 135 -135 -393 -5 327 -35 -259 -199 58 242 -29 93 -263 -74 164 -32 -197 -10 201 40 -207
4934 -207 88 184 389 -22 -22 78 338 234 -241 -249 144 204 324 -3 -273 248 75 -64 -169 -337 -177 -142
4956a42R8n6QO29l32m71j75O26K16k65l99K54K89m86R7L19q0Jj04m25K84L02L9
4979B27k00m39N37J18L9k67k06K18K12N9l89K7J7L88n85J85M96j15k86j87l4L44
5001A59J58n4m91J24J74n5k04j23J52J15n7q8K98J27j46J20m42L04P6l03m5l4
5023b35L36J62k07j12Q9l83N16j98k37K2L60J75o02Q1K92K29j66j64L6M00j23
5044B71k92L68o9j17m04K92j30K90qm56J53jJ34K93l77j48J69J52Np7o5K30j09
5067A04l80K80r2K24k31k46L59o1J74J97l71R1l43N30n4k96L06J01q8m76J96J76
5089A00K54m77o0K80k61K62l48K45P0M2jJ0k70J18K30l00j11O3J38J24k97k18
5111d07L57L55l21k91K60O21j76m22k40J82k57M51j77Q4M22o48n7m5K45J37J45
$$ plain form
4956 -142 -44 -100 -92 537 205 -266 -441 185 401 136 -263 -9 280 -206 -109 210 130 131 27 -398 -114 188 227
4979 227 27 -412 125 243 282 15 -191 27 239 298 -91 -64 -47 341 -244 -59 437 322 36 -151 -185 159
5001 159 317 263 -228 -104 70 15 -189 -312 -160 -45 -102 -190 108 235 89 209 -233 71 147 -156 -201 -235
5023 -235 101 263 56 -56 33 -350 166 -32 -269 -247 113 288 -314 -233 59 288 122 -42 -6 394 271
5044 271 -21 347 278 161 -243 49 -81 209 201 -255 -102 -103 31 324 -53 -201 -32 120 125 48 -17 213 104
5067 104 -276 4 -88 136 -95 -341 18 -43 131 328 -43 48 -295 235 181 -115 191 292 204 -272 -76 100
5089 100 354 -123 -183 97 -164 98 -250 -5 65 107 106 116 -154 -36 194 -106 -217 -154 -16 108 -189 -407
5111 -407 -50 305 -16 -307 -47 574 398 -24 -264 -82 -339 112 -65 19 441 -207 -264 -309 -64 73 218
5132B18m71K7J02M40r8k51j16J49J21j27QJ30k69J15k22L21K24j00k17N8J67J6
5154B25J0l51j6p6L27j60N5l85M55J65m42O0L10L68m81m37j18M76J79j21j07m57
5176e21N81J20K68m78k7J07l9l73L13J51J87l19l08o0O06J04p5o72O08O2o5k40
5198g0j4M1k3j54q9N33m36J94j39K87K81j55j57j19j36J96j94J91l6j64K27l9
5220B5J47o8pM6k81pJ39J85J8o34K36L85L9k17k13L04P2k38J83j30k3K37k27j56
5244a85l2N02m1k51j58J59k57L2L72j58l60L02J71m1P6j56J71j49j02K68K14r
5266C68l02j85qN38n08R4k16K93k6J34k58q4N14m63L1m6N17l84J53l83J85j08
5288a44L49k23k67P4N65O5o00j00M87K17n94q9J47N18n24M10k07j14J05k36J58
$$ plain form
5132 218 -253 -226 -124 316 218 -33 -149 0 121 -6 2 132 -137 -22 -244 77 301 201 -16 42 209 225
5154 225 235 -116 -132 -208 119 -41 14 -371 84 249 -193 -133 177 545 64 -373 -491 -15 164 43 -64 -521
5176 -521 60 180 448 -30 -57 50 11 -362 -49 102 289 -30 -338 -398 208 312 237 -435 173 235 170 -70
5198 -70 -84 -43 -66 -220 -309 224 -212 -18 -157 130 411 256 99 -20 -156 40 -154 37 1 -163 64 25
5220 25 172 104 97 143 -138 -145 -6 179 197 -437 -201 184 223 6 -207 97 169 -69 114 -16 -39 198 -29 -185
5244 -185 -217 285 244 -7 -165 -6 -263 -231 141 -17 -377 -75 96 55 131 -25 146 -3 -105 163 377 368
5266 368 66 -119 -127 411 -97 -3 -219 74 48 182 -76 -160 354 -109 -78 -124 393 9 162 -221 -36 -144
5288 -144 205 -18 -285 -211 354 419 -181 -281 206 423 -171 -260 -113 405 -119 291 84 -30 75 -161 -3
5309cj01J69P4j81P0o41P48k76J44J83o0j72m3M8k14O16l28k04k44L43rj11J7
5332a75J7M97k42j62L46j88J18j81L9k28O0J58Nl72J75K65q0j73J23k30J33r4
5354a89J73J13N2m4J17m88J44N16k99J90l78l6K07L06k84j24K07j97j99rL43j54
5376c3J1J25n74L22M40j76n38M90K06n23K61q3k09N31m7m62J95K09l08R4j33k7
5398b29J17O05n09k93L90j01L97l22k53k48N93j6p7k1J4k6r1K7P2L91k79J0r8
5421E3l37K29OR1l10L95k55K42k49L62n61N38l60O5L33k90jp3K32j8m2k12L87
5444B25l31K07o1m45K97M9j28L63k34K12k04l3j26J00L06j94J32l86K19J35O6
5465A69l7n64K74P6P5j30J15K31j31J58l12lp0M22j63n09K50J03L09o69L13M61
$$ plain form
5309 -3 -104 65 139 -42 28 -613 135 -141 3 186 126 -46 -89 -41 -255 361 33 -171 -415 -72 -81 -192 -175
5332 -175 -158 339 97 -65 281 93 211 30 69 -159 -99 59 64 -308 -133 132 52 -121 2 -228 -95 -189
5354 -189 -16 97 149 105 222 -266 -122 394 95 285 -93 -129 78 384 100 -24 183 -14 -213 -222 121 -33
5376 -33 -22 103 -471 -149 291 115 -423 67 273 -250 11 -72 -281 250 203 -259 -64 145 -163 -69 -202 -229
5398 -229 -112 493 -16 -309 81 -20 377 55 -198 -446 147 131 54 33 47 21 -70 -43 29 420 141 151 53
5421 53 -284 -55 -49 42 -268 127 -128 114 -135 227 -334 204 -156 -91 242 -48 -49 -122 110 92 50 -162 225
5444 225 -106 101 40 -405 -108 -59 -187 176 -58 154 -50 -83 -209 -109 197 3 135 -251 -32 103 169
5465 169 132 -432 -158 -82 -7 -137 -22 209 78 236 -76 -79 -149 273 110 -399 -149 -46 263 -406 -93 368
5487C68m02o2p0O25k22l12K7J40q0J09r2l34J35J00K11M6k82K93K11m39K36k68
5509f2J65j21L4P6l2M6k62O1l4p7M02J6n00M10K42j69k30J3M38m45N5J9j38K68
5533A75j49L19l46p2L3K1J68L12o20J78L1Q6l76L46k71j85N04j92n2J56k92K64
5555C8j96K04K47j98Jj73m6j1K70l3j61j6J47k46J8J78k63K08Q2J57j18j22m6
5578g9K48l20P1k46L89L26l72k05NJ52J96k33O2k05o0O94m65l29M38m27K23L62
5600B25o8l23M11r3m50L65p8M2r7j56%J09L46R3m03L37n6n38K21J85J80j18m01
5623b67Q7Q8K09j43J22k61M81o30K91l65N81j53K00l75k63N40j22ro7J97J73l15
5645ak26M8L56N0k3N4l63PJ50j19K57j12k67J62K59k44jJ28n3l00l14N70J67k78
$$ plain form
5487 368 -34 -96 -166 459 237 -75 -48 92 12 121 29 -305 -170 -70 141 187 -95 198 409 -30 206 -62
5509 -62 103 -18 16 92 60 106 -156 -95 -129 -206 196 212 -288 122 364 195 -35 -22 416 -29 26 45 -93 175
5533 175 26 345 -1 -73 -40 -19 149 461 -159 19 50 136 -240 106 -165 -350 154 -38 -90 66 -226 38
5555 38 -158 46 293 95 96 -77 -123 -134 136 103 -58 -74 73 -173 -155 23 -240 -32 50 207 89 -33 -79
5578 -79 169 -151 -80 -326 63 389 17 -188 -183 -31 165 -68 -6 -211 -271 423 -42 -371 67 -360 -137 225
5600 225 157 -166 245 152 -298 67 -11 31 -66 -222 -222 -113 233 326 -77 260 204 -334 -113 72 252 134 -267
5623 -267 -180 -92 117 -26 96 -165 316 -314 -23 -388 193 40 240 -135 -398 142 20 11 -56 141 314 -1
5645 -1 -227 -179 177 227 204 258 -105 -98 52 -67 190 78 -189 -27 232 -12 -13 115 62 -238 -552 18 185 -93
5669i3M3o6J29K7q4M9j60p3J85K6k24O45k08l85K08K08J5k88J65j32K33j72m16
5692c68M06p7J54j59k0p8J96j12K77o71O20oj48J04l05J41j16M16m62K55j33J53
5714F7k65J66J88K54j15m72j28L23J30p7o4j0K83j4l3l06o2j12M57r8j69J53J0
5737A06mj29r8L4K2P9j56J13k6L41l76Q3Q0P3k23L4J53k75R8j09J88j4J06J6k30
5762a14j68L89J85j99m7k54K95Q2m86%K56Q6K6l57M50n8J17m32L56m61K79NJ4
5785c6K03j84Q1K%OJ98k97K02m15J89L00j7p07N30k87M88k58j7N4Q8k59q1L21
5809A04j22K36j68k02O0M49j79l23L2j09K81j67mJ32q6L45j75l16J34P2K48q8
5831A54p9l21J16rL30o15M39R4K35n64J30K14J17k08k64K51K12l58K09j52k0M32
$$ plain form
5669 -93 -50 -116 13 40 -44 5 -155 -228 -43 -17 -241 404 196 -189 19 227 242 -46 119 -13 220 48 -368
5692 -368 38 -39 115 -44 -64 -142 54 -58 219 -452 168 162 14 118 -187 -46 -162 254 -208 47 -86 67
5714 67 -198 -32 156 410 295 -177 -305 18 148 71 7 -3 280 266 233 -73 -135 -247 210 112 -57 96 106
5737 106 102 -27 -125 -91 -69 10 -146 -33 -59 282 -94 -11 69 142 -81 -47 106 -169 -71 -180 8 -6 100 116 -114
5762 -114 -282 107 292 93 46 -208 87 169 -317 -317 -61 25 51 -306 144 86 203 -229 127 -334 -55 -50 -36
5785 -36 167 -17 64 66 66 72 270 -27 175 -240 -51 249 232 -475 55 -232 256 -2 -19 35 123 -136 -217 104
5809 104 -18 218 50 -152 -92 357 178 -145 -113 -222 59 -108 -112 20 -66 279 104 -212 -78 -6 242 154
5831 154 75 -246 -130 -139 191 -424 15 109 344 -220 -90 124 241 33 -231 20 232 -126 83 -69 -89 343
5853C43m35Q5k12J45J77J4j35J8m3K42q8n5j15k0QJ47l56L98j83J88j55pJ02r0
5877b7o3Q7l29J03j2L17l77K40K45k38J19k50K54J43m80j71N96k35P8j57K7J72
5899D2J21n78J83L11q4j16kL36l61L22j76j13J05O4Q8q4j0M9j28K44l48J67j04
5922g2K32m80K82L90k73j53K26l45K51K26j10n0j38K41n07N0L2L12Q2r4l3j08
5944c9K37P8l15n5N5J31k79p0O0L31j23j18q1j5R1P1J46l4R0O3k30K15k06k59
5968b56L90qk45J96J82j19p5j73J04Q4k02K20k32O7K78j10l21J72J55m18O3j6
5990b64P8K73L5k26l0L26q0j95k5m8L21k41J04np2J38k30l4O7L97l51L8k20K36
6014hN7j61M5j7J50l33J05m6J99K8j05k02K27j02L97j77l67J77r7L80j04J74m40
$$ plain form
5853 343 -92 -7 -219 -74 103 117 -18 0 -43 199 111 56 -59 -79 -71 76 -280 118 -65 123 -32 -39 63 -27
5877 -27 -90 -3 -332 -229 -241 76 -301 -61 184 -54 65 -185 69 212 -268 -439 157 -78 0 -157 -130 42
5899 42 163 -415 -232 79 -5 -121 -123 213 -148 174 -2 -115 -10 54 142 58 48 97 -31 213 -135 32 -72
5922 -72 160 -320 -38 352 79 -74 152 -193 58 284 174 124 -14 227 -280 -230 -198 114 196 102 69 -39
5944 -39 198 276 -39 -94 -39 92 -187 -257 -197 134 11 -107 -188 -203 -112 -41 105 71 161 224 -6 209 3 -256
5968 -256 134 126 -119 77 259 140 65 -108 -4 80 -122 98 -134 -67 211 101 -220 -48 107 -311 -248 -264
5990 -264 -186 87 122 -104 -134 192 112 -83 -108 -156 165 -76 28 23 -49 89 -141 -175 -108 289 -62 -24 -244 -8
6014 -8 49 -112 -67 -84 66 -267 -162 -208 -9 19 -86 -288 -61 -163 234 57 -310 -133 -230 150 46 220 -220
6037b20M39k45r0P4L54k51J44l27j44L55K3k36n0L00j54q2K22j30l2O7O5M0m27
6060c05M41K4n82M95R6l24K15l14N15k12P2l00L77m9k4k19p1J95k4J28j70J91
6082A55k30m3L37q7L1l18L16j0L9p6j05K9N9p2j6L7P5q4k02R0J62l6m69N82k13
6107d9J76j70K4J61p3j87j46K37J01J03j29l64K72M41l45j65O7n2M30k60k44q4
6129b56L34j03K74k27J06J01k85J04k78N61n6j90q2j30K21k51j79L76j7j5M3P4
6151A25K5m21K04J84j26j6P0J95n73J98k3J25O3J97m68M43m35K54k96J97j9J52
6173E5j03m3K06k8J23m44J66J22J30k82l7J76k3j96J58m0jK41k89l95L34J91O5
6196H6K30l51j36m1J18p1K94k62L40n5l14J40k0K86k77J17P9k12j45K24k36P19
$$ plain form
6037 -220 219 -26 -116 -42 312 61 205 -122 -266 89 112 -124 -174 126 -28 -110 112 -18 -50 17 82 122 -305
6060 -305 136 160 -422 73 169 -155 60 -254 261 49 121 -179 198 149 125 -94 -165 30 6 134 -36 155
6082 155 -75 -118 219 132 163 -155 161 151 190 114 9 38 97 25 9 46 121 37 -165 -75 87 51 -418 164 -49
6107 -49 127 -43 -19 142 69 -118 -264 -27 74 177 48 -316 -44 397 52 -113 -46 -98 332 72 -172 -256
6129 -256 78 -25 249 22 128 229 -56 48 -230 331 275 85 3 -127 94 -157 -336 40 23 8 51 125
6151 125 150 -271 -67 117 -9 -25 45 240 -333 -135 -158 -33 30 227 -241 202 -233 21 -275 -78 -97 55
6173 55 -48 -91 115 87 210 -234 -68 54 184 -98 -135 41 18 -178 -20 -60 -61 180 -109 -504 -170 21 86
6196 86 316 -35 -171 -212 -94 -165 129 -133 207 152 -162 -22 -42 244 -33 84 163 -49 -194 30 -206 513
6218E13j19n50l3L61j77k51J42Pj64R9O5K27k93L23l42K87J80o9m1n3j78j12K49
6241G1j12j33J44p1K51N3L9m95J75K12o8k00N3N7j35L72p6m05N64n22J58n6M75
6264C51l93M0pl03L06J83l92M44Rl62M9L26m51K52O2L66l73l7J27k84M4J08j5
6287E0p5P9Pk13J76j11L15j96k02L22k46K0K09r5j22k2J54k34J39M85m81p9M8
6310g2M2p1j01J83j90J66j90L21l20M12J4m94L22J61j69p1q1n1L78l16R9k06L17
6333H3j40J43j38J90j07M8k19KJ36j51K95r3q5k7L04j78K20n41K73N77n59k3q0
6356g0K95K3k2l68jM49k50J35j03j6R2l9j95lJ94O8m9K14k85Pm8k55L65q6k08
6381a56L60k02L6j41J83K25p51O20j1k32n8K22K7K12l32R2l05L98j44m50N05j46
$$ plain form
6218 513 394 -156 -189 172 -5 -256 -114 -107 -271 -172 -107 120 -173 150 -192 95 275 206 165 112 -66 -178 71
6241 71 -41 -174 -30 -101 150 203 242 -253 -78 134 66 -134 -81 -24 -159 213 137 -268 296 -226 -68 -124 351
6264 351 -42 -2 -9 -312 -6 177 -215 229 238 -124 -75 251 -200 52 114 480 107 70 197 -87 -43 65 50
6287 50 -25 54 61 -152 24 -87 228 32 -170 152 -94 -74 135 40 -82 -104 50 -184 -45 440 -41 -120 -72
6310 -72 -30 -101 -202 -19 -209 -43 -233 88 -232 180 194 -300 22 183 14 -57 -138 -189 189 -127 -28 -234 83
6333 83 -57 86 -52 138 31 79 -140 -138 -2 -153 142 49 -36 -63 241 63 283 -258 15 592 33 10 -70
6356 -70 225 248 226 -142 -143 306 56 191 88 72 164 125 -70 -73 121 189 140 354 69 76 28 -227 138 52 -156
6381 -156 204 2 38 -103 80 305 -446 174 163 -69 -127 95 122 334 2 94 -211 187 43 -407 98 -48
6403d8J70j82j02L52k27K69j25l23K70J88k69J11J73l88K77m77L44m1J16m68L07
6424g3K65j52k3r8L12l76P9j46P5R5%Q2Nj10L6K14j67q2k02J28J78K29l0n11L15
6449D3O62p25N8J62l02K03j19Q7k4oj34J75o3J12J21k30k45L22o8k1j12r2J23
6472g3l3J21J76j95o4J05N0l59Q4N56k66J70k37QkQ4K5k5l7J22j90m33L25J19
6496C1k4q8J7J43j50K41j02k8p5l2K4k37M49r8Q3J08q9K5K16n44P9N8J41j4k14
6521h0L6K58j5J03j52K6j46pj72R0K41j9K04j84k65L05J68l90N5j16LR6j74J6
6545a19k0J72K47n9j81p9M9n0o3LL01l98J29J46j08j7r9q7L36j56K02k97J3L18
6569A83N5k01pk68N0P18o63K30l27P02l33k14M41n39M32m87L10k3p2q5M60m39
$$ plain form
6403 -48 122 -60 -162 190 -37 232 107 -216 54 242 -27 84 257 -131 146 -331 13 -28 88 -380 -73
6424 -73 192 40 17 -81 231 -145 -66 -212 -137 -42 -42 40 45 -65 -29 185 18 -64 -266 -138 40 269 239 -272 43
6449 43 705 -20 38 200 -102 101 -18 69 45 39 -95 80 17 129 250 20 -225 97 29 8 -104 -196 -73
6472 -73 -106 15 191 -4 -68 37 87 -272 -188 368 102 272 35 43 41 125 150 125 88 210 20 -413 -88 31
6496 31 7 -81 -64 79 -71 170 68 40 -35 -67 -43 -280 169 71 154 262 173 198 414 -130 -51 7 148 134 -80
6521 -80 -44 214 199 302 150 176 30 23 -149 -59 182 163 367 183 -82 223 391 1 56 -60 -57 39 -135 -119
6545 -119 -139 33 280 221 40 -39 10 -40 -103 -100 201 -197 -68 78 -30 -47 -146 -233 103 -53 149 -148 -135 183
6569 183 238 37 30 -238 -188 530 -133 97 -230 472 139 -75 366 -173 259 -228 82 59 -13 -98 362 -77
6591g7J99j39r2j17L71J6k13j64J3J49p7R9k0J52n6j22ln0P7K46k26j16L01j16
6615C5J11m5m99L21K24k2l8M8n6o4k08K98l77J82M09o09K37nP3j10J23N3l49L34
6639F6J69j52k02J57J28j23K7J9j41j6j59R5J63O6q0M0L9j88K21m4k70o0K33K15
6663B03k23O7j43O5k81L94k4P7M4k34Q2L8k40J4K11M1k38L07M6l07O9J72k26k25
6687c11J70K3M5M0N0o5m6L61k02J65l15o1J28k38J37L08k66J11J54l49M32m66
6709a95K92j70J2J48l36J16Q8j01J57J00l63K10n6J47J21j01j39L26p1l27N2L38
6731B48q6j20J1q9J96j47J1j71J04R5Q7j29l2q6K07J34k65j27K00J61l27j03j03
6754c31M91m38r3J73L63k92M57k00j71N1k42M61n17P7L95J53j89N3k06M44o22
$$ plain form
6591 -77 122 -17 -109 -226 145 161 -52 -216 -203 -54 -131 -32 -52 100 44 -78 -81 -131 -54 192 -34 -150 151 35
6615 35 146 101 -398 -77 147 125 87 135 79 15 -193 105 -272 -90 319 -290 -53 -58 15 -95 28 81 -268 66
6639 66 235 83 -119 38 166 43 70 89 -52 -68 -227 -132 31 97 17 57 96 -92 129 85 -185 -245 -12 203
6663 203 -20 47 -96 -31 -312 82 58 135 179 -55 27 65 -175 -161 50 91 -147 160 206 -101 -32 140 -86 -311
6687 -311 -141 -118 -73 -33 17 -48 -94 267 65 230 -85 -146 -18 -256 -119 189 -77 34 188 -161 271 -195
6709 -195 97 -73 -61 87 -249 -133 -45 -146 11 111 -252 -42 -98 49 170 69 -70 256 185 -142 -90 248
6731 248 162 42 53 -36 160 13 24 -147 -43 52 139 10 -22 -108 99 233 -32 -159 41 202 -125 -228 -331
6754 -331 160 -278 -371 -198 165 -127 330 130 -41 10 -232 229 -288 -211 184 337 148 201 -5 439 -183
6775a83J30j6j37K01p4J13j1p2k1n2o2K95j8l38M10J0k43N6J96M0l18L01k61K74
6799B20j74l96J90O1j75L84l02J41Q8J20RJ32j03l37P8K98l02K41l55K34ok64
6821b18K49q8L23j13j25m03M21K03q9j02m7k55J90J19J50k63J64q7j87k05N79
6842B16M8l11m6N2r9K36j15k21J47L11j68M2L20n34L31m56n9M3N39k67O4k39J14
6865e2k2L22k80qj03l2K95q4k73J31P4j37L88k54J61n22M80l22L48k24J76k52
6887a90O3J85j09q3K1N26n28L82l96R1k10J73J9k32K67J74k58k48N51l01K53j46
6909DK5M8N4o1n3k90K88j37J41Ql09J66K30rj97l52N32J23k69K8Nk50M85j70l15
6934b75N17r4l47K2J74J59K6j99k76L77l49K48J2J93j59nj0M9j94P6Rr6j43K4
$$ plain form
6775 -183 -53 -69 -206 -5 -79 34 23 -49 -70 -122 -184 111 93 -245 165 175 -68 -12 184 224 -94 207 -54 220
6799 220 46 -350 -160 -99 -274 110 -192 -51 37 157 166 298 195 -142 -64 234 -68 173 -182 52 46 -218
6821 -218 31 -57 266 153 28 -375 46 249 160 58 11 -244 -54 65 215 -48 116 29 -158 -363 216
6842 216 264 -47 -93 -41 -140 96 -19 -240 -93 218 50 92 412 -122 209 -247 -306 -263 276 9 73 -166 -52
6865 -52 -74 248 -32 -40 -143 -175 120 36 -237 -106 -32 -169 219 -35 126 -396 84 -238 110 -114 62 -190
6887 -190 -127 58 -51 -134 -113 413 -115 267 -129 -38 -248 -75 -56 -288 -21 153 -105 -353 198 -103 150 4
6909 4 29 77 131 70 17 -273 15 -122 19 27 -282 -116 114 105 -92 -444 88 211 -58 -30 -25 -275 210 40 -275
6934 -275 242 148 -199 -177 -3 156 182 -17 -293 84 -265 -17 -5 188 29 24 14 63 -131 -55 -46 -142 -285 -261
6958b61N46l25j78j19L79j09mj50J46L75l4j38J09k74J50K88m28J61R6l25n6J83
6980C2k1K61j67j37j45L37j94j91N23l25nk02J77L4M2K7j23J48j79j47Q9J23K62
7003B19l91J68q2l5MJ27l41k9K49l5L96k25j72P7j83M55l82O9n1J32J2J26k82
7026a74J55q3R4j09M42j27j34J26l59O9J00m9K70j62l15K34j7J56k34J10l4K27
7048A86k29M6n6m7j7q2m7K93j58J86J48l87R7J37R6p3j6k00L78m44N2L6N4k6K11
7073A38Jj38j44J40l73O17j84r6J56k08Q5po9q8L58l37K0N7j47L78J7j34l44M04
7097A02k14R9K19j38r1j16L32m07K16j30L69l98J21k65N06K4k45Q4j4r2p6K9J65
7120H0n7m3k93L8L42n2k23M34j02j68J18n0k60M70m7p4J89l89K75j92l0K41k01
$$ plain form
6958 -261 285 -40 -218 -337 42 -67 -71 -221 -75 300 266 128 237 -37 113 401 -27 134 230 -95 -151 32
6980 32 11 272 105 -32 -177 160 -34 -225 298 -27 -32 -234 -57 -23 19 46 -77 71 -108 -255 -166 -43 219
7003 219 -172 -4 -86 -121 -117 10 -331 -360 -111 -146 250 25 -147 -70 -253 202 -180 -111 -162 -30 -18 108 -174
7026 -174 -19 -102 -8 -117 325 198 64 190 -169 -100 0 -49 221 59 -256 -22 -39 117 -117 -7 -41 186
7048 186 -43 3 -53 -100 -117 -199 -246 47 -111 75 223 -164 -67 70 166 93 77 -123 255 -189 -137 -101 -47 -73 138
7073 138 139 1 -143 -3 -376 241 57 -39 117 -91 -6 -13 -82 -170 188 -149 -129 -72 -219 159 176 42 -302 102
7097 102 -112 -13 206 68 -23 -139 193 -214 2 -128 241 -157 -36 -301 205 229 -16 68 54 -38 -114 -85 80
7120 80 23 -20 -313 -275 67 15 -208 226 124 -44 74 24 -236 234 187 113 302 -87 188 -4 -34 207 6
7143FP1j88j3J37P7J73l35m3M3R8q0m25L14M47l06p5J47K39j93n6J00l82K02J76
7167A34mP4m39K35nK55j48Jj15lMJ06J35l33J91Lm26L51j52L04j95k5K80m80L14
7192F2j62N0L14k17o8q7L21k52L08l36j63J2j91N99K7o47K40q5O4qj64O53n53
7215b83K91j18L69l14J48ml53lK02J66RJ0j7N3k95J18J72l7J9k86j00J15J31l09
7239c16L15m3J72k84m1K87L76n63j81M47o28K85K12M0j61J69p2K09l70J97K59
7260C09k08M8k89L27l05l3J74K7J36k09j83qL09k73l8N82l03j21j1P1J30k33m9
7283a50L02l43r1J59O3N0lp1J7L41m82L03R2j84l6j13O3Q1Lj27K66j45j8L44j82
7308A39k28j82N40q3j46j18K53k71J93K16l6m40L2P0o6J25j82L40k94J41j62P5
$$ plain form
7143 6 77 -111 -124 13 90 263 -72 -115 -72 26 -54 -479 -165 282 -24 -99 48 287 94 38 138 -244 -42 134
7167 134 130 204 -235 0 -5 250 102 103 -12 -15 -11 95 230 -103 88 91 -335 16 -136 168 -27 -52 228 -252 62
7192 62 -100 -50 264 47 -21 -108 213 -39 269 -67 -230 -218 -409 190 217 -430 -190 -275 -211 -219 -383 270 -283
7215 -283 8 -110 259 -55 93 89 -264 -267 -65 101 110 120 103 156 -139 -21 151 114 133 -153 -253 -138 -7 -316
7239 -316 -1 -44 128 -156 -197 90 466 -97 -278 169 -459 -174 38 78 -83 86 14 223 -147 50 309
7260 309 101 149 -140 187 -118 -151 23 50 186 -23 -206 -214 95 -178 -216 366 63 -58 -69 2 132 -101 -150
7283 -150 152 -191 -282 -123 -60 -10 -13 -84 -67 274 -208 95 187 3 -33 -146 -83 -2 1 -126 140 -5 -23 321 139
7308 139 -89 -271 269 186 40 -78 175 -96 97 313 277 -163 -131 -61 -127 -2 -184 156 -138 3 -159 -84
7330h4J29l9q3J64m8J06k97k9J8J22J3L3r7m8J4K29k59K16k19J89j40J15k48L76
7354A33j85pK03L6k39q4L65j11M0k17L12j43l20j9R5R6L17n84L39j05N3j84j5
7377b24O8j05P3OP6J64r3L0K75k34R9k42J78j26P6rJ52j29k49O9K01J31l06o9
7401a88j22L52k23J24o3J61L99n98J68K17m18m0J34Q2J16k32r5J47N8Q1k20L11
7423A51j93J86j80n2j00j4J92m4j01QL57P2r3m03K74l49O34m25n1J90j25J84k67
7446a49M20o9K0j08O1l52K40o0J49j45j9j61K19L0J32k07j7k1n7R4j9N0n2j7l03
7471c41J96K10P1j90L2L21l14J77O5k35M2L60l14l64J84K28l36P3O4nj38K02K25
7494B13l62J44L3k39K68k79R7K30l25J56L62j12k24J08p4J40n96L17K00M02n36
$$ plain form
7330 -84 45 6 -77 87 39 145 -152 -181 -163 -41 -28 5 -92 -140 -126 103 -156 60 -159 30 -110 5 -243 133
7354 133 -52 -59 144 180 -59 -143 222 111 151 -66 246 103 -217 -236 -141 -45 272 -312 27 -78 -25 -209 -224
7377 -224 -156 -261 -188 -182 -106 58 -35 -5 270 36 135 -107 71 -55 21 12 164 35 -214 -145 56 187 -119 -188
7401 -188 -310 42 -181 -57 -120 41 440 -158 10 227 -191 -231 -97 -15 101 -131 -226 -79 -21 60 -160 151
7423 151 -42 144 -36 -88 -188 -202 -10 -54 -155 -147 210 282 189 -214 60 -289 345 -80 -131 59 -66 118 -149
7446 -149 271 202 222 114 175 -177 63 3 152 7 -12 -173 46 76 208 1 -16 -37 -94 0 -19 31 -21 -38 -341
7471 -341 -145 65 136 -54 -22 299 -15 162 227 -8 34 394 80 -284 -100 128 -208 -135 -71 -76 -214 -12 213
7494 213 -149 -5 28 -211 57 -222 -125 105 -220 -64 298 186 -38 70 -4 136 -460 -143 57 459 -77
7515g7r5M19j89J78k11Lr3Rj15J09j8K37J70m51J09o2k9J83N6l37J46j43j70J34
7539b37K82L3j62J85O6m6J1N5K8n35J40K18j94J58j34P9k26J79K7J83l13J50J98
7562A45Qj89J54m51K58J76k07J95j02k45K94J60m27L44p3n3j67N0J1Q5J69l13
7584a78K95j07J10j62K58l75o1L57p4J33j67k38K45J68j11k65K13N3j33J4n0j10
7606a85J53K4K77l04j81K08j65o5K30K7J55j33r7J9N9qJ78k99L31j48r5r1kJ87
7630G5J18j06Lk58M3L0O9J57l56O2j44K95Q4L44k52k90J50k2q2P7k0J7L34R8k81
7655A45m82L08J67r5k61K37O8P8k73J47k47J98K77j20l64J04L85km16J88k5O5
7677H2R1j65J15k12J77j66J70n2J73r5k84P8K7L62m39J06L58k41j24K43k42K67
$$ plain form
7515 -77 -172 247 58 236 25 28 -65 -56 -171 -62 -80 157 327 -124 -15 -77 -106 77 133 -204 -58 -201 -371 -237
7539 -237 45 78 -84 101 167 121 132 187 215 -320 -180 38 -156 2 -132 -53 -279 -100 -73 110 -203 -53 145
7562 145 153 -36 118 -333 -75 101 -106 89 -13 -258 36 196 -231 113 40 -13 -180 -130 -119 -34 135 -178
7584 -178 117 10 120 -42 216 -159 -220 137 63 196 29 -209 36 204 93 -172 41 94 -39 -25 -75 -185
7606 -185 -32 -8 269 -35 -216 -8 -173 -238 -8 19 174 41 -56 -37 22 14 192 -107 224 76 -19 -110 -112 75
7630 75 193 87 90 -168 -125 -95 -26 131 -225 -163 -307 -12 72 416 164 -126 24 2 -80 -3 -23 -6 328 426 145
7655 145 -337 -29 138 43 -218 19 87 165 -108 39 -208 -10 267 147 -217 -113 272 270 -146 42 17 82
7677 82 173 8 123 -89 88 -78 92 40 213 118 -166 -88 -61 301 -138 -32 326 85 -39 204 -38 229
7699B29K47m77K47j88l9m0j26M3P1L9l89L50l0K06J09n2m04L0K61l8J20k54M0
7722d5L6o8J52K60P0m47k84J73J34Q9k08K86Ko0m7m62O43p7j4m03j7L82j08J54
7746A41k29k11J58J50L2J29l25%J43n4k39L57J8j11L5j1j09j64K77J16j69n2K2
7769i6j33M7N70k33q7n7J56j72K58j91n28K14J85L54k28j5l93K05K91l66J83Q4
7791D8m5k0j61L07J1j95O1rqj61KJ70j95L31n7k46J81o7K95J22m27j56Q7J99L6
7816A03j09K0Q3k77k4Q4J8J52j16j09K75k06o4J52j31K14P9O0m51L46l20K58r6
7839e9j9R4k6K3J59j84j90L42j12j40N7q5QJ18J0j80r0K95M44l34mj76Jj98l8
7864b84M39k13k38p5L46K20j65L34n46M2L71q5k09KQ8P6l3lk09L24l85J17J64
$$ plain form
7699 229 476 -1 246 58 19 -21 -147 -104 -33 6 -383 -33 -63 143 252 200 -204 -174 87 49 169 -85 -45
7722 -45 -9 -77 75 335 405 -42 -326 -153 -19 70 -138 148 150 90 43 -419 224 147 133 -270 -287 95 -13 141
7746 141 -88 -299 -141 9 41 170 -155 -155 -12 -66 -305 52 70 -41 -6 -17 -126 -290 -13 103 -66 -118 -96
7769 -96 -229 -182 388 155 68 11 167 -5 253 62 -466 -252 -67 287 59 44 -349 -144 147 -219 -36 48
7791 48 3 -17 -178 129 140 -55 6 -3 -11 -172 -170 0 -195 136 79 -167 14 -53 242 364 -63 -219 -132 67 103
7816 103 -6 14 97 -180 -204 -120 -102 50 -66 -175 100 -106 -170 -18 -149 65 144 204 -247 99 -221 37 -59
7839 -59 -78 16 -10 13 172 -12 -202 140 28 -112 -55 -140 -132 -14 -4 -184 -274 21 465 131 127 -49 -48 -246 -284
7864 -284 155 -58 -296 -371 -25 195 30 364 -182 -140 231 146 -63 -61 27 103 70 67 -142 182 -203 -86 78
7887G8l4k25J83j64K14K25m33m5M0L3J02M0J25k6j00j94K49l15K81L02l65k08
7909b37k0L82K0k45K92l35M15k38j25l3J23k77J06J99j52Q4J1PK40k42K1P1k39
7932a72J94k83M21k31j70K23j78L99k49k07J80Nj15K74j66K24O3J2j74oj70K97
7954A71q0Mj39J06o6j64M63Mk32j93K10m30L52l7r4J09J19l18J46J16m3J51k65
7977a10j34L14K96l1k07j18J20L1j55O5Qk86j12K98O3j46J12j63N15m85J72P3
7999A20k42O1k22N60n1k36k08M52l59K97j64k22K19M61n74J46J56o13K82J34M0
8020C7N7j6k15J26r7J2K21k60J89o8K4R1m35R7N13k48J07Rj44J06J2o9m3m9k20
8045b63O92k73P9k86J13j57K54j38J30j71J39j15p3J53o2oj38M2O1p8p5L42j2
$$ plain form
7887 78 44 -181 2 -162 52 277 -156 -201 -161 -128 -26 14 139 113 13 -181 68 -247 34 336 -29 -237
7909 -237 -257 125 145 -100 192 -143 272 34 -91 -124 -1 -278 -172 27 -125 -41 -30 -23 217 -25 -4 67 -172
7932 -172 22 -261 160 -71 -241 -18 -196 203 -46 -253 -73 -68 -183 91 -75 149 212 224 50 44 -126 171
7954 171 91 95 -44 62 -4 -168 295 299 67 -126 84 -346 6 -31 -125 -16 103 -215 -69 47 4 155 -110
7977 -110 -244 70 366 335 128 10 130 161 6 71 79 -207 -319 -21 42 -104 8 -155 360 -125 47 120
7999 120 -122 -61 -283 277 226 -10 -218 234 -125 172 8 -214 5 466 -108 38 194 -419 -137 -3 37
8020 37 94 78 -137 -11 -108 -96 125 -135 54 -14 10 101 -334 -237 276 28 135 144 0 106 118 49 6 -43 -263
8045 -263 429 156 235 -51 62 -95 159 21 151 -20 119 4 -69 84 22 16 -122 -80 -19 -97 -172 170 158
8068A58k20M63k42j52J76m4j77K45k91K27o2p3J88m17L31j46J80l34L53l33L26
8089A56l08N5o9Q5J56m6K18l17L32l11K00l08O8l9K24j42K66j28j60N5m0R9j81
8112a35Lj64K30K12Q3j54r2M21l10qr1j31l2J66k31R9K93j73j46M16k9k18ql5
8136c4l9k3L8j60J30L5J43J73j76j66J93p2J19k53j15K78J27k16J37q8J35P2m21
8159a83J23J48J65jl78J76J39j41j67L24k86Q2q9K51l21L50J9j68M9Nj6j31Q2
8182C2j94K21K41j89j98j35K20J38j91
$$ plain form
8068 158 -62 401 159 7 183 139 -38 207 -84 143 81 8 196 -221 110 -36 144 -190 163 -170 156
8089 156 -152 -97 -166 -81 75 29 247 -70 262 -49 151 -157 -89 -128 96 -46 220 92 -68 -13 -53 46 -135
8112 -135 -132 -296 -66 146 229 75 -17 404 94 86 -5 -136 -168 -2 -233 -134 159 -14 -160 256 227 9 1 -34
8136 -34 -73 -96 -58 -218 -88 -53 90 263 87 -79 114 42 161 -92 -207 71 198 -18 119 31 166 238 -183
8159 -183 -60 88 253 252 -126 50 189 48 -119 205 -81 1 -88 163 -158 192 211 43 92 97 81 -50 32
8182 32 -162 59 300 111 -87 -222 -2 136 -55
8191e5
$$ Imaginary data points
##PAGE= N=2
##DATA TABLE= (X++(I..I)), XYDATA
0@%%%%%%Qj6J6j6K4l2M0m9N7p2Q8j04J22j45J69j96K29k65L06l51M01m57N18n85
30c10O60p42Q31r31J040j159J292j437J594j767J956k166K400k657K942l261L622
47A907m031M501n044N680o442P370q531J0032j2058J4961j9501K7655m6802J71287
61A40984J20684l49809q9913J52489J49201m6816m1211k2364m1561l6961P8459
72A3182Q0124k4639r1962l0186J9121L6270L4112J8791m0597o4119k7176L7029
84d0050O4335M8128k9143r3730n2516P1164J03366N144q5288n9907J1840M8764
96g893M6786J4936m3581o6313r445N7285M4489j2906l0362p542k015j4521k735
109c3817L1228L7981j0001o4003m2766N1091R9412J5152j00686q1437M7898J00801
$$ plain form
0 0 0 0 0 0 0 0 8 -8 8 -8 16 -16 24 -25 32 -40 48 -56 66 -79 90 -106 123 -142 164 -187 214 -243 275 -310
30 -310 350 -392 439 -492 548 -611 681 -756 838 -929 1027 -1139 1261 -1396 1546 -1715 1907
47 1907 -2124 2377 -2667 3013 -3429 3941 -4590 5442 -6616 8345 -11156 16499 -30303 140984
61 140984 261668 -88141 -178054 -25565 123636 76820 35609 13245 -28316 -65277 13182
72 13182 93306 68667 -23295 -53481 -34360 1910 36022 54813 14216 -49903 -77079 -40050
84 -40050 24285 72413 43270 -50460 -102976 -31812 71554 76698 -8590 -68497 -56657 -7893
96 -7893 38893 53829 10248 -56065 -65510 -8225 36264 23358 -7004 -14546 -16561 -31082 -33817
109 -33817 -2589 35392 25391 -38612 -81378 -30287 69125 84277 -16409 -97846 -49948 50853
121E0853K1485n3197l9822m864j303J3418L7328J5046l1672k9900N392Q193O073
134b970L1753K2404m7286o7098K2242R1624L4183n7241o3756j0056L1342N3468
146C8609L8602k8404p4692k5326N1067M8503n799k6313j9469j7647K081L4392
158A5604K1157k3675k8167l867p851q152L6219N0893k5085q7356l2485O2833P3034
171D3102P622n0966o3572j5519O6547Q3179j1639r2858m3252N2127N5655J59j3958
184A6627n790k6102l0461J9580N3633J9752k7377l6267k4113M301M8636N1115
196F3534k2321q2464l3286O0376P2606J506n4595m9411n625M0585N0883R268l9466
209A1590l8353k694K0626K4632J9472o817l6713k2337K1166L1142L197r656o805
$$ plain form
121 50853 72338 19141 -20681 -25545 -26848 -13430 23898 38944 7272 -22628 -17236 -9043 -2970
134 -2970 28783 51187 3901 -63197 -40955 50669 84852 27611 -36145 -46201 -14859 38609
146 38609 77211 48807 -25885 -51211 -144 48359 42560 16247 -3222 -20869 -18788 15604
158 15604 36761 13086 -15081 -18948 -26799 -34951 1268 52161 27076 -60280 -92765 -29932 43102
171 43102 50724 -242 -63814 -79333 -12786 70393 58754 -34104 -77356 -25229 30426 30585 16627
184 16627 10837 -15265 -45726 -26146 27487 47239 19862 -16405 -40518 -36217 12419 63534
196 63534 41213 -41251 -74537 -14161 58445 59951 5356 -44055 -49680 -9095 41788 51056 11590
209 11590 -26763 -29457 -8831 15801 35273 28456 -8257 -30594 -9428 21714 24911 15255 8450
222H450k3256k4827K5940O2492J2056o3654n6766J7139N9900L5825j5067m9909
234a1677l5274K1670N3747J3090l8483k4824J4260Q004j3220P118K8158m19l9303
247a7153k7889J2701L5292K9137m218m9366m6877K5002P3620K2718n4225m9278
259e0536J1411L7356K2267O084j4022l5889j7899L0912M1099J599k4673j2860
271e151m782k977J4831K7483L668k6251k2092L17J3912K3038J7848k1534n2655
284c4345j3518N3214N0906j7305n5916k7304J7834L6992K4458r794l6188j9285
296c0251J8646K1451k777l198R669q998l1181l161M1189L0634k2011m4140j7213
309d1341K1795M0817K3555k4990n1856j5226M0784L9855o718k8460j4924l274
$$ plain form
222 8450 -14806 -39633 -13693 48799 60855 -2799 -59565 -42426 17474 53299 38232 -11677
234 -11677 -46951 -25281 28466 41556 3073 -21751 -7491 513 -12707 -5589 22569 22150 -17153
247 -17153 -45042 -32341 2951 32088 27870 -21496 -68373 -43371 30249 52967 -1258 -50536
259 -50536 -39125 -1769 20498 26582 12560 -23329 -41228 -10316 30783 32382 7709 -5151
271 -5151 -9933 -12910 1921 29404 33072 6821 -15271 -14954 -1042 21996 39844 18310 -34345
284 -34345 -47863 5351 56257 38952 -16964 -44268 -26434 10558 35016 25222 -10966 -30251
296 -30251 -11605 9846 7069 3871 13540 4542 -26639 -29800 11389 42023 20012 -24128 -41341
309 -41341 -19546 21271 44826 19836 -32020 -47246 -6462 33393 26675 -1785 -16709 -19983
321a9983N604K1419J8973j3490l0289r309J3509J4422J3089Q132j8045l6021n275
334c7264L7056L1602p081k8093k2652n024K4515M0598O475m6524m0824K0207M9488
347B2479J7359k1607k7947j3582R104K5811J7412j1590j8131j488O28q614Q749
360a417L1781N410m2151l4312K2311M7353J3056l0161l8905j1751K8203M1250
372C0667N479l7211l2077P350K4212J0965K410l351j7834j9715P341K8137J2237
385A8610j2565j7049j0796j183J8739K7486O06l2721k3748J2473K7175J4788l30
398B1485j6261k7918r180L3310L9356r609m5038j9028K3777K6412K688j0012j0840
411h58r697k560R172J2227Q946j111j8606k6156L036M1111K7271k7297m5522m212
$$ plain form
321 -19983 -14379 7040 26013 12523 -17766 -27075 -13566 856 13945 22077 4032 -31989 -37264
334 -37264 -208 31394 24313 -3780 -26432 -31456 -6941 33657 40132 -6392 -47216 -27009 22479
347 22479 39838 18231 -9716 -23298 -14194 11617 29029 17439 -692 -2180 -1552 -10166 -1417
360 -1417 30364 35774 -6377 -40689 -18378 28975 42031 11870 -27035 -38786 -10583 30667
372 30667 36146 -1065 -33142 -25792 -1580 9385 11795 8444 -9390 -29105 -21764 6373 18610
385 18610 6045 -11004 -21800 -22983 -4244 23242 23848 -8873 -32621 -20148 7027 21815 21485
398 21485 5224 -22694 -31874 1436 40792 31183 -13855 -32883 -9106 17306 19994 9982 -858
411 -858 -10555 -13115 -3943 8284 17230 16119 -2487 -28643 -25607 15504 42775 15478 -30044 -34256
425c4256L5191K7703k709k2654k2287k897K2993K3722l611j8662p826j621l205
438a0119J0105K3721K652l0626k3299J2914K3992Q386n175j4044k0701l895K5704
451c85K5150p945k7810j5508L050J8049K5899O158l3562l3805J3864L9987J0294
464B3436k2006j4373J629l20K185J5057J0660r915j8344q877O289K1206K1774
477B8401p083l8378k1401K8388M1380K124l1426k2434M072J8718J7483M388j3738
490A0494j9710l907J1896J4203P347j655j6505k1081J232K7700J9024j2355k6037
503i354j1322P535J6271J5395j034k1984k1460O053K5638J6282p369j9445j6873
516b1667M87K3574K4204o126l0141j4062J5085J6730J679j858k303j2263j2938
$$ plain form
425 -34256 935 28638 25929 3275 -19012 -21909 1084 24806 21195 2533 -5293 -6914 -10119
438 -10119 -14 23707 26359 -4267 -27566 -14652 9340 17726 12551 -1493 -22194 -26089 -385
451 -385 24765 16820 -10990 -26498 -23448 -5399 20500 26658 -6904 -40709 -26845 13142 23436
464 23436 1430 -12943 -11314 -11634 -9449 5608 16268 6353 -11991 -20868 -14579 6627 28401
477 28401 21318 -17060 -38461 -10073 31307 33431 2005 -20429 -16357 2361 19844 24232 10494
490 10494 -9216 -13123 -1227 12976 20323 18668 2163 -18918 -17686 10014 29038 16683 -9354
503 -9354 -20676 -13141 3130 18525 17491 -4493 -25953 -19900 5738 22020 14651 -4794 -21667
516 -21667 -21180 2394 26598 20472 -9669 -23731 -8646 8084 9763 7905 5602 -6661 -19599
529a9599O426K1876J1354j1951k4216j3969J1885L1782J4433k5882l4604J794
541c0671L0311J7153p479j2326q609n710O533J8095R892r368j3942o479J194J2759
555A353K0688K463k6747k3178J3292K8665Q005j2955j3544r287j568J6010K1864
568B5061k055k5903j6623Q933J9168J2916j072j7944k0704K551K6309J4309j2836
581A2110j6446k265J334o06J0164J4799n700k6296j3349J5412K4005O846j5488
594D520k4342r832J9297K7297J753k4217j7252O266J3732O962L123r58j0958j3094
608a7703J932J8380J5177l021j9282j7611M958K4713J6064j1961k2978p979R403
621i908J2765R285Q47j4279j9506l4K2109J7995m846j8536j4149J727J8647J9086
$$ plain form
529 -19599 -13173 8703 20057 8106 -16110 -30079 -18194 13588 28021 2139 -32465 -30671
541 -30671 -360 16793 9314 -3012 -11621 -17331 -10798 7297 17189 7821 -6121 -12600 -11406 1353
555 1353 22041 24504 -2243 -25421 -12129 16536 24541 11586 -1958 -11245 -12813 3197 25061
568 25061 23006 -2897 -19520 -10587 8581 21497 20425 2481 -18223 -15672 10637 24946 12110
581 12110 -4336 -6601 -5267 -5873 4291 19090 13390 -12906 -26255 -10843 13162 20008 4520
594 4520 -19822 -29654 -10357 16940 18693 -5524 -22776 -16510 -2778 4184 7307 6349 -4609 -17703
608 -17703 -15771 2609 17786 14765 -4517 -22128 -17170 7543 23607 11646 -11332 -19311 -9908
621 -9908 2857 12142 12989 -1290 -20796 -20830 1279 19274 14428 -4108 -18257 -16530 2117 21203
635B1203k859k1686j1813R374J2770L967L231k55j4803j6101R748K7241Q143j9607
649H553k0958k852J2905J8381P864j5686k5326k570K1650J4819o989j0433l152
662c794n666m595J3305J8492l295k3116j2982R151J6189J1576k913j8403j8069
675b4120O864K4032J0386j2684j5538m512K005Q298J4994N659j8087k0770K918
688b0555K2815J4160n607j4873j1878J324J5122J4915j859j3064j0124j70O377
701c417J1609J0875o690k1750j1699J4691K4513M902j8412k0135k077J6578J7548
714A6536n58j5666j0832J390O501P229P870L66j4388j4150M556J9633J2029p035
728A3481j6530j2091M723J9310J3734r681k0939o370J0679Q900L968J958p644
$$ plain form
635 21203 18344 -3342 -15155 -5781 6989 10956 14187 13932 -871 -16972 -7224 20017 28160 8553
649 8553 -12405 -15257 -2352 16029 23893 8207 -17119 -19689 1961 16780 9791 -642 -3794
662 -3794 -9460 -14055 -750 17742 14447 -8669 -21651 -12500 3689 15265 12352 -6051 -24120
675 -24120 -17256 6776 17162 4478 -11060 -15572 -13567 -5269 9725 15384 -2703 -23473 -20555
688 -20555 2260 16420 10813 -4060 -15938 -14614 508 15423 13564 500 -9624 -9794 -3417
701 -3417 8192 19067 12377 -9373 -21072 -6381 18132 23034 4622 -15513 -17590 -1012 16536
714 16536 15978 312 -10520 -9130 -2629 4600 12470 12836 -1552 -15702 -11146 8487 20516 13481
728 13481 -3049 -15140 -10417 8893 22627 12946 -7993 -14363 -3684 5216 9184 11142 3498
741C498j7610o000J8577J9438n019j9798j1181L414J1790J3355K157j5454j6231
754a9064M191J5038P612j944k477q597j3253L902K5055J3379j9474k4775J036
767a9371J9799J2975r71j0057j2430m431J0822J4409R75q318o836m457k052R980
781C7J8118O75k2792j7487J1081K3918P077j2600j4066n805N361J3078Q817m617
795A0795j3413q705K152J0591J0974K202j2915j7450n78J8531J5415n159j6981
808d541r533M310J1015Q356k0p499r768m451N562J3946R761q759k1139p713J6002
823d471J9759M13j5654j3759k98J0685J2285K239j0099j1156j720N451O939Q373
837H987J979j3900j7237M940K3673J1137j3850j7295j996Q531J0244P441l049
$$ plain form
741 3498 -14112 -20112 -1535 17903 12884 -6914 -18095 -14681 -2891 10464 12621 -2833 -19064
754 -19064 -14873 165 7777 5833 3356 -5241 -18494 -14592 10463 23842 4368 -20407 -19371
767 -19371 428 13403 12432 2375 -10055 -14486 -3664 10745 11720 3402 -3434 -7891 -9943 37
781 37 18155 18830 -3962 -21449 -10368 13550 20627 8027 -6039 -11844 -6483 6595 15412 10795
795 10795 -2618 -11323 -9171 1420 12394 14596 1681 -15769 -16347 2184 17599 12440 -4541
808 -4541 -14074 -9764 1251 9607 9587 2088 -7680 -12131 -6569 7377 17138 8379 -12760 -20473 -4471
823 -4471 15288 15701 47 -13712 -14010 -3325 8960 11199 1100 -10056 -11776 -6325 614 8987
837 8987 10966 -2934 -20171 -15231 8442 19579 5729 -11566 -13562 -5031 5213 12654 9605
850I605j3988q490P132J1721M025o90m848j2407p164J3420K1131j408k2244j2107
864a6312R437J2904M524j480o511j0706l754J0203J2824P67r189j0423n285O176
878f825J6433Q304j3474k0300m77J7263J1221m441q998n371k666K703R693P703
892A0768l880j2345p913L161J2750J1994l515j7353j2390Q882J9426N880j1297
905D168j2759k121N902Q238N900j297q809r180q29J0455J2797R80j3929j4713
919a5197K960J6597J0584o379j2164n979K766P528P581K041p691r993k920O982
933c284J1630N839p781j5964o371J4084J6736j632j4825q477L396O178N136M185
947H850k503j0510p142M676J1075O562l099j1894j1287M087J7818R822j1890j7096
$$ plain form
850 9605 -4383 -12873 -5741 5980 10005 9315 4467 -7940 -15104 -1684 19447 18039 -4205 -16312
864 -16312 -6875 6029 10553 9073 2562 -8144 -11898 -1695 11129 11896 2707 -7716 -13001 -6825
878 -6825 9608 17912 4438 -15862 -16339 924 12145 7704 -1294 -6665 -9331 -6628 3065 10768
892 10768 6888 -5457 -13370 -10209 2541 14535 11020 -6333 -18723 -9841 9585 15465 4168
905 4168 -8591 -10712 -4810 3428 9328 8031 -778 -9958 -10787 -332 12465 13445 -484 -15197
919 -15197 -12237 4360 14944 8565 -3599 -9578 -6812 716 8297 10338 2647 -7346 -10266 -3284
933 -3284 8346 14185 6404 -9560 -15931 -1847 14889 13257 -1568 -10045 -6649 -471 4665 8850
947 8850 6347 -4163 -11305 -6629 4446 11008 7909 -3985 -15272 -11185 6633 16455 4565 -12531
961a2531j56J0911N838O96n33n328q624j107J0654J0078j316j0351r118p59J0226
976a420J4035K65j5782j1206O224J3151M562l969m821n224m392N390J1981M594
990A3388r085j3024k727R808J2504L229j1200j3606J09J2527Q617k862p086m246
1004c654j865Q99P535Q041k420j2253q750N205J3361P587o353j4868o120Q973
1018d682J2754J622p800o697j616P18M726Q087J578r605j0114K82J0608R601k45
1033I217j1294j1583K397J4116Q640o794j0324k524K866L487N332M476m498j1138
1047g624m370Q687J1479K090q302j0490k814R116J2122O75j0581p901K017N802
1061i4L868L614j81q274r134L533J3839O989o956j2370m987O416J2106M635q017
$$ plain form
961 -12531 -12687 -1776 4062 4758 4225 -1103 -9727 -10834 -180 9898 8582 -1769 -10887 -11646 -1420
976 -1420 12615 12880 -2902 -14108 -7884 5267 9829 5860 1039 -4185 -8577 -3187 8794 13388
990 13388 4303 -8721 -11448 -1640 10864 14093 2893 -10713 -10604 1923 10540 7678 592 -3654
1004 -3654 -5519 -4620 2915 10956 8536 -3717 -12467 -7262 6099 13686 7333 -7535 -13655 -4682
1018 -4682 8072 9694 1894 -4803 -6419 -5701 -975 7112 8690 -915 -11029 -10747 -139 9462 9217
1033 9217 -2077 -13660 -11263 2853 11493 4699 -5625 -8149 -5283 -1796 3536 8012 3514 -7624
1047 -7624 -11994 -3307 8172 10262 1960 -8530 -11344 -2228 9894 10569 -12 -7913 -5896 -94
1061 -94 3774 7388 7207 -1067 -10201 -6668 7171 14160 7204 -5166 -10153 -3737 8369 13004 4987
1076D987j1146j477P397N841J63j051k606p241l846Q103J1152R0j1586r669J868
1091i021J0857Q752k472j1419p300L939R344L303k164l856n021m338L629J1248
1105E481N279q732j2723j241R570R944Q81q689r402l84Q742P239j166m561l961
1120c723l356M79P860R096l018j3317o826P662J2186L595o678r498l478O332R369
1135F685J817n407n169j786L86K975P949L776q816j1871Q14J2755Q679m253j0736
1150b202o026L425R086N333l665p749l099J438L072M619L832l014j0667n217P928
1165b906J1938O45r137q685j98P341P047M09o094o347j306M233M904L640q58p894
1181c268q551L011J3180O955q166j2319k318Q214Q380J269m884o387k324L339
$$ plain form
1076 4987 -6159 -7636 -239 5602 5765 4714 2108 -5133 -8979 -876 10276 10366 -1220 -10889 -9021
1091 -9021 1836 10588 8116 -3303 -10603 -6664 2680 5983 3819 -37 -5058 -9396 -5767 5481
1105 5481 10760 2028 -10695 -11936 -2366 7578 8459 -230 -9632 -10016 -1274 5965 4799 238 -3723
1120 -3723 -7079 -6600 1260 10356 7338 -5979 -12805 -5143 7043 10638 3960 -5538 -9016 -2684 6685
1135 6685 8502 3095 -2074 -3860 -3474 -499 7450 11226 2410 -9461 -8647 4108 12787 8534 -2202
1150 -2202 -8228 -4803 4283 9616 5951 -1798 -4897 -3459 -387 4232 8064 5050 -5617 -10834 -2906
1165 -2906 9032 9677 540 -8145 -8343 -1002 6045 6454 360 -5987 -7293 -3060 1844 5484 4626 -3268
1181 -3268 -11819 -8808 4372 11327 3161 -9158 -11476 -3262 5118 6387 1503 -4884 -7208 -3869
1195c869M915L142M17m134p211k468P993J1230p05j1979q138M563J0379N005l971
1210E169p006m016J571O227M056n3l722m705m003L769R639M701p929j1316o78
1225h296R802P670j219o604o101l90M764N802J127l442m910l975N83P279Q037
1240A0127l083j2777o335Q172J0762J124p110o327j082L016N296K974k001m813
1254b057l795q83M290Q001K847q923j0756J422J2370P651n906r255k894L705N175
1269I92L527j85m931m732p25M310N301K935l571q172m526O898J0852J016r447
1284d58p228K353O372L779M81k449m706l858K399O916M963k294q259n511L202
1299d298J0383M723o154r972k056P056N635M86l661l245k788j15M022N609R36
$$ plain form
1195 -3869 1046 4188 4605 471 -6740 -9208 -1215 10015 9310 -2669 -10807 -6244 4135 9140 5169
1210 5169 -1837 -5853 -4282 1945 6001 5948 2226 -2479 -6482 -2713 6926 11627 3698 -7618 -8296
1225 -8296 1506 9176 7957 1353 -4748 -5138 -374 5428 6555 3113 -1797 -5772 -5189 2090 10127
1240 10127 7044 -5733 -12068 -3896 6866 7990 880 -5447 -6529 -3513 1783 4757 2756 -2057
1254 -2057 -5852 -6735 -2445 5556 8403 -520 -11276 -9854 2516 10167 4261 -4994 -7888 -4183 992
1269 992 4519 4334 -597 -5329 -6054 -1744 3557 6492 2921 -5251 -9777 -2879 7973 8989 -458
1284 -458 -7686 -5333 1039 4818 5299 2850 -1856 -5714 -3315 3601 8564 6270 -1989 -7500 -4298
1299 -4298 6085 10808 4654 -5318 -7374 -318 5317 5803 2142 -1103 -3891 -4006 16 5625 6561
1314F561n676q051j003Q569Q957k382j0476n839M642P613K802k917m714l484O45
1329d753L550M249J652l141o109l946L760J0387L444q602r749J281R038M690k425
1344C326l623k752j975J848N776L535k976o101l244J739O952N820k439r989n403
1359i506O730R408L30o495l426N97k56J674N389J852n563o917L82O520O062L68
1375G149p102p196L74R493O758m134r034j501M073K612J080J968p46o496m519
1390g221M365Q574K140o418p613j534O117P366M92o388o114P72M895L314L27j566
1406A508k936m412Q9O694O378k358r248n004N114R112K405n390o651n63M156K999
1422A893K056r22k942m109p56M242N908J110n545p406p71Q626P846k603r840l700
$$ plain form
1314 6561 885 -7166 -8169 400 9357 6975 -3501 -9340 -4698 2915 5717 2800 -1914 -5398 -4753
1329 -4753 -1203 3046 4698 1557 -4552 -8498 -4738 5649 9093 491 -9258 -7977 1061 5751 3326
1344 3326 -297 -3049 -5024 -3176 2600 6135 3159 -2942 -6186 -4447 2505 8325 5886 -4103 -9506
1359 -9506 -2776 6632 6962 467 -2959 -2362 -2618 -944 4445 6297 734 -6183 -5801 719 6781 7149
1375 7149 47 -7149 -6775 2718 9476 5342 -3692 -5193 -1120 1492 2572 4540 3794 -2702 -7221
1390 -7221 -2856 5718 7858 1440 -6173 -7707 -1590 5776 6268 -120 -6234 -5462 -567 2747 3074 1508
1406 1508 -1428 -5840 -5751 943 7321 4963 -4285 -9289 -4175 4937 7342 1952 -4699 -5262 -1106 1893
1422 1893 3949 3027 85 -4024 -4780 -538 5370 6480 935 -6471 -7242 1384 9230 6627 -3213 -6913
1438f913M828N077M25n17j234l598l338K775O726K808n237o242k076M238O999
1453D721K913n777q476o02Q014M873k668l786n17j686j518M360P200j262r003
1468c214m988N056P467K335l659o368l549L538P613J935n109m428J1J460O09L479
1484B188L987m044q581j759R008P531l064q495l781L274N809K773j332m526k925
1499c937O45L530L150Q30j355n179m066L075Q550L308o356q669L57P216N270k010
1515D359m488k478j96J016L181L652j224n752m501K136P072L931k876p204m677
1530h049L723Q294K459n577n775M32L326J646Q43J783j562o704k147O781P277
1545F750j105p790m794K575N908M259j103o442m384K587O117J372j752q73k544
$$ plain form
1438 -6913 -2085 2992 3417 2900 1666 -1932 -5270 -2495 4231 7039 1802 -4440 -6516 -2278 4721
1453 4721 7634 1857 -6619 -7221 793 5666 2998 -788 -1305 -2991 -4509 -149 7051 5789 -3214
1468 -3214 -8202 -3146 4321 6656 2997 -3371 -6920 -3382 4231 6166 1057 -3371 -3360 -1900 -1291 2188
1484 2188 6175 2131 -6450 -8209 799 8330 5266 -3229 -7010 -3736 2073 4846 3514 -1012 -3937
1499 -3937 -3292 238 3388 4218 2863 -2316 -6382 -3307 5243 8551 2195 -6474 -6117 1099 6369 4359
1515 4359 -129 -2607 -2803 -1787 1394 5046 3822 -1930 -6431 -4295 2777 6708 3832 -3372 -8049
1530 -8049 -4326 3968 6427 850 -4925 -4493 -1167 479 1322 3105 1543 -5161 -7308 -527 6750
1545 6750 5645 -2145 -6939 -4364 1544 5803 4700 -1742 -6126 -3539 2578 3950 2198 1325 -1219
1560a219l336O13P855M505n764r077k91P724M948j298m685l654j06L016M854M86
1576D571l358l091r46K45L208N330k67p600o440M718R075J697o096n456M49L273
1592f88K834J277r78l449k887K45L441M556O58m956n738n75O995O140k481p541
1608c147l702L955M901J553k312k335k115q00J327M732K955l453o717j877N131
1623a904O936M92o081n001M80N521M195r00m085k007jJ751J968K966K79n039n540
1640e970K172Q499L219n158o623j166M617M032N08k158l816j684J791L151J759
1655C173K16k921m175j833N392P164j228q217m328L875O235J615l521k611j276
1670b440p0K576K987N20k685m038j826K673N784K471m816p150l30O687N148k749
$$ plain form
1560 -1219 -4555 -3942 3913 8418 2654 -6423 -6714 1010 5958 4660 -25 -3679 -3785 -769 4085 4571
1576 4571 1213 -1878 -2824 -2579 629 5959 5692 -1908 -8348 -3630 5445 7142 1046 -4410 -3961 -688
1592 -688 2146 3423 2445 -1004 -3891 -3646 -205 4351 5009 53 -5685 -6260 735 6875 4394 -3147
1608 -3147 -6849 -2894 2007 3560 1248 -1087 -3202 -4002 -2675 2057 5012 1559 -5158 -7035 -1904
1623 -1904 5032 5524 -557 -5558 -5078 443 4638 3738 -347 -2354 -2355 -604 1364 4330 4609 -430 -5970
1640 -5970 -3798 4701 7920 2762 -3861 -5027 -410 3622 4130 1972 -1844 -3528 -1737 1414 3173
1655 3173 3389 468 -3707 -5540 -148 7016 5788 -2429 -6757 -2882 3353 4968 1447 -1164 -2440
1670 -2440 -2510 66 3053 3573 888 -3150 -4976 -2303 3481 5952 1136 -6014 -6344 343 5491 2742
1686B742m818k093J673J729J829J559q36l869k706J180N243L780k344o450l653
1701g034M411O854J080m979m086J05K774J927J218k28k245k923o42L721M936M64
1717E353n924n154J798P173L665l689n398j037K939K717J020l66j961k706j184
1732b754J933M121J896l318o108j895N816N769j082n961l893K642L712J028m70
1747A436r44k311j878J352L683K680j288n048l170K700O394K263m236o194k0M433
1763a48K834o18j957j262j748l12K747L285M62l945m601N07N464M846k381o056
1779b883k844L751N006P47k573k029q79k94J565K550K058k268m793j774M074N062
1795D476J051n287n069J232N253L021k044l592o09L10N77K363K318p46m000l104
$$ plain form
1686 2742 -2076 -4169 -2496 -767 1062 2621 1785 -2084 -4790 -3610 1633 5413 3069 -3381 -7034
1701 -7034 -2623 4231 5311 332 -3754 -3649 -875 1052 2270 2042 -203 -3126 -3768 -47 4889 5353
1717 5353 -571 -5725 -3927 3246 6911 3222 -2176 -3213 -274 2443 3463 3097 1136 -1570 -2754
1732 -2754 -821 3300 5196 1878 -4230 -6125 -309 5460 4378 -1583 -5476 -2834 878 1906 1436
1747 1436 492 -1819 -3697 -2345 1338 4018 2730 -2318 -5488 -2788 3606 5869 1633 -4561 -4581 -148
1763 -148 2686 2068 111 -1151 -2899 -3211 -464 2821 3283 -662 -5263 -4756 708 5554 3173 -2883
1779 -2883 -5727 -1976 3030 3777 1204 -825 -1704 -1998 -433 2117 4175 1907 -2886 -4660 -586 4476
1795 4476 5527 240 -4829 -3597 1656 4677 2633 -959 -1568 -1258 -681 1682 4000 3254 -746 -3850
1811c850J524N524K774l186n853j540L928N117q01l613k603K38J411J218J708
1826A996Q4k716m174J62M552M140j585m967l522K426N399K259l079l742j25J702
1842a190K058P04Q18p79l382k100K803M660J166m260m834j61N020M001j504m713
1858a693k105J841K341J133q1k70j818k718O20M337L204j993n408k210L627N379
1874D186Q63m271l572J38L438J662j2q61j348k279p27L025M019R9n343l706J431
1891c258N247L016k690m580j362K358L218M44j601o47j166j580J268L261K293
1906D221k977n409p82M610M601j134m907k475J014M247J040r76k329o26p05L36
1922b251K469K983q53m546k911K934N306J823l583m740j52L715L098m89k320j389
$$ plain form
1811 -3850 -2326 3198 5972 2786 -3067 -4607 -679 4438 3637 24 -2579 -2341 -930 288 1996
1826 1996 2080 -636 -4810 -4648 -96 4044 2459 -2508 -6030 -3604 1795 4054 975 -2767 -2892 -1190
1842 -1190 868 1572 2390 1611 -1771 -3871 -1068 3592 4758 498 -4336 -4497 523 4524 3020 -1693
1858 -1693 -3798 -1957 384 1517 1436 1166 -652 -3370 -2750 1587 4791 2798 -2610 -4820 -1193 4186
1874 4186 5049 778 -2794 -2656 782 2444 2432 1571 223 -2056 -2783 242 4261 4360 -983 -4689 -3258
1891 -3258 1989 5005 2315 -2265 -3627 -1269 1949 2393 792 145 -1021 -2601 -1333 1928 4221
1906 4221 1244 -4165 -4947 -337 4264 3130 -1777 -4252 -3238 1009 2049 1073 -1256 -1882 -2587 -2251
1922 -2251 218 3201 2348 -2198 -5109 -2175 3131 4954 1371 -3369 -3521 194 3292 2803 483 -906
1938i06l51L27J202K308P36l229l956J50N180L344k531m859j691K346M097J052
1954C219k499k263j04M40R80J041J904n07m314k115L532N065J84n222l360J579
1970b440L890J918j104k682j785R25J418R90Q76q20j960k617M12M331L105k628
1986A829n453p94L851L664p84k553k078Q7J250J512J247Nk246k300M7K703L374
2003C361k79m714k923K058M780J809k929l024k51J909Q53M81O35k79k475j692
2019b680J781L950R36l101m502R5M597K941j322l501k477J719K796L90p26r70
2035g4m23j309q24K753L328j310m863j772L332L972Rk754k299K78J253K563K02
2052B062j155j840n17P0J357K382J152l038m462R02N254K659l567l754J08K267
$$ plain form
1938 -906 -1257 -930 272 2580 3316 87 -3869 -3719 1461 4805 2274 -2585 -4276 -1930 2167 3219
1954 3219 720 -1543 -1647 -1207 -227 814 2718 2211 -2103 -4218 -686 4379 4563 -659 -4019 -2440
1970 -2440 1450 3368 2264 -418 -2203 -1278 140 1130 2006 1186 -774 -3391 -2979 1352 4457 1829
1986 1829 -3624 -4418 -567 3097 2313 -240 -2318 -2231 -981 531 1778 1783 -463 -2763 -2716 -13 3361
2003 3361 3082 -1632 -4555 -2497 2283 4092 1163 -1861 -2112 -203 650 1131 1766 1487 -988 -2680
2019 -2680 -899 3051 3987 886 -3616 -3521 1076 4017 2695 -806 -3283 -1564 1232 1622 896 -74
2035 -74 -497 -1806 -2630 123 3451 2141 -2722 -4494 -1162 2810 2819 65 -2234 -1956 -703 1860 2062
2052 2062 907 -933 -1450 -1380 -23 2359 3511 473 -3989 -3087 2167 4826 1259 -2495 -2387 -120
2068a20J235K22l02q78j608m23J216K015J410j491l103k178K802M700O30m962
2084h35l363K867L356K01j943p80L19p87l78K177J733p84k939j674J306L406J897
2101C779k483l653p71L111K871n31k834r93Q47m85P57J797J217k197l919L09L636
2118D58L207k230l892j037K282K444K91r03j558q52Q53Q74O62R39k27k184k613
2135c486J824M762J075l809m324J533M233J464k353j680J76j86P31R35J049o97
2151A247j618r72j49K196K687n60m123k500K918M059k09l411j611J282O97r4R51
2168G90R29j480k830K84K826K001o59k698k027O57L275K293k001l245l29K557
2184C43P19p59K30J052k015k334R29L954J392k938l927L63L130K937j287k760
$$ plain form
2068 -120 1115 1337 1035 157 -1451 -1874 -658 1357 2767 1276 -1827 -4005 -1203 3497 4127 -835
2084 -835 -4198 -1331 2025 2226 283 -497 -178 -965 -1343 834 2567 1783 -1156 -2830 -1524 1882 3779
2101 3779 1296 -2357 -3128 -17 2854 2323 -511 -1504 -657 -1142 -385 1412 2629 432 -3487 -3178 458
2118 458 3665 1435 -2457 -3494 -1212 1232 1523 620 -938 -1790 -937 -63 599 1538 1311 -873 -3486
2135 -3486 -1662 3100 4175 366 -3958 -2425 1808 3272 919 -761 -585 -771 -40 895 1944 1247
2151 1247 -371 -1343 -1492 704 3391 2831 -1292 -3792 -874 3185 2976 -435 -2046 -764 -67 -161 790
2168 790 1719 239 -2591 -2307 519 2520 1861 -837 -2864 -2207 1068 3361 1360 -1885 -2214 343
2184 343 1062 303 533 1585 -430 -2764 -1835 2119 3511 573 -3354 -2991 139 3076 1789 -971
2200i71k186J370K245P27r07r17L09n72p60J061K995M40l917k979K838L989Q10
2217C575l114k131Q7J787J478O7n81j614p11L93J342J331J64j826k413k86L281
2234H29K643j395m110o34K667J658o01o32M04j346j448O45L271R59j901l177j004
2251c172K600K766N08l133l097R25L818J460k756j876J195M02p67L55K385N64
2267B177k751k832J612L470J224j883k457j340K127K709N82k438j995N00J542
2282B47m8M15P30j038k866l93L365K895j816l431j120K035K378J52j138p95o23
2299a051M12Q57R68Q67l63k417j584J569L815J102l570l810P39M347J774k630
2315A025k840N45J043N31l29P33N84j768j685K33K442K097r90l286j907J969L713
$$ plain form
2200 -971 -3157 -1787 458 1185 278 -639 -330 -902 -1662 -601 2394 2834 -1083 -4062 -1224 2765 3575
2217 3575 461 -1670 -1583 204 1682 1749 1168 -446 -1157 -764 578 1909 2073 247 -2166 -2452 829
2234 829 3472 2077 -2033 -2667 0 1658 1057 425 829 -517 -1965 -1320 1951 2910 1009 -2168 -3172
2251 -3172 -572 2194 2702 -431 -3528 -2603 1215 2675 -81 -1957 -762 -360 -1127 -772 1613 2177
2267 2177 -574 -3406 -1794 1676 2900 1017 -1440 -2780 -653 2056 2638 200 -1795 -1295 247
2282 247 199 614 1344 306 -2560 -2953 412 3307 1491 -1940 -3060 -1025 1353 1505 367 -428 -1051
2299 -1051 -639 218 1186 2053 1690 -727 -2311 -742 3073 4175 605 -3205 -2466 1881 3655 1025
2315 1025 -1815 -1270 -227 304 -25 708 1292 -476 -2161 -1928 514 2611 1621 -1665 -3572 -1603 2110
2332B110J106l466k483Q91K051O13j73l14n27j578m66K215K363p94k790j559J089
2349a712K757R58j208j994p82J069J595N87k48o44r59j518Q01L329J492k747l904
2366c128K40M334K148j755l142p21J554J466M80r56o81p5k27r79R84K307O27l339
2384h63k600J678M063J388l199l209Q38K589J486r3j828p36m65N38J169R52m78
2401A230j160j907k41K436J947j415k514j141J573J606M60n58p41p62n91O27K141
2418I90J273j759l132p41L289L427j033l765j710K256K400N76j729j365N76L41
2434a06L5n08J568R51j984k462J98L648K302k236l906m10K855K775p38j975j917
2451a910N93J913Q39k79m56p80p69m33J588J908l26k974j410J214K451L48j381
$$ plain form
2332 2110 3216 -250 -2733 -1842 209 822 649 335 -192 -1770 -2236 -21 2342 1548 -1242 -2801 -1712
2349 -1712 1045 2003 795 -1199 -1981 -912 683 1270 1022 378 -581 -2099 -1298 2031 3523 776 -3128
2366 -3128 -2888 1446 3594 1839 -1303 -2024 -470 996 1476 520 -161 -236 -463 -1442 -458 1849 2476 -863
2384 -863 -3463 -1785 2278 3666 467 -2742 -1904 685 2171 2078 250 -486 -951 -413 756 1708 1230
2401 1230 70 -1837 -2078 358 2305 890 -1624 -2765 -1192 414 874 316 -425 -1187 -1778 -1151 990
2418 990 2263 504 -2628 -3369 -80 3347 2314 -1451 -3161 -905 1495 2071 342 -1023 -447 -106
2434 -106 -71 -579 989 1940 -44 -2506 -2308 1340 3642 1406 -2500 -2910 -55 2720 1982 7 -1910
2451 -1910 -1317 596 1435 1156 700 -80 -849 -1282 306 2214 1888 -1086 -2496 -1282 1169 1517 136
2468A36r18o46L84Q32J401M96j348k023p25K028K764L52l087k283Q98L263J308
2485B832k022k424K11J584M28p42K73P34p87j756n29K332J812k96l731j403K258
2502a226L658j4k953k152P66K406Q68r17o35l79J96l00J037J281J59j769j879
2519a853M69K374J368j025k126n76O41J475M56j04j035j336o76J555K005N63k275
2536a00k439M23K912K153j549k994m57K086J485q74r13K07K59o01j075J310K123
2553A956j3k717k247J282L937P89k436l427M17L158J737j099k250j50P15O56j19
2570A89P53Q2q10j216o16J786J551j72k089j447P41J935J084j178j243p01K25
2587a126Q87J451L35j204k327m07K645K269r38k818r78J505K498l19j378o79N65
$$ plain form
2468 136 -782 -1428 -1044 -212 1189 1685 337 -1686 -2411 -383 2381 2733 -354 -2637 -1739 1524 2832
2485 2832 810 -1614 -1403 181 609 -133 140 874 87 -1669 -2198 134 1946 1650 -2081 -3484 -1226
2502 -1226 2432 2418 -535 -2687 -1921 485 1353 436 -199 -578 -382 -682 355 1636 1795 26 -1853
2519 -1853 -1384 990 2358 1333 -793 -1369 -728 747 1203 1099 64 -1272 -1948 -393 1612 2175 -100
2536 -100 -2539 -2116 796 2949 1400 -1594 -2051 35 1520 646 -267 -60 199 -402 -1477 -167 1956
2553 1956 1943 -774 -3021 -1739 2198 2987 551 -2876 -2459 699 2436 1337 -913 -1063 -348 308 189
2570 189 942 1024 214 -1002 -1618 168 1719 1547 -542 -1989 -1248 687 1771 593 -650 -1351 -1126
2587 -1126 -239 1212 1547 343 -1984 -2391 254 2523 1585 -1233 -2211 -706 1792 1473 95 -584 -19
2604a9M76j258K92J805M53j682k106M30K958J548j752l694n58L255K157m24l143
2621a262q57J218J472m0n81K70m67m33n10O37J860K41j809j634L60K310J411j222
2639I64j779n83P03J098Q20j08j079j314p0J416J970j88k109j431O30K462M62
2656A864j347j608p1J212N20n89L7P39k99j863o13K529K197j230l433p55J998
2673g12L320j54k873k014J273K106Q63j596j257N58O46p18k2J165R19j234j824
2690a554j63K545J288j357j505r08Q01J720N60o92j340n88J09J162J344k35j460
2707b73j426L19K108J477j339k020j20J036J248q08k89L33j0o54j044J383J822
2724A743N3k607j547J304L083M33j982k944Q14K676J669j932j928L41J458J77
$$ plain form
2604 -19 457 -801 -509 1296 1749 67 -2039 -1609 1349 2897 1145 -2549 -3107 148 2305 1881 -1262
2621 -1262 -2119 -901 571 531 -50 220 -247 -680 -1190 -553 1307 1548 -261 -1895 -1535 775 2186 964
2639 964 -815 -1398 -695 403 1223 1115 36 -1278 -1348 68 2038 1850 -259 -1690 -1060 1402 1864
2656 1864 517 -1091 -1162 50 570 -19 18 757 458 -1405 -2018 511 2708 1478 -1955 -2710 -712
2673 -712 2608 2454 -419 -2433 -1160 946 1809 213 -1044 -486 160 -558 -580 585 1504 270 -1554
2690 -1554 -1717 828 2116 759 -746 -1654 -853 867 1427 735 -605 -1193 -1084 78 1422 1187 -273
2707 -273 -1699 -1380 728 2205 866 -1154 -1274 -238 1010 202 -87 246 236 -418 -1462 -79 1743
2724 1743 1796 -811 -2358 -1054 2029 2462 480 -2464 -1650 1026 2695 763 -1165 -824 634 811
2740H11j412N09J385n80j773m59J448J723n13j940j122O47J997Q41j140j427p91
2757a796J591Q34l01P4k82j142m32J324K032p80k412n47J854J146m61q18j84R8
2775b02l49n1O44O40K43q72j724J2K816J512j982l037k61L268J484j101k621k0
2793a601J750P19o25m02M24K33p49m73L43J119N91p90k054j14K282J433j398k204
2811a516K01J587R02m46k48l82m83k60R18J054k22j352p84K52J209N05m74j117
2829f56l2j14Q69o4r4N4K1r30o37J647K108j148k851o26K393K128o89k502n28
2848a651J205J235J34j232m42N05N77m07o89Q01J454n57k425k92K251J984j485
2865I66k371j06J520J174q90j50n51j57L77M23M72o35k09l28j56N72J363j53j471
$$ plain form
2740 811 -601 -92 1293 713 -1060 -1519 -71 1652 1139 -801 -1923 -1276 721 1562 422 -1005 -1796
2757 -1796 -205 629 328 402 120 -1022 -1454 -130 1902 1122 -1290 -1837 17 1163 702 -116 -300 -202
2775 -202 -551 -602 42 682 925 53 -1671 -1659 1157 2669 687 -2350 -2611 657 2141 1040 -1581 -1601
2793 -1601 149 868 243 -159 265 498 -251 -724 -381 738 1329 539 -1515 -1629 653 2086 688 -1516
2811 -1516 -1315 272 1174 728 480 98 -385 -645 273 1327 1105 -247 -1031 -779 430 935 461 -656
2829 -656 -688 -802 67 3 -91 -37 -16 -946 -1583 64 2172 1024 -1827 -2453 -60 2068 1379 -1123 -1651
2848 -1651 -446 789 923 -309 -751 -246 331 -76 -765 36 1490 933 -1492 -1784 467 2451 966
2865 966 -1405 -1511 9 1183 293 143 -408 -565 -188 235 707 72 -137 -465 -621 -49 1314 1161 -310
2884c10p05N60J673n48p03L4K70m70p77J115J583p44j839j075J305J959J29j726
2902b69j797N13K064J177j619j304M86J307Q8j545N41J390k14k045p90J799J765
2919A547k74k090j125J532J035P59j485j038k2J040R81m69n30L26j81p25L82J031
2937F94P38j385j333O54J214L34r38j71N6j85r1P77O70j98j530m70O72J145Q72
2956A525r53k066j26K061J469j033j708m58J552M13j052k77J167J44j138q63J042
2973c01J350R4j038j750O01J888J032j206k227K5K101Q70j344k41J26j87j54l70
2991g31J264O48j397j051J13J364L98l12l86r19K71J037L03j55m68l28j57k76
3009g82J096J143n16k014j035K080J911l74k221q15J564Q11l84r80L59N53l59
$$ plain form
2884 -310 -1015 -455 1218 670 -33 1 271 -199 -976 139 1722 978 -861 -1936 -631 1328 1457 -269
2902 -269 -2066 -1553 511 1688 69 -1235 -749 558 646 -899 -358 1032 818 -1227 -2017 -218 1547
2919 1547 1273 -817 -1942 -410 625 1384 -101 -1139 -1161 -121 860 391 -139 187 6 -719 -337 694
2937 694 1432 47 -1286 -632 582 916 -22 -193 -137 -322 -413 364 1034 836 -694 -1164 -492 653 1525
2956 1525 572 -1494 -1620 441 1910 877 -831 -1289 263 676 -376 -653 514 658 -480 -1343 -301
2973 -301 1049 1143 105 -1645 -1044 844 1876 670 -1557 -1532 569 1439 95 -146 -20 -207 -361 -731
2991 -731 533 1181 -216 -1267 -1154 210 608 296 -90 -1009 -738 299 602 447 -21 -349 -506 -782
3009 -782 314 1457 941 -1073 -2108 -28 1883 1509 -712 -1527 37 848 464 -516 -157 396 37
3026C7m32K46O40J038j154j427l47J540J992j018k482q6J664J588j071j315J91
3043c96J92j15J2N38N69n61r12j78N45J267J67j075j391L93J420N44p44o68J24
3062b69R5K45oQ53l1j399j111R55J914Nj505j260O12J334N48n65r28%N43L0n66
3083e06L09P78J5j371o60J158K267p47k477o20J393J842%j570p39L83P39L26k39
3102B81k89L38l71o09J16J227Q57j358j374r5J825R40j095q71m13N01M85J89J68
3121D52np89o21M54J313N91o22j830n38J706J512o16j684o86J111O43j45l35M0
3140d9O60q98p77O82J487M11j808j127N03J592R12j257j549n6J653O51p27m66
3158a63J08j15k68l14R72J154q82j570PJ094J194n69j001q20K20J383J28l46j82
$$ plain form
3026 37 -395 -149 491 1529 375 -1052 -1399 141 2133 1115 -1367 -1453 211 1799 728 -587 -396
3043 -396 -204 -319 -307 231 800 239 -673 -851 -306 961 1128 53 -1338 -945 475 1019 275 -393 -269
3062 -269 -174 71 65 918 887 -512 -1623 -668 1246 1251 -254 -1514 -902 432 980 415 -513 -513 30 60 -506
3083 -506 -197 581 596 -775 -1435 -277 1990 1243 -1234 -1854 -461 1381 1381 -189 -928 -545 194 520 281
3102 281 -8 330 -41 -650 -534 693 1550 192 -1182 -1277 548 1488 393 -478 -891 -390 95 284 452
3121 452 447 -342 -963 -509 804 1395 773 -1057 -1595 111 1623 1007 -677 -1363 -252 391 246 -89 -49
3140 -49 611 -287 -1064 -382 1105 1516 -292 -1419 -916 676 1588 331 -1218 -1274 379 1030 303 -163
3158 -163 -55 -170 -438 -752 220 1374 492 -1078 -1071 23 1217 648 -353 -1173 -953 430 558 212 30
3177C0k14n79O35K49P58l17j156q27R46J587J93j481j182P56J330j15o52l34K76
3196i7J33o68P7J268N33j159j031m02J834Q60n62k244q8J561J160n67q38n53P65
3215a8J75j3n5M81L0p27r54Q28J358O5j345j028M84J301L99o99p36K4K72lL23
3236A62K98R3p37p28N18J292N69j473j251K86J072Q74p92q51M2K98M46k74R1O04
3256E39n58o61k08R28R76R3j781p07P30J601J55j221r93N18J183j80n28L96j83
3275I9l26l41K55J112L01o44j390N6J508L91p16j084k0P45L85J9j30j54R5m26
3295b65K26N4J000m73j307m38J075J132j27j102n84M69P59J72n44j75K21l46o33
3314h86P32J265k98j191r33L98J693N93j444p67l1J290L27n19l07j90L17l21j25
$$ plain form
3177 30 -184 -763 -128 121 879 562 -594 -1421 -475 1112 1305 -176 -1358 -602 728 613 -39 -373 -97
3196 -97 36 -632 -555 713 1246 87 -944 -1346 488 1348 786 -1458 -1546 15 1175 608 -230 -783 -18
3215 -18 157 144 89 570 600 -127 -1081 -253 1105 1170 -175 -1203 -719 582 981 282 -454 -430 -158 -161 162
3236 162 460 553 -184 -912 -394 898 1467 -6 -1257 -971 101 975 183 -668 -626 -328 118 -156 -65 539
3256 539 -19 -680 -888 40 1016 1109 -672 -1379 -649 952 1107 -114 -1107 -589 594 414 -114 282 99
3275 99 -227 -568 -313 799 1100 456 -934 -878 630 1021 305 -779 -799 -54 331 350 220 66 161 -265
3295 -265 -39 15 1015 542 -765 -1203 -128 1004 877 -225 -809 -340 419 591 47 -128 93 -253 -886
3314 -886 -154 1111 813 -378 -1311 -913 780 1373 -71 -838 -869 421 748 229 -78 -268 49 -272 -397
3333c97J020K1m00r51n99J375J317o50j360n80Q83Q83qq27j30L28q4j1K79N68
3353F77j34o76o83K45J308K40q66j247M85J148N04j030l03J83r9J90l06R90J72
3372G98n53j307L12J291O79o31j400l10J079J222l31j255k45N38M64l17k14O60
3390D80J99j212m07O62J223j06j062o46L26J336K12p69r39L41J44O31m68K93J97
3409D35l15q90J56Q75O59p76j118n34J594J145j083p80m5O79L58l74OK92k28n89
3429e33l86Q77Q43J21j498n88Q66J354r3j063j119Q73R28k25k77K98k12n28m3
3448d05L09O41J96o93r04QJ201Q92l77j783q0Q30R44l08o89L08k06o9K1K33O11
3469F80m84r19k79J035R72k61j145m69N65O81K88n59n68N65K6n29L12M47L87r38
$$ plain form
3333 -397 623 644 244 -707 -1306 69 1386 736 -624 -1204 -321 562 554 -273 -403 -75 -159 -170 109 677
3353 677 543 -133 -816 -571 737 977 111 -1136 -651 497 1001 -29 -332 -149 -248 -58 -364 626 798
3372 798 245 -1062 -750 541 1220 589 -811 -1121 -42 1180 849 -406 -651 -113 351 34 -180 480
3390 480 679 -533 -940 -278 945 839 -223 -869 -543 793 1005 236 -703 -362 -218 413 -55 238 435
3409 435 120 -770 -614 261 920 144 -974 -1508 86 1231 148 -632 -677 2 360 -14 -8 284 56 -533
3429 -533 -919 -42 801 922 -576 -1164 -298 1056 963 -100 -1219 -346 582 357 80 378 166 -362 -405
3448 -405 -96 545 741 48 -856 -848 353 1245 868 -915 -995 -165 779 471 -218 90 -116 -185 -164 69 680
3469 680 196 -723 -1002 33 1005 744 -401 -870 -305 376 664 105 -463 102 128 -401 -89 358 745 -193
3489a93j175Q19J432L89j551p74M90J314j29l18n45j55J35N8R1K3N47k35j060
3508h37j81R49J044q4j568l57Q13J263o18r37k3N60k47k1K78M79j07p84m94N88
3528b84P04M59o48j259K28J194Q21o88j125M71N48l62j49K15K10l78p11L42N98
3547A86N01l13r71p9O46P77p0p90m06K56O32l55l49N58L04o70n23M07J121n7j257
3568d52q03R45J164j33r08j69J94Q1M15n7l55j07K54n32r3N90P40n75r55P3Q54
3589A71J038p65j367L31N61p0K4K75j36R9k05j06L12K98j61m47n00K28Q37N42
3609I59j101r67Q23R13j36n58j22L25k12q41O05Q27J91r53l18K74K59P10j03r62
3629c87j73N01P39l77q96N79L7K21k95J39M78J46j427k27J182O88l48j045l78
$$ plain form
3489 -193 -1368 -549 883 1272 -279 -1053 -563 751 622 304 -241 -396 -261 -203 -112 -89 458 223 -837
3508 -837 -1018 -69 975 891 -677 -1034 -221 1042 424 -513 -536 24 -223 -244 34 513 406 -378 -872 -284
3528 -284 420 879 231 -1028 -800 394 1215 527 -598 -127 421 59 -90 125 335 -43 -754 -412 186
3547 186 687 374 -597 -676 -30 747 677 -113 -519 -263 369 14 -335 223 527 -143 -666 -259 862 805 -452
3568 -452 -1255 -310 854 721 -187 -356 -162 -81 334 277 -78 -185 69 -463 -556 34 774 199 -756 -683 171
3589 171 1209 444 -923 -592 -31 -101 -77 198 62 161 -44 -150 162 460 299 -148 -648 -420 417 959
3609 959 -142 -1109 -286 627 491 -67 -189 136 -76 -917 -312 515 706 -247 -565 -291 -32 678 575 -387
3629 -387 -560 -59 680 303 -593 -14 23 244 -51 88 566 712 -715 -942 240 928 580 -465 -843
3648h43N65N09k12J72n33j13M26O3k73K68L05M4q84l13J142O67m24j497J75J123
3668C67l5n62J87L0N9k10J13l1L30Q6p61o4L92Q66k56q01o00R90O40l28o84j92
3690d64Q21q7n90J02L35L55l82o36J06Q54R5l59q78m8J055K14o48k65M7M58K94
3711C79m18k0N00j00o29l31O92O99k18j172o4Q15K33K67p28k95L82j44M75l49
3731b6k4M88l45j69k96R09K77q21r70M76J206j14o33o75N59L40k3l65K77J56J14
3752C41m45m36N24M17N1q63l89O13J097n44p47k8M72J86N3l77J58J15l28j04J25
3773a09O11j84p55j24L23O95L07p90p27M36O73J73l82k72L25K07n74m53O61N83
3793F24n36o76r8O68Q33p11n45l59N49P64p4m62n5M42n77J27k02P90q5n46o13
$$ plain form
3648 -843 -278 231 19 191 -342 -455 -29 34 -239 29 334 378 -506 -819 323 990 566 -931 -756 367
3668 367 332 -230 -43 -13 46 -164 -51 -82 248 334 -427 -491 -99 767 511 -290 -890 100 740 412 -272 -464
3690 -464 357 270 -320 -218 117 472 90 -546 -440 414 509 150 -728 -776 279 493 -155 -420 -373 85 379
3711 379 -39 -59 441 341 -288 -619 73 772 554 -618 -682 133 366 633 -95 -390 -8 -152 323 -26
3731 -26 -50 438 93 -76 -372 537 814 -7 -977 -501 705 591 -42 -717 -158 182 159 -206 71 227 341
3752 341 -104 -540 -16 401 452 -411 -800 -187 910 366 -381 -409 63 249 302 -75 83 198 -130 -234 -109
3773 -109 502 318 -437 -561 -238 457 764 -26 -753 -317 356 529 147 -125 200 407 -167 -620 41 624
3793 624 88 -588 -686 -18 815 104 -441 -800 -251 513 439 -23 -78 364 -213 -86 -288 502 417 -129 -742
3814g42P12P52l8r02o14O14M80J7l73n4k17K51k2o6J81J47l63q2k28P07O24o09
3836A75p41NO81M10k64o73K27k45j34J58L87L56j74r0m72M20M36j9p60j14m2J207
3858G34k58m55k74p8M76l6j96L53L73m17p72J16Q54O9m94p53J80P75M08m87o79
3879e61M5N05K79l63J76K27j10k10m39M75O14k83p25j44M51O58Pn81l49Q8J83
3900e7L82n89M1N85n89j19K73N44J50p47p52J31J267J81n36p77L90L27L19j81
3920B43m10K87m1n09j79N36N16k13p79J77K35O29J15p24j31L44K83j25k17j39
3940a02J33m9j70n3M71J22q26j82M63O21M0l49o34O9M81M84k50m26k3L13j41l09
3962c17L37O08j69j011K00M98N37l87l85n31O01L77Q9m50j38K50k42J41J79K87
$$ plain form
3814 -742 -30 722 684 -218 -832 -218 262 279 -94 -148 -365 -114 -136 -202 -21 126 -237 -319 -547 160 784 175
3836 175 -566 -561 120 530 266 -407 -180 -425 -559 -401 -14 342 168 78 -394 26 462 443 -317 -431 -473 734
3858 734 476 21 -253 -331 145 109 -87 266 639 222 -550 -434 420 489 -5 -758 -578 197 605 118 -561
3879 -561 -516 -11 268 -95 81 308 198 -12 -451 24 638 355 -370 -514 -63 595 602 21 -328 -240 -57
3900 -57 325 -264 -223 362 -227 -346 -73 471 621 -126 -878 -747 520 701 165 -612 -222 105 424 243
3920 243 -167 120 79 -430 -609 -73 443 230 -549 -372 -137 492 607 -117 -248 96 379 254 37 -102
3940 -102 31 -18 -188 -241 230 352 -474 -656 -193 428 468 119 -515 -446 35 519 269 -157 -180 133 -8 -317
3962 -317 20 628 459 -552 -352 146 683 296 -89 -620 -19 358 447 -3 -141 109 -133 8 187 474
3982D74q9j32r78N49O64J75p15o10L71L65K04k20m77K37M23k75k86M14J62q7l33
4003a64m56J035k4j58p80M2O49K81k98o42j5O14k20j71qM14J39j61p83M47Q99
4024F40q5m06r16N45O36J15n25k08J97J1J49j91J9K96j44o01j02N47M70k95q73
4045g21L03N44L00kq90K98L15J43n07J81J92j03J94p96M33O23K41q58n83P03M23
4066D33k08j2p87N22J3K03k74l2K56l15n3J39Q3O86o27n28j02N70P89o03n66K42
4088a71L08J4K6n02L57P8j54k07K95K47O7p35l64R29q1J86m14l05J80P96n59k60
4110b69j2O81l32m24M3O85N5m55m99K52M81L6m32m07L81L30J44l11k4j26K53K15
4132B65o70N26l0L46o27j38K15N56p3r87L31K01Q14n93k03j08R0j44J70K88r7
$$ plain form
3982 474 385 253 -725 -176 488 663 -52 -662 -291 74 278 58 -419 -182 241 -34 -320 94 256 169 -164
4003 -164 -620 415 391 233 -547 -505 144 425 127 -515 -530 84 -136 -307 -315 99 238 77 -706 -259 640
4024 640 555 149 -767 -222 414 529 4 -204 -7 4 153 -38 -19 277 133 -468 -570 -23 447 152 -721
4045 -721 -418 126 426 424 -466 -168 147 290 -217 -36 156 53 247 -549 -116 507 748 -110 -693 10 433
4066 433 225 213 -574 -52 -39 164 -110 -142 114 -201 -254 -115 -32 654 27 -501 -603 -33 756 153 -413 -171
4088 -171 137 151 177 -325 32 110 -44 -251 44 291 358 -377 -741 188 107 293 -121 -426 -246 550 -9 -269
4110 -269 -281 400 68 -356 -313 372 427 -28 -527 -275 206 242 -190 -597 -216 114 258 -53 -77 -203 50 265
4132 265 -405 121 91 437 -190 -328 -113 443 370 -617 -286 -85 729 136 -67 -175 -85 -229 -59 229 132
4153A32N2j49n25K38K58O28p07n81K83P43K30o16l11J27R2K64n02L70L13k65j89
4174a15j48O07J25m17k85k28M03N77j85o66j09M05N1p0j34L49J20m53k75L73M75
4195D00J54r52n6J80N62J38o01l01K33L59K61n25j14M95L3o62K93R0O43l84p18
4216d72l9R89mk21k14k31K75J70j50k66K62o9P5k70o1J56L36o63q3M41N15j37
4238C39m73j39K06L84l23j80K75k4J19k65P8L89k02r8m72K7N41K12j18n73j34
4259d31O25N63m90m91J63M14n37P2J43K25J42o43j18L28N13l77l40l38O20K05
4279B48M2k06n91M51J41j7j45J82K58m26l77K2Q60j56n47k04K28M04J2j6m43M0
4301b40L89J82m36K6K63J37p37J11L60L01l46r0n36K65P71n19l40M96j92m8J76
$$ plain form
4153 132 184 35 -490 -252 6 634 -73 -654 -371 372 602 -14 -325 -198 -106 158 -344 26 339 74 -115
4174 -115 -263 344 469 52 -233 -461 -58 519 334 -332 -441 -36 15 -55 -189 160 280 -173 -448 -75 400
4195 400 554 -398 -454 -274 288 426 -175 -476 -243 116 377 -148 -262 233 266 -396 -103 -13 630 246 -472
4216 -472 -511 478 474 253 39 -192 83 253 103 -163 99 30 105 -165 -226 -70 266 -397 -480 -39 476 339
4238 339 -134 -273 -67 317 -6 -186 89 65 184 -81 -3 386 184 86 -386 -359 182 394 276 -297 -431
4259 -431 194 757 267 -224 -61 353 -184 -112 31 256 398 -245 -363 -35 478 101 -239 -577 43 248
4279 248 290 84 -507 -56 85 68 -77 105 363 -63 -440 -418 442 286 -261 -465 -237 167 179 163 -280 -240
4301 -240 149 331 -105 -79 184 321 -416 -305 55 356 10 -80 -616 -351 420 -99 -439 57 -135 -183 -7
4322gQ7o0Q5P1m98J20O33j2l23l25m1N45J63m20k64J37M25k96k30M27J90n10l40
4345d43K54L44J13j69l17n05J031k3J24n71k30L03R8L62o00M68R0j52o41K72O04
4366D12k56m21j74K32P47p4n07r5j88M07J53l42Kr2K77k59R8N7M01j48n41p4M45
4389F0N65m92k90r1K74M53l67n02M80k2rj83J53K85j85m02M6K04K98K55m78m93
4411d41M29o5L37k35l7K83l8l04k11M97L1k49k90M0J72L84j82j79l40K78L22p8
4433A24n88N86j20J38m06m2N17J56j89l46J13N46m16l84j27Q9P82l22k69K8M3
4454h7O7O5n9M6K63m34J48j85J66L60m01m23K87L50k18j96r4K59J69N5l76L96
4476A58j09j51N0J39l39N65M1m42k10L2O04n2o74R6K00K17M3j51J98m3k89N9l64
$$ plain form
4322 -7 80 20 105 176 -322 -202 431 419 96 -229 -270 275 438 18 -246 -109 316 20 -210 217 407 -103 -443
4345 -443 -189 155 268 99 -218 -723 308 285 409 -162 -392 -89 9 371 -229 239 329 177 -464 -192 412
4366 412 156 -265 -439 -207 540 466 -41 -136 -324 83 236 -106 -104 -196 81 -178 -80 -23 378 230 -311 -385 60
4389 60 625 133 -157 -248 26 479 112 -390 90 68 59 -124 29 314 129 -273 -227 -23 275 530 52 -441
4411 -441 -12 -77 260 25 -12 271 233 -71 -282 215 246 -3 -293 -253 -81 303 121 -58 -398 -120 202 124
4433 124 -464 122 2 140 -266 -308 209 365 176 -170 -57 489 73 -311 -438 -349 433 111 -158 -130 -87
4454 -87 -20 45 -14 32 295 -139 9 -176 -10 350 -51 -474 -187 163 -55 -251 -345 -86 83 138 -238 158
4476 158 49 -102 -52 87 -252 313 354 -88 -298 -266 338 286 -388 -292 -92 125 168 17 215 172 -117 -58 -422
4499d22N40L29n43j85P6L19L21k90l92j7K64K14m85L12P5p0l75j9L83M75p7m25
4521Hp4M96p2j00k86k67J54M75j37k90q7K57K5j91R8K38M7k2q44N02L95j49J88
4544C64n65l6L45p9K3M1L6K21p1m37r1K69J49k23l86N20L92n07j8q0q1N31m06
4567h9k04J36M47m93L43k69L78j44j54q6K72lK1p6k49P8L12j28j74o0L53J75m00
4590a4pQ5J60r3n60J69K46L19m44j11j83M40L67Q7o34J05J05J10l13K4L75l0j69
4613C4k94J56K23M87n84m22N16J25j29k74NJ17P1j3M6j89L78j86k60J79L17j52
4635A51j60j6l52L80J43k69m08M60K41Q0l61j52L28J21j47j69qL25J74k21l40
4656b00P2L48n4k30o9n1K87r5j11k1J61J4k23K70J01K33j39n24L32J04N0k49n50
$$ plain form
4499 -422 118 447 -96 -281 -205 114 435 145 -247 -264 0 214 -271 41 116 46 -329 -348 35 510 433 8
4521 8 -66 430 358 258 -28 -295 -141 334 197 -93 -180 77 102 -89 9 247 294 272 -572 -70 325 176 364
4544 364 -201 -237 108 29 52 93 129 350 279 -158 -249 20 169 -54 -440 80 472 -35 -53 -133 -214 317 -89
4567 -89 -293 -157 290 -203 140 -129 249 105 -49 -135 137 134 155 79 -170 -92 220 92 -82 -142 211 386 -14
4590 -14 -21 64 224 131 -429 -260 -14 305 -139 -250 -433 7 374 461 -173 -68 37 147 -166 -142 233 203 34
4613 34 -260 -104 119 606 22 -400 116 241 112 -162 -157 -40 31 18 64 -125 253 67 -193 -14 303 151
4635 151 -9 -25 -377 3 146 -123 -531 -71 170 250 -111 -263 65 186 39 -130 -138 187 361 140 -200
4656 -200 -128 220 166 -64 -133 -184 103 8 -103 -124 37 51 -172 98 199 432 293 -231 101 205 255 6 -544
4679e44K24L09n6J62m29L61r4j41J6N6M53j83k28k12K77L04k62j5l63L57K86J9
4701B97k30j27J3M2k3l5J05K01l44j51J09L13O9j06k95J9L2K67j98m3K8L58m78
4724a77J96J20k02O1m26J37R7L5L69pl62J73K53k09j19OK94k59m0J22L8M6K0l35
4748a69m0L43M6J5l10k33M62mJ21k93P6J00P5l41K20J46j66j27k39NP81l79l30
4771b41PK61P60o76J75l80lJ41l03L56J7J39j6m81L9N5L01k58k47L47K16j71k60
4794b22J19o1M71j93j27n3L65m08j45L4M09l51J05k38J2N48j09k86L3k76L78j21
4816a16L8r3L12N0m06J4K72K88m10j5l2j17L46Jk67j55O13j90n37L17K0oP1r6
4840i8j24P7N05k14m54J44Q3M03l41j33lR7K64R8j90j14k8K05n62L83k3J12k26
$$ plain form
4679 -544 -320 -11 -67 95 -334 27 -67 -208 -192 -136 317 134 -94 -306 -29 275 13 -2 -365 -8 278 297
4701 297 67 -60 -47 -5 -28 -63 42 243 -101 -252 -143 170 239 133 -162 -143 -111 156 -42 -85 -57 301 -177
4724 -177 19 139 -63 -2 -428 -291 -194 -159 210 203 -159 14 267 58 -61 -55 239 -20 -60 62 100 146 166 -169
4748 -169 -209 134 180 195 -115 -348 114 110 231 -62 14 114 189 -152 68 214 48 -79 -318 -313 468 89 -241
4771 -241 -234 27 787 111 286 -94 -97 44 -259 97 114 253 237 -244 -205 -150 151 -107 -354 -7 209 38 -222
4794 -222 -103 -164 307 114 -13 -66 299 -109 -254 -220 189 -162 -57 -295 -283 265 156 -130 -97 -373 5 -116
4816 -116 -78 -171 141 191 -215 -201 71 359 -51 -66 -98 -215 131 132 -135 -290 323 133 -404 -87 -67 -73 -2 -98
4840 -98 -222 -145 360 146 -308 -164 -81 322 -19 -152 -155 -58 206 304 114 0 -28 177 -385 -2 -25 87 -139
4863a39j00L93J57j49m44k45N11P1M5k05j9K30j62j35Q2M30k41K18k41r8L6M09
4885D04j61m49J90n8K51j77j64J97l0n0k75K63J55P8k50nK71j84K14n90J74M9
$$ plain form
4863 -139 -239 154 311 162 -282 -527 -16 55 100 -105 -124 106 -56 -191 -109 321 80 298 57 -41 -5 404
4885 404 243 -206 -16 -74 177 0 -164 33 3 -47 -322 -59 96 174 -76 -81 190 6 220 -370 -196 -147
$$ [...]
8191B3
##END NTUPLES=NMR FID
##END=
