##TITLE=1H_SAV-55(6-07) B
 DMSO-d6, 8 sc, 
 7.7.2020
##JCAMPDX= 6.0         $$ Bruker NMR JCAMP-DX V2.0
##DATA TYPE= NMR FID
##DATA CLASS= NTUPLES
##ORIGIN= UXNMR, Bruker Analytische Messtechnik GmbH
##OWNER= root
$$ XWIN-NMR		Version 3.5
$$ Tue Jul  7 10:20:14 2020 Russian Standard Time (UT+4h)  she@DPX200
##.OBSERVE FREQUENCY= 200.1315
##.OBSERVE NUCLEUS= ^1H
##.DELAY= (6, 6)
##.ACQUISITION MODE= SIMULTANEOUS
##.ACQUISITION SCHEME= undefined
##.AVERAGES= 8
##.DIGITISER RES= 18
##SPECTROMETER/DATA SYSTEM= spect
##.PULSE SEQUENCE= zg30
##.SOLVENT NAME= DMSO
##.SHIFT REFERENCE= (INTERNAL, DMSO, 0, 15.7039)
##AUDIT TRAIL= $$ (NUMBER, WHEN, WHO, WHERE, WHAT)
$$ ##TITLE= Audit trail, XWIN-NMR		Version 3.5
$$ ##JCAMPDX= 5.01
$$ ##ORIGIN= Bruker BioSpin GmbH
$$ ##OWNER= she
$$ F:/spectra/data/she/nmr/H-F/1/audita.txt
$$ ##AUDIT TRAIL=  $$ (NUMBER, WHEN, WHO, WHERE, WHAT)
(   1,<2020-07-07 10:19:08.81 +0400>,<she>,<DPX200>,
      <created by zg, POWCHK disabled, PULCHK disabled
       configuration hash MD5:
       00 E9 B6 7A A2 85 ED C7 34 08 36 98 17 FE 4E 26
       data hash MD5: 16K
       2D F4 10 B2 A1 1B A6 9E 5C EC 66 33 78 0F C4 C5>)
$$ ##END=
$$ 
$$ hash MD5
$$ 98 EA 57 13 EA E3 AD DB 4E 36 CA 2E 73 70 E6 8E
##$RELAX= 
##$RELAX= 
##$RELAX= 
##$RELAX= 
##$RELAX= 
##$RELAX= 
$$ Bruker specific parameters
$$ --------------------------
##$DU= <F:/spectra>
##$EXPNO= 1
##$NAME= <H-F>
##$PROCNO= 1
##$TYPE= <nmr>
##$USER= <she>
##$AMP= (0..31)
100 100 100 100 100 100 100 100 100 100 100 100 100 100 100 100 100 100 
100 100 100 100 100 100 100 100 100 100 100 100 100 100 
##$AQSEQ= 0
##$AQ_mod= 1
##$AUNM= <au_zg>
##$AUTOPOS= <>
##$BF1= 200.13
##$BF2= 200.13
##$BF3= 200.13
##$BF4= 200.13
##$BF5= 200.13
##$BF6= 200.13
##$BF7= 200.13
##$BF8= 200.13
##$BYTORDA= 1
##$CFDGTYP= 0
##$CFRGTYP= 5
##$CHEMSTR= <none>
##$CNST= (0..31)
1 1 145 1 1 1 1 1 1 1 1 1 1 1 1 1 1 1 1 1 1 1 1 1 1 1 1 1 1 1 1 1 
##$CPDPRG= <>
##$CPDPRG1= <>
##$CPDPRG2= <>
##$CPDPRG3= <>
##$CPDPRG4= <mlev>
##$CPDPRG5= <mlev>
##$CPDPRG6= <mlev>
##$CPDPRG7= <mlev>
##$CPDPRG8= <mlev>
##$CPDPRGB= <>
##$CPDPRGT= <>
##$D= (0..31)
0 1.2 0 0 0 0 0 0 0 0.06 0 0.03 0 0 0 0 0.0002 0 0 0 0 0 0 0 0 0 0 0 0 
0 0 0 
##$DATE= 1594102748
##$DBL= (0..7)
120 120 120 120 120 120 120 120 
##$DBP= (0..7)
150 150 150 150 150 150 150 150 
##$DBP07= 0
##$DBPNAM0= <>
##$DBPNAM1= <>
##$DBPNAM2= <>
##$DBPNAM3= <>
##$DBPNAM4= <>
##$DBPNAM5= <>
##$DBPNAM6= <>
##$DBPNAM7= <>
##$DBPOAL= (0..7)
0.5 0.5 0.5 0.5 0.5 0.5 0.5 0.5 
##$DBPOFFS= (0..7)
0 0 0 0 0 0 0 0 
##$DE= 6
##$DECBNUC= <off>
##$DECIM= 24
##$DECNUC= <off>
##$DECSTAT= 4
##$DIGMOD= 1
##$DIGTYP= 9
##$DL= (0..7)
0 120 120 120 120 120 120 120 
##$DP= (0..7)
150 150 150 150 150 150 150 150 
##$DP07= 0
##$DPNAME0= <>
##$DPNAME1= <>
##$DPNAME2= <>
##$DPNAME3= <>
##$DPNAME4= <>
##$DPNAME5= <>
##$DPNAME6= <>
##$DPNAME7= <>
##$DPOAL= (0..7)
0.5 0.5 0.5 0.5 0.5 0.5 0.5 0.5 
##$DPOFFS= (0..7)
0 0 0 0 0 0 0 0 
##$DQDMODE= 0
##$DR= 18
##$DS= 0
##$DSLIST= <SSSSSSSSSSSSSSS>
$$ [...]
##$SUBNAM2= <"">
##$SUBNAM3= <"">
##$SUBNAM4= <"">
##$SUBNAM5= <"">
##$SUBNAM6= <"">
##$SUBNAM7= <"">
##$SUBNAM8= <"">
##$SUBNAM9= <"">
##$SW= 24.9337058887773
##$SWIBOX= (0..15)
0 0 2 0 0 0 0 0 0 0 0 0 0 0 0 0 
##$SW_h= 4990.01996007984
##$TD= 16384
##$TD0= 1
##$TE= 0
##$TE2= 300
##$TE3= 300
##$TEG= 300
##$TL= (0..7)
0 120 120 120 120 120 120 120 
##$TP= (0..7)
150 150 150 150 150 150 150 150 
##$TP07= 0
##$TPNAME0= <>
##$TPNAME1= <>
##$TPNAME2= <>
##$TPNAME3= <>
##$TPNAME4= <>
##$TPNAME5= <>
##$TPNAME6= <>
##$TPNAME7= <>
##$TPOAL= (0..7)
0.5 0.5 0.5 0.5 0.5 0.5 0.5 0.5 
##$TPOFFS= (0..7)
0 0 0 0 0 0 0 0 
##$TUNHIN= 0
##$TUNHOUT= 0
##$TUNXOUT= 0
##$USERA1= <user>
##$USERA2= <user>
##$USERA3= <user>
##$USERA4= <user>
##$USERA5= <user>
##$V9= 5
##$VALIST= <valist>
##$VCLIST= <CCCCCCCCCCCCCCC>
##$VD= 0
##$VDLIST= <DDDDDDDDDDDDDDD>
##$VPLIST= <PPPPPPPPPPPPPPP>
##$VTLIST= <TTTTTTTTTTTTTTT>
##$WBST= 1024
##$WBSW= 4
##$XGAIN= (0..3)
0 0 0 0 
##$XL= 0
##$YL= 0
##$YMAX_a= 284021
##$YMIN_a= -187006
##$ZGOPTNS= <>
##$ZL1= 120
##$ZL2= 120
##$ZL3= 120
##$ZL4= 120
##$ABSF1= 10
##$ABSF2= 0
##$ABSG= 5
##$ABSL= 3
##$ALPHA= 0
##$AQORDER= 0
##$ASSFAC= 0
##$ASSFACI= 0
##$ASSFACX= 0
##$ASSWID= 0
##$AUNMP= <proc_1d>
##$AZFE= 0.1
##$AZFW= 0.1
##$BCFW= 1
##$BC_mod= 2
##$BYTORDP= 1
##$COROFFS= 0
##$CY= 11.3945322036743
##$DATMOD= 1
##$DC= 2
##$DFILT= <>
##$DTYPP= 0
##$F1P= 16.9975609425685
##$F2P= -3.02152046262296
##$FCOR= 0.5
##$FTSIZE= 0
##$FT_mod= 4
##$GAMMA= 1
##$GB= 0.15
##$INTBC= 1
##$INTSCL= 1
##$ISEN= 128
##$LB= 0.24
##$LEV0= 0
##$LPBIN= 0
##$MAXI= 10000
##$MC2= 0
##$MEAN= 0
##$ME_mod= 0
##$MI= 1.114404
##$NCOEF= 0
##$NC_proc= 0
##$NLEV= 6
##$NOISF1= 3.799351
##$NOISF2= 2.8
##$NSP= 1
##$NTH_PI= 0
##$NZP= 0
##$OFFSET= 15.70392
##$PC= 1
##$PHC0= -9794.952
##$PHC1= 15.60086
##$PH_mod= 1
##$PKNL= yes
##$PPARMOD= 0
##$PSCAL= 0
##$PSIGN= 0
##$REVERSE= no
##$SF= 200.130013532006
##$SI= 16384
##$SIGF1= 3
##$SIGF2= 2
##$SINO= 400
##$SIOLD= 16384
##$SREGLST= <1H.CDCl3>
##$SSB= 0
##$STSI= 0
##$STSR= 0
##$SW_p= 3612.71676300578
##$SYMM= 0
##$S_DEV= 0
##$TDeff= 0
##$TDoff= 0
##$TI= <>
##$TILT= no
##$TM1= 0
##$TM2= 0
##$TOPLEV= 0
##$USERP1= <user>
##$USERP2= <user>
##$USERP3= <user>
##$USERP4= <user>
##$USERP5= <user>
##$WDW= 1
##$XDIM= 8192
##$YMAX_p= 0
##$YMIN_p= 0
$$ End of Bruker specific parameters
$$ ---------------------------------
##NTUPLES= NMR FID
##VAR_NAME=  TIME,          FID/REAL,        FID/IMAG
##SYMBOL=    X,             R,               I
##VAR_TYPE=  INDEPENDENT,   DEPENDENT,       DEPENDENT
##VAR_FORM=  AFFN,          ASDF,            ASDF
##VAR_DIM=   8192,          8192,            8192
##UNITS=     SECONDS,       ARBITRARY UNITS, ARBITRARY UNITS
##FACTOR=    0.0002004,     1,               1
##FIRST=     0,             0,               0
##LAST=      1.6414764,     0,               0
##MIN=       0,             -187006,         0
##MAX=       1.6414764,     284021,          0
$$ Real data points
##PAGE= N=1
##DATA TABLE= (X++(R..R)), XYDATA
0@%%%%%%%%qJ6j6J6k1K9l2M0m9N7p1Q5j00J16j34J57j80K05k36K69l07L48l91
31b07M42m98N57o25O98p75Q62r58J062j176J302j442J598j770J961k175K418k694
49a420L011l380L814m336M976n787O847q302J0449j3950K0897n8157J97215Q8079
63B39956k81805j25393J00298J10887o703K2747R616p5640p6748P0125J09234
74I6574M544q1641m8808r164J7176M2878M9366o080n6676n8029j0965N0070Q2208
87G1453J8181q5972q9935K7377R8463L8258n0071n7320j6543K1454M7252M0894
99F3491j6494o2103l4473K6969L6905O082q192j446j0499k8439j5765K6262N2072
112C4370J7726n3581p0486R096R0573N0858o1091q6111J569O2620L0476j0924
$$ y = [0, 0, 0, 0, 0, 0, 0, 0, 0, -8, 8, -8, 8, -13, 16, -16, 24, -25, 32, -39, 46, -54, 62, -72, 85, -95, 110, -126, 143, -164, 184, -207, 235, -263, 294, -331, 367, -408, 454, -504, 558, -618, 684, -758, 840, -930, 1031, -1144, 1274, -1420, 1591, -1789, 2025, -2311, 2665, -3122, 3725, -4577, 5872, -8078, 12819, -45338, 151877, 239956, -41849, -167242, -66944, 43943, 37240, 59987, 69603, -6037, -82785, -12660, 96574, 101118, 19477, -29331, -38495, -21319, 21559, 70925, 64845, 8169, -49860, -60825, -10755, 71453, 89634, 3662, -86273, -58896, 39567, 77825, 27754, -29566, -46109, -24655, 22597, 63491, 46997, -15106, -49579, -22610, 14295, 20377, 12185, 10739, 240, -28199, -43964, -17702, 34370, 52096, -1485, -71971, -62875, 27698, 78556, 17465, -68646, -67077, -4457, 26019, 15095]
124A5095q962j1643k8874m830M1232L1575j6655k5298n310j0011p636L6546M5686
137E0915k9047p9146j7226O6771N6972q335m1918l9931j4576L7577O3628R614
149E5298n5264l7635K3006L2984O934J531k539k2391j6275K0779K7115n30q150
162B4863n558k9337l0634L2216P1145P974p3220n7874J7713N3516L7065m772n2919
175i822n4344J6647P4385K8285n2007m8251R732K5387Q057J4786J5549k3905m3722
188c9223k923L8710L0062K645j4630l3969l0371K2482O4399J9462n6987n7061
200e7404J1252N3121L1619j0220l7414l1794M930L7976K6905r744k2533j2005
212a5311l403O710K3325J5343j6924k6623k102J4158J0277J2272Q708k2767m1947
$$ y = [15095, 6133, -5510, -34384, -39214, 2018, 33593, 16938, -8360, -13670, -23681, -31317, 5229, 50915, 21868, -57278, -74504, -7733, 49239, 40904, -1014, -40945, -55521, -17944, 45684, 55298, 34, -37601, -14595, 18389, 25323, 26854, 24315, 1924, -14351, 6428, 33543, 33013, 24863, 19305, -10032, -40666, -8450, 62695, 70669, -2551, -60425, -42712, 10804, 47869, 43097, -9822, -64166, -47519, 26866, 55151, 3144, -45107, -35375, -9988, -1931, 12855, 28404, 4499, -39223, -42146, -3436, 26626, 29271, 14641, -19328, -49699, -27217, 37182, 56644, -343, -57404, -46152, 6969, 38588, 28368, -9046, -40840, -35910, 2066, 28971, 19227, -3306, -15311, -18714, -12004, 11321, 26664, 9740, -16883, -18985, -4827, 5450, 17722, 26430, 3663, -38284]
225c8284M30N3990L6436k5368m7843j5117K1752L1965J6838j6906l3086o098K7317
238F026J6326j3236q444R531l957j9876L436L0551J4596j9418k7680j3184R450
251a5879L3234K8351k1758n5700j5728M3637L7391j4184l2420j2367L635J0965
263a0823J9881Q836k2213k6298N990K2673P376k121K171o168j9704l075K3319
276a56K0535l940j6911j6508n766J9075L3891L602l9927l0676J8835L8925J0757
289C1736j7526k1749j1193O255K2204J3428j2791j6985M96M651m779N347J9362
302A8456O2k9804j8328K0839L0612N011j9197k3475j1648J6199L3613J1499k8194
315E645l0301N247K2986R355k386m473j0439j0347O722J8326M695r819q766o288
$$ y = [-38284, -37854, 16136, 52572, 27204, -20639, -35756, -14004, 17961, 34799, 17893, -15193, -21291, 6026, 22352, 9116, 672, 10203, 6246, -13630, -10194, 20357, 34953, 15535, -12145, -25329, -15879, 17355, 45706, 23948, -31752, -47480, -3843, 33548, 19364, -13056, -25423, -21788, -10823, 9058, 17894, -4319, -30617, -24627, -1954, 5422, 3301, 5472, -696, -20400, -23475, -156, 20379, 16439, -472, -16980, -22746, -3671, 30220, 33822, -6105, -36781, -17946, 20979, 31736, 14210, -7539, -18732, -12477, 9727, 23155, 10364, -6621, -6125, -1474, -6253, -906, 18456, 18518, -11286, -29614, -8775, 21837, 26848, 7651, -15824, -27472, -11273, 22340, 33839, 5645, -24656, -19409, 3577, 12932, 10546, 6073, -4366, -14713, -7991, 10335, 15030, 5211, -3555, -9843]
329i843m758J0827K4342M023k8930k4435Q697K4995J3893l354j7479k3698j275
342b6995K9805K4230j5034l0745n902J6755J3929M147l056j2581j1111N912J3668
355C022L471k115K869n349j7772k418K7396K1658j6289l0794o067K0910K2496
368B1018N555j7105k4727m102K2882K0758o214j7688o107J315O73P585J0879l752
382A0970j6154p500P167R195M567J902r229j8548j940K1849J6919r129k0255p946
396a8132M247R342J4918O013j7227k3113M291K6444J0828j3459j3069J052L628
409d237K797O301N087n080j0733n002L520J1646J3073l090k3903j6625J6183K7847
423A7784K604k0890j5228J961J1087J1670L876j0624j4029J203J1302M475l52
$$ y = [-9843, -14601, -3774, 20568, 24591, -4339, -28774, -20077, 4918, 18811, 15457, -2022, -25720, -26995, 2810, 27040, 12006, -18739, -24641, -7886, 6043, 10190, 7134, -5447, -16558, -10646, 3022, 6493, 4378, 7247, 1898, -15874, -18292, 9104, 30762, 14473, -16321, -22388, -1478, 21018, 26573, 9468, -15259, -19361, 3521, 24279, 18065, 377, -5730, -4415, -3742, 3843, 14722, 10970, -5184, -12684, -5517, 3678, 8245, 10147, 918, -17630, -19570, 2279, 19198, 10069, -10186, -18132, -13885, -4543, 10375, 16388, -839, -23952, -19661, 6783, 17611, 4152, -8917, -7865, -4237, -1440, 4861, 9948, 4868, -5865, -10867, -7347, 4299, 17372, 14282, -9621, -26246, -10063, 17784, 20388, -502, -15730, -13769, -2682, 8988, 12864, 2240, -11789, -10586, 716, 5191, 4839]
436D839K984l775j3457l674J7001J4800o540j4648n302K354O716J3019M647j6278
450B686j7983M996J8337Q506n146j0479j1941l853J5758J8359o305k1241n746
463a4052J1366N774k077K893J590r989r241N596J3513M748n800j1917j0705L981
477a4320K0551J2603j5151k2874j773J7229J2311j388p177q551m819O564J1971
490E176M143o420p019k816O74O968J1391J220j4038j1479N570J4009O671l381
504A0669q866r687j791J2516J3509l542j5333r021M550R788P252M64j0149j1557
518a1198O45J3650Q325n909p099r71j335l60P885R584l866j3742o598O895J2549
533H455O495n929j6051r026J1531J7764l32j4487q395K747L491L441N679p97j0459
$$ y = [4839, 7823, 4048, -9409, -13083, 3918, 18718, 12178, -2470, -7772, -5418, 1298, 14317, 18964, 2686, -15297, -10301, 8036, 16542, 11396, 917, -11024, -14877, 881, 19240, 12935, -8306, -14052, -2686, 3088, 1011, 3904, 5494, -4495, -13736, -8140, 5373, 10121, 4321, -7596, -18301, -14320, 6231, 18834, 3683, -19191, -20964, -3735, 8576, 7188, 11, -8540, -13359, -6795, 5176, 9319, 2899, -4120, -6936, -6262, 706, 12097, 13317, -721, -12200, -6630, 7379, 14050, 10669, 1803, -7884, -9675, 2841, 16350, 12808, -2525, -11546, -6996, 2792, 10044, 10508, 359, -11198, -10553, 3097, 11422, 5513, -1586, -2557, -3892, -4252, 3633, 13217, 9351, -4391, -10989, -4094, 8455, 14950, 9021, -7030, -16056, -4525, 13239, 12907, -1580, -9975, -7228, -3737, -296, 5383, 4586, -5873]
548e873p371N120Q196L047M45l973j0868m122J2222J4988m034j4819o173O119
562g096O925N948K869p491j2647q39J3552R839l788r325n243o87O374J0178K220
577A0789j0426q525L873P408J726J831J777o159j0038J999J4258Q209p910j2750
591c938m063O029J0602O181p538j3504l603R197P985p44n032l301l674k016N690
606a729Q363O43q640q134m36Q419R863P96j0941j0024L641J0925N453k485n617
621I7o441l392O740J1829J191j1586r065J839P450N401J345n278r228k807R057
636b848P594j849m949j820k876k089Q292J1092l271j4585n072J0152J0197Q46
650H814m335o280n801L368J2029M674q284q629J420L610L38M333M001n172j0797
$$ y = [-5873, -13244, -8124, 72, 3119, 3564, -409, -11277, -15399, -3177, 11811, 7777, -7042, -13215, -7096, -171, 5777, 8646, 1155, -11492, -12331, 1221, 11060, 7272, -2053, -7296, -7983, -1609, 8569, 10789, 363, -8162, -4289, 3119, 4845, 6676, 8453, 2294, -7744, -5745, 8513, 16722, 8812, -3938, -8001, -1972, 8630, 14811, 7273, -6231, -9834, -637, 7348, 6604, 1572, -1729, -5403, -7419, -1729, 6634, 7277, -1363, -9497, -9933, -1514, 8349, 9145, -1796, -11820, -8179, 2746, 8199, 5714, 97, -6344, -9736, -2996, 8833, 10024, -1562, -10627, -8788, -1338, 4063, 5408, 130, -9098, -11905, -2848, 4746, 2897, -2052, -3872, -6748, -8837, -545, 10547, 7276, -7309, -12381, -2229, 7968, 8814, 4479, -1801, -7602, -4234, 7795, 12469, 4185, -4444, -3024, 586, 924, 5257, 9258, 4086, -6711]
665f711j026J0887P586l007o930n477j543O438R918K64j1166p612L769P307L385
680F082J10l024q261m541P169J0503n69q814o550L91M236O116K101l931q004k507
696i493N207O162K762k150o037o503K284J0569P236n494j0689l617O365Q832K646
711H080n122p709j965M582N008J024r65k544n391k890O599Q399m40q145n579J230
727e828N509O852J434p091q913K036R359M247k996l367k131k983J262R008N628
742A2026q005j0276O00P795M423k58k523n574n050M096Q813J171o437m348m22
757c969m84L634P814K71j1370q125P448J1364M48p170m352r15J197M365N036j325
773C867p651k678K494K979L079K693k876r068l022Q909J0059k889r744l781L411
$$ y = [-6711, -7737, 3150, 10736, 7729, 799, -4678, -6221, 217, 10135, 10399, -767, -8379, -4610, 2697, 6082, 6192, 3168, -5093, -9634, -2465, 8038, 7469, -1345, -7895, -7504, -3268, 2848, 4949, 1018, -6986, -9493, -4286, 1876, 4638, 2488, -3549, -10052, -7768, 2801, 10037, 4543, -6146, -9763, -3398, 5434, 8080, 2958, -4751, -6716, -2134, 2874, 3898, 2933, 389, -5002, -7892, -1293, 7106, 6666, -1479, -7058, -5828, -319, 6533, 7967, 876, -8037, -6001, 3358, 7605, 4609, 1242, -889, -3872, -2610, 6398, 12026, 4021, -6255, -5655, 2140, 6563, 6305, 3782, -1792, -6842, -2746, 6067, 7238, 801, -3547, -3969, -4453, -819, 6995, 7266, -4104, -12229, -4781, 6583, 7031, -139, -4491, -5406, -4209, 156, 5192, 3867, -3784, -6462, -3968, -989, 2090, 4783, 1907, -7161, -10183, -1274, 8785, 5896, -3848, -7629, -4218]
788d218M890L675N85l950n901k68N144N480o9l376m989k620L399P623K643n429
804B619p681k30N285L987J257k802m328k778J775M618M238p80o520o011K406Q609
820C664N037m813q066j353L875M725K642j735m765m497K376M783K124n58k240
835A199m593l277M582Q807L71r505n941M205N719J482n33k473m614k100N192N797
851D318o14m425k671o53q8N155O306l534r432k119P356N813j318l755j856k085
867c602L18N337M533l291n827k103K857L470L570J3o191n521K748Q244K180n173
883A562l989O8P73J376L282K143l787n852q13M978M532M12l681n695j680N596
899g75O436m88o630l973J952M204J915M4j508l660k300K090M837K538k446n488
$$ y = [-4218, 672, 4347, 4932, 982, -4919, -5187, -43, 5437, 5368, 1992, -2997, -5617, -2218, 5405, 8048, 2619, -5062, -5292, -7, 3980, 5237, 2435, -1893, -4671, -2896, 1722, 5960, 5180, -1340, -7351, -4945, 3664, 8701, 3888, -4178, -5531, -1656, 3069, 5711, 3976, -789, -5286, -2910, 1873, 3997, 3439, 1199, -3394, -6671, -2089, 6718, 7089, -2416, -8357, -4152, 1567, 3049, 2516, 43, -4571, -6671, -1479, 4318, 3704, -721, -3392, -4045, -4133, 1022, 7328, 3794, -5638, -7757, -401, 5412, 4094, 339, -1517, -3602, -3284, 2053, 6586, 3295, -2532, -4635, -1778, 1692, 5262, 5275, -916, -6437, -3689, 4555, 6735, 1562, -2427, -2359, -1586, -210, 3072, 5215, 1428, -4424, -5237, -259, 4273, 4685, 1004, -4691, -6371, -775, 5661, 5173, -1457, -5430, -3478, 726, 2641, 2685, 1177, -2483, -4783, -2693, 2144, 4682, 2236, -3252]
915c252k512K905O444J798m587m383m26K834K335K045l02m260l057J557L897L525
931D561j490l828m066L71N798M625k766o112j443L364K773K11O88j074m365j138
947c891L337N147L5l845l411r64K893N380J334n598n324J789N113J204j510p10
963I79j164k746k90M936L316l044n060j192J946L264L104j419n050l682L682N435
979C015K72l394j967n73n81K277L942M20m775l715J797M109K474n79l898k693
995c869O91M322K441j762k663j007m3Q47K756K481k286m612j614L793M316N56
1011D347l491l703n72L511L515L9l332j844J58R05J474K384m9l831l068J300M422
1028B165K284k082l397k598J480M201K293k933l771m31K140Q07J111J031j589
$$ y = [-3252, -5764, -2859, 3585, 5383, 796, -3587, -4013, -1179, 1156, 3201, 2899, -1361, -4418, -2861, 1036, 4561, 3071, -757, -4823, -4452, 1346, 5971, 3205, -2907, -4350, -986, 1787, 1998, 2686, 1612, -2753, -3891, -554, 4593, 4628, 783, -2628, -3592, -699, 4681, 6015, 417, -4907, -3118, 1995, 3199, 1689, 979, -185, -2931, -3221, 1715, 5031, 1987, -3073, -4265, -2319, 945, 4049, 2630, -2420, -6102, -2420, 3015, 3287, -107, -2074, -2647, -3228, -951, 2991, 3411, -1364, -5079, -3282, 827, 3301, 2722, -1176, -3869, -3178, 1144, 3585, 1823, -840, -1847, -1890, -1043, 1713, 4194, 1908, -2704, -4318, -525, 3791, 4347, 856, -2847, -3419, 92, 3607, 3646, 314, -1530, -1372, -467, 1007, 3391, 3342, -489, -3557, -2257, 2165, 4449, 2367, -1030, -3628, -2148, 2053, 4346, 1413, -2358, -2789, -649, 158, 1269, 2300, 711]
1043G11l747j089M088L355r38l322k501O5K987K955R8l553l133J251K758J555
1059A540j4m99l273k314K185M767J112l628l397K71K527K650R07k422l093j18
1075b799K775K051o80m49n06k002j299L110L785o17m205k611K274L542J367j253
1091B483k875k238J545L014J096j182j361j510p72J287L706Q65l462l806P49L446
1107I85K174n87k489k386q7K582K280p96j756j380o81L83K593K346j898m279j657
1124d653L704L284m44k195k097k02R54K589P43j638k066o8L93J247J854J037k924
1141d82l686J294M587J760k457k955p20J514K114J545j197k155p25M81J397J235
1157A550R11r12k929j415K891L287k17k963j785K42J686K036O75j995k594j86
$$ y = [711, -3036, -4125, -37, 3318, 2380, -942, -3443, -3378, -391, 2564, 2662, -891, -4024, -2773, -15, 1540, 1526, 1027, -2246, -4560, -2375, 2392, 3504, -124, -3521, -3250, -723, 1927, 2834, 412, -2681, -2799, -24, 2027, 1347, 898, 392, -1610, -2909, 201, 3986, 3369, -836, -3447, -1173, 2369, 3736, 2483, -392, -2630, -1085, 1929, 3025, 1843, 482, -1028, -1800, -513, 3193, 4058, 596, -3210, -2461, 985, 3159, 2572, 83, -2303, -2390, 192, 2472, 1676, -80, -1460, -2141, -1758, 835, 3181, 1283, -2996, -4653, -949, 2335, 1891, -304, -2401, -2603, -1649, 940, 1683, 45, -2021, -2089, -1696, -449, 1405, 2442, -482, -4168, -2874, 1713, 3473, 1016, -1939, -2659, -1145, 969, 2514, 1317, -838, -1563, -1082, 315, 1550, 2461, 1549, -1380, -2795, 96, 3383, 3166, 203, -1582, -1340, 346, 2382, 3057, 1062, -1532, -1718]
1173a718K046J371Q56p17k230k399J507L530J592k873l360o3L124R06K91j233
1189F30j334j297O20K034J091k97j614k297m39K608K826l24m289j617K032K460
1205G93P58j139j341j082p3J502K028l13j450j627q26R87L283J236k604l304M34
1222b738L102J815o64j545j173l42R60J993Q68j500j547q29N87K153K038p00l512
1239a034j894K394L228P7j954j252m03M11J062J642j03k008j759O5K003J988p6
1256B387k188l323J058L347J957k221k480K17N55R28N82J003j360k308k27J436
1272f37J961M85j016k637q95J525K884O32k767j902O93J355R70L5j8j325j772
1289b429M91K253J782q96k411j587J203K633J335j473k460m84J656J249M11m94
$$ y = [-1718, 328, 1699, 2555, 1838, -392, -2791, -1284, 2246, 3838, 965, -2395, -2458, 666, 1572, 1863, 630, -704, -2001, -1381, 653, 1744, 1447, -167, -2464, -2903, -295, 2531, 2207, -2082, -3699, -1667, 793, 1551, 412, -929, -2011, -2084, -582, 1446, 1133, -317, -1944, -2770, -1783, 1500, 2736, 132, -3172, -2738, 364, 2179, 1515, -30, -1203, -1545, -585, 1408, 2276, 776, -771, -1600, -1013, 1140, 3178, 2478, -1034, -2928, -534, 2694, 2771, 817, -435, -838, -427, 635, 2277, 2174, 166, -1593, -1528, 475, 2463, 2387, 199, -3124, -2066, 1281, 3238, 1017, -1463, -1246, -691, 237, 819, 1822, 462, -1846, -2073, -637, 1324, 1809, 793, -1844, -2739, -1214, 1670, 2302, -465, -2367, -1674, -319, 651, 686, 668, -657, -2429, -1938, 315, 2097, 1201, -1210, -2797, -1594, 1039, 2374, 901, -1559, -2043, -387, 862, 1273, 779]
1305G79o32j083l53J256J938L88k051j828n23K408K356k87k783j730J356J730
1321I41M50k78p05o41j291J038J924Q95j328k131r39R54L020R53k016k886j21
1338b161K291J303o84o72m38j235l00J999J918p66k255j421J103J750J322m74
1354A280k109k012J106L126K52j378r12j50l52M43J900J010j718k681j08K543
1370B40J760q22j245j641p3J874K001m21k548m90P7J176L71J068l49j813j668
1387b503J583K934O00j867k372J88R50K151K99j113j641k30P65J366O34m96j410
1404a62j029l29J917K050o81k808j298R45K669P62j587j374l04N94O24M94J014
1421A497j197k233l13J830J803J74j150k314n54J966K407j65k511j488J369J163
$$ y = [779, 147, -936, -1289, -33, 1905, 2293, 242, -1586, -2109, 299, 2655, 2368, -415, -2145, -789, 941, 1391, 1113, 408, -233, -1524, -486, 1438, 2333, 1005, -1126, -2065, -1111, 1909, 2862, 846, -2040, -2161, 130, 1433, 749, 77, -361, -1596, -1896, 103, 2021, 1255, -1000, -2421, -1318, 432, 1754, 1280, -829, -2841, -1735, 1391, 1643, 265, -647, -797, -1149, -706, 1194, 2204, 486, -2195, -2303, 240, 2000, 1178, -67, -1708, -1781, 93, 2094, 1673, -875, -1365, -1288, -112, 259, 1327, 978, -835, -2503, -920, 2014, 2614, 747, -1625, -1437, -487, 1664, 1963, 850, -791, -1021, -256, 1110, 1744, 1248, -162, -1191, -1520, 397, 2447, 1766, -1042, -2340, -1395, 1274, 2036, 449, -925, -1229, -635, -11, 483, 1497, 300, -1933, -2246, -416, 1387, 1561, 411, -1903, -2457, -491, 1916, 1751, -760, -2248, -879, 284]
1437B84J77J58K75j009k128O51K983Q94j542k099k57J214J560P33m98k239j067
1454a910J863J493q4r87l60o58r45J089K810k57k558k149J373K566o9n62p25j223
1472a293m47J660J590j92j736p57N52M23Q70J112m91k605p44K279K102l99k526
1489f02q33N21Q71L61P45n78j198n63M63J265J001r07j439q90K67K232J038r63
1507G91k233l45J508J453j76n89l69o10n05J050J512L69k418j167O82J987P40
1524A680o04j250o07p9J579J188q78j514l43P52K08k0J168N1k079j521J542K774
1542B047k13k376p11M90O67O24M28q25j506j72J764K82J2l02j58j456k51J991
1560C35J551q20k966o2K034Q69l90l32n46m42m54J222J215l88j072p06K2N92J322
$$ y = [284, 461, 619, 894, -115, -2243, -1592, 1391, 2285, 743, -1356, -1613, -399, 1161, 1894, 1396, -843, -1910, -47, 1446, 1362, 375, 15, -643, -1588, -499, 2311, 2054, -504, -2653, -1280, 1286, 1217, 655, -70, -1293, -1740, -80, 1510, 1318, -418, -1175, -623, -200, 670, 1782, 1291, -1314, -2058, 221, 2323, 1924, -602, -1435, -914, -43, 318, 1063, 485, -713, -1276, -813, 452, 1453, 546, -893, -1783, -1516, 716, 1754, 791, -1442, -1787, -279, 1174, 998, 409, 40, -570, -1075, -25, 1487, 1856, -562, -1729, -1047, 940, 1680, 1076, -174, -781, -860, 719, 1907, 1029, -485, -828, -76, 132, 112, 1280, 1331, -748, -2269, -727, 2047, 1834, -542, -1253, -763, -96, 528, 956, 131, -1375, -1547, 217, 499, 511, 209, 51, -1405, -1656, 335, 1886, 1066, -1900, -1962, 72, 941, 551, 219, -327, -769, -1223, -1, 1214, 826, -246, -952, -930, -338, 984]
1579I84L46j020k045O34K086O71j336j091J57L84k6O14Q56l86j823l36Q51J320
1597H40N04p25j336p75J629J184p6j210r66K94J057L10k55K75o22p63k48J220
1615C37J356m57j952r16J308J119N37j240o86j59K96P94K16j73j035k49mO95P96
1634E83M47r79j779N6J876J011m86j597j84N28O58k5M66r6p70l91P25M54K08K5
1654G30j106q11O05J729K44j141j376N43J017J28j83o2N5j172J41R75R64l13q95
1673G2q02K25R54O66j08j590l07O27R91R7n74k93l17j99J35R77O12r19r09k75
1693i37Q62Q97K42j214o40j43J455K22n64l45m88L65k30R93J99j48j052n44J50
1712i20J198P23o40j480k39J207O00k45n20j74j97M26o5L86L12m00j221N20O57
$$ y = [984, 1330, 310, -1735, -1101, 985, 1656, 320, -771, -614, -230, -256, 358, 1214, 828, -995, -1331, -480, 840, 1344, 619, -717, -1492, 137, 1321, 1245, 35, -931, -637, 420, 730, 475, 750, 128, -635, -883, 337, 1693, 1236, -716, -1632, -324, 795, 1332, 92, -594, -753, -457, 337, 553, 380, -655, -904, -908, -213, 583, 1030, 51, -1728, -1672, 204, 1215, 729, -868, -1052, -524, 134, 109, 575, 479, -291, -682, 43, 497, 705, 730, -376, -1187, -582, 1147, 1391, 250, -1126, -583, 434, 562, 379, 317, 372, -800, -659, 316, 1280, 967, 72, -730, -505, 449, 1115, 1007, -583, -890, -263, 728, 825, 251, -42, -359, -558, -423, 554, 1166, 247, -662, -937, -75, 822, 1064, -150, -790, -933, 522, 744, 180, -165, -653, -288, -518, 475, 674, 526, -526, -1070, -920, 278, 1001, 361, -1119, -1358, -151, 449, 204, -316, -490, -687, -261, -326, 60, 372, -28, -1249, -729, -72]
1731g2O88M09j160p90P83R80K57m27p93L28j50q9P64O2m49o74l81N19J200o9o87
1752B49j197o7J110Q20k18o95m50LM57M78ML07p00r32r6J278N73l71j159m78O54
1773d30R05L14p92n80N5O10j42o0K77l28m90k84O93R79j49q16j121M87J028P32
1793H88k35j363j40P80l6J14J19l3k68o01K54J072j4m98p40j76P04N69P7o98o51
1814h76K71R10J20k36K21m80j88j70O48R32k35j028m12M36P97J75o51l43j37M72
1834B26M40m11k9j35k80m9j07R94J96m75j316p5J158M78k45p16j66L63J58K51
1854B60k25j10K29k20o1J33P44m92o51o72P01Q00k7n98n65J4O68K28J43m05k05
1875c11K44k22r2Q98J12n13j036O3J327L85n55j000J30N66K60K44k68n44K01K23
$$ y = [-72, 616, 1025, -135, -925, -142, 838, 1095, 668, -125, 203, 53, -36, 728, 790, 341, -333, -714, -195, 1005, 936, 249, -948, -1015, 95, 915, 697, 2, -448, -445, 12, 490, 494, 801, 101, -831, -927, 351, 924, 553, -606, -1084, -430, 475, 789, -3, -583, -528, 82, -60, -120, 157, -171, -661, -945, -252, 727, 578, -238, -1359, -872, 156, 888, 653, -710, -850, -70, -106, 8, 127, 94, -174, -775, -521, 551, 537, 39, -701, -877, -173, 396, 473, -225, -876, -605, 305, 425, 189, 410, -70, -258, -428, 220, 1152, 917, -111, -523, -87, 710, 885, 234, -109, -246, 226, 666, 255, 226, 91, -189, -238, -345, 649, 845, 370, -946, -1021, 137, 615, 370, -346, -512, -149, 9, 260, 35, -75, 154, -66, -127, 6, 750, 258, -393, -1065, -364, 436, 409, -189, -754, -740, -72, 156, 299, -106, -311, -67, -289, -381, 517, 629, 116, -920, -857, 470, 855, 300, -700, -570, -4, 256, 500, 232, -312, -111, 112]
1895A12j34L84Q2m23n61m75J188O03q3o75n45L9O89K24j3m22k40K69j31K23K62
1916C73L35o64n15k60J197N72o99j141J46N02M49M6n21m11L76N2p0M58j83j0q80
1937h48j04Q39O26p0l07r60P20P04j53k43n00l9K94J0N39l2l16l21m78L58N84
1958C03K82m55r25Q5Q31O39n49n11j44L29R0K20K04o9j62n02MK36M61L14r33m77
1980g29M32Q19L5n79j89j01L73M8q5N19l61q46P79p0N18o5l60n70kP35j2J43n03
2003g1l72K65M79k60K20j84q8l20J4L63N13j94r65j22P94M59k28o44n34N14J35
2024b26K51J51j14O8q36M94R2N53L04o98l25j95J040K48n63o90j82O81J9K48m3
2045B77K3m77O4J51L57O6p51J62l70K88O50j57o15k17L85P20j3o34J24K70m75
$$ y = [112, -22, 362, 444, 21, -540, -1015, 173, 776, 693, 18, -527, -488, 201, 425, 412, -10, -250, 19, -112, 111, 373, 708, 44, -471, -731, 466, 1038, 339, -802, -656, -154, 295, 341, -180, -591, -215, -163, -233, 225, 42, 32, -848, -952, -113, 513, 443, 136, -824, -104, 600, 447, 204, -296, -335, -41, -31, 508, 476, 160, -161, -639, -281, 303, 585, 130, -795, -710, 121, 760, 211, -300, -444, -115, -25, 195, 399, 330, 168, -334, -330, -94, 367, 681, -252, -729, -297, 522, 557, -22, -211, -312, 61, 109, 24, 543, 182, -664, 115, 45, 563, 498, 138, -432, -434, 301, 289, 432, -71, -443, -178, 301, 41, 261, 77, -11, -331, -317, 46, 559, 365, -600, -722, 72, 531, 303, -341, -875, -361, -226, 25, 176, 62, 130, -706, -212, -120, 433, 737, 39, -286, -481, 559, 807, 244, -446, -628, 53, 72, 320, 277, 300, -177, -113, 38, 395, 461, -290, -128, -498, -210, 440, 283, -332, -549, -164, 556, 543, -91, 33, 303, -172]
2066a72k34L25M77j97l91j82R8O21L42p01l27l9L53N55N1o35kM42m36l50M06M49
2088D53l33n56L84J78N28m37p29J92R6J81J99O4l58n6K92l8L95j79j88k81o0N8
2110a95N90m6n21m80L62N45J67m23k74L48j65l11Q62N3j77k00n87P43J2qj64n08
2132c77j94O68N52j02r21l43O56N07m94j59N34k22o46K49N31n2m2l68j40Q8J25
2153a50N04l45k21n18N26N78l66N6N05n06k61Q1O40K71o71q39K79N52N5L04k28
2174B46n00K65K7N77l2k82j94j76k48K25N32q7q56k23O27Q58p7r73j07R2N34j81
2196D7K75J2l49K3p3M07j65q2J84o85o2N54N15J2r41nJ17N37k28l62n1j7J52J30
2220e5K42N50q01m08J23K16M32l44k39j86L98J42J35j73j27J33p9Mj8P09k23p12
$$ y = [-172, -406, -81, 396, 199, -192, -374, -276, 345, 687, -14, -341, -380, -27, 528, 579, -56, -58, 384, -52, -402, 4, 453, 120, -436, -52, 126, 654, 217, -512, -320, -224, -43, 156, 220, -138, -194, 98, 60, 455, 276, 88, -193, -253, -195, 395, 349, -172, -652, -290, 255, 422, -1, -275, 73, -92, -403, 459, 512, 335, 135, -452, 291, 303, 295, 131, -377, -571, 97, 649, 547, -374, -717, -61, 446, -48, -207, 327, 105, -541, -292, 239, 187, 145, -223, -363, -275, -150, 354, 9, -212, -730, -204, 374, 8, 64, 569, 63, -198, -117, 523, 794, 123, -716, -437, 115, 170, 474, 246, -254, 11, 38, 615, 583, 301, 107, -69, -317, -92, 440, 353, -503, -726, -99, 759, 682, -291, -398, -306, 228, 47, 322, 334, -15, 8, -65, 342, 177, 95, 279, -406, -468, 86, 601, 613, -328, -333, -216, 321, 93, -269, -320, -337, -185, -55, 187, 737, -64, -472, -349, -133, 299, -45, -284, -470, -72, 70, 205, 32, -95, 38, -41, -37, -55, 654, 431, -281]
2242b81l04K08Q34j59m72Pq9L59K49j08P1M7l81J85K02k19P0j3n89k05Q08L26
2264E46m36k31k95M53J53q2j04j33j42L07K52m8k49J76j42m19L73J7M87k79n35
2285c31m2N44K80n64m5J61q5n6K57j6N6k36j73K03J98m2J60o13k25O03M51j11
2307C74l67m42o9Q24k03l19K22q1j78m97N79M76N7k4o51J65J60M44k82l53j53
2328c18L18L30l2j61n25M49j75L4J20K58k97l9o8l4N07Q9k82k71j51J27L23J03
2350C05l98N2k35J5L89p3J34l0o49L49N61j20o66m2K83R5J90l44j38M89j37l84
2372c54k4N46p8k52k01n6L91N71n9l88m38K91K84r3R1l88j39N1K01j02j70M55
2394A39m47J52J52p7M9R3m3l28N25l20K32J47m1l4m60l6P86j89l57r3J79J14L31
$$ y = [-281, -585, -377, 457, 298, -174, -167, -256, 103, 352, 244, 315, 362, -19, 166, 368, 149, 219, 206, -383, -588, 220, 546, 110, -121, -416, 37, 190, 108, 4, -129, -271, 36, 288, 240, -9, 167, 25, -394, -21, -4, 483, 204, -331, -373, 171, 451, -113, -158, 3, -82, -138, 119, 103, 159, -77, -250, -47, 151, 109, 269, -344, -569, 34, 485, 374, 7, -435, -504, 320, 117, -202, 20, -61, -239, -736, -157, 319, 376, 352, -299, -134, 26, 470, 188, -165, -318, 0, 330, 298, 137, -388, 61, -114, -80, 40, 298, 1, -38, -106, -140, 367, 456, 174, -97, -248, -121, 202, 305, -93, -41, -276, -261, 128, 55, 189, 159, -490, -141, 420, 300, -366, -408, -125, -30, 160, -184, -322, 167, 30, -354, -378, 168, 90, -162, -363, -419, -28, 543, 484, 96, -342, -51, 233, 140, 231, -157, -296, -245, -44, -146, -316, 139, -308, -156, -4, -81, -32, 61, 18, -310, 215, -105, 127, 274, 233, 199, -261, -297, 489, 300, -57, -150, 29, 143, 474]
2417D74k47l36k85Q0L80j67J43j55J03o9m0J30j07K0K75n63J99O69k89j63n80
2438e28N39J8K34l90K36m52L93p2j94%M21k43l59K21K45K02K46p47L9RL20J4l15
2461a63k0L8P0J23J53lk89J46j47j9O49m04l06k25M94K1q0o3K0k81J55j29K73
2484A3K08K39l02m49K6L64J47k32j56L1M8L45l49l36J19M20j20l8N3j80J64j50
2506a35K5j7J11KK63m17J35J77K90m95k51L48k24J21L47j34k61N0l37M01J87j00
2528H6o9l80K22P8J04j47L21m14K94K23n06J2R0L69q82M54P0J52j22k32K80j76
2550a73K50M74m68n20K73L60J17l29p9RK14K0k78o4K37j73J89m67M96r7%K16m78
2573b71k5K40K34O3m56K2J3J79j3P1Q1k02k74L90K24M9l50mn7nK0L60k12k59M20
$$ y = [474, 227, -109, -394, -314, 66, -101, 42, -113, -10, -79, -119, 11, -96, -76, 199, -364, -165, 504, 215, 52, -528, 11, 29, 263, -127, 109, -343, 50, -22, -216, -216, 205, -38, -397, -176, 69, 271, 517, -230, -191, -182, 138, 152, -163, -183, -145, -75, 48, 201, 198, -91, 55, -92, -111, 538, 134, -172, -397, 97, 118, 38, -25, -5, -286, -131, -260, 13, 221, 460, 158, -291, -265, 99, 246, 14, -142, -111, -63, 282, -67, -403, -284, 136, 16, -22, 31, -149, 15, -135, -110, -127, -16, -14, 249, -168, -33, 144, 434, -61, -312, 36, -188, -67, 280, 146, -115, -65, -402, -1, 186, 86, 17, -363, -141, -63, 41, -106, 215, -199, 95, 318, -188, -176, -86, 283, -599, -145, -75, 77, -45, -277, 3, -173, 77, 551, 83, -437, -164, 196, 313, -16, -95, -86, 128, 148, -130, -194, 43, -130, 59, -408, 88, -9, -9, 207, -271, -296, -56, 178, 241, -215, -193, -180, -1, -14, 57, 138, -64, -338, 52, 276, 325, -25, -29, -86, -91, -71, 289, 77, -182, 238]
2598B38l46J57K73r4k11l6K5l4J41j79k6j85K93K22k95j43J53K86m39J49J50J7
2620A16j14mj51j4L59j74P5k66K3J25J37j8l17K94j95jj1L27j13j52K14k8k65
2643a53L21k86J85k03J24j07j26K09n8J66L2j63L05L1q3k22l54O22L56n88k4k43
2665b59J76K40K29l93N8l4j04N8L8K5O4J45k64J2k20L77j91m90N37LL05j65l32
2688a85J19j67J83K59m05L28L3o30M72j16L21j23NQ2J4J23k43O9j62k46J46K64
2710A41J25j51K1L7j68k15M22j30j76j13K01P2m13J41q7P7J89J99j92J8P2o5K87
2733B92k84j76J92k8r7j43k3J46J79j7j38L3p0J1K04K08m85R2r5M03l45K47j89
2756h3N03m86J66O0m39L21N2q6j83K04O2k1P0k09Rm3P3j6J37J49k99p7J71j62
$$ y = [238, -108, 49, 322, 228, 17, -19, 6, -28, 113, -66, -92, -277, 16, 238, -57, -200, -47, 239, -200, -51, 99, 116, 2, -2, -153, -167, 192, 18, 93, -173, -150, -25, 112, 94, -223, 71, -124, -125, -136, 191, 78, -74, 140, 112, -153, 168, -118, 67, -136, -12, -119, -245, -36, -94, 72, 104, -59, 246, 277, 194, -28, -382, 240, 596, 8, -16, -259, -83, 157, 386, -7, 51, 17, -87, -29, 9, 34, 98, 243, -21, -9, -229, 148, -43, -533, 4, 7, 312, 147, -185, -66, -233, -50, 209, -196, 132, 165, -465, 7, -109, 212, 89, 94, 176, 190, 313, 70, 139, -23, -269, -123, 141, 266, 115, 136, 173, 5, -210, 212, 82, -94, -207, -6, 66, -347, -206, -293, -216, -27, 172, -20, -2, 70, 5, 292, 8, -168, 24, -4, -101, -244, -267, -121, 58, 41, -97, -64, -134, -123, 81, 289, -196, -104, -199, 204, -141, 106, -83, 420, -66, 100, 160, -279, 42, 94, 8, -175, 29, 91, 70, 140, -69, -60, -103, -30, -46, 91, 240, -59, -136, 35, -127]
2780a27K31M2J9j93q6J30p8L21m86J28K0J29j41j6N4L5j5M2J95j97j62m6M77k2
2804B54n71L44OJ47l38o1O46k36j57k9k8j26Q2m4L93k66j74o3K39k16L92l86M07
2827B15q2N8Pk33J14p6m3Q9m29L91OP1j18j58N61j66j78p0K99k71j01L21j72r9
2851f4L36l26m2j10Q9L6K68l08j3K88K5j87l33O05l2m12k8r1N23J11l47n5J06
2874C9k35o9K07L57m19Q2J25j25J46j47jj79rO3L79k79j86J57J29J5k3j23J95
2897I9K14m88Q7l78M74k41L09l96N61j54J62k57k3K00o6j80Ro4j28L40R8N6l69
2920a35K96O5k4J3k70R6p0o4L31m96J34L93n76L35q8j69J49J75l22K54p6j76Q5
2943a40L16r0j78J42p3O0k54Q8k4L09k02K44j48j94L61J70m56n3PL29j55m25J18
$$ y = [-127, 104, 146, 165, -28, -114, 16, -62, 259, -227, -99, -79, 50, -91, -107, -53, -18, -33, 9, 204, 7, -155, -201, 276, 254, -317, 27, 33, 180, -158, -219, 427, 191, 34, 5, -23, -149, -67, -111, 282, 16, -158, -221, 18, -198, 194, -192, 215, 133, 191, 198, -35, 79, 3, -40, 49, -380, 11, 17, 88, -30, -188, 373, 207, 29, -41, 258, -13, -114, 207, 35, -64, 272, -54, -96, -206, -117, -81, 187, -121, -134, 154, 179, -8, -341, 264, 232, -180, -208, -299, 224, 335, -12, -67, 39, -196, -265, -58, 299, -120, -38, 87, -38, 108, -39, -40, -219, -228, -165, 214, -65, -251, -94, 35, 50, 27, -96, 99, 313, -175, -88, -466, 8, -233, 76, -320, 241, 87, 249, -8, -31, 169, 103, -77, -68, -132, -260, 80, 178, 234, -135, 161, 226, 202, 215, -55, 41, -29, -93, 238, -258, -124, 269, -307, 28, -60, -229, -80, 95, -227, 27, -49, -225, -140, 176, 86, -92, 50, -23, 37, -217, -129, -153, 156, -46, 198, 50, -144, 217, 387, -69, -122, -115, 214, 59, -366, -248]
2966b48J91J74O2o08M62N9j23J24j25Q0j21K2J0j67K35l4J74q2k74J88Q2l37J68
2989h8n6K20K1j69J5L73k48k59L04l26K75m3j7J07k23M55l30l51K95j56K86N1
3011A36k73J15n4pN0l8L66J59n06P2j21K12J5J91j10k44K67J6j55Q5k53P9J68
3034A70k20Rj79J30L08l08j65K59J85J54j65r5l2l6r6r3M13p5k55K55k45o9Q5
3057f5p3o5M28L3m05j11K73K4J20n6o0j5K28l38j48M60j75J41k26k74M67k67m2
3080a46N16k79l54N45j66j98R9j92J39N9j83P0Q7j54L5j82K73n3J79j07p0j37
3102b19O93k35l28J76n7j15K3J96m76N11m82M56l38M37r8l49J28l3Q0k06P0J06
3124f0J40Jk51K05K3M3j81pP0o3K09j03q6k44J90J26LJ08k35PJ48k05j3K83k6
$$ y = [-248, -57, 117, 179, -429, 33, 92, -31, 93, -32, 48, -73, -51, -41, -208, 27, -7, 167, 85, -189, -1, 81, -256, -88, -144, 76, 97, -72, -57, 316, 68, -191, 113, -213, 62, 19, 2, 109, -114, 341, 11, -340, -45, -201, 85, 136, -137, -22, -76, -83, -33, -71, 295, 454, -52, 20, -101, 111, 126, 317, 207, -37, 230, 246, 91, 176, -77, 2, 170, -50, -41, -220, -90, 218, -90, -255, 4, 189, 343, 178, 83, 51, 15, -81, -174, 239, 164, -91, 164, -81, -150, -65, -138, -203, 225, 258, -147, -258, 15, 39, 159, 103, 43, 28, 256, -82, -230, 230, 55, 196, -30, -304, 163, -104, -146, 370, 91, -263, 282, 116, -82, 17, -175, -36, 23, -160, -90, -3, -157, -122, -304, -31, -84, 95, -12, -82, -219, 474, 239, -89, 87, 30, -85, -62, 134, -342, 169, -313, 143, -195, 242, 144, -205, -77, -110, -30, -236, -166, -60, 80, 81, -170, 35, 58, 101, -80, -87, -17, -80, 129, 26, -60, -304, -114, 12, 15, 123, -112, -105, 43, -162, -175, 108, 82]
3149H2j23J3j65M02j91O5j32K06J32m68M0p9M75k84L1L7nn5j97L73n38L33J90
3172A42k80R6L07j67N3j86l09N81k08j47L15l97J22K6M7j38L64j75j38j48L01
3193F1J49j33j10K2J02k81K1L1K44k83J55K90l6l91Q7J57M2J5k18j23K68m1j68
3216a40n6J22j02k2L3o3K74K50j84k34R4L4r1K0M6oJ60k02J1J8K02J16n27K67
3240B0j91N1K24r7J86j45l46J44J70k24L64l22j1q0J27R1J46k27J65K62j66l79
3262b38K32o8j98J19J7j27L19K38j25l75K42j9O6j30R3K27m27j39J38q2K45J21
3284A29l54q7L66J5L3J05l09L36j2j75J40k22N2j57J39rR2m4k45K76l91M29r3
3307A4k2J5j82J45J02j63J70k67N33k65k25J26j02L1L86m94J86L27l07O7j48M6
$$ y = [82, -41, -28, -193, 209, 18, 83, -49, 157, 289, -179, -139, -218, 257, -27, 4, 41, 36, -19, -216, 157, -381, -48, 142, -138, -42, 265, 98, 151, -35, -344, 237, 29, -118, 197, -200, -78, -52, -5, -143, 221, 46, -92, -240, 61, 210, 77, -33, -11, 91, -190, -169, -138, 106, -177, -22, 268, 232, -159, -72, 85, 127, 142, -76, -199, 69, 28, -140, -196, -74, -176, -198, -165, -228, 46, 296, 112, -122, -28, 6, -85, -65, -19, -25, 135, -67, -56, -38, 164, 280, -247, 20, -171, -120, 104, 7, 193, 48, -298, -154, 16, -208, 156, -166, -177, -257, -130, -39, 107, -120, 45, 307, 141, -238, -6, -74, -272, -153, -136, -263, 56, 294, 169, -206, 36, 17, 83, -47, 46, 273, -154, -293, -155, -237, 8, 129, -225, -312, 54, 69, 102, 207, -102, 234, 222, 47, 187, -35, 17, -140, -1, -10, 82, 38, -207, 69, -322, 107, 14, -8, 7, -175, -30, 72, -91, 79, -188, 345, 80, -145, -19, -121, -90, 296, -198, -12, 315, 8, 75, -73, -27]
3329b7Q0n4k82J91l2K88l28R0J09r6K59k30J23j79q8JJ28l6K27n7p3m95O18o1
3353G6J5Jk16M19l78j34K02J53L4k89O6J35j19N06m97R5j71r8R0JJ08J70j64J4
3377A9j60J86Q1k04K35m64P3J34J05q3k50P35l12J41m73K35K09j58m5l37L79l06
3399b60M11q7k61L97l47j84K02Q0J65Q8j98j93K66P1k36j32J88Q8K45k56j0j39
3421a02L57k98nj58J17K88k65J21N0j47M8j7K99k21pJ4k64j9K87j00M6l6l11L45
3445B2j29K78N4j52Ll16K15j2K00q1J0j93J19j28L18o6l63J81J15m1l92K60J91
3468I3n8n4L85l05l60K84k49L28k37L38r1o2k3J03m0j1Q3j33J6Q9k04J12j30K7
3492i9K9M83k60k4J79m23J8j71R5R7O3j05J62j73J50k70K81j28k68K34k80J20
$$ y = [-27, 53, -1, -283, -92, -124, 164, -164, -74, 35, -61, 198, -32, 91, -88, -176, -175, -47, -83, 144, 87, 14, -481, 137, 76, 91, 92, -124, 295, -83, -217, -15, 138, 172, -117, -51, 84, -35, 471, -26, 69, -102, -200, -110, -109, -1, 169, 5, 19, -141, 45, 126, -78, 157, -307, -234, -100, 5, -78, -328, 407, 95, 236, -237, -2, 207, 49, 4, -333, 46, -260, 151, 64, -197, 200, -147, -331, -129, -49, 116, 204, 6, -187, 79, 150, -86, -218, -30, 58, 303, 47, 37, -102, 255, -43, -48, -206, -89, 199, -66, 55, 105, -42, 6, -11, 288, 67, 60, 74, -190, -209, 78, -22, 24, -12, -323, 22, -107, 171, 225, 73, 76, -240, -25, -37, 163, 82, 92, -101, 18, -110, 208, 142, -221, -40, 75, 34, -358, -98, 93, 35, -19, 366, 61, -299, -15, -264, 64, -173, 165, 74, 12, -11, 92, 52, 41, 124, -9, 7, 96, -108, 4, -126, -99, -70, 413, 153, 129, 308, -115, -97, -268, -173, -76, -13, -118, 44, -129, 21, -249, 32, -96, -364, -130, -410, -290]
3514b90M68p9l22O7J68J27k43J11j51J17k25K27P9oN2K9j24J51l54o3M2J90o5
3537i4J87j89J14M3J32j92J42j98J7J19Q2k15K31K7j02r5j96PL51o2j1k15K53
3560A36r3j10j0j04L15Nm54K54k0L07j31k25L51j41p1J8k91K5L63L9om06m5K2
3584b72N04j00K0j15J91l65m2K29k29L79k71J74l6j26K03k28m3J80k23L08j04
3605C4%j36J0K42k04J25L53l68m30L92K0o6j79L30n0j70J4O4J69k36NK41r1J20
3629A89j42J61m11o2K33N2n4k47m5N77r2l07N09k90j70J16K57k37R8j10N5j73
3651i3K76K59m56j22J36k84L84j26Q4j13R2m0m9J00pJ70L9l67J09K9O5o4K38j61
3675I9j93K62L8k70m9K72R3l22J68M8m12L32k79Q0K83k15l1lj20L22l6k20k35
$$ y = [-290, 178, 99, -223, -156, 12, 139, -104, 7, -144, -27, -252, -25, 54, 48, 100, 129, 5, 156, -198, -261, -219, -29, -94, 93, -96, 18, 61, 193, 1, 143, -55, -38, 81, 163, -52, 179, 206, 104, 9, -187, -180, 171, 109, 98, -117, 136, 43, -67, -77, -181, 134, 139, -315, -61, -81, 226, 95, -130, 221, 80, 9, 27, -264, -239, 124, 163, 157, -249, -294, -272, 232, 132, 152, 37, 228, -137, -179, 50, -179, 200, -71, 103, 67, -59, 144, -84, -127, 53, -170, 138, 34, 34, -102, -92, 150, -54, 71, 424, 56, -374, 18, 38, -28, -207, 123, 73, -97, -83, -19, 150, -86, -81, 160, 69, 189, 47, 208, -203, -265, -32, 20, -34, -281, -326, 251, 159, -148, 361, 71, -99, 17, 274, 37, 135, 25, 80, -93, 183, 442, -14, -136, 0, -284, 100, -26, 58, -55, 37, -3, -52, 48, 41, 211, 250, -117, -8, 21, 86, 22, 260, 99, -94, 168, 206, -64, -113, 159, 252, -70, 98, 146, -266, 66, -213, -133, 150, -65, -96, -99, -219, 103, 67, -153, -388]
3698c88M66l49K23j7k0K80m48N33n19K40K83m8m85M8K63J62k18N5pJ19N5n21O21
3721C28j74m5j80P4lk4K08m46P5J24K83j15O0l08K82m1k02j89O14m67j1j31J89
3744i9JOJ95k55N0R2J50k23j2J35p5K96k16l10M23j34l8Lj26J22J71n14K68J99
3768A09j5j54j34m3N27k63j3m2J4J66m15J13J34j28J55j13n4RR2J72k85R1J39
3791F2J37k17O0j31J11K03k64k5q8K52M5j79p8j66K2L64j23j66L51j7j41J67k77
3814i8j82N03m15J32l2N66j93n30Q7o1M01j10l11M34k23P0J8j64qJ78J04k84L17
3837A99j60j1J58n44K48M07k81J34k19P2p0L0J59k80L07m27L10J74l38l8J64k38
3859b44L83J25j18j60j38K17p3K56l92J21q3K3n0P3O1K44O3m41K31j94K17k91
$$ y = [-388, 78, -271, -48, -65, -85, 195, -253, 280, -239, 1, 284, 236, -249, -201, 62, 224, 6, 61, 54, 173, 228, -293, 328, 154, 109, -71, 3, 0, -24, 184, -262, -187, -63, 220, 105, 165, -143, 139, 98, -104, -293, 321, -146, -157, -288, -99, -98, -92, 103, -152, -102, -10, 140, -83, -95, 40, -35, 261, 45, -265, 158, 24, -14, -11, -137, -15, 156, -358, -90, 109, 94, -60, -194, -237, 290, 27, 14, -28, -14, 152, -263, -150, -16, -144, 11, -102, -156, -147, -55, 117, -168, -77, 62, 199, -18, 42, -89, 22, 225, -39, -64, -152, 100, 145, -34, -112, -278, -256, 108, -15, -181, 170, 153, 12, 179, -98, -280, 223, -192, -60, -92, 474, 281, -249, -162, -223, 178, 68, -243, 191, -32, 38, 56, -108, -116, 62, 166, -118, 199, 39, 28, 186, -358, -110, 297, 16, 150, -69, 3, -67, -37, 122, -158, 149, -278, 32, 206, -132, -170, -6, -244, 139, 264, 146, -14, -152, 65, -8, 248, -144, -23, -106, -83, -133, -60, 1, 245, 308, -133, 98, -96, 121, -170]
3881a70J97K46l03k14K45J49j58j83P7m0K39j74o4M23j10k68l3L17l30K05r7R8
3903E2k65O3J0j01J08L92m1j89J46K13n65M0J59k85M07o6l38R1M55l0j76j54J08
3926C4K28k18J29j83K6qk4l03K83j03k19L94l11J40J58N3K72l00l61N05k33J13
3948G2k59K82j1k11n1mL22k15j81K78P4j31k92L91J75r9rj59n6j19n1K04j35L20
3972A35mj90%q9R8J84j87Q2J03k27M60k61j49J13p7r7NOL00j18k52k51J07N18
3996B09k47J9N6L63l74J92l55N9o9J07P1Kj08K05j96J51l14L89J5j07K19l51M
4019f0n5q6R9P8J0%L11j69j33Oj25l70L27M83l09K08n21M15J5k6k81o9K40K74
4043B62l8m18K19j53K99l07O1K76R9m11l2L7M21K9k96k82J60L72l81l4j14K56
$$ y = [-170, 27, 273, -30, -244, 1, 150, -8, -191, -114, -154, 85, -89, -153, 270, 160, -108, -141, 176, -154, 51, -46, 52, -213, -150, -140, -241, -133, 259, 218, 29, 175, 388, -177, -137, 22, -263, 144, 78, -260, -169, 286, 256, 80, -74, 34, 262, 44, 173, -10, 16, 8, -16, -319, -36, -139, -358, 36, -275, -135, 23, 76, 348, 48, -313, 192, -41, 72, -187, 95, 84, -127, -178, -182, 140, -75, -256, 22, 96, -35, -327, 64, 239, 140, 131, -28, -84, -203, -254, -50, -185, 135, 131, -59, -59, -148, -50, 134, -53, 29, 132, -95, 365, 104, -45, 68, -9, -106, -101, -95, 205, 87, -165, -416, -309, 209, -38, -19, 37, 400, 26, 218, -137, -78, -147, -40, 31, 33, -75, 130, -66, 85, -229, 160, 175, 68, 287, -64, -60, -115, -201, -102, -24, -14, -14, 297, 128, -5, 1, -124, -494, -167, 316, 7, 215, -306, 109, 124, 98, -183, -252, -12, 262, 224, -194, 25, -128, 171, -136, -75, 201, 300, -111, -143, -106, 315, 344, 48, -234, -74, 298, -83, -117, -231, 25]
4065B5K7p9L2k0N0k32L5N9R0K47l33J60m1k1QN3k52N31k44Rk62L70n2r3j73Q0
4091b6J04J03l98L07k26k7J65Q9Qk27J6j44J66J2L65Q0m79k03j6K28L21j88j1
4114A9OJ09p7j74P0j7m4J21j64K15k04L26k72l1r8K95j1q2R0mN5k45k76M18l11
4139b86J50l85N44j4L09m51J15j59J52L10j69J6l21mJ86l1J22J93l70K79m41L0
4161b25J41J81q6QQ1Q2J25l34m9k3J96j86K6k2J36r9Q8J60k58J17J75l94q0M00
4185A60j23J4N7m02Q1M2K50m37N07j22k31L18j1J12n2j59j9r7K87m08M16j89J04
4208I8J62r9M1j02J8j66j66J61Q3r1J44m17M36j32J16M1k48k35O50k96lK39j34
4231A00N6k95r5K94K5L57n54J94j03LO7k99R3K19J88k98O4J92j07j7k09j52O24
$$ y = [25, 52, -27, 5, -15, 35, -197, -162, -103, -13, 234, -99, 61, 20, -1, 7, 60, -192, 339, 95, 104, -158, 212, 160, 67, -106, -26, 78, 181, -217, 90, -136, -163, 2, 91, 99, -128, -112, -256, -90, -78, 287, 367, -112, -315, -331, -103, 218, 30, 19, 25, 134, 57, -117, -47, -64, -108, 13, -151, 64, -140, 186, -86, -117, -215, 80, 69, -13, 77, 73, 128, -117, -393, 25, -286, -136, -521, 23, 9, 318, -133, -18, -177, -25, 285, 116, 132, -189, -193, -7, -38, 84, 277, -93, 186, -255, -225, -84, 97, 11, 19, 100, 182, 307, -27, -76, -99, 97, -89, -63, -85, 51, -48, 40, 200, -58, 59, 234, -160, -240, 160, 37, 51, 108, -294, -213, -171, 79, -358, 149, 27, -204, 114, 103, 215, 163, 4, -15, -112, 175, -233, 183, -6, 98, 260, 161, 202, 100, 118, -48, -214, -53, 30, -61, 83, -334, 102, -30, 86, 127, -121, -356, 294, -2, -5, 234, 100, 156, -139, -234, 60, 85, 442, -112, 82, -21, -18, 49, -250, -157, 62, 250, -48, 16, 208, 101, 84, -125, -277, 347]
4254C47m24J44j72o8K70Q1k61j41L64J45k30j3k91M0N04l85k9J4J15j26k99M00
4276a5k64N95k54J45m3j46O8M6l29J35j54O9L9k5K51k9k31J04K73j60K00k05j91
4299a21j21O83l57n6Lj7q2L84m81j28M24l8J71k08n8N2k80J30J97j0j34J37j24
4322c4P4j38Q9O2K4j89J81j78L33M1k02r0J46l8k28N36K2m73l83K54K51j58j70
4345b68M31k00N3j40J69P7j19p5N1j4j39L18j18L0l07J19J92j71j7L29K62m78
4367a5K2j05M45j34j30k17K18J90k40k3kJ3k9J45L1l38M56N9j65m35O33r8j89
4390I2k00OJ58k49J35K5O2L9l17K13M26k26K2n0j43j03J28j21n8j6k8J61R1k19
4414a72J79j47K88l64K19l2j09J72J17r7J61P7m92j06K01o2K89j53K95l91M30
$$ y = [347, -77, 67, -105, -173, 97, 178, -83, -224, 140, 285, 55, 42, -249, -209, 295, -90, -119, -105, 10, -116, -415, -15, -279, 316, 62, 207, 164, 18, 86, 132, -197, -62, -216, -147, -108, -133, 118, 89, -142, -38, 235, 75, 275, 70, -121, -242, 441, 84, 28, 31, 14, -68, 316, -165, -293, 131, 93, 264, 56, -2, 50, -230, -100, 97, 87, -47, 90, -34, 40, -98, -9, 53, 77, -112, 69, -109, 224, 265, 63, -27, 119, 81, -147, 389, 411, -62, -445, -191, 60, -98, -268, 163, -37, 16, -124, 45, 122, 3, -72, -21, -35, -174, 144, 26, 56, -251, -132, 60, -111, -128, 201, 463, -15, 7, -98, 347, 213, 83, -134, 84, 274, 34, 11, 9, 22, -7, 138, 169, -169, 287, 346, 181, -254, 379, 281, 92, -108, -102, 56, -193, -58, -33, 29, 68, -249, -36, 390, 164, 186, 136, -7, -110, 18, -103, -161, -177, -205, -44, 47, -172, 7, -140, 148, -216, 3, -29, -138, 34, 151, 54, 215, 292, -200, -306, -105, -167, 122, -31, 264, -127, 303]
4435C03k64k63K33o6M4J85o05L87N7j24J50r1O0J19Q0k27Q3M2q5Q1n1n3K7K0Q8
4460A30l69K29J19M6l58LpK01J13l17K20L66l01J13n71N11j46J55j47k02L16o
4482I8j11KQ7j29K07m1o0n3N0J25m58O08m09K98k48k78N85n60K49m14J49J58L87
4505B42j10k87M38n1p6Mm81pK67L32l95j04M1J82l62N33m06L93j62J00l44k7J47
4528a33j71K46P7P5n3L3r1k54M73%j31j37O3o7k6J65k59J60k7J81l79K38J63j29
4552A7l1J04n2m3j81P1L33k61K94j89k70L87J71k91k48K61j52k16n7N16O6l10
4574h1J52p8l27P82m76O9K8n04N65j64K3N3j13J87N2K5l58K85j11Nk65K62j3p4
4598g6K55k54L23l16K9L0J4P3J11l02N8Q4L0o5J23n20M30J9j62l7J74L8j3q4J81
$$ y = [303, 39, -224, 9, -57, -13, 172, -433, -46, 11, -113, 37, -54, 6, 125, 205, -22, 61, 103, 18, 99, 48, -5, 22, 42, 130, -239, -10, 109, 155, -203, -200, -207, -6, 107, -210, 10, 376, 75, 188, -383, 128, -18, 137, -10, -212, 104, 98, -13, -11, 76, -53, 154, 113, 53, 0, 50, 175, -283, 325, -84, 214, -34, -312, 273, -287, -38, -452, -303, -145, 242, 132, -155, 283, 232, 156, 160, -321, -328, -61, 271, -124, -228, -187, -5, -367, 166, -240, 153, -9, 91, -253, -280, -133, -304, -58, 19, 94, 41, 74, -17, -271, 202, 202, 71, -66, -3, -70, -96, 69, -190, -30, -57, 124, -255, -17, 146, 17, -14, 90, 38, -5, -186, -115, 218, -43, 251, 62, -208, 179, 350, 59, -189, 72, -80, -296, -353, 163, 229, -81, 71, -7, -334, 448, -28, 41, 69, -435, 130, -34, -11, 42, -71, 116, 168, 193, -165, 120, 9, 14, -251, 11, -2, -76, 179, -75, 248, -68, -39, -9, 5, 78, 189, -113, -55, 29, 59, -6, 117, -403, 27, 46, -116, -153, 21, 59, 46, -38, 143]
4623A43j36L39k61o9l89N13J30j90m9j90Q5L20k32m73P48o2P5o84M30j21J30p2
4645a5p7J39J6k2m5M4l79M99l58K64n8J81k36j39m3L67q2J84j57k52L33O1k73
4668d8l5K48j63K37l68J79r7R3nk03L1K90l5l19K7O3Q9j37k32L38l50L64j16J6
4692a33L8K83l02J96p15N61N3l0K53k66l3m6M2J27j33m8L90k44k79J8L59K75m33
4715f7L25l78J21j91K19OP0j76L2l7%J1j5n7N1L2j35K14r5J14K26l17r7J45L3
4740C4j21P0j98K98k17K04Q8n36K58j4k29K29J90q8J7j44k4K24r0J00k04M0O3
4763e0j87K34q4J39R7o9q0J31l3j3q8j97ml0K45J47j34j79p9M23j31j96K47j16
4787gJ13m5m32N12q7J59j90l3J47l3r0M7J63n45L71j32J54J54QK9m54J73K95k71
$$ y = [143, 7, 346, 85, 16, -373, 140, 270, 80, 31, -159, -74, 246, 14, -459, 289, 227, 302, -382, 48, -73, 57, -15, -92, 47, 63, 41, -4, 40, -339, 160, -198, 66, 8, 189, -47, -186, -229, 138, 56, 240, 83, -169, 164, 225, -48, -83, 165, 2, 239, -129, 50, -47, 46, 41, -162, -131, 159, 124, -195, -168, -105, -16, -153, -385, -47, -397, -33, -149, -133, -95, 188, -114, 82, -633, -72, -19, -49, 204, -62, -95, -141, -99, 28, -105, -153, 237, -7, -286, -268, 91, 366, -67, 258, -120, 1, -190, 29, 35, 105, -71, -39, -76, -76, -65, -80, -137, -86, -54, -189, 25, -70, 44, 270, -47, -144, 1, 34, -87, -17, -215, 83, -134, 70, 158, -378, -120, -134, -363, -134, 56, -32, -15, -159, -183, 41, -49, 51, -153, -113, -50, -237, -3, -87, 52, 149, 80, 0, 131, 98, 85, -3, -200, -204, -234, 11, 158, 24, -155, -234, 189, 58, -138, 109, -7, 106, 61, -371, 141, 54, 213, 23, -10, 137, 104, 14, 61, 224, -321, 50, -82, 72, 226, 234, 263, -191, -18, 277, 6]
4811Fj72K00o0K5M0j65J89j75K23k04J82K65m23q7j49J84L69l59L63k67r2L67
4833B60J3n63M20j20k56K99Q6l8O9K33l34k98J7J75L44n62L82j58J75j31j91J60
4855a8j57L23o5j8M4j37Jn2J05j71J94J31o0k16q4K74j79K40k30o4K37r7l1N6
4879B6K99k27j57K69j41k70O6k54O53l95K47j38j24L24Jj22j70J95p3k33J61m8
4901a11J46j20j5K7R1o9j5k26K78k78L05M0j32r7J57J79k86k45K38K56j5j81n7
4924a30q9K55k14J85j11n2K90l04q3j08N05k89J28K98k54J55n34M67l14K76j23
4945d6M6j19k09N53p5k08K45M9l25M8J35K27j87k29qQ8R8q3M4n2l6R5J33r8k03
4970a17M57k34j13k82K71J90J10j58m55J78K52M6n6l62P1K16j48O4k02J86K72
$$ y = [6, -166, 34, -26, -1, 39, -126, 63, -112, 111, -93, 89, 354, -69, -156, -305, -121, 248, -111, 252, -15, -107, 260, 273, -290, 130, 10, -246, 53, 139, 101, 170, 403, 69, -229, -212, -37, 307, -255, 127, -31, 144, 13, -178, -18, -175, 148, 83, 65, 109, -28, -27, -79, 26, -145, 49, 180, 120, -96, -180, 94, -85, 155, -75, -139, 98, 1, -30, 26, 325, 98, -59, 210, 69, -201, -135, -389, 264, -131, 116, -22, -146, 178, 179, 57, -113, 82, 9, -224, -63, -111, 35, -85, -100, -73, 18, -51, -66, -292, -14, -292, 13, 53, -79, -176, -19, 160, -126, -371, -133, 123, 108, -73, -130, -219, 36, -178, 7, -104, -156, 134, -170, -253, -361, 144, -145, -17, 281, 27, 182, -352, 115, -199, 77, -46, 0, -119, -328, 225, 150, -58, 187, 236, -89, -41, 94, 321, 134, -95, -103, -15, 83, 0, 44, -8, -44, 51, 184, 86, -117, 340, 106, -7, -289, -18, 172, 282, 124, -331, -153, 99, 145, 89, -273, -202, 14, -134, -70, -272, -86, 186]
4991A86j42O6k52J57m5L1L1K04J61o38O36n70P8N14m17K7k7K7N7j81k6k32Q1L40
5015F6m59L71r3L19l27O4J60k71J55m2Q1j52n6P9m0j10L13l31P8K29pj44j44J60
5039a01J27J70l7o5J54l06J85j72L33k83j65K15j16k7j89N40Or9k57N24k87k46
5061i6R9j29j25L48n0k41M47k03j06j64L62k59K4J00k33L24M9k17r5L39p5P9J3
5084A91q2j97K35k09K2j74L65J53k94j63R3J04L26m39RK25j97J35k04L40Kk72
5106c1PK18n66N28p3m29J34O0O17j97l30r9J74J92m0r8J22p1J2o4j29K35j52J28
5130A48j09K03k27q5L6k33OK09L07l67J03l88O26j33l38m3M75m5Q2l60K65k05
5152g3Q2j82J50M76m93l7N3q2Q4l3k8L7J14j53K9k57J31L14q5J75j08p6P0R0m44
$$ y = [186, 44, 110, -142, 15, -30, 1, 32, 236, 397, -241, 395, -175, -97, 417, 0, 27, 0, 27, 84, -97, -123, -355, -274, 66, -393, -22, -115, 204, -123, -59, 101, -170, -15, -57, 24, -128, -184, -105, -145, -255, 58, -273, -195, 34, 27, -117, -261, -101, 26, 196, 159, 94, 248, -58, 127, -45, 288, 5, -160, 55, -61, -88, -277, 263, 269, 170, -87, 437, 150, -96, 3, -126, -251, 97, 47, -194, 253, 50, -56, -220, 142, -117, -93, 7, -226, 98, 147, -70, -165, 174, 99, 178, 191, 109, -88, 147, -62, -40, -214, 151, 304, 10, -153, -60, 44, 370, -69, -60, 165, -32, 103, -101, 239, 241, -31, -24, 194, -372, 156, 83, -346, -212, -152, 465, 268, -62, -161, 13, 205, 165, 67, 189, 118, 130, 66, -63, 172, 20, 148, 39, 242, 15, -70, -34, -267, -261, -52, 255, -112, -9, -397, 229, 96, -242, -285, 190, 145, 227, -133, 132, -73, 9, -173, -23, 453, -40, -77, -24, -106, -22, -55, -83, -46, 68, -85, -56, -313, -182, 132, 47, 222, 114, 38, 108, 198, -246]
5177b46M99l34K75j80k30M35k75KR8k16M42J13o19K19m7j9N3l10L28l33K25K85
5199A65k80K97n61N68k22k16L82l70K74j49m43L79K94k2J92m67J05K63k37J5l30
5220c63J56K52j50j4j05L14k7j46J13p1J47q5l0J8J58k41q8J31n7R7J09j42k19
5243b43M90k58j77P9m1K84k09J00n1R3m7P6k61Q8K23k81l0j57M61l47N18m16r7
5266b03L08j5l75K55m7O5J8l08K46J00J65k45k06J61L3J64j73m7J6J3J98l96J03
5289a70M08l55K73l53R7n4J32L1j97K63k36r7J4K50j71K02k03J15Q5R6j78m4K32
5312A40j41K88m10L17q2K36l53M2j91J61M60l44l0j16O3k66J07J14j15L06l8j52
5334dp6q4J85K46k90LM4Q5j78r3K49j71J40q4JM1k67K44l2k08M7l4K76J28k86
$$ y = [-246, 253, -81, 194, 14, -216, 219, -56, -54, 44, -172, 270, 383, -236, -17, -64, -83, -30, -340, -12, -345, -120, 165, -115, 182, -379, 189, -33, -249, 133, -237, 37, -112, -555, -176, 118, 96, 288, -179, -74, 189, -48, -33, -363, -207, 45, -105, -119, -224, 90, 63, -83, 30, -41, 106, 21, -9, 9, 167, -74, -162, -31, -88, 9, 118, -24, -243, 247, -11, -188, -109, -150, 134, -75, 25, -26, 67, 20, 96, -165, -77, 146, -135, -165, -322, 139, -208, 310, -106, -203, 105, 90, -285, -30, -77, -12, 6, -302, -56, 44, 209, -36, -242, -81, -48, 116, -57, -104, -88, -75, 123, -273, -170, 238, -117, 156, -197, -100, -154, -22, 9, -188, 75, -161, -258, -244, 6, -165, 37, -166, -51, 34, 130, -48, -92, 140, -1, 287, -123, 194, 112, 348, -5, 37, -154, 7, 467, 123, 93, -23, 40, -226, -119, -5, -120, 186, 148, -4, -80, -164, 21, 267, -23, -20, 24, 109, -69, -162, 87, -84, 56, -28, -27, 14, -253, -9, -41, -249, -202, -236, 40, 168, -118]
5359a18J03j3K85m75l6L24r5Q0l40J63K55j28k6p4O9L89l42j08K52l52K27l4j44
5382a38L78j28j57p8j1R1N1j42K95k08J97k25J36j00Q9k89K43R1oj30J44j81k45
5405c23M96M7j51j28R6j37R5l3l29K2L09k6L27n56K90j86J92J66Jm16L54m23N3
5428b60J88J25J17n01L03J62l34K70k34p9K45k24N8J80K49l66p9K05M5Rk85N5
5450a51L23k27J13J06m85J82J98K22k23l25N25k11J10k11QL5J35j29k56K33J55
5471A27O2k95q7R6L5J79N3j31M9l53L95O1n07J77k04M25j27k3j2N1j50K12j88
5494a55P9M6J60K12l93K58l03q9j78L68j0j83M0K75j17k46J52M51k75l94J57K60
5516A15j02n5L12k54RJ15j06K51m76K44J44m87M33k39J53j71j51k05M97N0L4N5
$$ y = [-118, -15, -28, 257, -218, -254, 70, -25, 55, -285, -122, 133, 5, -21, -95, -26, 363, 21, -87, 165, -187, 40, 6, -138, 240, 112, -45, -123, -134, -43, 8, -134, 161, -47, 150, -75, 61, -39, 50, -239, 4, 95, 89, -41, 103, -78, -323, 173, 220, 69, -59, 37, -100, -5, -38, -367, -345, -36, -62, 265, -291, -1, -187, 5, 171, 172, -244, 110, -313, -260, -72, 53, 170, -331, -28, 134, -200, 70, -164, -243, 2, -222, -164, 16, 265, -101, -180, 25, 70, 79, -206, -151, 172, -55, 58, 164, -321, -139, 59, 281, 58, -267, 258, 47, 157, -54, -46, -11, 124, -5, -261, -28, 127, 189, -106, -193, -97, -62, 117, 170, 39, 88, -265, 130, 191, -316, -139, -343, 82, -45, -68, -80, -29, -179, 33, -155, -76, -30, 130, 342, -51, 207, -96, -185, -363, 5, -5, -188, -148, 127, 10, -236, -84, 367, 92, -302, -145, 115, 13, -42, 270, 16, 25, 140, 34, 285, -191, 53, 197, -290, 143, -96, 57, -114, -265, -470, 27, 77, 111, 166]
5538A66n79J09M53k05M4R6q9N4j03K5m48M09J40j97M4J12j46rK7J9p8J72j6k5
5562b5L02J43m25l38M05q1k06Q5K8m0N9j48M9K78k02l0K3O5j33K76j89O2M7N6
5586F1o9M7j03K56r1k30l6j7L31r6J5mq5J02k49Q6J77j4k8J32j89j10L74j30o0
5611G0K4o4M46l42J4l60Q4K25J12l02J60l54L00j74J67j08j64O02m79m8J53K2
5633a6j6l08K41j26L29r9N9L7Ml97Q4o9J51J55K08k75j55J58J50L3l53M75l09
5656c9r2M71o79L02j5J31N0nj23j26K33J23k19J87k58O0J06q4mn5j39M22l88K62
5680A21k6k11K4K23j03k04L67rk92J56k3q8R6qn0j92K26o6J68j55L4Q1J38j46
5704F1J40k75K0O8m0K7j21Q5j16J63rO9j01J81j00r8o0L73l89j25M51j09Kl44
$$ y = [166, -413, -304, 149, -56, -12, 84, -5, 49, -54, -29, -477, -68, 72, -125, -81, 31, -115, -124, -97, -78, -156, 16, 0, -25, 277, 420, -5, -343, 62, -19, -225, -140, -112, -152, -93, -241, -192, 86, -116, -146, -123, -58, -191, 85, -104, -42, 5, 61, -8, 39, -64, 192, 101, -129, -165, -182, 149, 53, 68, 64, -21, 81, -168, -82, 95, 81, 53, 185, -4, -114, 260, 130, 70, 94, 30, 476, 134, 148, -212, -128, 97, 209, -93, 67, -287, 13, -161, 6, -102, -266, 336, -143, -191, -38, -16, -32, -340, -99, -225, 104, 5, 64, 101, 105, -292, -208, -277, -126, 29, 237, -38, -193, -35, 115, 148, -205, 270, -39, -131, 340, -339, -37, -52, 79, 129, 124, 1, -125, 108, 231, 12, 199, -59, 1, 107, 23, 19, -36, -175, 247, -141, 121, 95, -116, -92, 131, 28, -176, 191, 182, -110, 46, 23, -65, 31, 23, -27, -219, 7, -59, 109, -46, -12, 69, 207, 61, 201, -74, -54, 14, -26, 1, -120, -35, -151, 12, 3, 72, -29, 152, 52, -46, -106, 267, -122, -247, 204, 95, 97, -247]
5728b47l9J27K48j52J18J74j75j89J99k8j44J77k83J40%J73k75R8L4L86o4m07
5750a29M57m20P1J25O0k70J27j29K7j6n5K70r5K55m05j65J61K19R3k11r6K32j8
5773H8k23K57O0l00R0j3j35K65n7Q8K7q4j53K32n3j45J68k1j18n7K96j96j65M27
5797B78k96K68k09j05np3L67m42Q1K3J35P2J65Ml67J17M0j69L17j1j86L8K89l31
5821@k84P21l96l08K52l5J39J6k39q7M3J20J19N1j46K93m16j83M21j34J91m35
5843b97M3M55k85K1K02j53k19K41n9J12j00R2L61m41J02j99J9J63J23l36K87J97
5865C29n9m96K25J55p3n0K20k13J05N0k31J02o2n7L1J35q1P9j08j98K57K05k13
5888E2k73K86m4J29K24n61J1K77k8k15K23n8l9j55J4J77J37k72L15m55r0M05N3
$$ y = [-247, -286, -159, 89, -63, 55, 229, 54, -135, 64, 36, -108, 69, -214, -74, -74, 99, -176, -78, -44, 342, 278, -129, 328, -92, -21, 104, 164, -106, 21, -108, -81, -97, -152, 118, 23, 278, -127, -292, -131, 88, 181, -30, -126, 106, 88, -135, 122, 182, -118, -28, -41, -176, 89, 32, 120, 147, 63, -90, 142, 89, -56, 112, 91, -27, -84, 212, 16, -149, 278, -18, 250, 41, -64, -69, -142, 225, -217, -136, -113, 22, 94, 259, 263, -104, 13, 53, -116, 201, 190, 4, 42, 331, 0, -284, 437, 41, -267, -15, -50, 89, 105, -134, -221, -178, -58, 61, 112, -34, 259, -157, -340, 81, -53, 138, -297, -254, 201, -84, -63, 139, -14, -233, 8, -51, 61, -39, 53, 414, -27, 75, -124, -105, 58, 181, -155, 132, 329, 270, -226, -1, 154, 81, 31, 251, 38, 143, 193, -38, 64, 2, -55, -24, 111, 30, 109, 1, -197, 60, 265, 52, -221, 65, 21, 150, 374, -187, -176, 101, 73, -142, 81, 23, -16, -171, -157, 20, 157, -115, 200, -255, -345, 60, 113]
5911A13k2L15q26K23j19J66o9K32k39K92l09L64j95K5nP1P4j54j02M9K72r6l44
5934b84M61j47J69m78N54l55n8J06k7K26m29M54l08N8k75M13k49J20J47R9l30
5955a33p1O36k97k10J1K51r4m94M71k22J94J54k43r5l4K1J46L30j78P0j34j85
5977a06J64l9M4K39J4l29k95K26K88j9Pl84K94j36O4j98J4K20kk29J57K76m44
6000a74K66j8M41o01j6L09n3l05K21j21R2k94L78k24j0K86k01J9k70L86k19J09
6022AM5m1O0j20Q0j56J25M7k22p1J43K35J3j16J70k90J45j44M26j71j9k12K62
6045A90l11L83j13j76J6K05l93L8L16k05K14k48J64q2N9m8k57M30j59k07M03k19
6067@p0N7j8j34K66r8j24M4j33J66J22j50m6J02K52N0j42j57K60j02M5l10K2J6
$$ y = [113, 91, 406, -420, -197, -316, -150, -219, 13, -226, 66, -243, 121, -74, -49, -54, 17, 91, -63, -165, -116, 156, 60, -284, 177, 30, 199, -279, 275, -80, -138, -32, -59, 167, -262, 192, -116, -58, -333, 80, -169, -49, 98, 197, -133, -204, 432, 135, -75, -64, 187, 93, -401, 70, -152, 42, 196, -47, -142, -176, -155, -9, 321, 143, 213, 79, -106, 58, 19, 63, 302, 316, -13, -308, -82, 206, 187, 194, -190, 104, -32, 32, -166, -152, 68, 66, -163, -6, 270, -174, 92, 74, 515, -86, -102, 207, 154, -151, 70, -51, 41, -253, 125, -99, -109, 177, -24, -5, -275, 111, -108, 1, 46, 5, 65, -55, 25, -131, -6, 41, -181, -252, -109, 126, 139, 23, 193, -97, 48, -96, 330, 159, 140, -72, 190, -121, 262, 149, -27, -11, 194, -199, -161, 155, -50, 164, -84, 80, -2, 57, 9, -248, 182, 23, -184, 219, 0, -70, -13, -31, -165, 101, 3, -121, -77, -210, -44, 78, -72, -118, -16, 236, 286, 144, -13, 247, 145, 190, -120, -98, -82]
6091h2n8L53n08N39k18J45o6k11N0k64L69j1J59q0O0k43J29k36L69J2k68N3L0
6114B3J92l04L85n98K61J63k96K18j40J34J10k70J01P5Q5mk09j62K97k54K2L26
6136A55j08n7N4m8K53J28n26K27k98L11j65M4M2j33J86k72K59k35L43m5j5j13
6158a3r8K0K77k64j98L10l96M00k26L18n7K00j49l81K78K41k5j79k45M80m12J60
6180D1l08J77J72K08k16j03L4r6J54O8m29L73M8j64q2J08P6k5j71M78k63%k23
6203a43J9M20l92M9m2J32K0m47N99m06J42L22m7K1k51l6r0J74k61N04k11n7O0
6226G9K02m58M09n18M47l01J02K21j34j5q7q0M62p6k31m10M31k60L22J82n39M44
6248A92j75M1m0k86O0Q1J41j21K15k49k46N46J48m78P7K54p2l6k03J17o4r2L56
$$ y = [-82, -140, 213, -295, 244, 26, 171, 105, -106, -56, -320, 49, 38, 197, 117, 177, -66, 63, -173, 196, 208, -60, -7, 23, 215, -89, 296, -302, -41, 122, -174, 44, -96, 38, 148, -122, -21, 54, 139, 135, -74, -236, 61, -193, -171, 155, 47, -10, 44, -4, 249, 377, -149, 78, -220, 91, -74, -30, 12, -121, 65, -207, 52, -183, 160, 115, 100, -13, -111, -91, 186, -78, -276, 34, -362, 38, -188, 130, 73, 273, 124, -257, 21, 262, 237, 58, -187, 293, -119, 41, -267, -90, 82, 290, 74, -29, 5, -91, 63, 131, -298, 75, 123, -41, -123, -15, 61, 36, -135, 343, 80, 80, -143, -124, 296, -96, -47, -89, 43, 63, -384, 215, -191, -49, 273, 226, 247, -4, -40, -130, 44, -217, 287, 76, 19, 79, 281, -177, 232, -286, 161, -140, -38, 183, 49, 34, -53, -133, 329, 253, 22, -388, 43, -217, 105, 287, -252, 192, 17, 58, 18, -268, -208, -127, 14, -107, 108, -141, -387, 159, 307, -171, -94, 160, 88, 52, -151, -34, -98, -190, 166]
6271A66k50R7j9k01K51k08J50j73J10K3o3K15k31K44p7k98L31k66K71k83K8J24
6293e9J67O6k69J8k28L27L5Rj23K18j94j26N02l28J30Lr9J79j92o0k10Q5K06k25
6317a68M31k62l2j08R4J1l7J20k01P7K75k62q8J44R0qJ17l14k12M06kj56K84k61
6341f2j77n3K04j46P7K36J0l24K85M9j46o6N1N8n2J95l20K5K94j68O5l0l1j23
6365a49m2J95m1M5K2N5k70K75n2k79L14J35l03j15L2J21j1K80l23J07J96j17N3
6388A28N7l34K80L0l02K69n9j91K95r3j27J19j58mj1m7r5L44J60L7l84P8M5K6
6412F3j62j4L06m38J46k49J86m1M33n47M06j96J60j49J96j17m9pp1K63K02m52
6434a31n9P6K31N5j87j29J83J94r8k51j12K10o8N6R1l65K69O9k4q2l13K85K89
$$ y = [166, -84, 13, -6, -207, 44, -164, -14, -187, -77, -54, -117, 98, -133, 111, 34, -264, 67, -199, 72, -211, -183, -59, 108, 174, -95, -77, -305, 22, 57, 66, -57, 161, -33, -159, 343, 15, 145, 148, 49, 228, 36, -24, -234, -149, 57, -168, 263, 1, -31, -139, -45, -34, -71, 49, -152, -75, 200, -62, -150, -6, 84, 76, 193, -121, -333, 73, 71, -85, 199, -62, -239, -292, -88, -234, -157, 79, 89, -235, 50, 99, -47, -113, -62, -4, -56, 139, -181, -156, 138, -30, 35, 5, -26, -149, -191, 4, -37, 8, 30, 85, -185, 90, 38, -241, 73, 208, -95, -210, -178, -57, -68, 212, -111, -4, 192, 75, 128, 185, -149, 131, 161, -141, 128, 69, -122, 173, 80, -47, 72, -86, -90, -101, -148, -243, 101, 261, 298, -86, -8, 37, 63, -99, -113, 193, -245, -99, -348, -162, -203, 230, -317, 89, -107, 53, -96, 100, -17, -66, -73, -144, 119, 321, -131, -190, -114, 117, 172, -15, -144, 39, 233, 135, -116, -228, -18, -86, -30, 61, -304, -35, 34, 10, -72, -385, -100, 189]
6457A89J45m77j75J94L49k52J12k56K91j11J87l72l16M99R4j57J07l06PJ14L00
6478A66M3n50N25k63K85k76OK66j51j9K28j54l15M43k21O4J3m1J4K01j0m38K20
6501C6J45j31j7j90J84j62J74j45K00q8j33K73n1l6k22L23j00j90P6j3k6k4J64
6524D7J58j66M6r3K46k54N4K8J00j82k65M52J00k97p8J00l5J53k60J21j69L29
6546A35Q4m93J42K06j72Q1J26J1j82L35l83M9O3J11R1k29j09N0L08J8l14M6l7
6569f3J16rj64J46j74M4J26J06q2k39K75j34O5j64N7M3R8o4J50m7j81j0L0M9j22
6594a48J30J10p8k23M21k00m49K89K34J14k38k5J64j24n0K45k78l81N81o9N9j35
6616e1j91K62o1n5J42k67N1O6JJ95l17j00L78k16L29o9k33J00%j23o6K36J8kN2
$$ y = [189, 334, -143, -318, -124, 225, -27, 85, -171, 120, 9, 196, -176, -492, 7, 101, -56, 51, -255, -248, -134, 166, 209, -341, 184, -79, 206, -70, -64, 202, 51, 32, 260, 106, -209, 234, 13, 77, 90, 49, 63, 264, 254, -184, 36, 181, 50, 33, -157, 27, -135, 39, -106, 94, 6, -127, 146, 95, 59, -163, 160, 60, -130, -54, -67, -93, -117, 47, 205, 39, 85, -8, 238, -16, 38, 66, 166, -16, -281, 171, 271, -26, -104, -4, -39, 114, -146, -25, -194, 135, 219, -274, -132, 74, -98, -17, 109, 120, -62, 273, -110, -61, 2, 113, 204, -25, -134, -84, 224, 242, -72, -26, -63, 53, 44, -120, 26, -148, -104, 22, 128, 46, -193, 82, -52, 13, -151, -94, -51, 47, -17, 133, 86, -95, -105, -75, -26, -148, -18, 92, 14, -209, 212, 12, -437, -148, 86, 200, -38, -63, 101, -23, -73, 172, -106, -487, 94, 25, 84, -51, -242, 20, -41, -96, 46, -221, -170, -104, -103, 92, -225, -325, 53, -163, 166, 97, -136, -36, -36, -159, -225, 11, 29, 27, 79]
6641G9L1M1J18k58j87J89j44K17k96J76q0K28k46K11j87J08M0j35qj57N9j44M14
6664F9q6J32J07l24P8J78n31J13K12O0Pk26K50p2r9K75j82L9r9m3J63k21OL14
6688A20j32m1K35q3l86J56K58l31K11K11k06l3K14j53n58L12K94m63L1N79j49
6709H6j65L0l59K09L20j81n2M7m38P72l99o8J49K6O9O2k71N2K43J37l04J95j54
6732FL6j40J83l59J43K45k15J74k92J28K80J72n84M43l82J54k0J08l0k39L17o9
6754E9p2Q0j27J27j3K6O6j01m5M3n0L5j73J66N2l34K88k9m1N3kk38R9r2J92k8
6780e9L30m12R2j2l26L09k42P21m01L86m28P0P2j95R0oJ85l80L78j87R2J09j94
6803hJ36n6k7J68j85j78J02rN4j46l2J02Q2K58l97J77j52L40k08n1n4j69K2K65
$$ y = [79, 110, 151, 269, 11, -176, 13, -131, 86, -210, -34, -114, 114, -132, 79, -108, 0, 40, -95, -103, -260, -201, -345, 69, -17, 115, 222, -102, -24, 154, -377, -264, -52, 8, 15, -211, 39, -33, -132, 143, -39, 0, -99, -142, 21, -200, -194, 120, -12, -53, 182, 99, -287, -131, 127, -204, 7, 218, 12, -21, 193, 40, -518, -206, 88, -375, -344, 235, 86, -79, -49, -408, -199, 121, -60, -112, -65, -503, 269, -130, -198, -49, -23, 46, 108, -163, -111, 132, 269, -35, 160, 6, 42, -98, 85, -274, -131, 114, -101, 73, -219, -91, 189, 361, -223, 220, -162, -8, -28, 80, 50, -189, 128, 59, -13, 67, -60, 67, 54, 80, 146, 45, 0, 43, -7, 28, -145, 21, 73, -261, 27, -2, -43, 10, 8, -230, -131, -223, -31, -59, 271, -141, -49, -61, -387, -78, -320, 401, 0, 386, -42, 28, 100, -95, -5, -11, 174, -206, 172, -15, 77, 186, -8, 128, 72, 45, 213, 28, -150, -48, -57, -3, -149, -181, -79, 3, 261, -136, 41, -111, 229, 21, -30, -84, -253, -231, 34]
6827C4K80l87J65k99J08K51P6k20Q7k4JJ78n3k43j2K55j70Lj41K27j25k82L70
6850G9k16J59J00j0l86M09k90J91J03m70L85j71L32j99q5K58o2l96K73j1p2M1
6872c8K35k39j31K08j31L40o4m53L7L90QO1j70J42j80K9o8N8k11j06J00K97k25
6895a11M36k22J63q7m00L20L0J10n75L86J40j08k06P2K7J94j56K43k97M76k30
6916B05m03m9L66R3j83N5q1K1k42J22J59k73j67M71J90j47j89j83N22j68q3J19
6938A55k82j18J30j14M2O0M05n28J09J56L1N1J54l39J97m09N3K99N3j9N2j46J4
6961Fl7l34M26J15m27K81j58L75j51r6j07k27P5K17N0j86j43M97n54L61j98L03
6983H8K21l80r0L19k35j65K67l39N71l86RJ18p5J15j9j56M13M8k85j34K03k44
$$ y = [34, 314, -73, 92, -207, -99, 152, 228, 8, 95, 71, 72, 250, 197, -46, -58, 197, 27, 30, -111, 116, -9, -291, 79, -137, 22, 122, 112, -274, 135, -155, 36, 139, -331, 54, -117, 215, 16, -69, 189, 127, -269, 4, -7, -79, -38, 197, -42, -173, 35, -96, 244, 180, -273, -236, 154, 162, 223, 53, 195, 15, 44, -24, 34, -177, -283, -183, 114, -111, 325, 103, 266, 179, -221, 99, 129, 239, -336, 50, 190, 82, -124, -52, -25, 169, 13, 256, -41, 435, 205, -198, -247, 119, 212, 29, 84, 3, 24, -218, -96, 63, -210, -377, 94, 284, 137, -52, -235, 287, 119, 36, 155, -127, -245, -115, -229, -187, -127, 278, -250, -141, 15, 46, 97, 251, -88, 109, -300, -247, 52, 105, 86, 138, -8, 6, -31, -365, 61, 176, -251, 30, -128, 247, 96, 0, -107, -334, -259, -42, 8, -178, -321, 176, -378, -17, -215, 88, 309, -71, -161, 158, -77, -242, 25, -314, 257, -129, -120, -2, -77, 38, 19, -137, 276, 324, 39, -95, 108, -136]
7005a36L60j24K01j01l26J05R6k16k2M1q2J4Q9J73l23K22L1K4j92J57J13Q1l35
7028a50M3L0K22Q3k60N3R1k41P7J23j03k9K15j16k43Q3j03L51k67M1J40Q0k11
7051i1J27M1k8l6L51j93r0l24J55n0K22K5l77J2L58l27J79R1K20j34m2M8l11L92
7075B18k05J61l27qJ52qM7M4j78R8j36l85K83K99l08o3K45r4K53j07n4P3L2J80
7099B12q8J91o15J42J63L8k59j9K09L9L6m1k49O9J19L8j98K03j78k99N81K9l9
7122H4J06j82J1j51j35K93r8J31o9K52p8Jk43J21M1Q2j12l9Oj41Q2k74O42l22
7146HK35k61K76k05j55J50K10l41K87j86K8j9j88N98l7l60j4k08J85M9J12q8j3
7169F3RJ67l54J64J4P2l18M18l80o9P8K09j54O0J00J61k77O6m1J85r3m0k35K78
$$ y = [-136, 224, 100, 301, 200, -126, -21, 75, -141, -163, -122, -204, -190, -101, 72, -251, -29, 2, 26, -166, -9, 104, 185, -150, -107, -77, 145, 228, -32, 21, 112, -129, -52, 71, -32, -61, 154, 38, -205, -122, -225, 126, -141, -100, 40, 120, -91, 36, 77, 49, 13, 364, 171, 81, -243, -88, -138, 84, 109, -268, -256, 102, -225, -46, 45, 265, 131, 89, 137, -174, 218, 13, 174, -153, -161, -9, -17, 30, 74, -104, -6, -142, -527, -244, 55, -253, -316, -71, -165, 88, -19, -73, 0, 32, 212, 124, 315, -300, -158, 5, 43, -216, -235, -26, 13, 49, 8, -241, -172, -53, -15, -213, -10, -188, -487, 94, 123, 84, 190, 8, 19, -132, -267, 26, -72, 59, -10, 242, 164, 165, -78, 43, 84, 166, 54, 15, 21, -120, -38, -312, 330, 8, 243, -18, 258, 53, -102, 48, 258, -83, 204, 18, 46, 27, -161, 437, 400, 40, 26, -182, 3, 52, 164, 76, 63, 72, 239, -115, 49, 63, 135, -183, 235, -145, -214, -136, 73, -81, -21, 79, 240, -37, 29, -12, 173, 80, 40, -195, 83]
7193H3K12j17M0r7l75L97j19k39L16k36J60j78K44l00L42l11p3L03j64J37J0k25
7215a90M07p3l24J48J39k84Q4J40k81J62J81k19j02J01Rj2J35K10k80l5O7R2k28
7238a53J61k4J34j26O2p0r5J66J31l72J73J19q2j8Q2M8l78J78R3k61L15k51J8
7261a50L5j49N67k38j34J85k26Q7q3N2m21L74L04k46K03n0M2k76k35M58J79m90
7283b12J05K14k82M58l24K85k02L5k98J58J93l00L33m5j20Kj57K12m4J42j21P8
7305A10k19K56k46L39l02j63K96N1m6k35K02j63K37r8K7k01L7L27k52j10L69K2
7327B38l29p0J87k18K49J12j70j20K42J82p9o8Q8k96J62l11L98l13J09m3k2R8
7349B6R6P4k91j20J35j78M48j46r6Q8p7j12L75k9Lk96R8k81J20L13P9J1l34k4
$$ y = [83, 295, 178, 218, 121, -254, 143, 24, -215, 101, -135, 25, -153, 91, -209, 133, -178, -251, 52, -112, 25, 35, -190, 217, 144, -180, -32, 107, -177, -93, 47, -234, -72, 109, -110, -212, -111, -102, -114, 21, 231, -49, -84, -17, 75, -153, 8, -16, 118, -8, 54, -16, -111, 55, 186, -186, -13, 106, 24, 6, 88, 136, -242, -64, 29, -232, 83, -168, -150, -115, -264, 303, 65, -69, 116, -110, -23, -106, -54, -475, -101, 203, -43, 160, 110, 152, -124, -359, 99, 278, -212, -107, 107, -175, 283, -41, 244, 42, 77, -221, -63, 130, -170, 163, 118, -2, 0, -157, 55, 11, 153, 32, 110, -109, 147, -99, 240, -62, -225, 71, 122, 76, -159, 43, -120, 117, 19, 46, -155, -118, 209, -43, -153, 216, 238, -91, -161, 26, -192, 57, 169, -1, -121, 121, 303, 224, 156, 244, -52, 110, -201, 197, -116, -7, -50, -72, 26, 122, 196, -95, -215, -80, -258, 190, 44, -52, 36, -41, -153, 222, 193, 196, -100, -2, -283, -163, 150, 229, 240, -94, -118]
7373a18J09Q9k02o8L0l5J54J41k54Kj04K07J79j06P3j72k4P5N4j95K72K7j79K75
7397B30k68k55O2L14j12k10K66J6l29K46O5j69j2K59n3k42L55k61K07l61J2J13
7419a27K73l16k7M35k08J21j06j19j60K9L7J67m17M92M9n89K94L38k81K22j54
7440d7l84K45J18N9j8L19l75J80l92L01l8J56j05m59L84K34j08m6K42m62N1q5
7462b30K63m14O69l68O1r2L64p8kj12k54n6L61k47Q6L35k67j60L78m6l62J67J04
7485A00j20J57k62J43j18J17NJ53j59J2j48p1R1j32L71j86L7j5Q4o8M04k77m0
7508G8j21K08j26r1J93k17M01j44k56L3k24K0J46J28J08j30K69k05j91J59l05
7529b67M93k08n9K55k42p9K67k97J66k75n5M64m6j45n5K19m3j38K38k23k47J68
$$ y = [-118, -9, 80, -122, -190, -160, -195, -41, 100, -154, -152, -256, -49, 130, 24, 97, -75, -99, -24, 30, -165, 107, 134, -45, 230, -38, -293, -231, 83, -29, -239, 27, 43, -286, -40, 25, -144, -156, 103, 50, -192, 163, -98, 109, -252, -240, -127, 146, -170, -197, 238, 30, 151, 45, -74, -234, -205, -168, -1, -418, 74, 123, -466, -172, 166, -115, 107, -47, -431, -186, -68, -9, -27, 292, -83, 97, -295, 6, -32, 124, 19, -440, -56, 178, 70, 24, 266, -196, -145, -230, 33, -381, 288, -80, -19, -111, 253, 175, 173, 61, -193, -249, 112, -135, -49, 286, 19, -141, 237, 191, -171, -4, 100, -20, 137, -125, 18, -100, 17, 22, 175, 16, 28, -120, -191, -100, -232, 139, -47, -10, -25, 59, -9, 395, 118, 78, -43, 165, 39, -52, 141, -76, 325, 181, -75, -42, -266, -246, -100, 28, 136, 6, 275, 70, -121, 38, -267, 226, 18, -41, 214, -28, -107, 160, -137, 29, -246, -301, 163, 117, -28, -83, 136, 93, -45, 193, -30, -277, -109]
7551a09J69p2O1j06K77l87Q5j56K97j76nR8qL34j93J36O1n65K75M6p9MQm6qj44
7577b03N4K64J78m58L60k93oR3k21M69l28K58j94P5n0o5N0O3j33R1L1m18L61K4
7601BJ70n05M45j26J25j82m2J38m8J32rn2j28J10J36m59L45j09k98O12l26M11
7623C42l62P6q5K72p3m07K31J56k87K08O1k22J56mj45K42j49L6k89O7J37J37m3
7646E5j12K49J26k14r2L1L5N5R5l27J67k66j3J69J35m2mm4n0p9P9J33L0k6k27
7671a37J74k60J46L7J09M4k19m5K12l02L74p8K72k30k05K28J38q2m29L46r2N1
7693E2r9K83l73J90o7J25l23N86j66m69K50j84M61p1j48R3l80j17K50p2N2J97
7715G0r2J7j7j89J3K41k32M58k01r4P0j1k03L78m37K46K1n2k1J18k41L4L41l05
$$ y = [-109, 60, -12, 49, -57, 220, -167, -82, -238, 59, -117, -122, -24, -32, 302, 109, 245, 306, -259, 16, 62, -17, -13, -5, -51, -59, -203, -149, 115, 293, -165, 195, -98, -104, -11, -232, 237, -91, 167, -27, 48, -2, -67, -17, 46, -87, 4, 35, -383, -22, 2, 172, -333, 112, -14, 111, -71, -113, 25, -23, 109, 100, 48, -80, 30, 166, -293, 52, -57, -355, 257, -69, 342, -20, 56, -29, 243, 170, -237, -6, 150, -137, 71, 132, -90, 66, 62, -83, 159, 10, 46, -243, -176, -39, 98, 55, -57, 192, 318, 104, 12, 43, 78, 133, 228, -99, 68, -198, -211, -42, 93, 51, 47, 3, -47, -126, -47, 86, 116, 90, -137, 37, -223, -77, -40, 69, 113, -106, -151, 61, -241, 133, 55, 327, 97, -108, 120, 258, 176, -253, 93, 1, 52, -47, 236, -137, 53, -14, 111, -212, 374, 208, -261, -11, -195, 266, 195, 47, 140, -240, -357, -107, -179, -127, 70, -22, -5, -22, -211, -198, 43, -189, 269, 68, -26, 44, 33, -170, 208, -229, 17, 38, -14, -35, 83, -158, -124, 217, -88]
7739h8j76K19J06M2Q4k30j81J92K14j45r2OJ0P7J00k39K57l13J81j99K63l27M30
7762A91m7j51L4j74J12q4J14K50j88P6q2j39j35O94m69k7k06L22K9j50K08j51
7784B7p7m8J19n8J7K9j62J60l17J02K42P4k36J82Rl71L85l48L58l79M75k41j52
7807b10L75n3k94P9K97k61j56M62j04K68l65j22K56l1j22K4l34R0L78L3q2j57
7829b9k68R2M63R7j55r3k77K42k65M18j29j8P5j42M6J3P3j28j46J01j02K57m1
7852H4j79L17k05K21k14j26J03k08L42l03L4L33k13L3q0K67M0M8m29J05l1j98
7874b59L46O5n36K12M43j00j09l27K91j22K97R2n33K44k73L26M3k39K57J80m23
7895a25J35P7r6j11N4P9L1j2M8k77J40k1K2J13j32Q6L5J16k44J05m1J25p1k30
$$ y = [-88, -264, -45, 61, 103, 187, -43, -224, -32, 182, 37, -55, -49, -39, 38, 138, -101, 156, -157, 24, -175, 88, -239, 191, 144, -7, 27, -147, -35, -119, -5, 245, 57, 133, 51, -88, -223, 471, 2, -25, -231, 91, 120, -30, 178, 27, -50, -98, 21, -37, -20, 9, -153, 7, -310, -208, 34, 108, -128, 54, 63, -308, 77, -271, 87, -292, 183, -58, -210, 165, 112, -182, -103, 194, -67, -223, 239, 135, 403, 38, -84, 172, 141, 19, 43, -291, -201, 177, 210, 128, -29, -297, -205, 258, 355, 200, 107, -170, 72, -193, 225, 96, 78, 153, 11, 57, 70, 143, 15, -131, -30, -132, 125, 84, -95, 222, 17, 238, 24, -102, 1, -207, 135, -168, -134, 199, -14, 19, -61, 206, 246, 294, -135, -30, -61, -259, 87, 152, -384, -172, 271, 171, 62, -265, 26, -96, 201, 293, -240, 4, -269, 57, 100, -139, 118, 298, -125, 10, 87, -9, -120, -66, 13, 44, 32, 80, -197, -57, -78, -56, 57, -75, 11, 46, 162, -82, 23, -18, 107, 36, -194]
7919a94K93ql83L28r7n8O5N6l84J88J99J37k42j1K36j54J97l02L05l6j44k4O4
7942C1k65K79j27j04L53K54m03j11J00K62n21L92p7k99N31k66K2j97L44k00K67
7963B65k25l00L51k28K15j71j94N52j47jj90K04j79J42k81J00J30J6r6L7K11k50
7985c9K53k72J1J50l36j62M70q9k44M58r4k2j56j37JJ1J71M4o5N7j30J32J49l82
8009b21L09l50M82k19K12k93J64l2J4k8j96P4j7j50K19K35L1l69J14J25j20J11
8031I5k0n6j81M28l16J7m3J90j59L30k56j94M1Q8k26M51k70k54J27L02j83p0O7
8054i2l7j69L82K7l2l08J67j85J3L60k53K68j55J80j43k5l9O3m91P93m99p5L05
8077E5l52K98k9o1p5K8q2L96k60J4k9K05J59l59K08R7j33o1Q7j19R2j68j1K26
$$ y = [-194, 99, 91, -292, 36, -61, -119, -54, 2, -382, -194, 5, 142, -100, -111, 125, -29, 168, -134, 171, 135, -9, -33, 31, -234, 45, -82, -186, 167, 421, 18, -93, 7, 269, -252, 140, 63, -236, 295, 29, 51, -146, 198, -2, 265, 40, -260, 91, -137, 78, -93, -287, 265, 118, 117, -73, 131, -48, 94, -187, -87, 43, 59, -37, 0, 211, -39, 214, -58, -47, 103, -233, -395, 75, -14, -258, 200, 106, 84, -72, -209, -208, -197, -26, 18, -47, 10, -120, 12, 161, -221, 88, -262, 220, 1, 213, -80, 84, 52, 66, 38, -158, -84, -101, -251, -32, 203, 234, -135, -21, 104, -16, 95, 75, 19, -162, 266, -50, -33, -76, 114, -45, 285, 29, -165, -124, -36, -262, 189, -81, -335, -208, 94, -89, -159, -92, -129, -298, 84, 111, 79, -229, -62, -247, -234, 126, -127, 141, -14, 166, 23, -2, -41, 22, -469, 324, -175, -250, 55, -297, 1, -28, -89, -164, -136, -218, 178, -82, -68, -97, 108, 267, -92, 116, 213, 80, 19, 106, -13, 79, -89, -100, 126]
8101A26k35J76J60k42Nn4j40K07k26K21J36J61j91M0n4r5J72k24k4O5J9J55l44
8124a86L45k20J41L7Oj97j44p0K64l9K12j02j38j1J58j44J3J48m8j62N05m76M9
8147e9k2J54p4P4J34r7j47n5p4J36J3p3l0p2K02K19k48j26R4K16N6k01j20J79
8171G9%l24M64l47L06j91P3k39J79M2J75n60L03l8Q3mML0j86K4
$$ y = [126, -109, 67, 227, -15, -10, -64, -204, 3, -223, -2, 134, 295, 104, 144, 90, -5, 167, -57, -81, -16, 3, 158, -186, 159, -61, 80, 117, 123, -74, -218, -288, -24, -63, 149, 47, -91, -102, 56, -88, -75, 73, 25, -137, 368, -108, -59, -81, 73, -1, 73, 207, 110, -37, -92, -166, -30, -17, -90, -120, -192, 10, 229, -19, -145, -51, 165, 221, 20, -100, 79, 79, -245, 219, -128, 178, -13, 60, -179, 0, 42, 217, -343, -40, -78, 5, 1, 5, 35, -151, -127]
8191a27
$$ Imaginary data points
##PAGE= N=2
##DATA TABLE= (X++(I..I)), XYDATA
0@%%%%NnQj6J6j8K6l2M0n6O6p6R4j14J35j60J86k15K52k91L34l84M38m98N65o37
30c37P20q12R10j019J137j268J411j568J740j928K137k366K620k901L213l564
46a875L959m406M918n512O208p038Q052r320J0962j3177J6350k1313L0224n1153
60c3121J88129J29013l78589r2438J63398J50948n3381l2477j5160n3334n1664
71g8676Q8403R6591k7323j07194l1611K8719L8559K6708J6559l6083o0276k9557
83g5181L2181O1956N1713k3120r2116n7848O6072J04405Q087q3772n8784J2217
95e4190M5981M1564J4764l5765n9139j2996M6687M0410o637k2356q119p242j6599
108c3637j876K9975L5263n854n4589m1325L9367Q8017K0676q2571p4091L3130
$$ y = [0, 0, 0, 0, 0, 5, 0, 8, -8, 8, -10, 16, -16, 24, -32, 34, -42, 52, -62, 73, -87, 99, -116, 136, -155, 179, -205, 233, -265, 300, -337, 383, -429, 481, -538, 599, -669, 742, -826, 914, -1014, 1123, -1243, 1377, -1524, 1689, -1875, 2084, -2322, 2596, -2916, 3292, -3746, 4306, -5014, 5948, -7229, 9121, -12192, 18032, -33121, 155008, 284021, -94568, -187006, -23608, 127340, 73959, 41482, 26322, -27012, -78676, 9727, 106318, 78995, -28199, -59810, -31091, 7468, 34176, 50735, 14652, -45624, -75181, -43000, 18956, 70669, 47549, -44567, -102415, -36343, 68062, 76149, -7623, -66407, -54190, -8209, 33355, 48119, 12354, -46785, -59781, -13094, 27316, 20679, -1677, -9796, -17038, -33637, -35513, -5538, 29725, 23871, -30718, -72043, -32676, 55341, 76017, -6554, -80645, -47515]
120d7515Q3451K2160l7869k8201r767j3087P104M2417K3210k9099l2196K237Q034
133i121K436K7498K7191l5549o5548Q695P8717L9227m0389n5474j8025J9121M7510
146B6289M3723j7585o7667k8847M0869M1845l210j7128j0762j8086q646K4337
158E132K4876j0730k2016q817j4759j1945L4016N2498j6154p8713l5738M8944
170c3406O1781J2200l3463n0193k4400M2415P2277O257o8586m4528L0527M3062
182A3943O331k406m61k5810l3635J2100M7823K1287j8441k6450k1811q035L2473
195c092N0687l558o4597l9979L7776O0751J1690l6581m1261j3495K5615M2818
207B6774J4916k6378l0989m594J0337J4382J8033N522k2861k5027N856K2432Q835
$$ y = [-47515, 35936, 58096, 20227, -7974, -17741, -30828, -23724, 18693, 41903, 12804, -19392, -17155, -9121, -6685, 20813, 48004, 12455, -53093, -44398, 34319, 73546, 33157, -22317, -40342, -21221, 26289, 70012, 52427, -15240, -44087, -3218, 38627, 35417, 18289, 7527, -10559, -19205, 5132, 30008, 19278, -2738, -11555, -26314, -38259, -4243, 48255, 32101, -46612, -82350, -33406, 28375, 40575, 7112, -43081, -67481, -25066, 47211, 53468, -15118, -59646, -29119, 13943, 20274, 17868, 17407, -8403, -42038, -29938, 17885, 39172, 20731, -5719, -27530, -35565, -3092, 47595, 44037, -20560, -60539, -22763, 37988, 49678, 13097, -28164, -41659, -16044, 26774, 41690, 15312, -15677, -20271, -9934, 4448, 22481, 28003, 5142, -19885, -14029, 8403, 17238]
220A7238p57l097k0148k6190J4357N1082J7447m3630m5984N895L9040K8032k302
233C0983k9020k8665M777L3710J4799j9540j5192Q007o61j4419N721K7137N083
246B2720k9158k5182K096K1838K6131R186l0614m4164L419N3412K9007l0540l8880
259c0729j45K1138J6086J0605k755k5116j9213J6179K9127N205j1510m724n248
272a100j1813L789K4845J4329j4478k1537q633O358J9634K0725j0071l9653j7995
285c5600L1848L8016m623l2429k0563L513J7048K0173M855j9775j8796M875J1890
298D32J16K435J2072n208k7272r872K7409K6591p698k7443j5964L990K3009K4961
312B7558l638l3943k2338J7842K9682M028j4440r931o235k375J1100J6604j455
$$ y = [17238, 16481, 13384, -6764, -32954, -18597, 32485, 49932, 6302, -39682, -33787, 5253, 33285, 30983, 1963, -26702, -21925, 11785, 26584, 7044, -8148, -141, -802, -15221, -9500, 17637, 22720, -6438, -31620, -29524, -7686, 18445, 27631, -2983, -47147, -43728, 9684, 38691, 8151, -30729, -30874, -9736, 6350, 16955, 14200, -10916, -30129, -13950, 15177, 20382, 8872, 4148, -1100, -12913, -9124, 15721, 30050, 15572, -5965, -14598, -8240, 11394, 32119, 22048, -17605, -35600, -3752, 34264, 29641, -2788, -23351, -19838, -2790, 17383, 22238, 2463, -16333, -11458, 432, 548, 2983, 15055, 9847, -17425, -27297, 112, 26703, 19005, -8438, -24402, -20412, 2597, 27558, 23920, -10023, -32361, -14519, 15163, 19191, 4751, -5180, -11415, -13790, -2690, 13914, 12459]
325A2459j6316j0018J568L543J1807J6302n368k9366j6224K0335K7997L714j4946
338E487j8369j0788R853K9030J3109k3972k9883M588K6811J3242n739j0886j1195
351h712l684J1039J5522J010q989k328m055j0725L698K5165J2142k4111k9100
364b3128N028K7262J5766q565k2066j6889P460K6047J3604j6577k1744k175J0217
377e760N748M582M549q186j6025k592J3646J0386L4n237r288j0945N083K2131
391H126J1458j6462k0513N00J3658J1020O032k842j7599j4873J2868K7009L311
404B1693k1680j4006O895J0062K899K256K36q391r500O73R234J0005M857r288
418E945k1000o750K1242K4131o778k5622j0428J2207J4960N872m257j2699r424
$$ y = [12459, -3857, -13875, -12307, -8764, 3043, 19345, 13977, -15389, -31613, -11278, 16719, 20433, 5487, -12882, -23670, -13817, 15213, 28322, 4350, -25533, -20945, 5866, 19108, 13369, 2483, -8712, -12396, -1357, 14165, 15175, 6186, 3858, -197, -10922, -7224, 17941, 30083, 5972, -23128, -18100, 9162, 24928, 16363, -5703, -22592, -15132, 10915, 24519, 7942, -13802, -15977, -5760, -12, 4570, 9119, 933, -15092, -17684, -4038, 6348, 6382, 1145, -8143, -19088, -14005, 8126, 19584, 3122, -17391, -16891, -3233, 7787, 13819, 10977, -6622, -21495, -8627, 18382, 21693, 13, -13993, -7098, 2964, 5863, 8119, 8355, -36, -9536, -8863, 371, 10376, 15233, 5945, -15055, -21805, -563, 23568, 16790, -8832, -19260, -7053, 7907, 13779, 9522, -3177, -12601]
431a2601O831J4442L701o382k932l182q720J269J7758R851j3593j7394o17Q892
445b677P762O801k204j7109j2309J1346J9361K449j3065j1310m456M431J6160
458E180J1435j2742k1789N5J7573P399o001j818j2p766m844R812J3446n36j1157
473a765j0236k212R605J7819M702j9354j8995P165K1746Q336r197j0584m447K171
487e246Q674J0229j208j1093o648J790N790O347N417m424j4859p036J0382J4179
501A2294J573j0144r942m834M479J2546Q022q697j5951l163J0894J0322J756n285
515C870r966o479O288J4572L716j0439q577J099L525J540O316M301p351j3443
529a1028j571J1799J0741l14j0836j2974j852J4849J4243n786j7636n488R650
$$ y = [-12601, -5770, 8672, 12373, 5991, 3059, -123, -8843, -7574, 10184, 20035, 6442, -10952, -11569, -2677, 5085, 11886, 9682, -7427, -19736, -8390, 10971, 13420, 355, -10955, -15411, -10980, 5180, 16615, 3873, -17916, -17861, -288, 7111, 1110, -708, -720, -8486, -13330, -3518, 9928, 9392, -1765, -12001, -14213, -4608, 13211, 17913, -1441, -20436, -13271, 8475, 16811, 7614, -2970, -7417, -5246, 3428, 13657, 12449, 1356, -5292, -3502, 2288, 8635, 14052, 9628, -5231, -12267, -1885, 12294, 13867, 3723, -6219, -11053, -6574, 5972, 13994, 5297, -10654, -13817, -2923, 7399, 9155, 3870, -6096, -12575, -6287, 8285, 12001, 1562, -7015, -5916, -2391, -851, 5465, 9766, 2415, -11028, -12599, -800, 9941, 9627, -1209, -14183, -16035, -1186, 13057, 7271, -10365, -15853, -6203]
542f203P071J574Q79l166r038k777R264Q975j8m700m701n853J128J3060J1455
557A6950r604j6416j570J1535P805Q31k644q078q605L889J4880O270r687j1098
571e542o57N040P112O179k879j1569o498P560R347Ll484j436n108o350N104J3478
587A0300K933j3031j1900J315J0221Q284l20j0113j1037J591J2429P024n394p804
601e502j995Q98J954N437N554l308r253m712N429R686N958m561j2125n979Q472
616d047J1402J863p546o464k873J201P682Q132l198j2798n891P526R600K120l152
631C557o294o066K135J0466O079n131p722n96J645J561O810O556o695j4250j185
646i130J3886Q784m556q072n080j052N805R510M20j1129p593M622O582L53L60
$$ y = [-6203, 868, 2442, 3321, 155, -8883, -11660, -2396, 6579, 6561, 1861, -2840, -8693, -7565, 5495, 16950, 7346, -9070, -10640, 895, 8700, 9531, 6887, -1191, -9796, -5907, 8973, 15243, 5556, -5542, -6199, -1159, 5953, 12132, 9253, -2316, -8814, -1254, 8093, 8096, 4612, 3176, -1932, -8282, -3178, 10300, 13233, 202, -11698, -10383, -162, 8122, 7802, -2311, -13348, -11757, 672, 7696, 2302, -5502, -7497, -6599, -4645, 792, 6346, 3038, -6215, -10927, -5498, 4188, 10146, 5585, -6540, -12519, -4047, 7355, 9218, 1672, -4792, -7665, -6464, 1218, 9350, 6152, -6646, -12537, -5011, 4589, 6709, 3557, -2737, -8803, -6668, 3798, 9877, 4746, -2976, -3572, -1927, -366, 6444, 13000, 6305, -7945, -9130, 4756, 13540, 8984, 912, -4168, -5220, 585, 10095, 10515, -614, -8207, -3585, 2997, 3350, 3710]
661C710N78n576p948K722J1860M530p770q218j860K987P360O380l865j1864m742
676a1716P700Q326J16l723m462m708n74Q757P938l838j0609l984N308O732L318
691D581j044n558o001J278Q143N499j523m878n140k129N218R625K804r169r745
706h039J010R097P181j606q361n941J555P160M162j735l835k794k594Q90P438
721C588N312l821r563k606N483O761L366k364q026o140N341J0273K219p399n339
736b915J92L48K591O393J493r509q989M359J0173K250m360m882l489q73N805P763
752F350j844q844l462L113L037K776M359k384j0428m725J0543J0793l184j0034
766c934l064L207L005L714K196l609o896o57N361M298L30m95l897o300N82J0524
$$ y = [3710, 4288, -1288, -9236, -6514, 5346, 9876, 2106, -6112, -7972, -4985, 2375, 8755, 4890, -6974, -11716, -4016, 4310, 4426, 703, -3759, -8467, -9041, -284, 7654, 3816, -6793, -10777, -5469, 1263, 4581, 3537, -2021, -8022, -6744, 1399, 6898, 5375, 497, -4643, -6772, -1554, 8071, 10875, 1706, -8039, -7029, 2068, 9249, 7643, -718, -6659, -5104, 2056, 6218, 4483, 648, -2146, -4740, -3850, 3588, 8900, 5079, -4484, -7090, -1607, 5154, 8520, 6156, -1870, -8010, -2669, 7604, 9823, 2424, -2915, -2723, -2375, 216, 6609, 8102, -1407, -10396, -6037, 4136, 6386, 2026, -2856, -6345, -7218, -1413, 6350, 4506, -4338, -7800, -4687, -1650, 1126, 5485, 3101, -7327, -12052, -1509, 9284, 6100, -3934, -6998, -3791, -786, 2928, 5124, 1515, -5381, -6038, -677, 3621, 3951, 3456, -441, -6741, -6159, 4365]
782D365P060o763j0607j219P354N682L88k819m344l757J921O396L278k861n157
797a083l375M81N078N534n38p757n294K716O936K812k128m658l421M94L731M518
813D046J131l155o628k800N275Q255J603p771o887J103O602L815o40l382m826
828d259j282L872N117L09l360k880k319m22N606O385k513j0044l418P040P106
843D938r36l498k471k617M60N825M532l101n606j250J832K166L497L185n133q657
859f834O94R739M584m961n240p42O35J831M393K044m727o325Q51M924L238M54
875D558k803n208l029N024P280l5p357l885K882K404J149J521K08m580m010J992
891c889N745L039k306m894l784J648O377M590l367p534j951M556N109M8k169k659
$$ y = [4365, 11425, 4662, -5945, -7164, 190, 5872, 6260, 3441, -903, -4660, -2739, 3657, 6935, 4074, -1083, -4458, -3977, 1101, 6635, 6097, -1660, -6954, -4238, 2698, 5510, 3382, -1276, -4697, -4203, -472, 4046, 5177, 2022, -4606, -7406, -2131, 6124, 7727, -44, -6931, -5828, 774, 4589, 3949, 567, -4259, -5541, -1669, 3448, 3757, 397, -2483, -4802, -5224, 382, 6767, 4254, -5790, -9208, -2168, 4938, 4002, 504, -1967, -4584, -4124, 1701, 6233, 3132, -2474, -3724, -1892, 274, 3771, 6956, 1823, -6834, -6140, 3599, 8183, 3222, -2018, -2760, -2125, -294, 4099, 6143, 1416, -4909, -4058, 866, 4104, 4558, 1755, -3453, -6482, -1458, 5822, 5787, -1570, -5455, -2573, -169, 980, 2501, 2709, -1871, -5881, -3889, 1856, 4895, 2589, -2305, -6089, -4441, 1936, 6526, 3159, -4375, -6326, -1770, 3339, 3387, 1218, -1441]
907a441j990J89L292L897Q9m052m697J89N109M986r82n936l750K048M359K154
923C464k75k398l668j043L394M438N54l132m026j477K583N246K466m536o094K03
939d301N338K605j327j660j020k380j60M671L287k111n240j732J259L924L497
954D650j107o108l785L996N704l12l059j615m71r74Q87M557J491m233m354N04
970d229M042K858O25l103m607r46N110N083j687m880j725J598J126K125K112r66
986B536n160k082M066M524M31l010l410j149K169M518Q43l401k864j5J990J344
1002A330J118P03l017l972R99M440L278j965l858k954J701L989K407j766m191
1017a758j087J508J661J188N50q92l814j431L445L694K69l460l277n01K876L892
$$ y = [-1441, -3431, -3242, 50, 3947, 4036, -16, -4713, -4524, 585, 5571, 4589, -1347, -5097, -3049, 1310, 3464, 3189, 791, -2877, -3920, -526, 3912, 4466, 1334, -2692, -4169, -1586, 3660, 6126, 1590, -4504, -4301, 1037, 3642, 2315, 655, -365, -2745, -2905, 1766, 5053, 2942, -2298, -4030, -2771, 1153, 4650, 3543, -2565, -6350, -2354, 3350, 3038, -21, -1636, -2107, -3081, -2194, 2363, 3854, -379, -4733, -4229, -187, 2671, 3296, 193, -4414, -5360, -250, 4833, 3146, -1734, -3459, -1861, -735, 1390, 3502, 2536, -2624, -4706, -640, 3884, 4315, 1305, -2105, -3254, -1085, 3433, 4276, 875, -1989, -2004, -14, 1330, 2448, 3151, 134, -3838, -2839, 1601, 4879, 2914, -944, -3898, -2197, 1792, 4199, 2433, -1758, -2845, -1337, 324, 1512, 2062, 1170, -2644, -4075, -630, 3064, 3333, -127, -3404, -3905, -1029, 2863]
1033B863L25m092l370J072L428J108l21j93j845k947J135M148K295k387m007j116
1049c904K266K861K133j642l691k166K746L447N17j505j386j947m86K875M222
1064D340p85m694k825K550L672J403j129k727k281J192L067J717j459j887l74
1079b20j044K80K537K966k450m685j208L948L355k66k762l179j14K562L083l71
1095B432k598j766OL45J998K072m92l710k572K531L433J239k618k519r43R93L203
1112A034J243k105j998q29J015J065J940R87k515l844R0M752K671k057l409j016
1128b976J195K250J786j10k529j686R67J290J177R78n23k804k037K225M454M38
1144D095m009k623N47L106J390K11j907k087kJ322J725L46k70j546k341L77L156
$$ y = [2863, 3188, -904, -4274, -3202, 226, 1334, 1013, 820, -1025, -3972, -2837, 1311, 3606, 1219, -2788, -3904, -1638, 1223, 3356, 1714, -1977, -4143, -1397, 2050, 2567, 1062, -324, -2271, -2757, 118, 4340, 3555, -1139, -3964, -1414, 2258, 3661, 2532, -195, -2476, -1284, 1783, 3500, 2041, 154, -220, -1264, -984, 1553, 4519, 2069, -2616, -3824, 124, 3479, 3213, 451, -2728, -2842, -280, 2803, 2432, -166, -1932, -1926, -1581, 417, 2489, 1997, -1713, -4285, -1754, 1679, 2918, 300, -2219, -3162, -2169, 1034, 2277, 172, -1826, -2655, -1640, -575, 1365, 2352, -163, -4007, -3917, 835, 3506, 1449, -1960, -2976, -1781, 469, 2255, 2145, -384, -2070, -1103, 187, 1364, 2342, 1819, -985, -3022, -797, 3657, 4095, 86, -2537, -1990, 1116, 2506, 2717, 810, -1277, -1279, 43, 1768, 2114, 1844, 298, -2043, -1666, 1490]
1161A490K295j533l824j331K102K522R07j069k367j752N71K708J276q81j597j594
1177b077n23J902L174O4l439k985J658L184P94j306j670o89j13J389J613j23o79
1194A74j744j224J062K806J836j969l781n25L193K472k48k123j486K0J000J605
1210A068J017r22j781r21O01J524J505L76k711k678J699L289J247j995j910o90
1226a282O68J327J651j36j922j390o5J407K010P53k051l136j26K818K813j540
1242A799k701q77O64J016P66J090j163j938q17Q84K183J028j005k627j980K121
1258a557L306P37k980k592J158J916M15N36n10j030j392L06J985J420k94k082
1274f58j262j7K324K107l84l588j383J897J955K47m95q37q05r09J198K470M10
$$ y = [1490, 3785, 2252, -1572, -2903, -801, 1721, 2628, 1559, -808, -2560, -1989, 719, 1995, 1114, -483, -2077, -2600, -698, 2476, 2540, -899, -3884, -2226, 958, 1752, 446, -1224, -1913, -2026, -637, 976, 853, 174, -1570, -2794, -1732, 1074, 2910, 941, -2840, -3365, -172, 2300, 2052, -71, -1557, -1537, -537, 1068, 2085, 1163, -618, -1539, -938, 586, 2091, 2467, -244, -2922, -1223, 2066, 3313, 1318, -592, -1282, -614, 713, 2364, 2228, 306, -1084, -1149, 258, 2268, 3021, 970, -2166, -2292, 526, 3339, 1799, -902, -1779, -1115, -99, 667, 1757, 594, -1344, -2161, -1277, 906, 1934, 929, -1698, -3678, -1557, 1749, 2486, -494, -3086, -1928, -12, 403, 939, 429, -601, -1993, -1687, 298, 1718, 1424, -658, -1920, -1937, 387, 2494, 2110, -1478, -2861, -964, 991, 1238, 743, -94, -899, -1808, -610, 1860, 2270]
1291B270j701k414j53K099K200J93k341j946N50K010J146m52r46r20n22N20J329
1308I22J338o98k360j251J052K344J815j759l091q87K464J840j36j272j142n24
1324a345L6J620J334j80j806j522l27K071J886m2k656k158J369K736O35j411j229
1341i89j24j70L67J769O51j042k286j52J831J497J83j054j886q07K133K301o83
1358A539j984q55O33N85J7J600K90k182k245J466K666O93j284k019p06O20K397
1375A231J187j434k578k03J835Q59r8J81l31j776o94J643K466o3k641j593R52
1392a057J779J244m67j812j441L81J909N60k07p49j109n67J28K375J099j387k784
1409b105q20K634K128j88j733j629K93J454M48M74l34r97j652N77J991J506j300
$$ y = [2270, 569, -1845, -1998, 101, 2301, 2494, 153, -1793, -1243, 767, 1913, 1461, 515, -405, -927, -407, 922, 2260, 1562, -798, -2049, -997, 1347, 3162, 1403, -1688, -2575, -111, 1729, 1593, 321, -821, -1345, -1309, 311, 1645, 1465, -341, -1863, -2190, -119, 1767, 1725, -931, -3089, -1720, 1016, 1651, 240, -989, -1113, -1283, -916, 853, 1504, 462, -1824, -1976, -145, 1352, 1535, 481, -1405, -2212, -79, 2222, 1539, -445, -1300, -667, -82, -65, 1535, 1825, -357, -2602, -1136, 1530, 2223, 939, -1080, -1786, -1166, 1231, 2418, 984, -1594, -1797, 38, 897, 799, 980, 649, -1127, -1821, -178, 2288, 2225, -416, -2009, -1057, 722, 1966, 1499, -313, -1754, -1373, 536, 1096, 889, 140, -969, -1536, -1408, 967, 2066, 679, -2105, -2925, -291, 1837, 1649, -84, -1713, -1420, 34, 482, 956, 622, -375, -2027, -1450, 541, 2047, 747]
1426G47j612r67O20K060J566j083k621q64J733J798l09p26Q1j003q87Q66K832
1443B231R6k639j988J165J745J144j87j297j786m68K079J888p26k128P4Q0k06
1460i23Q34K252o44l170j168K379K358j95k030q90K2L81J587P23p02j866o73J390
1478c35O76K35P95j170k318l6K686K068j614k886N5J570J124p5q2r48j134J44
1496a245J393J074N1j153j381k88Q32K326K14j989j633K43K411R94j189p70m14
1513e24j41M09P64J044m25j682j180J234K069M55j647j395m13J148J373N21j309
1530C01j777M44J106K44J13Q2k51j758p20K303J943j245k286p14J780R75N5l63
1548B32l63j219K20J410Q05q87n99L3m13K83J332J215j799k251L78K508P42j121
$$ y = [747, -865, -1832, -1212, 848, 2414, 1331, -1290, -2154, -421, 1377, 1068, 342, 423, -580, -1467, -601, 2231, 2327, -312, -2300, -1135, 610, 1754, 1567, 270, -1516, -1984, 95, 1983, 1257, -871, -797, -717, -923, -89, 2163, 1519, -1651, -2819, -440, 1918, 1723, -307, -1197, -1175, -794, 793, 1516, 814, -1052, -1725, -335, 341, 576, 1371, 201, -2117, -2153, 533, 2601, 987, -1899, -1844, -274, 850, 775, 693, -255, -1389, -1245, 148, 1222, 1273, 120, -1261, -1549, -717, 1609, 1823, -166, -1799, -1556, 855, 1849, 660, -110, -524, -665, -256, 508, 1552, 1127, -555, -1735, -501, 1568, 2023, 376, -1019, -1432, -284, 1089, 1610, 301, -1476, -1032, 74, 318, 431, 513, 262, -1496, -2216, 87, 2030, 785, -1501, -2215, -435, 540, 595, 232, -131, -1350, -1130, 280, 1085, 198, -401, -368, -781, -498, 834, 2049, 250, -2001, -1623, 885, 1627, 506]
1566E06q22l34O4J88J105P48r25j210n07J038Q73M41j46j406j348J174J838L04
1584A581j867q77Q31N68r9L23M46p41j114j19J664Q60m68j266j210M69J724R79
1602A684q64j465n90R63R88l21o6j60n88l43r6J466Q78j438j245l74J468J424
1620A321p82j238l10J38N95N68Q8p19n85qP78K91P45k50r67j254N30J869Q89j355
1640C44j346L66R88J88J61Q3p02m95k30J173O28o88r7j061k76J128J357m03j469
1659c51q07Q83J291k20r48j25N48q60J81R56M13l81j321l55P69J327L57j102j313
1678a058J40R55Q60k34j193q1P7K19K3P86J73j033p98N90Q45Q44o60j455l39R91
1698c48R08J67o26o09q7L45mM41N87p44j074k11P58J254j06r61r75K65J370O79
$$ y = [506, -316, -650, -586, -398, 707, 1455, 530, -680, -1187, -149, 724, 1165, 1019, -387, -1735, -561, 1277, 1581, -286, -1163, -332, 236, 137, 460, 906, 165, -949, -1068, 596, 1456, 988, -278, -1488, -1019, 705, 1684, 820, -645, -1235, -272, 716, 395, 329, 169, -419, -762, -858, 608, 1486, 48, -1197, -1571, -103, 1321, 539, -699, -1009, -871, -276, 292, 380, -339, -924, -932, -154, 137, 882, 632, -335, -1589, -1059, 810, 1699, 344, -1002, -636, 352, 540, 701, 784, 82, -413, -643, 530, 1158, 470, 373, -688, -964, 164, 1521, 1118, -351, -1158, -275, 1016, 796, -152, -277, 271, -589, -408, 548, 961, 580, -741, -1096, -327, 1000, 1357, 255, -1058, -918, 37, 897, 663, -530, -611, -534, -315, -292, 494, 667, -366, -1164, -574, 271, 1115, 455, -1000, -1339, -348, 560, 727, 101, -508, -595, -250, -254, 187, 774, 30, -1044, -1255, -497, 757, 651, -310, -1285, -1020, 350, 1029]
1718A029o62q71p3L43K73pP94j50p62q76O13J401M23n93j225l97P43J264j44j401
1738b78l61M06K53J4J95L06m90n88j9P69O85l67q85p59L02J102N78n66j032k68
1758a003R61L94m46L94r9n61l50M18R32po57j013N9R93O55j27j102n07O99M93
1778A26P1j17j10l26q0K3M42Q66m85q99o37Q24J036J69q08p78l23J390L18k54
1798D48m50j21Q2n27K83J049j61q67q46N54J125N56n24o95m59N99O71k9l6l85
1818B67J95n75K97K89O64o40j014j07O02R18j09j114m87K94O62r7K29l45m46K4
1838d93k32O57N07M1r56l56K94J148O12p21r27k27L34N04O05q21l92K98j8N8K0
1859f5M51n19l97p70Q98J001l90n75n82M66O38O66o19l76L7j69K02K59N49j88
$$ y = [1029, 367, -504, -577, -234, 39, 32, 826, 676, -86, -962, -349, 1052, 1475, 882, -343, -740, 3, 1267, 1123, -278, -639, -233, 20, 34, 229, 535, 45, -543, -562, 207, 892, 525, -360, -1119, -817, 285, 863, 297, -735, -1003, -42, 352, -94, 300, 201, -360, -710, -292, 640, 633, -24, -1037, -978, 15, 670, 543, -559, -1066, -367, 126, 197, 80, -30, -356, -436, -413, 29, 895, 410, -489, -1126, -302, 734, 903, 95, -683, -1006, 384, 702, 448, -2, -123, -41, -568, -285, 764, 603, -264, -1110, -556, 569, 1125, 601, -94, -553, 46, 717, 688, 652, 267, 462, -113, 184, 473, 1137, 497, -517, -624, -22, 896, 787, -327, -814, -520, 142, 45, 274, -71, -517, -493, -725, -68, 439, 480, -476, -832, -538, 610, 1222, 501, -426, -653, -319, 185, 790, -31, -423, -125, -143, -85, -65, 386, -133, -530, -1300, -402, 599, 209, -366, -948, -482, 156, 822, 203, -173, -136, -305, -103, 156, 705, 517]
1879E17n60n50J46J021K93p77r22N75L34M96l04l41mq3L9L97n1L53n73m39j14
1900e47P85O49l94q29k53L40P23J61l84l92j22J03M68j71L4%o02k73M56P44K35
1921G31j220j78L08L67O66o69k48m67K47M36r2L15l16R5k90j26O67N88m00q31
1941d17l0P17L21k26l47r4j56K14J05K70n63J33k86J20J76L51N36j081n56N31
1961b82P15J18n21n24K75K69q1K18Q5k00l04J09L50P7L75m70m40m88O19O55l2
1982E23q59l32N49L98qj09J69o39k74J54L82L60k19n09j78K52O70Qr9p71j10M82
2004a60K62k6j17j50LM4JL41L65p24o52L37P20L58m35m66l7L31L28L16m13k20
2026FL2m0J23R1J13n9o02o8J09P55j32n05n66L51O02K49m40l56m0p3R8L92L70
$$ y = [517, -43, -593, -447, 574, 867, 90, -832, -257, 77, 573, 269, -72, -76, -159, -120, 277, 226, 579, 6, -433, -547, 238, 887, 493, -336, -589, -249, 474, 635, 251, -141, -263, -160, 308, 137, 171, 171, -431, -704, -248, 496, 731, -489, -667, -359, 8, 674, 5, -243, -710, -463, -27, -119, 196, -120, -25, -315, -441, 226, 814, 414, -417, -447, 270, 591, 365, 18, -76, -232, -18, 87, 357, -206, -73, -359, -239, -63, 288, 824, -257, -813, -282, 433, 551, 30, -494, -219, 50, -31, 187, 272, 72, -232, -123, 227, 304, 679, 209, -231, -719, -100, 555, 523, -336, -668, -119, 279, 271, 162, 331, -308, -582, -428, -46, 314, 95, -414, -592, -340, 330, 338, 239, -532, -642, -160, 102, 76, -41, -191, -188, -144, -143, 198, 563, -161, -813, -476, 244, 602, 167, -299, -336, -5, 323, 639, 226, 6, 38, -2, 121, 212, 325, 266, -336, -404, -295, 460, 328, -177, -743, -392, 210, 459, 19, -337, -377, -450, -352, 40, 410]
2049D10l1n88j88J36N59J51j16q05m67Q20P57m28o55K38J30J55l21N52K72m56
2069A25n98k8N81N57n28j82l98J02P16P2k64o70K23K58J28j7j31K39k77l28J95
2090b25P42J05p41j37R3L06M27l13n12k78J58N40J48K9o34K21o8k15K06P48l13
2111B87p94l6O02M76r7l08o33L19O8J06M75k53k82j99j17L92L18J7m71m38q2L39
2133c11R88l40p56p9Q20K68o04J51J56n51j0j48P61N0l37l41J55L69L05J07k67
2154C86q73K26N83L59m76k39k53O47n86J51Q01n15n24l07J26N22K50m13J44r3
2174h4L1K24P9j20j88N0R7k0k00L43o4p36K19P55M68p53p78M49L99l01M6L8j01
2197a47N4j90J77J76K11M9n02L4j26N12L9l20l33ON75Q5r1m29j1k43M28K5K85
$$ y = [410, 379, -209, -397, -261, 298, 449, 333, -472, -939, -119, 638, 210, -445, -207, -77, 78, -243, 309, 581, 125, -473, -501, 80, 637, 109, -73, -471, -369, 347, 419, 155, -515, -292, -34, 94, 77, -54, 185, -92, -420, -225, 517, 622, -119, -256, -163, 143, 570, 257, -255, -533, -375, 165, 313, 342, -292, -71, -139, -354, -148, 600, 287, -507, -543, 59, 535, 438, 130, -503, -184, -116, -10, 465, 212, -70, -269, -386, 6, 324, 341, -130, -568, -650, -311, 677, 337, -419, -498, 322, 590, -14, 137, 293, -258, -268, -416, 345, 395, 58, -283, -128, 241, 546, 653, 386, -487, -261, 322, 681, 205, -34, -287, 360, -226, -75, 726, 211, -313, -620, -494, 28, 278, -135, 9, -84, -53, 171, 250, 130, -58, -8, 89, 69, -131, 212, 148, -588, -369, 386, 854, 101, -677, -228, 171, -130, -84, -46, -147, -93, -283, -106, 70, 281, 330, -172, -138, -264, 248, 287, -33, -366, -360, 215, 300, 209, -220, -231, -474, -46, -21, 264]
2220B64M1o84R9L92M2J58j10j23n10L84M16M3l59l79K19J76Jj36K83J22o38o66
2242i65J113O38j80q87j79M10L79R8p48K93l27L89J56j27k14L90j8p42M4L79O03
2263E05n49l94o3N41K35J10o10r7K62L3N9O6qk81P5K77j64K68L32o03j96k56P69
2286C11q3m58j70M93j96K67P9o9k96j39k6L22r6L67k76k10j57M44L64n57r1k44
2308d21P58Lk56j21L42l0l41J96j91J18K85n22k14M78K56J79l22l11l20M50M73
2329D89l10k24l50N51l29L1M6L57k09m06J57N51k06m0k94j2K2j56K76K85m67j41
2351c79J09N33p7J58m08n03J86L5O81l06j88m36N10M39k97k96K83n8J04j83l6
2372a29L98l7j05k70L60j75M88l12k97m14M03j7L33m41O0J05n4j31m3L54j43j36
$$ y = [264, 305, -379, -280, 112, 154, 312, 202, 79, -431, -47, 369, 412, 53, -326, -107, 69, 70, -66, 217, 339, -299, -965, 148, 786, 606, -281, -460, -50, 329, 427, -321, -28, -355, 34, 190, 63, -151, 239, 221, -521, -477, -98, 505, -44, -438, -501, 40, 275, 385, -225, -322, -60, -27, 32, 98, 90, -191, -116, 161, -3, 265, 597, -6, -202, -458, 311, 228, -230, -400, 93, -103, 164, 243, 174, -122, -261, -287, 35, -61, 306, 30, -180, -337, 107, 471, -86, -177, -421, 337, 340, 84, -37, 305, 275, -66, 130, -61, 57, 342, -180, -394, 84, 340, 519, 197, -114, -434, 16, 489, 179, -45, -395, 156, -173, -142, -96, 261, 52, -354, -197, 354, 148, 108, -186, -198, -176, -332, -56, 229, -238, -379, -270, 263, 186, 344, -64, -567, -381, -346, 335, 29, -159, -595, -85, 354, 57, -239, 44, -14, 90, -93, -129, 269, 232, 127, -143, 217, 42, 530, 218, -79, -493, -90, -107, 226, -215, -155, -50, -104, -235, -278, 76, -67, -203]
2394b03K3L44Q5k1k27Kj9J0J24P1l2p1Mq1j50K90k2k65m8J77L00l63l0K3J12j74
2420a41J00O1k92L28j85R1ok12P58m51r1l44M41L16Rl80L1k42M18n1k64j50J35
2443a21K59K74j28k04l40J72m6J06J32J07J37n22J01J05q5J14K1j53K43n62M42
2464E2MJ01j25j25J95P9K03n69J00j00K97j50r8l19L86j24k07O74n25K97J77n53
2486c30J58J09K11J91K8p62K78L95j66J26l86Q6j84O16k55m2k26L01k10kj55o2
2508b81L58k22j49J93N4K17l82J97j34j33L89k14M8O9m07L01K30j8L6j64l5j3
2530f0K87Rm18J17J77l81J12Pq1L86j61k39q2K30L83m3n32o0N41P3l44J48l12
2553b43L91K0j0l18K53l36L68k56p7K90Q8k47k66K97M2M19k77l77J17K94j38Q2
$$ y = [-203, -180, 164, 249, 228, 1, 3, -16, -6, 118, 189, 157, 86, 90, 9, -141, 149, 127, -138, -186, -9, 291, -72, -102, -79, 33, -141, -41, 20, -272, 56, -129, -38, -44, -256, 502, 51, -40, -384, 57, 373, 382, 2, 33, -209, 209, 158, -106, -256, -121, 138, 412, 284, 80, -260, -88, -134, -28, 104, 211, 348, -174, -73, 32, -53, 61, 82, -71, 172, -390, 52, 56, 157, 32, -93, 102, 181, 384, -185, -85, -185, 112, -38, -136, -455, -69, -193, -400, 274, -251, 46, 223, -330, -172, -63, 148, 339, 367, -395, -117, 278, 112, 238, -148, -62, -246, 370, 115, 73, -153, 148, -62, -64, -219, -281, 77, -145, -294, -101, -47, 170, -212, -15, -149, -282, 107, -107, -59, 10, -397, -96, 134, 116, 152, -12, -47, -60, 227, 236, -182, -65, 112, -269, -157, -150, -231, 155, -6, -245, -327, -97, 286, 243, -289, -349, 192, 265, -79, 69, -243, 148, 168, 158, -160, 93, -243, 125, -131, -208, 82, 170, -77, -343, -46, -4, 415, 138, -239, -122, 172, 34, 116]
2575A16k96J70j89M80k76J88l27K7l0j17R9j20K07m1j95M81k35j6M0J3k07L37
2597A09k63K27M43o82K83m38J7N03Q4l30M3j84L45J34m78K12j13M39o42K26Q2
2618A7k62N92k54k68N15j96j20o4m86K28N31K61l63n7k47J71J28jj29k40M2K94
2640I2r0K11j99O6p1j84N6K69n71K31J67j63l5M9J41J37k37J06O9K70m81J10k69
2663c26L50k09N27j97l78J77j23P9M2q8N4J58k49P0N6P4k6K83o48L02K90p2k76
2686a30k3J92p1n6J22J8O7j22K7j82M26k10q1K16k16P0m7n3l1J08R0l31L62l16
2710a71L75r2j35J7j07q3K60k83J96j57K51o9L3j23l21L66J72l59j29J86J1O2
2732a00j17L04j05r0lJ44J6K72m6l46q2n1K00K07j90q0J14j71N1K17K2O4j65k32
$$ y = [116, -180, -10, -199, 281, 5, 193, -134, -107, -137, -254, -155, -275, -68, -109, -304, 177, -58, -74, -34, -21, -228, 109, -154, 73, 516, -166, 117, -321, -304, 199, 283, -47, -4, -188, 157, 291, -187, 25, -88, 351, -291, -65, 17, -245, 347, 93, -175, 340, 144, 24, -40, -526, -298, 233, 494, 131, 74, -173, -2, 126, 125, -4, -244, -202, 92, 2, 213, 14, 80, 9, -175, -119, 150, -421, -190, -23, -186, -221, -172, -31, 106, -131, -25, 44, 314, -167, -57, -326, 24, -185, 342, 145, -233, -56, -179, -100, -58, -146, -92, 66, -183, -113, -57, 17, -9, 274, -374, -72, 218, 146, -130, -153, 39, -32, -88, 34, 52, 119, -3, 24, -158, 268, 58, -23, 193, -23, 47, 0, -53, -84, 24, 114, -217, 145, -171, 204, 112, -23, -6, -113, -196, 64, -219, -23, -180, 71, 2, 35, -88, -409, -43, 129, -230, -359, -173, -162, -100, -217, 87, -18, -108, -111, 33, 49, 321, 275, -71, -153, -204, -4, 203, 13, -67, 47, -124, -73, 144, 166, 230, 65, -167]
2756a67K41L75l28j44J5k27J96K04k62R8j16j06R4K57j33r8P4K08j55r7R7J71
2778A97j96l62L99J9K56k81QO8j18q7o5L11q0J25m33M60j25L71l78q9L08k37J53
2801B24m72M76l97L03q6j17J26P8K68m14r2M26k44k48Q9k02K77j54J66j16P0J8
2823b1j86M86n02M63k11M8N2l3j42K2K41l86J48R0J47k72J46j88o1J61j49J07
2845d0J98m15M89l18m8L42j07p64P21ln9K86n92L33j94J51K35k8l50J74R5j84
2867g8K65j79K29k57m05P1K00L75j13j64p9kJ30r6j23K99j35M9l5K64j28k39p6
2890b27M42j65q3p0K5J31r8L67l8j77J2l9j83J56j02L47l85Q3k65J96L8J35j01
2913ak01N7J22K99l62p7M42l27l9M31n23J47J61k72K42j74J34M6j21Q8l67M30
$$ y = [-167, 74, 449, 121, -23, -8, -235, -39, 165, -97, 1, -115, -221, -127, 130, -3, -101, -27, 181, 26, -71, 26, 197, 1, -361, 38, 57, 313, 32, 40, 108, -10, -97, -162, 149, 69, 194, -239, 221, 96, 467, 89, 0, 308, 71, 224, -248, 228, -169, 134, 48, -69, 57, 135, 403, -11, -103, 323, 79, -169, -80, -282, -5, -159, 7, -109, -39, -21, -207, 279, -223, 240, 29, 77, 129, 96, -46, -24, 217, -169, -21, 69, 216, -56, 90, -98, -159, 2, -147, -40, 158, -257, 232, -86, -134, 208, 101, -663, 58, 55, -4, 282, -310, 23, -171, -20, 215, 187, -163, 11, 106, -78, 187, 8, 237, -20, -425, -354, -154, 221, 108, -56, -135, -137, -7, -103, -226, 73, -62, -13, -48, 216, 88, -151, -227, 215, 50, -33, -103, -78, 53, -45, 322, 284, 107, 119, 80, -103, 53, -49, 298, -87, -4, -269, -73, -35, 100, -1, -202, -145, -23, 276, -86, -163, 279, -48, -87, 344, -179, -32, 129, -143, 99, -75, 59, 105, -16, 72, -295, 135]
2935A35q7j76J07K20l04L28j08k33J18j63J54j45K53j15k41J44J83k05K87L1n2
2956A31L2j60k63K36n9p3J42k27M40p0N34n43k12k79L93m0j27L12l86L8k82N03
2978D0L17l36j16L37k75j88L46m6q8n2j10L88o9r6J05j75Q9j51J94l1qj42J02
3001C5K00k48p0o7K75l5m01L95j18j54R8k8n3j8L16k3n2R5k96K14L03l03j43p8
$$ y = [135, 48, -128, -21, 199, -105, 223, 115, -118, 0, -163, -9, -154, 99, -16, -257, -113, 70, -135, 152, 183, 131, 163, 3, -260, -24, -83, -156, -14, -241, 199, 129, 663, 120, -92, -371, 22, -18, -145, 167, -219, -181, -463, 40, 357, 21, -95, 242, -33, -221, 125, 79, -9, -61, -171, 217, 148, 52, 157, -18, 71, -80, 114, 83, 75, -67, 35, 235, -13, -83, -150, 125, 90, -311, 84, -34, -188, -90, -118, -171, -189, 127, 104, 52, 147, -149, 65, 368, 65, -78, -156]
$$ [...]
8191A32
##END NTUPLES=NMR FID
##END=
