##TITLE=1H_SAV-52-f4
 CDCl3, 8 sc, 
 5.2.2020
##JCAMPDX= 6.0         $$ Bruker NMR JCAMP-DX V2.0
##DATA TYPE= NMR FID
##DATA CLASS= NTUPLES
##ORIGIN= UXNMR, Bruker Analytische Messtechnik GmbH
##OWNER= root
$$ XWIN-NMR		Version 3.5
$$ Wed Feb  5 16:30:25 2020 Russian Standard Time (UT+4h)  she@DPX200
##.OBSERVE FREQUENCY= 200.1315
##.OBSERVE NUCLEUS= ^1H
##.DELAY= (6, 6)
##.ACQUISITION MODE= SIMULTANEOUS
##.ACQUISITION SCHEME= undefined
##.AVERAGES= 8
##.DIGITISER RES= 18
##SPECTROMETER/DATA SYSTEM= spect
##.PULSE SEQUENCE= zg30
##.SOLVENT NAME= CDCl3
##.SHIFT REFERENCE= (INTERNAL, CDCl3, 0, 15.7039)
##AUDIT TRAIL= $$ (NUMBER, WHEN, WHO, WHERE, WHAT)
$$ ##TITLE= Audit trail, XWIN-NMR		Version 3.5
$$ ##JCAMPDX= 5.01
$$ ##ORIGIN= Bruker BioSpin GmbH
$$ ##OWNER= she
$$ F:/spectra/data/she/nmr/H-F/1/audita.txt
$$ ##AUDIT TRAIL=  $$ (NUMBER, WHEN, WHO, WHERE, WHAT)
(   1,<2020-02-05 16:29:18.92 +0400>,<she>,<DPX200>,
      <created by zg, POWCHK disabled, PULCHK disabled
       configuration hash MD5:
       00 E9 B6 7A A2 85 ED C7 34 08 36 98 17 FE 4E 26
       data hash MD5: 16K
       04 6B 79 BF EF BA 7C 81 CF 8A 43 F1 EB 0F D0 51>)
$$ ##END=
$$ 
$$ hash MD5
$$ B2 56 A5 8F D0 05 5D 5F 72 1E CE 6A 1C A1 7E 5D
##$RELAX= 
##$RELAX= 
##$RELAX= 
##$RELAX= 
##$RELAX= 
##$RELAX= 
$$ Bruker specific parameters
$$ --------------------------
##$DU= <F:/spectra>
##$EXPNO= 1
##$NAME= <H-F>
##$PROCNO= 1
##$TYPE= <nmr>
##$USER= <she>
##$AMP= (0..31)
100 100 100 100 100 100 100 100 100 100 100 100 100 100 100 100 100 100 
100 100 100 100 100 100 100 100 100 100 100 100 100 100 
##$AQSEQ= 0
##$AQ_mod= 1
##$AUNM= <au_zg>
##$AUTOPOS= <>
##$BF1= 200.13
##$BF2= 200.13
##$BF3= 200.13
##$BF4= 200.13
##$BF5= 200.13
##$BF6= 200.13
##$BF7= 200.13
##$BF8= 200.13
##$BYTORDA= 1
##$CFDGTYP= 0
##$CFRGTYP= 5
##$CHEMSTR= <none>
##$CNST= (0..31)
1 1 145 1 1 1 1 1 1 1 1 1 1 1 1 1 1 1 1 1 1 1 1 1 1 1 1 1 1 1 1 1 
##$CPDPRG= <>
##$CPDPRG1= <>
##$CPDPRG2= <>
##$CPDPRG3= <>
##$CPDPRG4= <mlev>
##$CPDPRG5= <mlev>
##$CPDPRG6= <mlev>
##$CPDPRG7= <mlev>
##$CPDPRG8= <mlev>
##$CPDPRGB= <>
##$CPDPRGT= <>
##$D= (0..31)
0 1.2 0 0 0 0 0 0 0 0.06 0 0.03 0 0 0 0 0.0002 0 0 0 0 0 0 0 0 0 0 0 0 
0 0 0 
##$DATE= 1580905758
##$DBL= (0..7)
120 120 120 120 120 120 120 120 
##$DBP= (0..7)
150 150 150 150 150 150 150 150 
##$DBP07= 0
##$DBPNAM0= <>
##$DBPNAM1= <>
##$DBPNAM2= <>
##$DBPNAM3= <>
##$DBPNAM4= <>
##$DBPNAM5= <>
##$DBPNAM6= <>
##$DBPNAM7= <>
##$DBPOAL= (0..7)
0.5 0.5 0.5 0.5 0.5 0.5 0.5 0.5 
##$DBPOFFS= (0..7)
0 0 0 0 0 0 0 0 
##$DE= 6
##$DECBNUC= <off>
##$DECIM= 24
##$DECNUC= <off>
##$DECSTAT= 4
##$DIGMOD= 1
##$DIGTYP= 9
##$DL= (0..7)
0 120 120 120 120 120 120 120 
##$DP= (0..7)
150 150 150 150 150 150 150 150 
##$DP07= 0
##$DPNAME0= <>
##$DPNAME1= <>
##$DPNAME2= <>
##$DPNAME3= <>
##$DPNAME4= <>
##$DPNAME5= <>
##$DPNAME6= <>
##$DPNAME7= <>
##$DPOAL= (0..7)
0.5 0.5 0.5 0.5 0.5 0.5 0.5 0.5 
##$DPOFFS= (0..7)
0 0 0 0 0 0 0 0 
##$DQDMODE= 0
##$DR= 18
##$DS= 0
##$DSLIST= <SSSSSSSSSSSSSSS>
$$ [...]
##$SUBNAM2= <"">
##$SUBNAM3= <"">
##$SUBNAM4= <"">
##$SUBNAM5= <"">
##$SUBNAM6= <"">
##$SUBNAM7= <"">
##$SUBNAM8= <"">
##$SUBNAM9= <"">
##$SW= 24.9337058887773
##$SWIBOX= (0..15)
0 0 2 0 0 0 0 0 0 0 0 0 0 0 0 0 
##$SW_h= 4990.01996007984
##$TD= 16384
##$TD0= 1
##$TE= 0
##$TE2= 300
##$TE3= 300
##$TEG= 300
##$TL= (0..7)
0 120 120 120 120 120 120 120 
##$TP= (0..7)
150 150 150 150 150 150 150 150 
##$TP07= 0
##$TPNAME0= <>
##$TPNAME1= <>
##$TPNAME2= <>
##$TPNAME3= <>
##$TPNAME4= <>
##$TPNAME5= <>
##$TPNAME6= <>
##$TPNAME7= <>
##$TPOAL= (0..7)
0.5 0.5 0.5 0.5 0.5 0.5 0.5 0.5 
##$TPOFFS= (0..7)
0 0 0 0 0 0 0 0 
##$TUNHIN= 0
##$TUNHOUT= 0
##$TUNXOUT= 0
##$USERA1= <user>
##$USERA2= <user>
##$USERA3= <user>
##$USERA4= <user>
##$USERA5= <user>
##$V9= 5
##$VALIST= <valist>
##$VCLIST= <CCCCCCCCCCCCCCC>
##$VD= 0
##$VDLIST= <DDDDDDDDDDDDDDD>
##$VPLIST= <PPPPPPPPPPPPPPP>
##$VTLIST= <TTTTTTTTTTTTTTT>
##$WBST= 1024
##$WBSW= 4
##$XGAIN= (0..3)
0 0 0 0 
##$XL= 0
##$YL= 0
##$YMAX_a= 233868
##$YMIN_a= -78600
##$ZGOPTNS= <>
##$ZL1= 120
##$ZL2= 120
##$ZL3= 120
##$ZL4= 120
##$ABSF1= 10
##$ABSF2= 0
##$ABSG= 5
##$ABSL= 3
##$ALPHA= 0
##$AQORDER= 0
##$ASSFAC= 0
##$ASSFACI= 0
##$ASSFACX= 0
##$ASSWID= 0
##$AUNMP= <proc_1d>
##$AZFE= 0.1
##$AZFW= 0.1
##$BCFW= 1
##$BC_mod= 2
##$BYTORDP= 1
##$COROFFS= 0
##$CY= 11.3945322036743
##$DATMOD= 1
##$DC= 2
##$DFILT= <>
##$DTYPP= 0
##$F1P= 16.9975609425685
##$F2P= -3.02152046262296
##$FCOR= 0.5
##$FTSIZE= 0
##$FT_mod= 4
##$GAMMA= 1
##$GB= 0.15
##$INTBC= 1
##$INTSCL= 1
##$ISEN= 128
##$LB= 0.24
##$LEV0= 0
##$LPBIN= 0
##$MAXI= 10000
##$MC2= 0
##$MEAN= 0
##$ME_mod= 0
##$MI= 1.114404
##$NCOEF= 0
##$NC_proc= 0
##$NLEV= 6
##$NOISF1= 3.799351
##$NOISF2= 2.8
##$NSP= 1
##$NTH_PI= 0
##$NZP= 0
##$OFFSET= 15.70392
##$PC= 1
##$PHC0= -9787.082
##$PHC1= 15.40081
##$PH_mod= 1
##$PKNL= yes
##$PPARMOD= 0
##$PSCAL= 0
##$PSIGN= 0
##$REVERSE= no
##$SF= 200.130013532006
##$SI= 16384
##$SIGF1= 3
##$SIGF2= 2
##$SINO= 400
##$SIOLD= 16384
##$SREGLST= <1H.CDCl3>
##$SSB= 0
##$STSI= 0
##$STSR= 0
##$SW_p= 3612.71676300578
##$SYMM= 0
##$S_DEV= 0
##$TDeff= 0
##$TDoff= 0
##$TI= <>
##$TILT= no
##$TM1= 0
##$TM2= 0
##$TOPLEV= 0
##$USERP1= <user>
##$USERP2= <user>
##$USERP3= <user>
##$USERP4= <user>
##$USERP5= <user>
##$WDW= 1
##$XDIM= 8192
##$YMAX_p= 0
##$YMIN_p= 0
$$ End of Bruker specific parameters
$$ ---------------------------------
##NTUPLES= NMR FID
##VAR_NAME=  TIME,          FID/REAL,        FID/IMAG
##SYMBOL=    X,             R,               I
##VAR_TYPE=  INDEPENDENT,   DEPENDENT,       DEPENDENT
##VAR_FORM=  AFFN,          ASDF,            ASDF
##VAR_DIM=   8192,          8192,            8192
##UNITS=     SECONDS,       ARBITRARY UNITS, ARBITRARY UNITS
##FACTOR=    0.0002004,     1,               1
##FIRST=     0,             0,               0
##LAST=      1.6414764,     0,               0
##MIN=       0,             -78600,          0
##MAX=       1.6414764,     233868,          0
$$ Real data points
##PAGE= N=1
##DATA TABLE= (X++(R..R)), XYDATA
$$ [...]
$$ plain form
2117 -23 1236 272 -729 -140 1161 -130 -1013 434 1013 178 -1120 -818 553 707 101 -420 -447 235
2135 235 493 689 -71 -355 44 671 243 561 957 731 204 55 1231 1781 463 152 1406 1588 298
2154 298 -369 1257 1991 607 -828 282 942 875 88 260 624 61 68 451 977 613 -79 403 789 1022
2174 1022 916 672 213 469 1545 1460 -49 -97 1493 1970 295 -559 1019 1437 529 -994 365 1299
2192 1299 -209 -1091 492 1262 -435 -1427 173 1538 164 -1152 -196 895 94 -759 223 698 -87
2209 -87 -387 273 453 -211 -667 475 411 -781 -660 62 -148 -1238 -1117 -284 -382 -1779 -1051 192 -799
2228 -799 -2221 -1820 508 148 -2211 -2053 442 -121 -1747 -1708 9 303 -2046 -1900 5 614 -1160
2245 -1160 -1683 -281 -191 -1316 -1204 -31 -431 -1095 -1269 -609 -935 -1381 -682 -199 -1041 -1554 -528 342 -854
$$ packed form
2117b3J259r64j001N89J301j291q83J447N79q35j298L02J371J54o06n21k7O82
2135B35K58J96p60k84L99O27m28L18L96k26n27j49J176N50j318l11J254J82j290
2154B98o67J626P34j384j435J110O60o7p87J72L64n63PL83N26l64o92M82L86K33
2174A022j06k44m59K56J076q5j509m8J590M77j675q54J578M18r08j523J359R34
2192A299j508q82J583P70j697r92J600J365j374j316R56J091q01q53R82M75p85
2209h7l00O60J80o64m56J142o4j192J21P22k10j090J21Q33r8j397P28J243r91
2228g99j422M01K328l60k359J58K495n63j626L9J717K94k349J46J905O09j774
2245a160n23J402R0j125J12J173m00o64j74O60l26m46O99M83q42n13J026Q70j196
$$ plain form
2264 -854 -1601 -308 203 -624 -1123 529 1418 -688 -1359 63 1801 150 -1230 57 1351 510 -708
2281 -708 410 1751 364 -992 81 1643 753 -890 5 1078 508 -637 -189 650 411 -164 -230
2298 -230 320 -95 -219 330 525 -296 -447 463 678 -76 -7 554 362 -343 353 1357 740 -844 -843 812
2318 812 1254 -390 -830 353 917 -620 -907 -104 761 -259 -1199 -94 551 -702 -1442 -270 759
2335 759 15 -1235 -765 368 235 -355 -602 74 57 -12 436 66 -265 -167 474 575 -49 -265 -204 120 176
2356 176 120 483 -223 -700 -176 372 138 -830 -864 325 301 -785 -851 288 807 -561 -796 601 736 -24
2376 -24 -457 725 693 -146 -677 439 1696 778 -973 -201 1300 1096 58 -618 -37 715 -39 -397 282
2395 282 -83 -247 -233 270 178 -240 179 300 -28 489 625 826 105 371 1312 1132 499 324 1737 1639 509
$$ packed form
2264h54p47J293N11q27m99J652Q89k106o71J422J738j651j380J287J294q41j218
2281g08J118J341j387j356J073J562q90j643Q95J073n70j145M48Q39k39n75o6
2298b30N50m15j24N49J95q21j51R10K15p54O9N61j92p05O96J004o17j584JJ655
2318H12M42j644m40J183N64j537k87Q03Q65j020r40J105O45j253p40J172J029
2335G59p44j250M70J133j33n90k47O76j7o9M48l70l31R8O41J01o24k16O1L24N6
2356A76n6L63p06m77N24N48k34r68l4J189k4j086o6J139N19j368k35J397J35p60
2376b4m33J182l2q39n31J116J257r18j751P72J501k04j038o76N81P52p54l58O79
2395B82l65j64J4N03r2m18M19J21l28N17J36K01p21K66R41j80o33j75J413r8j130
$$ plain form
2416 509 81 1544 1810 863 -161 883 1962 883 -5 1034 1495 223 147 1027 1978 499 -229 397
2434 397 1746 1065 155 615 1291 908 717 1103 1271 812 670 1059 1267 646 447 713 598 184 437 794
2454 794 178 -374 179 907 -238 -1089 -337 851 55 -1372 -897 824 150 -1199 -1047 296 290 -882
2472 -882 -822 451 406 -841 -1124 253 582 -759 -951 -383 -26 -298 -356 -205 -212 -734 -235 -210 -696 -389 -314
2493 -314 67 -597 -729 -98 128 -514 -681 226 318 -435 -902 141 439 -496 -949 270 1032 -530 -823
2512 -823 363 903 -104 -588 277 792 -211 -878 -7 640 -363 -407 28 186 68 -339 -236 20 -226
2531 -226 -525 -43 -581 -969 -198 -21 -442 -838 -175 279 -414 -814 -327 596 -577 -800 -138 804 -94 -895
2551 -895 -82 1000 -92 -856 -511 752 199 -965 -762 51 198 -609 -313 -33 -106 -434 228 311 -243
$$ packed form
2416E09m28J463K66r47j024J044J079j079q88J039M61j272p6Q80R51j479p28O26
2434C97J349o81r10M60O76l83j91L86J68m59j42L89K08o21j99K66j15m14K53L57
2454G94o16n52N53P28j145q51P52J188p96j427M75J721o74j349J52J343oj172
2472h82O0J273m5j247k83J377L29j341j92N68L57k72n8J51pn22M99K5m86L07P5
2493c14L81o64j32O31K26o42j67R07R2p53m67J043K98r35m53J219P62j562k93
2512h23J186N40j007m84Q65N15j003o67Q71O47j003m4M35J58j18m07J03K56k46
2531b26k99M82n38l88P71J77m21l96O63M54o93m00M87R23j173k23O62R42q98q01
2551h95Q13J082j092p64L45J263n53j164K03Q13J47q07K96K80p3l28O62Q3n54
$$ plain form
2570 -243 -3 595 540 280 544 837 338 157 775 1487 728 -44 355 1538 957 -559 8 1193 717
2589 717 -261 94 766 590 -643 -282 759 325 -747 -214 1007 560 -714 -372 556 400 -140 -253
2607 -253 215 -30 -110 -134 139 -629 -1079 -62 -103 -1177 -1196 -121 -768 -1833 -1649 -419 -670 -2000 -1759
2626 -1759 -39 -149 -2021 -1798 -69 388 -1461 -1646 3 529 -981 -1419 -183 103 -945 -1263 -153
2643 -153 389 -652 -999 124 -121 -633 -631 436 -286 -834 -200 461 482 -414 337 1361 715 -343 861
2662 861 2006 852 51 1486 2060 1009 -150 1304 2376 1012 -182 976 2112 1179 -402 603
2678 603 1735 652 -556 625 1686 660 -726 338 1755 746 -496 350 827 765 171 698 868
2695 868 59 -281 867 1067 -645 -695 596 452 -701 -652 638 535 -1206 -1463 782 246 -1276 -1349
$$ packed form
2570b43K40N98n5k60K64K93m99j81O18P12p59p72L99J183n81j516N67J185m76
2589G17r78L55O72j76j233L61J041m34j072N33J221m47j274L42R28j56n40j13
2607b53M68k45q0k4K73p68m50J017m1j074j9J075o47j065J84J230k51j330K41
2626a759J720j10j872K23J729M57j849j85J649N26j510m38J236K86j048l18J110
2643a53N42j041l47J123k45n12KJ067p22n48O34O61K1q96P51J024o46j058J204
2662H61J145j154q01J435N74j051j159J454J072j364j194J158J136r33j581J005
2678F03J132j083j208J181J061j026j386J064J417j009j242Q46M77o2n94N27J70
2695H68q09l40J148K00j712n0J291j44j153M9J290j03j741k57K245n36j522p3
$$ plain form
2713 -1349 405 285 -1470 -1442 406 776 -902 -1260 -29 583 -594 -1043 -215 -457 -1225 -867 244 142
2731 142 -1454 -1714 311 -106 -618 -930 141 -402 -694 -287 247 17 -885 41 653 -362 -760 206 781
2750 781 -95 -623 -41 806 -78 -1012 59 791 -279 -1460 58 732 -244 -1554 -400 815 255 -839
2768 -839 -557 343 236 -249 -83 600 -184 -435 111 501 -82 -192 206 84 -617 -681 -58 -193 -1513 -740
2788 -740 -43 -344 -1612 -1159 -51 -453 -1008 -1017 175 -91 -1113 -641 549 315 -390 -438 390 770 -337
2807 -337 -124 479 623 -328 -330 24 460 -372 -997 -326 -157 -521 -648 -523 -1065 -659 -335 -219 -341 -259 4
2828 4 -173 -429 -97 883 444 -145 -33 857 997 421 230 804 969 -374 -411 525 791 -404 -955 -240
2848 -240 499 200 -416 -108 -101 -250 -225 -25 -38 42 -357 -131 38 443 528 207 -418 128 883 450 -108 -267
$$ packed form
2713a349J754j20j755K8J848L70j678l58J231O12j177m49Q28k42p68L58J111j02
2731A42j596k60K025m17n12l12J071n43k92M07N34k30r02R26O12j015l98R66N75
2750G81q76n28N82Q47q84r34J071P32j070j181J518O74r76j310J154J215n60j094
2768h39K82R00j07m85J66O83p84k51N46L90n83j10L98j22p01o4O23j35j320P73
2788g40O97l01j268M53J108m02n55rJ192k66j022M72J190k34p05m8Q28L80j107
2807c37K13O03J44r51kL54M36q32o25O71J69l64j27J25n42M06L24J16j22Q2K63
2828Dj77k56L32R80m39n89J12Q90J40n76j91N74J65j343l7R36K66j195n51P15
2848b40P39k99o16L08Pj49K5K00j3Q0l99K26J69M05Q5l21o25N46P55m33n58j59
$$ plain form
2870 -267 17 139 -330 -361 110 107 -810 -1193 -381 148 -891 -934 -570 -346 -700 -890 -513 -266 -629 -1136 -607
2891 -607 -100 7 -139 -172 -293 -131 36 112 326 -311 16 10 -348 -216 188 -15 -447 -497 -62 -46 -463 -1094
2913 -1094 135 353 -327 -544 -117 898 272 -434 309 1086 827 464 444 1527 859 806 961 1409 1174
2932 1174 704 490 1071 1084 878 691 607 597 945 853 844 533 710 1019 687 298 759 1272 912 531 728 1259
2954 1259 952 453 822 1680 1215 612 490 1430 1436 802 156 1014 1052 628 464 446 361 4 -288 276 474
2975 474 -466 -605 -555 -201 -420 -640 -530 -164 -356 -305 -428 -687 -209 -72 -309 -316 -218 15 269 -225 -434 -10
2997 -10 163 -312 -747 118 417 -563 -792 -251 140 -282 -1179 -748 -297 -314 -966 -773 -225 -344 -457 -634 101
3018 101 188 78 -317 200 545 292 71 455 786 577 237 124 264 367 651 560 124 334 242 416 211
$$ packed form
2870b67K84J22m69l1M71lr17l83Q12N29j039m3L64K24l54j90L77K47l63n07N29
2891f07N07J07j46l3j21J62J67P6K14o37L27ol58J32M04k03m32n0M35J6m17o31
2913a094J229K18o80k17M27J015o26p06P43P77k59l63k0J083o68n3J55M48k35
2932A174m70k14N81J3k06j87q4j0L48r2rl11J77L09l32l89M61N13l60l81J97N31
2954A259l07m99L69Q58m65o03j22R40Oo34o46Q58L8m24j64j8q5l57k92N64J98
2975D74r40j39N0L54k19k20J10L66j92N1j23k59M78J37k37pR8K33K54m94k09M24
2997a0J73m75m35Q65K99r80k29N41L91m22q97M31M51j7o52J93N48j19j13j77P35
3018A01Q7j10l95N17L45k53k21L84L31k09l40j13J40J03K84r1m36K10r2J74k05
$$ plain form
3039 211 250 113 39 -229 -100 92 180 -136 -374 128 226 98 -47 305 229 304 -184 -82 712 472 -121 -92
3061 -92 978 909 -269 -293 552 549 102 -442 -38 29 -92 -561 -438 -217 -274 -499 -563 -578 -646 -464 -598 -627 -883
3084 -883 -481 -595 -407 -73 -29 -113 -582 -357 120 522 51 -584 -84 832 109 -494 -71 535 188 -373 -231
3105 -231 670 56 -702 -510 -193 210 -788 -770 69 83 -813 -821 -97 287 -511 -650 -56 -17 108 176 175 162 -157
3128 -157 -124 162 347 -130 256 298 -88 359 456 -197 -332 -570 155 285 -826 -890 -364 -316 -635 -1046 -165
3149 -165 -103 -735 -1187 -228 111 -439 -721 -242 58 -423 -322 -57 157 52 -433 188 508 250 -64 -434
3169 -434 1 108 -119 138 -158 -477 -77 -22 -130 -596 24 149 -453 -520 -335 444 250 -119 176 612 703
3190 703 -14 359 911 567 22 441 1442 1228 221 14 1179 1499 1067 707 1136 775 572 1168 1201
$$ packed form
3039B11L9j37p4k68J29J92Q8l16k38N02R8j28j45L52p6P5m88J02P94k40n93K9
3061i2J070o9j178k4Q45lm47n44M04O7j21m69J23K21n7k25o4j5o8J82j34k9k56
3084h83M02j14J88L34M4q4m69K25M77M02m71o35N00R16p23o03M23O06l47n61J42
3105b31R01o14p58J92L17M03r98J8Q39J4q96qP24L84p98j39N94L9J25O8jj3l19
3128a57L3K86J85m77L86M2l86M47R7o53j35k38P25J30j111o4N26M8l19m11Q81
3149a65O2o32m52R59L39n50k82M79L00m81J01K65K14j05m85O21L20k58l14l70
3169d34M35J07k27K57k96l19M00N5j08m66O20J25o02o7J85P79j94l69K95M36R1
3190G03p17L73N52l44n45M19J001k14j007k07J165L20m32l60M29l61k03N96L3
$$ plain form
3209 1201 828 225 496 667 629 362 302 610 177 106 650 684 172 281 612 1005 147 27 845 1152 192
3230 192 181 656 1072 667 479 978 735 -256 -436 480 875 -446 -796 -195 42 -360 -596 -693 -392 -780
3250 -780 -558 -519 -605 -1071 -976 -350 -725 -484 -295 120 -261 -611 112 435 -212 -670 328 735 -57 -488 408
3271 408 598 252 -419 -269 286 188 -1072 -594 88 -206 -950 -325 -32 -401 -388 -77 467 104 -486 223
3291 223 432 294 647 571 405 109 443 793 641 289 314 314 173 -432 216 376 -288 -768 -118 529 57
3312 57 -665 -363 122 91 -682 -543 425 319 -341 -283 483 646 -200 -603 195 164 -459 -187 314 -154 -463
3333 -463 -783 -363 -380 -698 -444 -682 -991 -408 -203 -284 -797 -895 -276 -9 -634 -494 -94 425 -540 -482 206
3354 206 447 -257 -704 119 808 -271 -687 287 411 -540 -628 154 -151 -286 -729 -140 61 -38 -289 257
$$ packed form
3209A201l73o03K71J71l8k67o0L08m33p1N44L4n12J09L31L93q58j20Q18L07r60
3230A92j1M75M16m05j88M99k43r91j80R16L95j321l50O01K37m02k36r7L01l88
3250g80K22L9q6m66R5O26l75K41J89M15l81l50P23L23o47m58R98M07p92m31Q96
3271D08J90l46o71J50N55r8j260M78O82k94p44O25K93l69J3L11N44l63n90P09
3291B23K09j38L53p6j66k96L34L50j52l52K5%j41o05O48J60o64m80O50O47m72
3312E7p22L02M85l1p73J39R68j06o60N8P66J63q46m03P98l1o23K72N01m68l09
3333d63l20M20j7l18K54k38l09N83K05q1n13r8O19K67o25J40M00N19r65N8O88
3354B06K41p04m47Q23O89j079m16R74J24r51q8P82l05j35m43N89K01r9k51N46
$$ plain form
3374 257 431 9 -350 175 396 -29 -85 87 86 -219 84 303 -264 -954 -216 -80 -630 -1054 -842 -220 -931
3395 -931 -1176 -721 -103 -944 -1413 -753 -142 -682 -1078 -583 31 -520 -1103 -858 -371 -307 -537 -1051 -453 -90
3415 -90 -898 -633 -396 -831 -775 -477 -346 -883 -689 -75 -364 -600 -610 56 -329 -618 -367 376 255 -534 104
3436 104 842 597 -54 -273 915 837 178 264 713 1046 -241 351 692 908 263 304 956 846 671 544
3456 544 1021 1015 677 960 910 738 963 942 917 501 219 665 1116 416 131 438 715 -180 -404 204 535 -80
3478 -80 -825 139 559 -299 -869 -35 373 -22 -524 364 612 126 -278 9 858 96 -299 -370 68 -107 -321
3499 -321 -317 -143 -451 -581 -747 -534 -604 -674 -247 -705 -713 -470 -18 -30 -101 77 452 408 106 365 1060 703 128
3522 128 403 1341 1447 427 440 882 757 350 113 442 801 -73 -66 795 233 17 -240 200 416 170 -235
$$ packed form
3374B57J74m22l59N25K21m25n6J72jl05L03K19n67o90P38J36n50m24K12O22p11
3395i31k45M55O18q41m69O60O11n40l96M95O14n51n83K45M87O4k30n14N98L63
3415i0q08K65K37m35N6K98J31n37J94O14k89k36j0O66l85k89K51P43j21p89O38
3436A04P38k45o51k19J188p8o59Q6M49L33j287N92L41K16o45M1O52j10j75j27
3456E44M77ol38K83n0j72K25k1k5m16k82M46M51p00k85L07K77q95k24O08L31o15
3478h0p45R64M20q58n70Q34M08l95n02Q88K48m86m04K87Q49p62l95p1M38j75k14
3499c21MJ74l08j30j66K13p0p0M27m58qK43M52j2p1J78L75m4l02K59O95l57n75
3522A28K75R38J06j020J3M42j25m07k37L29L59q74PQ61n62k16k57M40K16k46m05
$$ plain form
3543 -235 161 587 315 120 327 644 677 736 324 432 93 706 798 147 16 55 643 182 88 375 59 -611
3565 -611 -425 -52 -24 -332 -792 -551 -49 -229 -700 -405 -315 20 -200 -533 115 620 152 -178 2 272 302
3586 302 142 261 398 380 209 287 308 522 73 -171 31 287 444 -79 -177 89 135 -180 191 70 14 291
3608 291 -414 257 105 213 356 133 274 804 79 409 623 520 36 201 192 467 459 -100 -223 71 244
3629 244 -267 -698 -175 -292 -534 -823 -673 -140 -737 -729 -721 -204 -235 -645 -710 -383 -309 -575 -922 -432 -74 -272
3651 -272 -555 -666 -298 -334 -241 -395 -555 -279 -630 -393 -493 -529 -648 -339 -588 -598 -579 -217 -293 -601 -332 -282
3673 -282 -473 -357 -43 5 -547 -229 101 221 145 -95 74 416 163 391 -25 416 30 -296 36 177 259
3694 259 -109 -147 -3 73 -113 -81 -81 176 89 -104 -130 77 393 196 -201 124 246 447 197 514 -51 329
$$ packed form
3543b35L96M26k72j95K07L17L3N9m12J08l39O13R2o51j31L9N88m61r4K87l16o70
3565f11J86L73K8l08m60K41N02j80m71K95R0L35k20l33O48N05m68l30J80K70L0
3586C02j60J19J37j8j71P8K1K14m49k44K02K56J57n23r8K66M6l15L71j21n6K77
3608B91p05O71j52J08J43k23J41N30p25L30K14j03m84J65rK75qn59j23K94J73
3629B44n11m31N23j17k42k89J50N33n97QQN17l1m10o5L27P4k66l47M90L58j98
3651b72k83j11L68l6R3j54j60K76l51K37j00l6j19L09k49j0J9L62p6l08K69N0
3673b82j91J16L14M8n52L18L30J20p6k40J69L42k53K28m16M41l86l26L32J41Q2
3694B59l68l8J44P6j86L2%K57q7j93k6K07L16j97l97L25J22K01k50L17n65L80
$$ plain form
3716 329 -102 -178 372 319 411 -28 -154 508 623 -8 42 -20 243 472 64 230 -16 304 -162 50 238 497
3738 497 -16 -162 297 695 238 -169 189 482 180 44 -261 478 511 40 39 32 546 191 109 96 42 158 145
3761 145 35 134 -96 13 -47 6 93 16 -8 -80 80 48 -13 -130 -339 90 193 -236 -266 116 -1 -450 -164
3784 -164 84 -5 -315 -363 -94 190 -275 -402 190 363 142 -428 -58 414 393 -119 -206 164 203 81 463 525
3806 525 453 191 417 514 489 300 225 493 204 723 467 423 315 725 747 248 109 521 1050 560 46 330
3828 330 566 342 220 327 542 420 -366 78 831 476 194 448 852 363 98 300 295 161 57 -20 327
3849 327 199 98 15 190 -167 -363 -23 108 -252 -100 74 -10 -497 -353 -81 67 -542 -148 161 177 -404
3870 -404 -213 -80 32 -38 -587 -37 -14 -569 -700 58 127 -60 -537 49 94 -171 -408 -175 196 79 -21
$$ packed form
3716C29m31p6N50n3R2m39j26O62J15o31N0o2K63K29m08J66k46L20m66K12J88K59
3738D97n13j46M59L98m57m07L58K93l02j36l05P39L3m71jpN14l55q2j3n4J16j3
3761A45j10R9k30J09o0N3Q7p7k4p2J60l2o1j17k09M29J03m29l0L82j17m49K86
3784a64K48q9l10m8K69K84m65j27N92J73k21n70L70M72k1n12q7L70L9j22L82O2
3806E25p2k62K26R7k5j89p5K68k89N19k56m4j08M10K2m99j39M12N29m90n14K84
3828C30K36k24j22J07K15j22p86M44P53l55k82K54M04m89k65K02nj34j04p7L47
3849C27j28j01q3J75l57j96L40J31l60J52J74q4m87J44K72J48o09L94L09J6n81
3870d04J91J33J12p0n49N50K3n55j31P58O9j87m77N86M5k65k37K33L71j17j00
$$ plain form
3891 -21 -211 33 -159 7 -62 -79 -253 -50 -327 -318 -246 154 -232 -145 -454 -432 -189 -169 -373 -658 149 -339 -613
3914 -613 -244 51 -15 -848 -430 130 -286 -595 -341 -21 -112 -954 -338 -2 -10 -796 -666 -461 -494 -515 -543 -316
3936 -316 -738 -835 -502 -550 -635 -824 -396 -233 -489 -446 34 -135 -495 -440 384 -34 -386 -454 -179 96 -415 -305
3958 -305 59 316 -356 -271 111 164 -190 -392 -70 192 -50 -106 422 394 64 -93 344 539 380 419 406 262
3980 262 645 637 725 334 282 163 460 69 -32 224 241 -114 -289 90 296 -317 -557 -40 233 -253 -305 0
4002 0 86 -19 -427 -138 453 -103 -368 86 419 9 -606 -46 -50 -88 -620 -230 -425 -254 -278 -305 -292 -608 -247
4025 -247 -258 -467 -777 -297 33 -309 -688 -96 254 -60 -27 217 388 434 112 -49 734 321 -170 2 536
4046 536 83 -158 -72 303 333 -346 -478 12 214 35 -43 256 510 39 132 562 259 283 625 558 566 596 331
$$ packed form
3891b1j90K44j92J66o9j7j74K03k77RP2M00l86Q7l09K2K43K0k04k85Q07m88k74
3914f13L69K95o6q33M18N60m16l09K54L20r1q42O16L36qp86J30K05l3k1k8K27
3936c16m22r7L33m8q5j89M28J63k56M3M80j69l60N5Q24m18l52o8K75K75n11J10
3958c05L64K57o72Q5L82N3l54k02L22K62k42n6N28k8l30j57M37J95j59L9j3j44
3980B62L83qQ8l91n2j19K97l91j01K56J7l55j75L79K06o13k40N17K73m86n2L05
4002@Q6j05m08K89N91n56k65M54L33m10o15N60ml8n32L90j95J71k4k7J3l16L61
4025b47j1k09l10M80L30l42l79N92L50l14L3K44J71M6l22j61P83m13m91J72N34
4046E36m53k41Q6L75L0o79j32M90K02j79p8K99K54m71R3M30l03K4L42o7QL0k65
$$ plain form
4069 331 430 140 601 978 254 196 348 683 173 -178 -247 243 428 -103 -366 245 112 -41 -63 436 104
4090 104 -142 -160 20 509 124 22 256 142 543 239 406 440 172 347 379 318 21 246 507 -184 123
4111 123 391 490 29 -20 675 682 328 -20 493 422 250 -264 319 730 -25 -193 189 436 149 -285 69 282
4133 282 61 302 37 448 104 -122 224 196 337 199 124 355 89 -61 194 124 -206 -162 -158 59 -174 -129
4155 -129 -230 -295 -715 -439 58 -499 -747 -675 -57 -437 -837 -864 75 -231 -420 -693 -94 96 -457 -256 -112
4176 -112 76 -466 -326 -267 200 -120 -151 -161 -186 -233 -410 -372 -704 -373 -340 -288 -593 -369 -328 -57 -428 -204 118
4199 118 -145 83 -254 131 479 194 64 94 730 434 139 365 619 231 49 0 372 76 52 -88 -186
4220 -186 -328 -298 -161 -129 -169 -543 -642 -86 -54 -93 257 135 108 51 220 -161 9 190 383 353 -55 -6 444
$$ packed form
4069C31R9k90M61L77p24n8J52L35n10l51o9M90J85n31k63O11j33j53k2M99l32
4090A04k46j8J80M89l85j02K34j14M01l04J67L4k68J75L2o1k97K25K61o91L07
4111A23K68R9m61m9O95Pl54l48N13p1j72n14N83M11p55j68L82K47k87m34L54K13
4133B82k21K41k65M11l44k26L46k8J41j38p5K31k66j50K55p0l30M4MK17k33M5
4155a29j01o5m20K76M97n57k48P2O18l80m00k7R39l06j89k73N99J90n53K01J44
4176a12J88n42J40N9M67l20l1j0k5m7j77L8l32L31L3N2l05K24M1K71l71K24L22
4199A18k63K28l37L85L48k85j30L0O36k96k95K26K54l88j82m9L72k96k4j40r8
4220a86j42L0J37L2m0l74r9N56L2l9L50j22k7n7J69l81J70J81J93l0m08M9M50
$$ plain form
4243 444 -5 158 78 30 139 -448 -59 60 -302 -439 -397 -23 -175 -317 -492 -503 -409 -251 -398 -177 -423 -206
4265 -206 -300 60 99 323 -460 -434 94 276 43 47 -4 -112 259 -107 -94 146 29 -501 -111 -182 2 -23 -220
4288 -220 -314 -395 -96 -383 -206 -217 -140 14 -366 69 180 94 -95 -327 145 271 510 -135 243 27 439 -140
4310 -140 422 396 125 -67 -49 136 106 -156 -134 -63 22 -2 -404 76 -129 -241 -600 -93 42 -68 -10 -20 -140
4333 -140 -79 571 242 185 454 319 28 260 157 455 526 184 333 623 27 173 153 495 357 6 -75 242
4355 242 492 145 -231 232 562 84 225 218 464 407 113 174 416 104 329 215 520 73 318 498 383
4376 383 169 311 215 -29 314 218 266 -127 -181 -193 86 -140 -88 -244 -47 -305 -132 123 41 142 -168 -379
4398 -379 -48 54 -250 -241 252 128 -269 -192 399 261 -370 -432 31 91 66 37 -383 -252 39 -57 106 350 290
$$ packed form
4243D44m49J63q0m8J09n87L89J19l62j37M2L74j52j42j75j1R4J58j47K21k46K17
4265b06r4L60L9K24p83K6N28J82k33Mn1j08L71l66J3K40j17n30L90p1J84k5j97
4288b20r4q1K99k87J77j1P7J54l80M35J11q6j89k32M72J26K39o45L78k16M12n79
4310a40N62k6k71j92J8J85l0k62K2P1Q5k4m02M80k05j12l59N07J35j10N8j0j20
4333a40O1O50l29n7K69j35k91K32j03K98P1l42J49K90n96J46k0L42j38l51q1L17
4355B42K50l47l76M63L30m78J41pK46n7k94O1K42l12K25j14L05m47K45J80j15
4376C83k14J42r6k44L43r6M8l93n4j2K79k26N2j56J97k58J73K55q2J01l10k11
4398c79L31J02l04RM93j24l97P7N91j38o31o2M63O0k5k9m20J31K91r6J63K44o0
$$ plain form
4421 290 -250 -246 -131 -190 146 -61 -424 -236 216 -160 -391 -217 88 -56 -315 -478 -148 -168 -29 -262 152
4442 152 -72 -158 -141 -120 -113 -4 -164 -26 -128 39 -259 -193 -101 138 -53 -615 -384 9 -74 -71 -389 -233 -187 -185
4466 -185 -181 -278 -48 -104 -392 -155 28 -61 -228 -199 -66 93 -173 -191 -55 476 -44 86 276 347 176 146 -34
4489 -34 129 91 -270 -90 89 342 -6 239 -362 -122 302 -29 -101 -93 -196 57 -382 -130 170 -210 -78 -337
4511 -337 -107 224 -24 -259 166 150 -88 -84 -133 344 -155 -270 -24 107 -105 -418 -524 87 -356 -431 -634 -98
4533 -98 -295 -601 -330 -2 -373 -274 -282 -317 -370 -390 -193 -202 -504 31 285 -188 -133 -268 -117 -36 -555 326 279 4
4557 4 -483 194 12 -196 -409 -324 21 -142 -266 -394 -155 -150 -26 -151 148 100 -98 -281 248 121 326 112
4579 112 294 451 183 529 339 82 120 300 285 13 196 333 234 172 6 452 406 125 -94 465 361 239
$$ packed form
4421B90n40MJ15n9L36k07l63J88M52l76k31J74L05j44k59j63L30k0J39k33M14
4442A52k24q6J7K1PJ09j60J38j02J67k98O6R2K39j91n62K31L93q3Ll18J56M6K
4466a85Mr7K30n6k88K37J83q9j67K9J33J59k66j8J36N31n20J30J90P1j71l0j80
4489c4J63l8l61J80J79K53l48K45o01K40M24l31p2Qj03K53m39K52L00l80J32k59
4511c37K30L31k48k35M25j6k38Mm9M77m99j15K46J31k12l13j06O11m43p5k03N36
4533i8j97l06K71L28l71R9ql5n3k0J97rl02N35K54m73N5j35J51Q1n19Q81m7k75
4557Dm87O77j82k08k13Q5L45j63j24j28K39NJ24j25K99m8j98j83N29j27K05k14
4579A12J82J57k68L46j90k57L8J80j5k72J83J37r9o2j66M46m6k81k19N59j04j22
$$ plain form
4601 239 187 509 572 190 -122 331 221 354 -104 113 285 395 218 267 260 78 -104 249 166 174 99 130 403
4624 403 138 159 89 30 -161 257 223 136 11 459 389 249 -52 140 230 214 85 159 551 270 213 -256 196
4647 196 19 -336 -42 170 -49 -219 -71 23 341 86 -497 222 330 221 299 188 295 -29 460 271 172
4668 172 140 254 -24 -314 65 -116 -1 -89 -470 -322 7 34 -614 79 317 -643 -247 47 -125 -197 -566
4689 -566 -168 0 -267 17 -85 283 -143 -338 112 98 -120 -81 -162 97 34 -310 -169 -101 -351 -465 -40 157
4711 157 -322 -212 -48 -398 -233 110 327 45 1 -3 291 -63 -124 139 190 43 -83 357 261 217 12 399
4733 399 432 291 9 -155 113 52 -180 -12 -48 22 -171 -157 -145 -34 36 -7 121 23 73 26 87 -121 122 419
4757 419 92 -223 -78 200 25 -45 -82 113 -261 -264 -343 161 -119 59 -99 -254 -68 -457 -684 66 -55 -278
$$ packed form
4601B39n2L22O3l82l12M53j10J33m58K17J72J10j77M9pj82j82L53q3Qp5L1K73
4624D03k65K1p0n9j91M18l4q7j25M48p0j40l01J92R0j6j29P4L92k81n7m69M52
4647A96j77l55K94K12k19j70J48R4L18k55n83P19J08j09P8j11J07l24M89j89r9
4668A72l2J14k78k90L79j81J15q8l81J48L29K7o48O93K38r60L96K94j72p2l69
4689e66L98J68k67K84j02L68m26j95M50j4k18L9q1K59o3l44J41O8k50j14M25J97
4711A57m79J10J64l50J65L43K17k82m4mK94l54o1K63N1j47j26M40r6m4k05L87
4733C99L3j41k82j64K68o1k32J68l6P0j93J4J2J11P0m3J28r8N0m7O1k08K43K97
4757D19l27l15J45K78j75p0l7J95l74lp9N04k80J78j58j55J86l89k27P50j21k23
$$ plain form
4779 -278 -402 35 -21 -459 -479 -130 -165 -261 -120 -422 -321 -309 -589 -230 -261 -187 -145 -15 -296 -35 -158 -72 -280
4802 -280 -301 -193 78 -570 -139 188 -11 -173 -352 -248 -251 -96 -260 -156 -88 -118 -306 100 -187 -101 -89 -140 30
4825 30 -205 -39 83 22 190 -248 68 26 -43 250 -175 -47 149 273 343 52 -72 -6 -68 -168 -287 -43
4847 -43 13 59 51 224 189 27 -51 452 397 -261 -113 16 387 498 13 55 232 423 166 198 105 212 408 199
4871 199 196 136 177 35 134 406 -5 335 13 63 214 496 260 -89 390 509 228 42 325 414 467 126 342
4894 342 374 441 177 21 181 87 154 220 184 117 353 -136 -45 -81 247 175 174 93 231 78 125 -120 236 -38 14
4919 14 -153 -54 -23 12 -3 -147 52 205 -129 -18 411 -45 -325 -69 169 151 0 -137 -47 420 -208 -240 -70
4942 -70 332 -173 -107 60 200 -56 -1 163 -68 -28 100 156 -40 155 0 -139 12 1 -49 -77 73 99 -72
$$ packed form
4779b78j24M37n6m38k0L49l5r6J41l02J01J2k80L59l1P4M2J30k81K61j23Q6k08
4802b80k1J08K71o48M31L27j99j62j79J04lJ55j64J04O8l0j88M06k87Q6J2n1J70
4825C0k35J66J22o1J68m38L16m2o9K93m25J28J96J24P0k91j24O6o2j00j19K44
4847d3N6M6qJ73l5j62p8N03n5o58J48J29L71J11m85M2J77J91k57L2r3J07J96k09
4871A99lo0M1j42R9K72m11L40l22N0J51K82k36l49M79J19k81j86K83Q9N3l41K16
4894C42L2O7k64j56J60r4O7O6l6o7K36m89R1l6L28p2jq1J38j53M7k45L56k74N2
4919A4j67R9L1L5j5j44J99J53l34J11M29m56k80K56K38j8j51j37R0M67o28l2J70
4942g0M02n05O6J67J40k56N5J64k31M0J28N6j96J95j55j39J51j1n0k8J50K6j71
$$ plain form
4965 -72 -45 21 124 -92 463 12 -201 132 206 196 158 -238 390 46 -154 65 152 49 -81 -430 -50 177
4987 177 56 -114 -34 254 159 -8 244 204 -20 -246 261 478 -144 -232 253 -103 146 164 -16 -4 -184 -88
5009 -88 115 -255 -142 -49 77 -131 -239 -224 96 -310 -191 100 66 223 194 117 162 233 59 -164 47 -138 -158
5032 -158 -139 43 201 -458 -347 -79 61 -276 -470 221 -61 -94 -276 -154 -124 -180 -122 -110 -20 -405 -406 -284 -34
5055 -34 -305 -310 -153 -232 -643 -83 -47 -293 -259 -123 209 -132 -285 -220 78 -443 -495 -319 183 -184 -306 -81 -106
5078 -106 -331 -455 -58 188 95 -375 -218 -9 228 -134 -332 -117 37 -129 113 53 -123 -139 -113 195 48
5099 48 7 229 -162 204 29 -29 386 39 115 50 -35 -70 -161 180 449 -4 -167 205 301 53 -117 -58 286
5122 286 392 -123 -160 363 267 153 -13 299 172 -27 134 -89 -33 33 188 220 236 243 50 46 37 260 123 271
$$ packed form
4965g2K7O6J03k16N55m51k13L33P4j0l8l96O28l44k00K19Q7j03j30l49L80K27
4987A77j21j70Q0K88r5j67K52m0k24k26N07K17o22q8M85l56K49J8j80J2j80R6
5009h8K03l70J13R3J26k08j08J5L20m06J19K91l4J57k9p7M5P1j74k23K11j85k0
5032a58J9J82J58o59J11K68J40l37j94O91k82l3j82J22L0n6N8J2R0l85jJ22K50
5055c4k71nJ57p9m11N60L6k46L4J36L32l41j53O5K98n21n2J76N02l67j22K25k5
5078a06k25j24L97K46r3m70J57K09K37l62j98K15J54j66K42o0j76j6K6L08j47
5099D8m1K22l91L66j75n8M15l47P6o5q5l5r1L41K69m53j63L72R6k48j70N9L44
5122B86J06n15l7N23r6j14j66L12j27j99J61k23N6O6J55L2J6Pj93mrK23j37J48
$$ plain form
5146 271 181 265 385 221 20 -34 304 215 -36 -28 119 170 -281 -176 278 346 63 -2 250 292 -228 -87 80
5169 80 349 1 311 150 378 127 135 390 241 47 322 256 48 68 -63 289 -84 -174 208 51 -41 -144
5191 -144 312 71 -65 -146 244 134 -203 -48 310 30 53 27 331 305 -74 -218 82 172 -106 25 -41 386
5213 386 -307 -190 -417 -245 -95 -132 -188 -277 -125 181 -231 -325 -153 -112 -161 -31 104 -151 196 163 -145 120
5235 120 108 15 124 328 189 -131 199 -30 389 56 -115 23 493 268 4 155 102 390 3 233 323
5256 323 146 -17 176 138 282 238 379 -57 125 379 296 82 149 -168 125 2 135 98 28 -112 -47 -277
5278 -277 225 134 140 -329 -152 161 -326 -90 423 -171 -416 -73 -309 -11 -567 -99 50 -52 -121 -81 -294 -413
5300 -413 -446 -162 -164 -360 -217 -254 -197 -121 -530 -155 -219 -179 -436 -50 -182 -222 -122 -282 -248 -305 -395 115 -135 -141 -232
$$ packed form
5146B71r0Q4J20j64k01n4L38q9k51QJ47N1m51J05M54O8k83o5K52M2n20J41J67
5169H0K69l48L10j61K28k51QK55j49j94K75o6k08K0j31L52l73r0L82j57r2j03
5191a44M56k41j36q1L90j10l37J55L58k80K3k6L04k6l79j44L00R0k78J31o6M27
5213C86o93J17k27J72J50l7n6q9J52L06m12r4J72M1m9J30J35k55L47l3l08K65
5235A20j2r3J09K04j39l20L30k29M19l33j71J38M70k25k64J51n3K88l87K30R0
5256C23j77j63J93l8J44m4J41m36J82K54q3k14O7l17K93j23J33l7p0j40O5k30
5278b77N02r1Om69J77L13m87K36N13n94k45L43k36K98n56M68J49j02o9M0k13j19
5300d13l3K84kj96J43l7N7P6m09L75o4M0k57L86j32m0J00j60L4n7r0N10k50or1
$$ plain form
5325 -232 203 -173 -164 -178 -133 153 -153 -238 82 -48 37 -400 -155 42 20 -204 145 -151 -70 -208 -154 99 304
5348 304 166 -11 -70 40 -38 -46 -58 -342 -272 -82 -231 -380 -20 241 -41 -355 67 -90 -78 -192 -173 98 48
5371 48 -298 -390 207 -110 -89 -205 83 -108 -52 -199 275 255 -275 -57 -148 149 -46 35 -184 67 -30 -145 136
5394 136 -296 -96 157 265 5 -174 317 -45 60 -78 396 452 -63 311 298 109 -4 97 440 517 -86
5415 -86 -109 54 91 445 270 30 412 160 85 243 10 -7 -185 193 60 336 389 169 177 424 -92 252 -13
5438 -13 152 156 -19 -66 -139 176 -23 -483 -247 -18 -212 293 -105 31 -80 -23 -571 48 192 -115 -203 154
5460 154 250 163 148 -48 45 146 -179 -316 -117 -211 -185 -1 -184 9 171 226 -42 141 137 -92 -78 128 51 372
5484 372 213 -26 446 291 224 107 371 265 310 101 454 485 373 66 -36 381 425 259 -26 460 369 251
$$ packed form
5325b32M35l76Rj4M5K86l06q5L20j30Q5m37K45J97k2k24L49k96Q1j38N4K53K05
5348C04j38j77n9J10p8qj2k84P0J90j49j49L60K61k82l14M22j57J2j14J9K71n0
5371D8l46r2N97l17K1j16K88j91N6j47M74k0n30K18r1K97j95Q1k19K51r7j15K81
5394A36m32K00K53J08k60j79M91l62J05j38M74N6n15L74j3j89j13J01L43P7o03
5415h6k3J63L7L54j75k40L82k52p5J58k33j7j78L78j33K76N3k20QK47n16L44k65
5438a3J65Mj75m7p3L15j99m60K36K29j94N05l98J36j11N7n48O19J44l07q8L57
5460A54R6q7j5j96R3J01l25j37J99r4K6J84j83J93J62N5k68J83mk29J4K06p7L21
5484C72j59k39M72j55o7j17K64j06M5k09L53L1j12l07j02M17M4j66k85M86r1j18
$$ plain form
5506 251 -170 218 -161 500 -18 63 145 458 299 240 -79 297 232 204 109 255 215 420 329 -90 182 162 -219
5529 -219 -299 99 -39 -44 -209 177 -342 -306 118 15 -311 -467 -340 111 176 -484 -227 -229 -99 49 -183 28
5551 28 -135 -175 -285 22 -236 -132 138 7 -253 -80 -6 -449 -292 34 7 -290 -254 -301 -294 159 -213 -395 47
5574 47 -7 -309 -351 -283 -180 -145 -391 -134 -35 -251 -177 -247 6 38 -407 -216 -77 254 88 50 11 -554 248 -237
5598 -237 -166 -89 -191 25 75 321 -60 -37 -463 -259 -203 63 51 -51 -345 -158 55 -301 214 158 30 -471
5620 -471 6 233 139 6 -131 -50 127 -281 -29 87 -119 -48 89 323 -83 -112 88 155 25 91 212 -131
5642 -131 -144 -77 -337 -24 -199 -313 26 52 -277 -6 141 -66 182 -78 118 119 198 -59 182 -78 107 -158
5664 -158 90 239 36 -32 62 86 -96 -299 -201 189 -59 -24 -142 29 72 84 -368 -36 448 134 82 -237 40
$$ packed form
5506B51m21L88l79O61n18Q1Q2L13j59n9l19L76o5k8r5J46m0K05r1m19K72k0l81
5529b19q0L98j38nj65L86n19L6M24j03l26j56J27M51O5o60K57kJ30J48k32K11
5551B8j63m0j10L07k58J04K70j31k60J73P4m43J57L26k7k97L6m7PM53l72j82M42
5574D7n4l02m2O8J03L5k46K57R9k16P4p0K53L2m45J91J39L31j66l8l9n65Q02m85
5598b37P1P7j02K16N0K46l81K3m26K04N6K66j2j02k94J87K13l56N15n6j28n01
5620d71M77K27r4j33j37Q1J77m08K52J16k06P1J37K34m06k9K00O7j30O6J21l43
5642a31j3O7k60L13j75j14L39K6l29K71J47k07K48k60J96JP9k57K41k60J85k65
5664a58K48J49k03o8R4K4j82k03R8L90k48L5j18J71M3J2m52L32M84l14n2l19K77
$$ plain form
5687 40 150 188 206 -127 348 126 30 94 -167 295 299 94 158 132 -12 -238 -172 -259 151 -19 -225 9 143 18
5711 18 -164 -93 146 -73 -331 83 364 452 -218 67 50 404 -229 -83 -98 142 221 139 329 163 -31 -308
5733 -308 -61 14 -6 -17 -78 258 197 76 168 197 -135 133 112 165 198 126 289 -139 90 -10 134 65 102 142 136
5758 136 152 -2 188 149 135 159 -88 497 -121 -74 165 464 170 62 598 386 109 378 96 486 432 119
5780 119 269 200 336 140 -46 229 356 139 274 218 346 72 283 81 -253 276 573 579 65 8 -43 202
5802 202 -82 -126 -19 207 -143 -225 24 2 -313 -297 -261 88 -151 -34 -95 14 -52 -411 -137 -262 -219 -208 -97
5825 -97 -137 -165 -138 -186 0 -197 50 175 -257 -328 -137 -220 -168 -66 7 167 -235 -133 37 35 51 -9 -295 -48
5849 -48 -203 -154 -158 -306 -186 -29 202 126 179 -403 229 340 156 -8 -162 -166 380 -15 94 340 270 -105 -126
$$ packed form
5687D0J10L8J8l33M75k22r6O4k61M62Mk05O4k6j44k26O6q7M10j70k06K34J34j25
5711A8j82P1K39k19k58M14K81Q8o70K85j7L54o33J46j5K40P9q2J90j66j94k77
5733c08K47P5k0j1o1L36o1j21R2K9l32K68k1N3L3p2J63m28K29j00J44o9L7M0o
5758A36J6j54J90l9j4K4k47N85o18M7K39K99k94j08N36k12k77K69k82L90n4l13
5780A19J50o9J36j96j86K75J27k17J35n6J28k74K11k02l34N29K97On14n7n1K45
5802B02k84m4J07K26l50q2K49k2l15J6L6L49k39J17o1J09o6l59K74j25M3J1J11
5825i7m0k8K7m8J86j97K47J25m32p1J91q3N2J02P3J60m02J02J70kJ6o0k86K47
5849d8j55M9mj48J20J57K31p6N3n82O32J11j84j64j54mN46l95J09K46p0l75k1
$$ plain form
5872 -126 -156 198 -186 185 5 -114 -50 -54 -93 -221 -77 95 -106 -12 183 154 -85 -47 -164 75 47 -39 -61 96
5896 96 106 293 11 -295 299 113 -184 -312 67 -40 249 -181 -8 55 -98 54 116 -298 -6 -120 -124 -386
5918 -386 132 -67 -182 77 295 33 254 -75 270 10 85 -71 115 -56 -97 41 -171 285 -224 181 223
5939 223 37 -199 99 -149 -183 -51 99 -246 137 -64 218 -290 157 147 98 111 -22 38 182 158 -134 -148
5961 -148 -274 -163 -213 121 -19 87 58 -275 -153 19 -194 -191 -140 48 91 -258 -179 -238 -205 -182 -443 179 -1
5984 -1 27 -246 -276 156 -227 -153 -153 -235 42 107 -25 -63 36 69 67 145 -60 182 122 145 48 372 59 36 321 330 210
6011 210 165 375 481 567 275 156 125 334 389 457 307 363 148 466 284 452 -80 542 324 292 165 172 272
6034 272 289 240 173 116 -53 -231 325 418 14 90 81 -42 -299 -193 -178 -102 82 -87 -218 11 -23 -25 196 -112
$$ packed form
5872a26l0L54l84L71j80j19O4ml9j28J44J72k01R4J95k9k39L8j17K39k8q6k2J57
5896I6J0J87k82l06N94j86k97j28L79j07K89m30J73O3j53J52O2m14K92j14mk62
5918c86N18j99j15K59K18k62K21l29L45k60P5j56J86j71m1J38k12M56n09M05M2
5939B23j86k36K98k48l4J32J50l45L83k01K82n08M47j0m9J3j33O0J44k4k92j4
5961a48j26J11n0L34j40J06k9l33J22J72k13LN1J88M3l49P9n9L3K3k61O22j80
5984aK8k73l0M32l83P4%q2K77O5j32l8R9L3kP8k05K42o0K3r7L24l13k3K85Rj20
6011B10m5K10J06Q6k92j19l1K09N5O8j50N6k15L18j82J68n32O22k18l2j27PJ00
6034B72J7m9o7n7j69j78N56R3m04P6rj23k57J06J5P6J84j69j31K29l4kK21l08
$$ plain form
6058 -112 -318 -177 53 10 101 -60 -22 -77 76 -266 -193 -150 108 -147 115 -283 -23 -288 -113 103 -246 33
6080 33 -253 -398 48 -265 -141 100 -70 151 246 100 -14 368 193 278 61 17 370 31 69 70 43 183 -167
6103 -167 -535 90 122 -217 -148 -120 -202 7 -57 60 -150 106 75 56 -219 32 -365 -107 -19 -118 -111 -54 -175 -75
6127 -75 -434 -73 -327 -392 -165 -111 -239 36 -121 -330 -216 -275 152 -106 -21 -162 -232 28 -110 -444 -5 41
6149 41 -209 -203 -87 -135 -84 -58 -57 -82 -80 115 -305 221 228 -122 -123 -91 -155 146 -18 -265 -72 128 245 -155 -49 -134
6175 -134 -2 74 7 24 325 -63 204 152 110 322 109 184 -26 -27 -239 143 -4 -115 -226 -110 -207 -115 183
6198 183 193 114 199 -114 -351 -317 -113 -306 99 -105 81 -10 -135 -9 -135 -36 -32 -18 -249 -6 74 85 -344 -178
6222 -178 -10 8 -3 -41 -229 201 -277 -221 -33 -261 -69 -237 368 194 200 -195 106 195 -21 32 -169 64 -157
$$ packed form
6058a12k06J41K30m3R1j61L8n5J53l42P3M3K58k55K62l98K60k65J75K16l49K79
6080C3k86j45M46l13J24K41j70K21R5j46j14L82j75Q5k17m4L53l39L8Jk7J40l50
6103a67l68O25L2l39O9K8q2K09o4J17k10K56l1j9k75K51l97K58Q8r9PN7j21J00
6127g5l59L61k54o5K27N4j28K75j57k09J14n9M27k58Q5j41p0K60j38l34M39M6
6149D1k50OJ16m8N1K6Jk5KJ95m20N26Pl50jL2o4L01j64k47J93K00J17m00J06q5
6175a34J32P6o7J7L01l88K67n2m2K12k13P5k10jk12L82j47j11j11J16r7R2K98
6198A83J0p9Q5l13k37L4K04j93M05k04J86r1j25J26j26R9MJ4k31K43Q0J1m29J66
6222a78J68J8j1l8j88M30m78N6J88k28J92j68O05j74Ol95L01Q9k16N3k01K33k21
$$ plain form
6245 -157 102 -13 -171 205 294 -209 -292 101 99 32 35 44 215 92 108 -109 320 70 83 -27 130 49 69 149 96
6270 96 260 192 263 109 206 224 72 -14 54 177 187 -158 -14 -91 358 104 -22 190 -156 45 85 13 275 40
6294 40 40 -116 135 172 100 -54 -155 335 176 43 181 -8 338 173 -1 -74 13 47 188 300 105 105 22 203
6318 203 86 247 -56 41 -201 267 243 110 118 -51 301 -77 215 -122 249 -110 -117 32 92 103 -178 -92 90
6341 90 -263 -322 -139 -224 192 -86 -170 -410 37 -91 -296 -64 -86 -4 -113 -144 -131 -249 -46 -174 -50 -123 -376
6364 -376 -435 -318 -381 -135 -353 -219 -166 57 183 -138 -122 246 -60 38 -120 186 74 -139 299 271 135 -224
6386 -224 181 28 28 158 -35 17 156 -108 -250 -154 325 -97 26 288 350 172 -15 257 67 286 144 60
6408 60 42 87 139 -109 -140 79 281 22 30 -27 227 39 68 29 -271 -237 -136 -274 -264 -69 -308 -10 -50 -185
$$ packed form
6245a57K59j15j58L76Q9n03q3L93ko7LRJ71j23J6k17M29k50J3j10J57q1K0Q0n3
6270I6J64o8P1j54R7J8j52q6O8J23J0l45J44p7M49k54j26K12l46K01M0p2K62k35
6294D0%j56K51L7p2j54j01M90j59j33J38j89L46j65j74p3Q7L4J41J12j95%q3J81
6318B03j17J61l03R7k42M68k4j33Qj69L52l78K92l37L71l59pJ49O0J1k81Q6J82
6341I0l53n9J83q5M16k78q4k40M47j28k05K32k2Q2j09l1J3j18K03j28J24p3k53
6364c76n9J17o3K46k18J34N3K23J26l21J6L68l06R8j58L06j12k13M38k8j36l59
6386b24M05j53%J30j93N2J39k64j42R6M79m22J23K62O2j78j87K72j90K19j42q4
6408F0j8M5N2k48l1K19K02k59Qn7K54j88K9l9l00L4J01j38J0J95k39K98m0j35
$$ plain form
6432 -185 -204 -156 -51 244 -28 -207 -149 -5 114 -171 -627 -132 227 -249 -137 -125 -170 -101 -187 -383 -463 -493 -189
6455 -189 -338 -33 -395 -70 -137 -464 -46 86 -79 -12 12 -174 -179 -221 -97 -146 23 -7 -112 -32 22 12 127 99
6479 99 138 115 186 -74 51 29 -70 -254 61 -155 -158 117 -13 289 -145 90 0 218 -80 -35 12 131 65 -19
6503 -19 -263 -14 64 -23 -114 -42 -3 92 -37 22 -50 -160 -319 -308 -163 34 -368 75 -124 148 210 -50 -51 -1 -130
6528 -130 110 392 -118 -3 211 -198 -183 177 259 227 -96 103 259 68 45 57 313 -207 166 202 151 356
6550 356 -60 282 31 312 345 146 56 309 198 39 351 4 10 158 66 26 67 -5 256 -34 212 138 -218
6573 -218 -201 -242 221 -87 -80 205 -227 265 -212 -185 135 144 -252 110 -44 -9 88 -247 134 -45 -158 -198 -197 -82
6597 -82 104 -152 -169 -190 -58 -72 -209 -194 172 74 235 8 391 116 -33 -34 -233 332 -99 -156 -409 126 -102
$$ packed form
6432a85j9M8J05K95k72j79N8J44J19k85m56M95L59m76J12J2m5O9q6j96q0l0L04
6455a89j49L05l62L25o7l27M18J32j65O7K4j86nm2J24m9J69l0j05Q0N4j0J15k8
6479I9L9k3P1k60J25k2r9j84L15k16lK75j30L02m34K35r0K18k98M5M7J19o6q4
6503a9k44K49P8q7r1P2L9R5j29N9p2j10j59J1J45J97m02M43j99K72O2k60jN0j29
6528a30K40K82n10J15K14m09J5L60Q2l2l23J99J56j91k3J2K56n20L73L6n1K05
6550C56m16L42k51K81L3j99r0K53j11j59L12l47OJ48r2m0M1p2K61k90K46p4l56
6573b18J7m1M63l08PK85m32M92m77K7L20Rl96L62j54L5R7l35L81j79j13m0JJ15
6597h2J86k56j7k1J32j4j37J5L66r8J61k27L83k75j49jj99N65m31n7k53N35k28
$$ plain form
6620 -102 -329 -225 -44 24 55 -34 -354 299 88 -8 159 9 140 45 155 -192 -84 51 218 65 -159 245
6642 245 -126 -16 -10 49 20 13 -83 26 -35 -74 131 40 141 17 221 139 180 -283 -83 -130 119 121 99 -51 -51 -189
6668 -189 -1 -38 128 -82 97 167 150 44 101 -101 -147 187 -13 155 -161 -91 -72 20 -38 -130 57 -8 34 -190
6692 -190 -24 -119 -185 -128 168 -27 -23 44 -53 -181 -315 -171 -223 4 -63 -230 -173 -377 118 -252 -87 -602 0
6715 0 -32 -220 -122 -218 -329 165 -193 94 -70 295 -128 -214 -119 -401 -199 -208 41 -40 -101 -195 -112 -182 186 -186 276
6740 276 -158 -105 -241 86 -74 256 420 88 59 -146 87 75 30 40 -490 -59 83 -65 -48 -183 105 -12
6762 -12 -93 -302 -265 -360 29 -20 -88 47 18 193 234 88 94 -77 141 -40 236 175 188 -199 47 5 -181 182
6786 182 15 -194 -305 291 115 -164 -48 -141 -93 -97 -45 199 326 -36 154 38 -132 35 355 227 169 -64
$$ packed form
6620a02k27J04J81O8L1q9l20O53k11r6J67j50J31r5J10l47J08J35J67j53k24M04
6642B45l71J10ON9k9pr6J09o1l9K05r1J01j24K04q2M1m63K00m7K49Kk2j50%j38
6668a89J88l7J66k10J79P0j7j06N7k02m6L34k00J68l16P0J9R2n8r2J87o5M2k24
6692a90J66r5o6N7K96j95MO7r7j28j34J44n2K27o7j67N7k04M95l70J65n15O02
6715@l2j88R8r6j11M94l58K87j64L65m23q6R5k82K02rK49q1o1r4Q3p0L68l72M62
6740B76m34N3j36L27j60L30J64l32k9k05K33j2m5J0n30M31J42j48J7j35K88j17
6762a2q1k09L7r5L89m9o8J35k9J75M1j46Oj71K18j81K76o1J3l87K46m2j86L63
6786A82j67k09j11N96j76k79J16r3M8mN2K44J27l62J90j16j70J67L20j28n8k33
$$ plain form
6808 -64 98 210 94 76 31 -173 230 210 38 127 163 78 -45 -252 -29 108 -1 75 19 277 216 154 -34 -175
6832 -175 -104 149 50 -17 -128 74 -145 -68 80 -45 -229 -106 101 -177 -89 188 102 -290 -209 81 -323 -41
6854 -41 -78 97 55 48 -36 -294 -151 -421 82 -175 -120 250 -108 -82 -86 -325 281 -37 121 -201 -389 120 -100
6877 -100 -2 -68 205 -77 -104 -164 41 245 -41 126 -150 252 20 36 -57 -136 14 -273 -304 75 459 229 -20
6900 -20 260 57 -28 39 33 25 277 324 -90 75 27 -135 139 210 161 -119 -159 146 208 163 6 -65 136 -118 -150
6925 -150 197 44 -66 -61 73 -95 -134 247 144 52 -41 -143 204 -276 -241 -97 225 45 35 -154 135 -86
6947 -86 -126 -175 82 19 123 86 -45 -394 -179 84 -244 62 -83 72 -390 -42 -189 -142 -164 -17 75 -98 8
6970 8 76 201 -64 207 -221 73 230 -41 -73 -178 21 99 -369 -12 286 87 -175 -174 -16 89 -121 182
$$ packed form
6808f4J62J12j16j8m5k04M03k0j72Q9L6q5j23k07K23J37j09P6n6K58o1o2j88j41
6832a75P1K53r9o7j11K02k19P7J48j25j84J23K07k78Q8K77q6l92Q1K90m04K82
6854d1l7J75m2pq4k58J43k70N03k57N5L70l58K6mk39O06l18J58l22j88N09k20
6877a00R8o6K73k82k7o0K05K04k86J67k76M02k32J6r3p9J50k87l1L79L84k30k49
6900b0K80k03q5O7oqK52M7m14J65m8j62K74P1m9k80m0L05O2m5j57p1K01k54l2
6925a50L47j53j10NJ34j68l9L81j03r2r3j02L47m80L5J44L22j80j0j89K89k21
6947h6m0m9K57o3J04l7j31l49K15K63l28L06j45J55m62L48j47M7k2J47R2j73J06
6970HO8J25k65K71m28K94J57k71l2j05J99P8m68L57K98j99k62JJ58J05k10L03
$$ plain form
6992 182 -344 -65 85 -393 -128 59 -204 -297 -187 54 -159 -59 -8 -308 -39 67 -350 -1 -72 -41 -83 58
7014 58 -184 -82 39 60 -60 -31 -276 -298 -113 5 -2 -321 -137 71 173 -45 -311 -227 422 -59 -83 -27 42
7037 42 163 -462 -76 -42 -151 195 4 7 122 159 216 -45 -173 152 3 -124 266 -118 87 232 144 72 334
7060 334 127 163 199 243 176 -4 124 -25 -56 -1 334 3 -120 59 231 143 -42 -31 -77 6 60 -150 -229 -32
7084 -32 -219 -116 -12 28 271 206 37 -31 -69 7 288 269 -11 259 260 -61 228 90 -75 -27 -242 -42 -52 3
7108 3 -58 -252 207 68 -401 -203 -199 31 72 13 -26 104 -479 6 236 110 188 49 232 76 221 -57 184
7131 184 58 -100 178 -2 103 -36 552 184 144 -55 -73 296 -132 -42 192 69 -170 -267 43 -107 339
7152 339 -28 203 350 22 31 220 131 100 32 -110 31 305 153 194 248 228 -203 -76 104 65 152 -15 16 199
$$ packed form
6992A82n26K79J50m78K65J87k63r3J10K41k13J00N1l00K69J06m17L49p1L1m2J41
7014E8k42J02J21K1j20K9k45k2J85J18pl19J84K08J02k18k66Q4O49m81k4N6O9
7037D2J21o25L86L4j09L46j91LJ15L7N7k61j28L25j49j27L90l84K05J45q8p2K62
7060C34k07L6L6M4o7j80J28j49l1N5L35l31j23J79J72q8j85J1m6Q3N4k10p9J97
7084c2j87J03J04M0K43o5j69o8l8P6K81j9k80K70Jl21K89j38j65M8k15K00j0N5
7108Co1j94M59j39m69J98MK30M1n9l9J30n83M85K30j26P8j39J83j56J45k78K41
7131A84j26j58K78j80J05j39N88l68m0j99j8L69m28R0K34j23k39r7L10j50M46
7152C39l67K31J47l28RJ89q9l1o8j42J41K74j52M1N4k0m31J27J80l9Q7j67L1J83
$$ plain form
7176 199 221 -59 116 202 292 73 -252 -89 -4 -116 -123 31 20 70 245 121 95 264 108 -36 63 -190 321
7199 321 201 -105 -297 57 -72 -45 39 -202 -62 -304 1 -45 -154 -268 -195 -159 45 42 183 -109 28 -19 -10
7222 -10 -192 -231 -39 124 -47 230 154 -226 116 -94 -192 -182 67 -189 -177 -33 -183 -98 -28 108 170 -327 -40
7245 -40 -184 -163 -119 142 -158 163 -106 -173 -163 280 -165 -55 -249 -41 186 145 -124 -89 448 -53 -52 94 -67
7268 -67 68 47 -71 -1 -32 -336 -252 -105 -12 -363 -20 -17 -186 211 -281 221 98 -188 -253 -184 21 122 -103
7291 -103 -229 -1 -62 62 -22 -89 -148 125 40 -259 63 -27 -15 -266 -180 -147 103 15 -31 167 -256 24 -40 106
7315 106 -122 -18 193 133 30 77 99 -177 43 46 -238 -124 62 47 122 -40 6 62 83 -22 -23 74 78 -21 -114 199
7341 199 118 -53 -3 -94 385 168 -74 47 7 64 24 -206 -23 106 -120 -278 32 -29 -11 -16 166 -58 40 -115
$$ packed form
7176A99K2k80J75Q6R0k19l25J63Q5j12pJ54j1N0J75j24k6J69j56j44R9k53N11
7199C21j20l06j92L54j29K7Q4k41J40k42L05m6j09j14P3L6K04lJ41k92J37m7R
7222a0j82l9J92J63j71K77p6l80L42k10r8J0K49k56J2J44j50Q5P0J36O2m97K87
7245d0j44K1M4K61l00L21k69o7J0M43m45J10j94K08K27m1k69L5N37n01JJ46j61
7268f7J35k1j18P0l1l04Q4J47R3l51L43Lj69L97m92N02j23k86o5O9K05J01k25
7291a03j26K28o1J24q4o7n9K73q5k99L22r0J2k51Q6L3K50q8m6J98m23K80o4J46
7315A06k28J04K11o0j03M7K2k76K20Lk84J14J86j5P5j62M6N6K1j05jR7Mr9r3L13
7341A99q1j71N0r1M79k17k42J21m0N7m0k30J83J29k26j58L10o1J8nJ82k24R8j55
$$ plain form
7365 -115 -141 129 -260 -107 -268 48 -23 94 -162 -46 81 -90 172 -162 -346 -56 154 -287 -240 196 145
7386 145 139 -70 -149 13 -248 12 -271 -92 -16 -24 466 84 263 -134 85 -29 159 3 -137 205 261 116
7408 116 114 -113 -105 49 -38 -1 -22 60 36 249 -99 -30 -80 89 121 38 180 57 147 -38 114 145 12 -130 287
7433 287 99 422 73 142 44 -57 -136 121 331 221 -195 32 -306 119 30 76 -9 172 87 -219 119 98 359
7456 359 72 -12 -127 -214 26 -124 222 -50 113 -7 -85 -88 150 206 -340 -109 39 -77 206 -93 -89 5 -170
7479 -170 21 47 -310 25 17 -36 -131 -275 -296 -26 -153 -109 -181 163 88 163 -314 225 56 -119 -53 32 23 71 162
7504 162 -98 -290 -19 122 -110 188 -377 -80 137 -12 190 -144 126 -73 -222 -77 -26 -26 -227 -73 -62
7525 -62 41 27 -109 67 -5 -249 -181 -28 90 -91 115 2 -375 11 -283 -85 -43 -41 63 -94 -313 97
$$ packed form
7365a15k6K70l89J53j61L16p1J17k56J16J27j71K62l34j84K90K10m41M7M36n1
7386A45ok09p9J62k61K60k83J79P6qM90l82J79l97K19j14J88j56j40L42N6j45
7408A16kk27QJ54q7L7k1Q2k4K13l48O9n0J69L2q3J42j23R0j85J52L1j33j42M17
7433B87j88L23l49O9r8j01p9K57K10j10m16K27l38M25q9M6q5J81q5l06L38k1K61
7456C59k87q4j15q7K40j50L46k72J63j20p8lK38N6n46K31J48j16K83k99MR4j75
7479a70J91K6l57L35qn3r5j44k1K70j27M4p2L44p5P5m77N39j69j75O6Q5rM8R1
7504A62k60j92K71J41k32K98n65K97K17j49K02l34K70j99j49J45N1%k01J54J1
7525f2J03j4j36J76p2k44O8J53J18j81K06j13l77L86k94J98M2KJ04j57k19M10
$$ plain form
7547 97 -156 -151 81 -12 -55 -278 -238 34 -113 -345 -247 -103 220 270 -328 50 65 -24 -77 9 -67 -65 -15 18 55 -216
7573 -216 138 88 201 -63 -47 187 162 67 289 -33 -156 15 344 54 -168 -141 -14 226 35 -146 138 -258
7595 -258 102 -119 -186 15 1 1 -175 -115 30 -396 -77 -63 -132 10 31 -107 -89 -120 32 204 8 45 198 -153
7619 -153 -218 -385 -322 142 -58 -219 -313 50 -110 -183 59 8 11 2 -74 -30 -164 -217 103 249 -36 -153 -253 188
7643 188 -20 -72 -82 182 -15 122 -2 -91 11 207 290 193 -49 -13 -4 81 71 125 -99 152 -39 -64 22 -143
7667 -143 -24 13 351 -260 35 127 82 268 91 -19 72 -66 -40 -87 235 310 191 269 355 121 78 199 -63
7690 -63 -100 -17 -41 65 -13 -66 150 219 97 309 -121 -105 -193 -96 -54 49 269 -143 157 73 47 179 148 -184 -132
7715 -132 26 222 17 -78 90 -90 25 151 1 11 -291 -220 74 -259 190 -303 283 -244 107 -190 -529
$$ packed form
7547I7k53NK32r3m3k23M0K72j47k32R8J44L23N0n98L78J5q9n3Q6p6KN0L3L7k71
7573b16L54n0J13k64J6K34k5r5K22l22j23J71L29k90k22K7J27K40j91j81K84l96
7595b58L60k21o7K01j4%j76O0J45m26L19J4o9J42K1j38J8l1J52J72j96L7J53l51
7619a53o5j67O3M64k00j61r4L63j60p3K42n1Lrp6M4j34n3L20J46k85j17j00M41
7643A88k08n2j0K64j97J37j24q9J02J96Q3r7k42L6RQ5j0N4k24K51j91k5Q6j65
7667a43J19L7L38o11K95R2m5J86j77j10R1j38K6m7L22P5j19P8Q6k34m3J21k62
7690f3l7Q3k4J06p8n3K16O9j22K12m30J6q8R7M2J03K20m12L00q4k6J32l1l32N2
7715a32J58J96k05r5J68j80J15J26j50J0l02P1K94l33M49m93N86n27L51k97l39
$$ plain form
7736 -529 -167 238 -46 280 -19 -122 -210 -152 -118 -126 -20 -61 267 39 122 273 -326 30 60 -8 62 26 119 55
7760 55 -69 -35 -216 131 -113 -68 -227 -225 134 46 115 -209 -173 133 -203 -269 -327 -301 -162 64 125 -122 -292 -93
7784 -93 -126 16 86 -141 -164 -9 -236 -185 -102 97 -76 35 -315 -117 146 -30 -59 173 -60 -181 -260 -73 212
7807 212 17 -27 -302 -75 202 -70 -78 8 257 -146 -108 35 215 -98 -244 -128 -123 -188 -64 -171 -10 -177 -55
7830 -55 -187 -316 144 -201 -71 75 -292 -68 -94 -191 -155 53 28 -216 76 147 22 51 -64 -143 72 199 82
7853 82 -2 94 -193 -189 -294 87 231 -1 -90 -169 148 -63 280 -185 232 12 255 -174 -52 118 58 80 -190
7876 -190 28 14 63 -213 25 -233 70 -13 60 -78 -53 -204 -22 216 -243 201 -86 -249 -136 -169 -124 100
7898 100 267 -8 20 -21 -127 70 63 81 12 0 -16 90 -48 299 153 -85 160 213 250 43 -155 64 129 -20
$$ packed form
7736e29L62M05k84L26k99j03q8N8L4qJ06m1L28k28Q3J51n99L56L0o8P0l6R3o4
7760E5j24L4j81L47k44M5j59KL59q8O9l24L6L06l36o6n8K6J39K26O1k47j70J99
7784i3l3J42P0k27k3J55k27N1Q3J99j73J11l50J98K63j76k9K32k33j21p9J87K85
7807B12j95m4k75K27K77k72qQ6K49m03L8J43J80l13j46J16No5J24j07J61j67J22
7830e5j32j29M60l45J30J46l67K24k6r7L6K08k5k44K92P1j25K9j15p9K15J27j17
7853H2q4R6k87Mj05L81J44k32q9p9L17k11L43m65M17k20K43m29J22J70o0K2k70
7876a90K18j4M9k76K38k58L03q3P3j38K5j51J82K38m59M44k87j63J13l3M5K24
7898A00J67k75K8m1j06J97pJ8o9j2j6J06j38L47j46k38K45N3L7k07j98K19O5j49
$$ plain form
7922 -20 -28 230 -4 12 -14 155 13 -141 144 -64 -194 -45 -85 111 -40 -55 41 -177 -190 19 131 91 132 145
7946 145 343 -144 172 226 68 174 20 65 -48 57 -254 65 192 341 222 -54 6 157 -86 -149 -20
7967 -20 -139 69 -123 174 -184 525 195 -132 -30 27 -20 -268 43 -270 163 29 166 5 160 -249 -5
7988 -5 -112 140 -87 -154 8 142 223 -54 -205 -126 85 158 284 -123 -307 210 54 -4 23 -76 -165 -297 -43
8011 -43 -12 -361 79 -160 -55 87 -134 87 -13 -29 -163 -152 41 230 -47 155 58 202 147 -22 139 -158
8033 -158 -202 140 120 -114 -67 147 8 400 -101 171 -142 -107 -48 66 60 -30 -68 -181 49 363 65 -202 349
8056 349 -10 20 -128 123 268 33 150 230 -39 -77 129 134 60 -93 -252 -153 185 -152 1 -367 -97 -23 63
8079 63 293 283 -86 346 -170 172 309 393 -193 -127 -98 -124 -17 -157 27 107 30 -142 35 379 44 224 46
$$ packed form
7922b0qK58k34J6k6J69j42j54K85k08j30J49m0J96j51j5R6k18j3K09J12m0M1J3
7946A45J98m87L16N4j58J06j54M5j13J05l11L19J27J49j19k76O0J51k43o3J29
7967b0j19K08j92K97l58P09l30l27J02N7m7k48L11l13M33j34J37j61J55m09K44
7988ej07K52k27o7J62J34Q1k77j51P9K11P3J26m07j84N17j56n8K7r9q9j32K54
8011d3L1l49M40k39J05J42k21K21j00j6j34J1J93J89k77K02r7J44n5j69J61k97
8033a58m4L42k0k34M7K14j39L92n01K72l13L5N9J14or0l8j13K30L14k98k67N51
8056C49l59L0j48K51J45k35J17Q0k69l8K06Np4j53j59R9L38l37J53l68K70P4Q6
8079F3K30j0l69M32n16L42J37Q4n86O6K9k6J07j40J84Q0p7j72J77L44l35J80j78
$$ plain form
8102 46 79 16 58 -120 121 118 -108 -221 -98 124 -157 35 21 -160 309 -189 70 -163 -3 -29 40 -52 -182
8125 -182 61 -88 -109 -43 -74 38 -288 -122 -19 -4 -37 149 51 149 -89 -28 105 136 -99 3 -274 -59 297
8148 297 -40 118 -197 -152 -51 -168 -24 97 -134 196 97 -160 97 61 -109 70 273 3 84 -401 74
8169 74 -103 154 53 -248 -18 214 12 167 2 121 -56 6 -81 -87 -94 -134 -120 203 126 214 -100 380
$$ packed form
8102D6L3o3M2j78K41lk26j13J23K22k81J92j4j81M69m98K59k33J60k6O9r2j30
8125a82K43j49k1O6l1J12l26J66J03J5l3J86r8R8k38O1J33L1k35J02k77K15L56
8148B97l37J58l15M5J01j17J44J21k31L30r9k57K57l6j70J79K03k70Q1m85M75
8169G4j77K57j01l01K30K32k02J55j65J19j77O2q7opm0J4L23p7Q8l14M80
8191C80
$$ Imaginary data points
##PAGE= N=2
##DATA TABLE= (X++(I..I)), XYDATA
$$ plain form
0 0 0 0 0 0 0 0 0 -8 8 -8 8 -16 16 -17 24 -32 35 -40 48 -57 70 -79 93 -107 123 -140 159 -181 204 -231 260
31 260 -293 328 -368 408 -455 508 -564 624 -692 766 -847 940 -1041 1154 -1280 1421 -1584
48 -1584 1772 -1991 2247 -2558 2944 -3429 4068 -4951 6254 -8377 12437 -23025 108696 233868
62 233868 10677 -38703 63935 118639 17677 7732 103593 124943 11208 -23159 52811
73 52811 75157 -10310 -30102 41976 61126 -20753 -56254 -5783 24213 -8526 -9822 30311
85 30311 31548 -11807 -15221 19230 25931 12328 30249 47012 13780 -19577 10597 55828 47154
98 47154 17655 19330 13191 -27581 -40250 3839 21855 -24082 -45255 650 19780 -38311 -75985
111 -75985 -32900 -1407 -39520 -58883 -6787 19058 -35947 -66082 -2226 49620 6661 -42641
$$ packed form
0@%%%%%%%qJ6j6J6k4L2l3M1n6O7p5Q8j05J27j49J72k00K30k63K99l40L85m35M91
31B60n53O21o96P76q63R63j072J188j316J458j613J787j981K195k434K701l005
48a584L356l763M238m805N502o373P497r019J1205j4631K0814l5462J31721J25172
62B33868k23191m9380J02638N4704j00962r945R5861K1350j13735l4367P5970
73E2811K2346q5467j9792P2078J9150q1879l5501N0471K9996l2739j296M0133
85C0311J237m3355l414L4451O701j3603J7921J6763l3232l3357L0174M5231q674
98D7154k9499J675o139m0772j2669M4089J8016m5937k1173M5905J9130n8091l7674
111g5985M3085L1493l8113j9363N2096K5845n5005l0135O3856N1846m2959m9302
$$ plain form
123 -42641 -11367 32455 12904 -10879 17845 38221 4846 -12604 30453 54969 12575 -17616
135 -17616 18827 46353 5711 -30570 520 37258 17100 -9602 13514 39585 14570 -20845
147 -20845 -12416 12460 10464 614 13836 27581 15451 1571 11107 24386 17873 5684 6036
160 6036 12743 17403 21740 21949 11377 3458 13319 25861 18047 770 549 9004 3702 -9402 -7810
175 -7810 2257 -1394 -13207 -10906 884 -1806 -19610 -29781 -26452 -24106 -25122 -16986 -3992 -5076
189 -5076 -18361 -20073 -6580 -2319 -17663 -27433 -11709 9980 8274 -6503 -3043 13261 11747
202 11747 -5531 -7887 9852 13244 -6212 -14399 3624 12766 -7229 -19945 -1283 14404 -3138
215 -3138 -23048 -9386 8851 -6086 -28990 -17055 10181 10127 -6970 -1281 18952 16247 -3097
$$ packed form
123d2641L1274M3822j9551k3783K8724K0376l3375j7450M3057K4516m2394l0191
135a7616L6443K7526m0642l6281L1090L6738k0158k6702K3116K6071k5015l5415
147b0845Q429K4876j996r850J3222J3745j2130j3880R536J3279o513j2189L52
160F036O707M660M337K09j0572p919R861J2542p814j7277k21Q455n302j3104J592
175g810J0067l651j1813K301J1790k690j7804j0171L329K346j016Q136J2994j084
189e076j3285j712J3493M261j5344r770J5724K1689j706j4777L460J6304j514
202A1747j7278k356J7739L392j9456q187J8023R142j9995j2716J8662J5687j7542
215c138j9910J3662J8237j4937k2904J1935K7236n4j7097N689K0233k705j9344
$$ plain form
228 -3097 -4800 9211 10802 3850 10503 23682 20919 10075 10502 14132 5701 -2475 1067 4124 -3430
243 -3430 -5465 3527 2643 -12510 -16489 -3128 -1252 -17691 -20593 -5157 -4424 -23368 -23455 -246 4380
258 4380 -16532 -18391 7172 11156 -14853 -22966 -729 4114 -20375 -22823 8447 17620 -11710
271 -11710 -24772 -188 9226 -20377 -35292 -10121 5275 -16478 -27793 -3636 9532 -13304
283 -13304 -28311 -9714 2936 -12291 -20462 -3162 3894 -11745 -13824 7863 12257 -8099 -11180
296 -11180 11596 15313 -7919 -13347 8591 13578 -7016 -9363 15518 22486 9 -8647 8060
309 8060 11789 -6582 -11603 5378 10962 -1228 -924 13708 12979 -2548 -3571 7242 2417 -8914
323 -8914 294 16520 7405 -9092 800 20303 10995 -10050 -3594 15704 7847 -10990 -2598 16494
$$ packed form
228c097j703J4011J591o952O653J3179k763j0844M27L630q431q176L542L057p554
243c430k035Q992q84j5153l979J3361J876j6439k902J5436P33j8944q7K3209M626
258D380k0912j859K5563L984k6009q113K2237M843k4489k448L1270R173k9330
271a1710j3062K4584R414k9603j4915K5171J5396k1753j1315K4157J3168k2836
283a3304j5007J8597J2650j5227q171J7300P056j5639k079K1687M394k0356l081
296a1180K2776L717k3232n428K1938M987k0594k347K4881O968k2477q656J6707
309H060L729j8371n021J6981N584j2190L04J4632p29j5527j023J0813m825j1331
323h914R208J6226r115j6497R892J9503r308k1045O456J9298p857j8837Q392J9092
$$ plain form
337 16494 7554 -11742 -965 21223 12060 -10717 -3794 15598 4280 -17782 -6544 19579 10400
350 10400 -14121 -4902 23247 15884 -15547 -14228 12763 11323 -15354 -13038 16971 21538 -7278
363 -7278 -15460 9073 20162 -1555 -16011 -1940 10700 2652 -3994 3045 7659 876 -1931 5460
377 5460 7526 -188 -3576 390 292 -2745 1317 6640 2770 -3788 1896 8854 2029 -8215 -4981
392 -4981 3562 -1727 -9083 -1694 9897 5344 -6713 -4695 3966 685 -8601 -5003 2511 -3573 -10921
407 -10921 588 14778 5255 -13875 -10051 10195 10746 -7473 -11867 2254 7344 -2611 -3077 8659
421 8659 9320 -4161 -6526 6672 10221 -3363 -9639 248 6519 897 -859 6146 5814 -2586 -2100
436 -2100 5277 1382 -8727 -4077 9289 5524 -8321 -3069 15338 12745 -7925 -11236 6423 11655
$$ packed form
337A6494q940j9296J0777K2188r163k2777O923J9392j1318k2062J1238K6123r179
350A0400k4521R219K8149p363l1431J319K6991j440k6677K316L0009M567k8816
363g278q182K4533J1089k1717j4456J4071J2640q048o646P039M614o783k807P391
377E460K066p714l388L966r8l037M062N323l870o558N684O958o825j0244L234
392d981Q543n289p356P389J1591m553j2057K018Q661l281r286L598P514o084p348
407a0921J1509J4190r523j9130L824K0246N51j8219m394J4121N090r955m66J1736
421H659O61j3481k365J3198L549j3584o276R887O271n622j756P005l32q400M86
436b100P377l895j0109M650J3366l765j3845N252J8407k593k0670l311J7659N232
$$ plain form
450 11655 -2380 -6990 5576 8860 -1797 -1260 12367 10782 -7044 -10006 6009 10453 -4267
463 -4267 -9900 1263 5474 -3593 -3130 5836 2156 -11796 -10359 3469 1828 -12208 -10680 3745
477 3745 4137 -8040 -6765 6122 4337 -9470 -8844 3397 2166 -7033 -2377 8528 2257 -9177
491 -9177 -887 13459 3941 -15261 -10520 7151 4454 -12143 -9604 5135 1435 -13297 -8379 5967
505 5967 -519 -18383 -15275 2236 1801 -12893 -11469 2709 3320 -7340 -6801 3024 1027 -8004 -5359
520 -5359 2359 -1028 -6411 394 6259 -2610 -10816 -2582 5565 -4346 -15098 -9707 -1628 -7705 -13175
535 -13175 -4737 297 -11369 -17466 -4626 4137 -8843 -20688 -9931 3847 -1574 -10807 -4518
548 -4518 4645 -392 -8101 -1729 5509 -1705 -9780 -3486 5183 596 -7146 -3975 3161 607 -7182
$$ packed form
450A1655j4035m610J2566L284j0657N37J3627j585j7826k962J6015M444j4720
463d267n633J1163M211r067M63Q966l680j3952J437J3828j641j4036J528J4425
477C745L92j2177J275J2887j785j3807O26J2241j231r199M656J0905o271j1434
491i177Q290J4346r518j9202M741J7671k697j6597K539J4739l700j4732M918J4346
505E967o486j7864L108J7511m35j4694J424J4178O11j0660N39R825j997r031K645
520e359P718l387n383O805N865q869q206Q234Q147r911j0752N391Q079o077n470
535a3175Q438N034j1666o097J2840Q763j2980j1845J0757J3778n421r233O289
548d518R163n037p709O372P238p214q075O294Q669m587p742L171P136k554p789
$$ plain form
563 -7182 -7153 -2546 -2806 -5433 -5109 -3686 -4208 -2485 1482 2257 -1636 -2634 1230 3962 2211 1299 2954
580 2954 4165 5097 7736 9835 6175 1205 2374 7586 7418 533 -2311 2882 6795 4374 -68 88
596 88 3095 2047 -1414 -1565 2009 2010 -1796 -2009 4344 7213 2071 -3154 1481 7655 4175 -2984 -1364
613 -1364 5531 4264 -2229 -1565 4946 4324 -1851 -2625 860 -416 -5414 -3940 723 -1160 -5374 -2215
629 -2215 3258 99 -5064 -2887 1043 -2022 -5622 417 4644 -2504 -6963 2073 8591 306 -7044
644 -7044 -376 5977 -1323 -6346 3241 8996 -2018 -7873 5001 13812 1544 -8152 4079 14131
658 14131 2348 -7966 3971 15409 4706 -6184 4635 16214 5086 -7016 1624 12266
670 12266 2791 -6911 2225 11288 2671 -5487 3032 9687 960 -3881 6131 9653 -1375 -3770
$$ packed form
563g182K9M607k60k627L24J423n22J723L967P75l893r98L864K732j751r12J655
580B954J211R32K639K099l660m970J169N212j68o885k844N193L913k421m442J56
596H8L007j048l461j51L574Jl806k13O353K869n142n225M635O174l480p159J620
613a364O895j267o493O64O511o22o175p74L485j276m998J474M663j883m214L159
629b215N473l159n163K177L930l065l600O039M227p148m459R036O518q285p350
644g044O668O353p300n023R587N755j1014n855J2874Q811j2268r696J2231J0052
658A4131j1783j0314J1937J1438j0703j0890J0819J1579j1128j2102Q640J0642
670A2266r475r702R136R063q617q158Q519O655q727m841J0012L522j1028k395
$$ plain form
684 -3770 9964 13643 12 -3283 10872 13934 -1548 -5026 10124 12252 -5024 -8466 7767
697 7767 10082 -7995 -10946 5966 8085 -11176 -15002 3041 6921 -10270 -13803 4090 8520 -6513
711 -6513 -7793 9835 11105 -5788 -6004 13332 16454 -488 -2940 13126 15572 1126 151 13850
725 13850 11069 -5073 -3756 10424 7878 -8207 -6083 8097 3523 -11734 -6852 9375 4318
738 4318 -11665 -6973 10659 7522 -7316 -982 16568 11460 -4272 2409 20313 15746 -2272
751 -2272 671 16691 14447 -173 1766 12622 6499 -7055 -2827 8988 2383 -11920 -9208 1787
765 1787 -2460 -12027 -7461 379 -5583 -12976 -4614 3307 -4470 -10399 -707 7434 -1831 -8912 2001
780 2001 10874 879 -8325 1575 8634 -1389 -9076 -531 5674 -6320 -13630 -2935 4864 -7207
$$ packed form
684c770J3734L679j3631l295J4155L062j5482l478J5150K128j7276l442J6233
697G767K315j8077k951J6912K119j9261l826J8043L880j7191l533J7893M430j5033
711f513j280J7628J270j6893k16J9336L122j6942k452J6066K446j4446r75J3699
725A3850k781j6142J317J4180k546j6085K124J4180m574j5257M882J6227n057
738D318j5983M692J7632l137j4838O334J7550n108j5732O681J7904m567j8018
751b272K943J6020k244j4620J939J0856o123j3554M228J1815o605j4303K712J0995
765A787m247r567M566P840n962p393Q362P921p777n929R692Q141r265p081J0913
780B001Q873r995r204R900P059j0023p687Q545O205j1994p310J0695P799j2071
$$ plain form
794 -7207 -17663 -9072 495 -6232 -14503 -8202 -1192 -6264 -11201 -3934 2419 -3352 -7574 -722 5174
809 5174 443 -3355 1847 6637 3287 -171 2620 3880 1360 1531 4708 2368 -2657 -1472 4791
824 4791 3575 -3226 -3784 1349 2469 -1973 -2328 2022 1047 -3643 -1615 4623 4852 -1893 -2611 4082
840 4082 6655 1171 -1851 2502 6501 4071 -125 287 3313 4285 2574 801 877 1465 2079 1858 1138
857 1138 1275 -88 -1639 -50 2638 1820 -2745 -4336 -47 2542 -547 -4234 -3167 -670 -1159 -2603
873 -2603 -2291 -1953 -2561 -2008 -776 -1580 -3425 -2500 842 562 -2168 -2305 -428 332 -163 1003 978 -2427
891 -2427 -2668 2589 4479 -1467 -6104 -1009 4530 317 -5318 -2737 2293 -860 -5166 -1005 2979
906 2979 -2209 -6754 -1198 4958 289 -5919 -1617 6056 3389 -3490 -1693 4540 3337 -735 992
$$ packed form
794g207j0456Q591R567o727q271O301P010n072m937P267O353n771m222O852N896
809E174m731l798N202M790l350l458K791J260k520J71L177k340n025J185O263
824D791j216o801n58N133J120m442l55M350r75m690K028O238K29o745p18O693
840D082K573n484l022M353L999k430m196M12L026R72j711j773P6N88O14k21p20
857A138J37j363j551J589K688q18m565j591M289K589l089l687J067K497m89j444
873b603L12L38o08N53J232q04j845R25L342k80k730j37J877P60m95J166k5l405
891b427k41N257J890n946m637N095N539m213n635K581N030l153m306M161L984
906B979n188m545N556O156m669o208M302P673k667o879J797O233j203m072J727
$$ plain form
921 992 3426 851 -938 3692 5241 -621 -3956 1564 4581 -699 -4494 425 2571 -2575 -3988
936 -3988 2571 3703 -4403 -5774 2960 5426 -3843 -7111 2494 7207 -1507 -5910 2177 7518 90
951 90 -4598 1929 6130 -1391 -3988 3028 6972 -890 -5065 1875 6992 608 -4466 519 4155 -93
967 -93 -2686 2290 3801 -322 -1736 3485 4523 -792 -1600 3454 3961 -1407 -625 4755 4377 -1183 -265
984 -265 5129 3871 -2789 -271 6073 3837 -3969 -2071 6706 6188 -2961 -3133 5694 6270 -2092 -3510
1000 -3510 3766 5523 -1973 -3465 3588 5616 -1167 -3322 1940 3927 -1530 -3768 262 1546 -2183
1015 -2183 -3180 712 498 -3350 -2789 1159 -631 -5252 -3736 823 60 -4799 -3597 2083 1389 -3718
1031 -3718 -3790 1180 599 -4184 -4002 1255 1345 -3411 -3684 1386 1307 -3941 -4504 26 453 -4544 -6113 -423
$$ packed form
921I92K434k575j789M630J549n862l335N520L017n280l795M919K146n146j413
936c988O559J132q106j371Q734K466r269l268R605M713q714m403Q087N341p428
951I0m688O527M201p521k597P016L944p862m175O940N117o384n074M985L636m248
967i3k593M976J511m123j414N221J038n315q08N054N07n368P82N380l78n560R18
984b65N394j258o660K518O344k236p806J898Q777n18r149j72Q827N76q362j418
1000c510P276J757p496j492P053K028o783k155N262J987n457k238M030J284l729
1015b183r97L892k14l848N61L948j790m621J516M559p63m859J202N680o94n107
1031c718p2M970n81m783J82N257R0m756k73N070p9n248n63M530M27m997j569N690
$$ plain form
1049 -423 716 -4488 -6142 -628 1311 -3635 -6429 -1577 969 -2992 -6142 -2563 1390 -1034 -3276
1064 -3276 -804 1303 -646 -1723 231 706 -1818 -1487 1134 1301 -1507 -358 1899 127 -3923 -2426
1080 -2426 2618 680 -6328 -5038 2664 2666 -4960 -6336 826 3286 -3845 -6144 336 2662 -3672 -5189
1096 -5189 1570 4578 -1125 -3730 2480 5152 -378 -3232 2326 4661 -308 -2676 2779 5159 658
1111 658 -2269 1916 3175 -1827 -3383 1249 2606 -2493 -4160 311 2437 -1358 -2915 91 -508
1126 -508 -3255 -1320 2513 195 -4673 -1487 5422 3789 -2723 -1244 5333 3665 -2820 -1071 6179
1141 6179 3992 -3851 -2218 6579 6333 -3158 -4226 3204 3456 -4064 -5541 768 1380 -3993 -5066 -213
1157 -213 226 -4480 -4429 -461 -1620 -5743 -3486 1382 9 -4603 -2947 2168 1450 -2492 -1174 2906
$$ packed form
1049d23J139n204j654N514J939m946k794M852K546l961l150L579L953k424k242
1064c276K472K107j949j077J954M75k524L31K621J67k808J149K257j772m050J497
1080b426N044j938p008J290P702Kp626j376P162K460p131k299O480K326o334j517
1096e189O759L008n703k605O210K672n530k854N558K335m969k368N455K380m501
1111F58k927M185J259n002j556M632J357n099j667M471K126l795j557L006n99
1126e08k747J935L833k318m868L186O909j633o512J479O577j668o485J749P250
1141F179k187p843J633Q797k46r491j068P430K52p520j477O309O12n373j073M853
1157b13M39m706N1L968j159m123K257M868j373m612J656N115p18l942J318M080
$$ plain form
1173 2906 336 -3138 502 4419 1185 -3775 2 4769 1668 -3543 -2133 1148 -1726 -5062 -2036
1188 -2036 1446 -2212 -6196 -2350 2420 -937 -5470 -3404 1672 -295 -3711 -674 3455 2653 299
1203 299 2000 4653 3728 2066 3869 5010 3236 1800 4056 5227 3534 2197 3127 2763 1085 909
1219 909 2427 969 -3279 -2325 2167 2943 -1360 -2836 654 2853 846 -1147 491 1537 1132 1264
1235 1264 3800 5103 3383 2521 3675 4923 4459 2486 1924 2808 4023 3302 1084 235 2318 3292 143
1252 143 -2665 -1429 594 -170 -2930 -3067 -1105 -1009 -1646 42 1580 -1260 -3281 -645 3130 1344
1268 1344 -1583 -1251 2531 3741 2649 2402 1925 1052 314 1790 2165 205 -1157 320 1376 362
1284 362 -296 271 -933 -2735 -1483 270 -1694 -4536 -1922 2007 -1258 -5327 -2409 3441 1444 -5251
$$ packed form
1173B906k570l474L640L917l234m960L777M767l101n211J410L281k874l336L026
1188b036L482l658l984L846M770l357m533K066N076j967l416L037M129q02k354
1203B99J701K653r25j662J803J141j774j436K256J171j693j337R30l64j678j76
1219I09J518j458m248R54M492P76m303j476L490K199k007j993J638J046m05J32
1235A264K536J303j720q62J154J248m64j973n62Q84J215p21k218q49K083R74l149
1252A43k808J236K023p64k760j37J962R6o37J688J538k840k021K636L775j786
1268A344k927L32L782J210j092k47m77q73p38J476L75j960j362J477J056j014
1284C62o58N67j204j802J252J753j964k842K614L929l265m069K918N850j997o695
$$ plain form
1300 -5251 -4224 1566 1590 -3458 -2719 2623 1800 -3198 -2186 3981 3327 -3351 -4438 872 2494 -1260
1316 -1260 -1860 621 301 -1952 -169 1777 -1260 -4998 -2174 1202 -1538 -4796 -1610 1960 -1789
1331 -1789 -5038 -924 3157 -1585 -5614 -1446 2998 -884 -4054 955 5008 190 -2891 2077 5893
1346 5893 408 -3448 1591 6098 834 -3444 1967 5970 536 -4019 1536 4331 -1551 -6113 -843
1361 -843 3538 -1572 -5315 -568 3083 -1067 -4257 -206 2290 -1477 -2580 2057 2892 -1101 -883 5611
1377 5611 5147 -2026 -1594 5527 6389 -1890 -4474 2611 5591 -657 -3410 1739 2685 -3395 -4826 1049
1393 1049 1675 -4767 -6669 -1192 1341 -2363 -3614 -446 185 -2718 -1283 2211 19 -3349 -920
1408 -920 4269 2194 -1985 -188 4630 2507 -2285 -650 2917 722 -3585 -1030 2069 -1064 -4673
$$ packed form
1300e251J027N790K4n048P39N342q23m998J012O167o54o678j087N310J622l754
1316a260o00K481l20k253J783J946l037l738K824L376k740l258L186L570l749
1331a789l249M114M081m742m029M168M444l882l170N009M053m818l081M968L816
1346E893n485l856N039M507n264m278N411M003n434m555N555K795n882m562N270
1361h43M381n110l743M747L651m150l190M051K496l767j103M637Q35l993K18O494
1377E611m64p173M32P121Q62q279k584P085K980o248k753N149R46o080j431N875
1393A049O26o442j902N477K533l704j251L168O31k903J435L494k192l368K429
1408i20N189k075m179J797M818k123m792J635L567k195m307K555L099l133l609
$$ plain form
1423 -4673 -669 3531 -1380 -6289 -3251 1866 -1082 -5184 -1579 2638 -564 -4501 33 5140 1352
1438 1352 -4557 -2142 4408 3491 -2458 -2388 2889 3086 154 -969 1647 1362 -617 -905 -444 -543 -1019
1455 -1019 398 121 -1150 -710 1064 379 -1201 -324 1549 -312 -2524 -449 3735 3143 -860 -1165
1471 -1165 2133 2594 -17 230 2408 926 -1009 663 3890 3030 -631 -658 2545 2736 510 -46 1841
1488 1841 1602 71 715 2548 3101 1340 1055 1972 1865 1719 1441 1352 1388 1237 2009 1758 1325 2408 3376
1507 3376 1072 -1212 177 3726 2586 -219 271 1950 2904 1469 1596 2083 1232 -414 863 2868
1523 2868 2100 -495 164 1917 1365 426 1304 1119 -1179 -1744 151 1011 -1827 -2780 121 1292 -1532
1540 -1532 -3179 -58 1712 -1576 -3674 -1229 1013 -1043 -2056 134 1518 -1069 -2488 153 1623
$$ packed form
1423d673M004M200m911m909L038N117k948m102L605M217l202l937M534N107l788
1438A352n909K415O550r17n949P0N277J97k932j123K616k85j979k88M61r9m76
1455a019J417k77j271M40J774o85j580Q77J873j861k212K075M184n92m003l05
1471a165L298M61k611K47K178j482j935J672L227q60l661k7L203J91k226n56J887
1488A841k39j531O44J833N53j761k85R17j07j46k78q9L6j51P72k51m33J083R68
1507C376k304k284J389L549j140k805M90J679R54j435J27M87q51j646J277K005
1523B868p68k595O59J753n52r39Q78j85k298n65J895Q60k838r53K901J171k824
1540a532j647L121J770l288k098K445K242k056j013K190J384k587j419K641J470
$$ plain form
1555 1623 -1460 -3568 -1091 1209 -336 -1963 -973 -206 -1330 -1484 -255 -615 -2622 -2567 -516 -276 -2019
1572 -2019 -1527 136 -345 -1535 -480 1004 -830 -2773 -809 2050 329 -2425 -153 2956 1347
1587 1347 -1764 -388 2437 621 -3190 -1086 2855 1333 -2377 -975 2758 1060 -2977 -1856 2528
1602 2528 1652 -2733 -2579 1554 1896 -676 -1614 236 478 -877 160 1027 -281 -1696 -931 862 258
1619 258 -12 1018 310 -1448 -1034 1945 1762 -2178 -3294 905 2423 -597 -1797 998 1953 -1614
1635 -1614 -3378 80 2157 -1227 -3297 -599 1852 -611 -2392 236 1844 -1293 -3198 -509 2643
1650 2643 304 -3080 -1569 967 504 -1087 -310 1003 -684 -2214 -334 933 -382 -2488 -1588 -263
1666 -263 464 329 -585 -1164 -2156 -740 -165 -1126 -2414 -1515 294 138 -1885 -1991 418 2 -2836 -3019
$$ packed form
1555A623l083k108K477K300j545j627R90P67j124j54J229l60k007N5K051K40j743
1572b019M92J663m81j190J055J484j834j943J964K859j721k754K272L109j609
1587A347l111J376K825j816l811K104L941j522l710J402L733j698m037J121M384
1602B528q76m385J54M133L42k572r38J850K42j355J037Q67j308j415P65J793o04
1619B58k70J030p08j758M14K979j83l940j116M199J518l020j200K795R55l567
1635a614j764L458K077l384k070K698K451k463j781K628J608l137j905K689L152
1650B643k339l384J511K536m63j591P77J313j687j530J880J267j315k106R00J325
1666b63P27j35r14n79r92J416N75r61j288Q99J809j56k023j06K409m16k838j83
$$ plain form
1684 -3019 -365 1097 -1049 -1987 -330 304 -946 -1863 -241 544 -930 -2449 -1042 375 -300 -1644
1700 -1644 -1421 -790 -900 16 128 -764 -2420 -1746 741 298 -1432 -1789 898 1205 -510 -1145 141 740
1718 740 -565 -966 1126 1361 -300 -208 1756 1938 -1052 -1062 1578 2853 223 -1323 1382 2902 607
1735 607 -871 1167 2423 412 -944 1733 3450 387 -2388 674 4036 2327 -676 -493 2654
1750 2654 2798 1183 73 737 1328 1127 1700 1915 1022 1370 2122 1775 143 42 1515 1784 623 896
1768 896 2093 1461 -517 171 2795 2037 -926 -987 2734 3275 -374 -1542 1032 2446 158 -251 1803
1785 1803 2095 -559 -932 2273 2534 -886 -1949 1475 3093 527 -1092 629 1574 -213 -1002 653
1801 653 915 -310 -555 1094 934 -189 -864 19 380 -924 -443 852 26 -1251 179 1318 -552
$$ packed form
1684c019K654J462k146r38J657O34j250r17J622P85j474j519J407J417o75j344
1700a644K23O31j10R16J12q92j656O74K487m43j730l57K687L07j715o35J286N99
1718G40j305m01K092K35j661R2J964J82k990j0K640J275k630j546K705J520k295
1735F07j478K038J256k011j356K677J717l063k775L062L362j709l003J83L147
1750B654J44j615j110O64N91k01N73K15q93L48P52l47j632j01J473K69j161K73
1768H96J197o32j978O88K624p58k963o1L721N41l649j168K574J414k288m09K054
1785A803K92k654l73L205K61l420j063L424J618k566j619J721R45j787p89J655
1801F53K62j225k45J649j60j123o75Q83L61j304M81J295q26j277J430J139j870
$$ plain form
1818 -552 -2020 -248 2417 384 -2690 -1299 1469 709 -2195 -1364 952 572 -1605 -708 1427 79
1834 79 -2505 -1978 848 1143 -962 -1168 97 232 -428 -91 64 -1138 -1445 -86 1066 242 -741 -245
1852 -245 387 -65 -239 669 348 -597 -341 1372 1490 -566 -968 1352 1902 -33 -843 777 1942 243
1870 243 -842 706 1446 360 -356 1102 1401 -70 -865 587 1195 278 -612 -92 846 1228 1122 382
1888 382 -344 6 837 1019 -446 -718 120 742 117 -375 344 20 -1327 -458 572 259 -1764 -1702 186
1907 186 845 -1002 -1892 -622 332 -796 -1516 -843 -696 -1575 -1326 -970 -556 -1275 -1174 -653 -727 -1144 -1715
1926 -1715 -1379 -1855 -1309 -368 -612 -2078 -2058 -321 -33 -2127 -2343 -320 304 -2011 -2586 -362 355 -1635
1944 -1635 -2555 -424 689 -1517 -2465 3 765 -1721 -2765 -279 1038 -1059 -1915 -206 427 -855
$$ packed form
1818e52j468J772K665k033l074J391K768p60k904Q31K316l80k177Q97K135j348
1834G9k584N27K826K95k105k06J265J35o60L37J55j202l07J359J152q24r83M96
1852b45O32m52j74R08l21r45K56J713J18k056m02K320N50j935q10J620J165j699
1870B43j085J548P40j086p16J458K99j471p95J452O08r17q90N20R38L82j06p40
1888C82p26L50Q31J82j465k72Q38O22o25m92P19l24j347Q69J030l13k023O2J888
1907A86O59j847q90J270R54j128p20O73J47q79K49L56M14p19J01N21p4m17n71
1926a715L36m76N46R41k44j466K0J737K88k094k16K023O24k315n75K224P17j990
1944a635r20K131J113k206r48K468P62k486j044K486J317k097q56J709O33j282
$$ plain form
1960 -855 -1182 -471 -149 -1704 -1505 902 875 -980 -938 639 469 -1191 -579 1032 54 -2188 -454 1968
1978 1968 697 -2055 -656 1967 391 -2579 -422 2687 787 -2854 -1277 2525 1345 -2139 -964
1993 -964 1649 1070 -1589 -536 1987 765 -1682 -762 1964 1510 -707 -185 1869 576 -1230 427
2009 427 2607 149 -1403 761 2686 211 -1489 1171 2173 -455 -1599 1675 2689 -533 -2268
2024 -2268 1228 3054 -116 -1768 1230 2833 -390 -1898 1662 3464 156 -1773 1355 3527 589
2039 589 -1770 1060 2823 115 -1205 1381 2584 -141 -1270 772 2263 401 -901 375 882
2054 882 -870 -713 1206 788 -1717 -922 1402 1110 -1532 -1042 1410 579 -2045 -849 2133 1014 -2341
2071 -2341 -1641 2037 1520 -1688 -1591 1223 916 -2100 -1120 1810 1343 -1645 -1795 1177 1669 -891 -1384
$$ packed form
1960h55l27P11L22j555J99K407k7j855M2J577j70j660O12J611r78k242J734K422
1978A968j271k752J399K623j576k970K157L109j900l641J577L802j180l484J175
1993i64K613n79k659J053K523j222k447R20K726m54k217N22K054j293j806J657
2009D27K180k458j552K164J925k475j700K660J002k628j144L274J014l222j735
2024b268L496J826l170j652K998J603l223j508L560J802l308j929L128K172k938
2039E89k359K830J763k708j320K586J203k725j129K042J491j862j302J276N07
2054H82j752J57J919m18k505P95K324k92k642M90K452q31k624J196K982j119l355
2071b341P00L678n17l208R7K814l07l016R80K930m67k988j50K972M92k560m93
$$ plain form
2088 -1384 280 -153 -1346 -505 1253 437 -1220 -1025 573 333 -459 213 385 157 -535 923 1763 -5
2106 -5 -785 1231 1954 199 -458 1364 1926 326 -899 953 1901 436 -889 289 1133 118 -398
2123 -398 690 1304 -183 -1209 -72 1368 1072 -178 -181 337 674 1024 1053 327 365 718 900 703 522
2142 522 1070 703 175 287 813 1095 84 -424 649 946 -677 -915 335 820 -165 -1639 -346 511
2160 511 113 -601 -477 73 -399 -282 215 470 -279 -455 -249 434 470 43 -325 -454 80 606 336 -805
2180 -805 -1068 160 439 -1153 -1683 -446 390 -1174 -1787 -525 364 -938 -1823 -464 -198 -1138 -1838 -411
2198 -411 892 -472 -2014 -751 226 -238 -1171 -643 -150 -787 -1212 -500 23 -1066 -1187 -243 -199 -1239
2216 -1239 -1804 -480 -419 -1865 -1549 -789 -745 -1536 -958 416 -277 -2020 -1330 1110 690 -1634 -1137 848
$$ packed form
2088a384J664m33j193Q41J758q16j657J95J598k40p92O72J72k28o92J458Q40j768
2106ep80K016P23j755o57J822N62j600j225J852R48j465j325J178Q44j015n16
2123c98J088O14j487j026J137J440k96j250lN18L37L50K9p26L8L53J82j97j81
2142E22N48l67n28J12N26K82j011n08J073K97j623k38J250M85r85j474J293Q57
2160E11l98p14J24N50m72J17M97K55p49j76K06O83L6m27l68j29N34N26k70j141
2180h05k63J228K79j592n30J237Q36j564o13J262Q89j302q85J359K66r40p00J427
2198d11J303j364j542J263R77m64r33N28M93o37m25P12N23j089j21R44M4j040
2216a239n65J324O1j446L16P60M4p91N78J374o93j743O90K440m20k324M97J985
$$ plain form
2234 848 860 -1143 -801 1161 908 -1201 -1152 1108 1422 -656 -973 433 775 -184 -161 784 665 -323 -214
2253 -214 361 724 182 293 613 176 -137 647 1578 574 -441 844 1903 842 87 1491 2111 520
2271 520 -356 1216 2396 879 -582 473 1682 760 -497 656 1521 349 -1227 203 1784 541
2287 541 -1338 -480 992 922 -661 -371 702 471 -560 188 740 247 -256 598 621 -231 -504 544 581
2306 581 -254 -151 248 277 -618 -96 908 41 -1181 -875 690 1140 -1069 -1662 -289 771 -328 -1294
2324 -1294 -47 794 -239 -1113 307 1004 -55 -798 274 1011 304 -685 89 1278 780 -491 -268
2341 -268 462 869 727 184 276 211 138 777 800 67 -349 277 308 276 255 177 -350 -123 234 633 247 -497 -2
2364 -2 767 922 28 -384 964 1124 313 -59 630 1129 243 100 595 1151 -98 -352 987 1523 464
$$ packed form
2234H48J2k003L42J962k53k109M9K260L14k078l17J406L42r59K3R45j19r88J09
2253b14N75L63n42J11L20m37l13P84R31j004j015J285J059j061p55J404O20j591
2271E20q76J572J180j517j461J055J209r22j257J153Q65j172j576J430J581j243
2287E41j879Q58J472p0j583K90J073k31j031P48N52m93n03Q54K3q52k73J048L7
2306E81q35J03L99K9q95N22J004q67j222L06J565M50k209n93J373J060j099r66
2324a294J247Q41j033q74J420O97j059p43J072P37p07r89P74J189m98j271K23
2341b68P30M07j42n43R2o5p3O39K3p33m16O26L1l2k1p8n27K27L57L99l86p44M95
2364bP69J55q94m12J348J60q11l72O89M99q86j43M95N56j249k54J339N36j059
$$ plain form
2383 464 -984 -213 1427 850 -279 -500 508 534 186 -19 206 706 153 235 632 631 281 714 729 666 508
2404 508 1237 1036 461 529 1440 1027 -183 164 1149 1233 -391 -701 849 1013 -195 -900 71 973 -260
2423 -260 -1029 202 717 -185 -1034 241 695 -137 -869 -93 594 146 -818 -117 399 -133 -610 -328 8
2442 8 -325 -645 -93 -362 -746 -1107 -524 -734 -1109 -825 -438 -1088 -1785 -955 -450 -780 -1776 -790 -80 -594 -2012
2463 -2012 -1038 354 244 -1644 -1555 662 173 -952 -1014 205 121 -1242 -1095 186 445 -682 -1328 -180
2481 -180 124 -338 -1033 -282 -240 -114 -483 252 -279 -401 270 40 -556 -672 70 300 -117 -381 591 494 -204
2502 -204 -677 535 856 -482 -566 401 749 -336 -968 10 1082 -198 -758 205 492 -684 -691 -97 100
2521 100 -544 -904 -291 362 -473 -753 -563 -309 -154 -219 -140 -292 -441 130 483 -156 -434 512 752 -38 -789
$$ packed form
2383D64j448P71J640n77j129k21J008K6l48k05K25N00n53Q2L97jl50M33J5o3j58
2404E08P29k01n75O8R11m13j210L47R85Q4j624l10J550J64j208p05R71R02j233
2423b60p69J231N15r02q49J275M54q32p32P76O87m48r64P01N16n32m77K82L36
2442Hl33l20N52k69l84l61N83k10l75K84L87o50o97Q30N05l30r96R86P10n14j418
2463b012R74J392j10j888Q9K217m89j125o2J219q4j363J47J281K59j127o46J148
2481a80L04m62o95P51M2J26l69P35n31j22O71k30n96j16P42K30m17k64R72r7o98
2502b04m73J212L21j338q4R67L48j085o32R78J072j280n60R63K87j176pN94J97
2521A00o44l60O13O53q35k80J90K54J55o5P9j52j49N71L53o39k78R46K40p90p51
$$ plain form
2542 -789 435 1006 -116 -636 242 913 -225 -655 86 1029 173 -876 -341 985 541 -510 -56 707
2560 707 552 20 145 397 356 388 631 809 440 155 688 761 -35 61 819 70 -342 155 609 -130 -861
2581 -861 -399 713 63 -1491 -906 416 -220 -1365 -849 -45 -177 -1316 -1002 485 142 -1199 -703 225
2599 225 109 -1077 -899 208 298 -896 -885 -299 -457 -1138 -695 -526 -977 -1242 -434 -436 -1182 -1406 -44 -31
2619 -31 -839 -1083 248 664 -991 -780 1129 1053 -828 -560 1393 1850 -392 -407 1392 1861 231 -130
2637 -130 944 1112 56 22 1245 1204 420 41 901 1331 642 278 1475 1103 508 887 1749 1061 542
2656 542 1287 2226 1121 534 1123 1950 1037 131 683 1317 463 -708 309 1246 -200 -1455 -319 1319
2674 1319 -106 -1558 -436 908 -114 -1290 -404 629 -505 -1778 -672 885 217 -1303 -883 410
$$ packed form
2542g89J224N71j122n20Q78O71j138m30P41R43q56j049N35J326m44j051M54P63
2560G07j55n32J25K52m1L2K43J78l69k85N33P3p96R6P58p49m12M97M54p39p31
2581h61M62J112o50j554N85J322o36j145N16Q04j32j139L14J487l43j341M96R28
2599B25j16j186J78J107R0j194J1N86j58o81M43J69m51k65Q08kp46k24J362J3
2619c1q08k44J331M16j655K11J909p6j881K68J953M57k242j5J799M69j630l61
2637a30J074J68j056l4J223m1p84l79Q60M30o89l64J197l72n95L79Q62o88n19
2656E42P45R39j105n87N89Q27r13r06N52O34q54j171J017R37j446j255J136J638
2674A319j425j452J122J344j022j176Q86J033j134j273J106J557o68j520M20J293
$$ plain form
2690 410 -90 -732 -876 -361 -845 -919 -196 -180 -1442 -1715 -295 -479 -1881 -1564 -131 -450 -1674 -1282 203
2709 203 44 -1723 -1247 523 473 -1255 -1251 296 707 -1346 -1299 177 581 -319 -868 144 -44 -752 -431
2728 -431 771 246 -1035 -941 760 598 -6 -149 415 438 -62 304 783 249 -717 356 1215 147 -538
2747 -538 172 858 -211 -762 -154 827 -119 -1108 -177 562 -141 -1349 106 1436 -211 -1337 -319 1172
2765 1172 470 -780 -397 889 641 -487 -56 357 -147 -659 56 35 -499 -712 -318 -119 -765 -666 -12
2784 -12 -533 -890 -501 422 -189 -755 -461 1015 702 -468 -381 1129 949 -15 435 1286 1046 60 27 778
2804 778 855 -220 -389 297 281 -614 -663 547 333 -446 -783 10 601 150 -269 -131 223 305 827 915 423
2825 423 511 651 925 746 806 1371 537 142 342 1249 681 -166 -20 351 363 -531 -810 412 271 -593 -654
$$ packed form
2690D10n00o42j44N15m84p4P23J6j262k73J420j84j402L17J433l19j224L92J485
2709B03j59j767M76J770n0j728MJ547M11k053M7J476M04r00n49J012j88p08L21
2728d31J202n25j281R4J701j62o04j43N64K3n00L66M79n34r66J073Q59j068o85
2747e38P10O86j069n51O08R81r46r89R31P39p03j208J455J330j647j126J018J491
2765A172p02j250L83J286k48j128M31M13n04n12P15k1n34k13L94J99o46R9O54
2784a2n21l57L89R23o11n66K94J476l13j170Q7J510j80r64M50Q51k40r86l3P51
2804G78P7j075j69O86j6q95m9J210k14p79l37P93N91m51m19J38L54Q2N22Q8m92
2825D23Q8J40K74j79O0N65q34l95K00R07n68q47J46L71J2q94k79J222j41q64o1
$$ plain form
2846 -654 -93 676 261 -696 -328 196 -15 130 341 634 46 -7 177 715 626 322 276 -484 48 420 476
2867 476 -475 -325 102 341 -628 -570 -188 -166 -902 -892 -105 166 -105 -568 84 343 184 17 843 655 79
2888 79 -64 251 1271 860 373 333 262 487 421 763 376 317 449 252 258 460 481 526 -41 67 989 1020 421
2911 421 287 895 1101 629 336 1167 1444 1016 312 1141 1867 1323 633 739 1169 704 580 695 947 694
2931 694 63 49 610 420 222 198 87 142 49 124 -77 -106 121 481 -95 -227 214 774 422 -150 20 450
2953 450 280 -547 -419 376 -226 -842 -785 -9 -187 -1134 -1262 -734 -547 -881 -1397 -831 -877 -1502 -1383 -800 -420
2974 -420 -963 -1060 -843 -594 -439 -877 -695 -175 -197 -573 -267 -181 -23 -106 -376 -41 -395 12 122 -74 -307
2995 -307 -205 -1 -538 -722 -135 130 -506 -1104 -95 291 -169 -919 -488 409 559 -468 -330 751 819
$$ packed form
2846f54N61P69m15r57L68N24k11J45K11K93n88n3J84N38q9l04m6p60N32L72N6
2867D76r51J50M27K39r69N8L82K2p36J0P87K71k71m63O52K59j59j67Q26j88n76
2888G9j43L15J020m11m87m0p1K25o6L42l87n9J32j97OK02K1M5n67J08R22L1n99
2911D21j34O08K06m72k93Q31K77m28p04Q29P26n44o90J06M30m65j24J15K52k53
2931F94o31j4N61j90j98k4j11N5r3P5k01k9K27L60n76j32M41N60l52n72J70M30
2953D50j70q27J28P95o02o16N7P76j78r47j28N28J87l34n16N66m6o25J19N83L80
2974d20n43r7K17K49J55m38J82N20k2l76L06Q6J58q3k70L35l54M07J10j96k33
2995c07J02K04n37j84N87K65o36n98J009L86m60p50M31Q97J50j027J38J081O8
$$ plain form
3014 819 -140 75 753 780 618 188 412 529 585 264 306 898 322 87 208 -287 223 -14 -438 -283 -461
3035 -461 -445 -138 -363 -87 -81 -200 -512 -287 33 -86 -312 -460 -235 490 -64 -386 -303 368 328 -28 -84 294
3057 294 -146 -593 -423 367 206 -460 -836 -210 28 -576 -813 -503 13 -283 -778 -614 -327 -346 -789 -593
3077 -593 -308 -317 -327 72 -93 164 -205 200 152 200 273 120 -297 -103 418 863 88 -626 91 688 338 -194
3099 -194 -368 71 -79 -713 -637 40 -79 -665 -304 305 116 -378 -508 319 366 -350 -279 452 520 52 -98
3120 -98 596 584 152 545 493 510 230 287 71 443 -45 95 -305 -689 -255 205 25 -857 -583 -149 142 -326
3142 -326 -800 28 348 -294 -560 123 775 -198 -526 226 1072 375 -316 571 1128 564 185 523 570 385
3162 385 -223 371 810 265 -156 -26 662 370 44 280 162 239 564 697 437 11 586 1053 371 258
$$ packed form
3014H19r59K15O78K7j62m30K24J17N6l21M2N92n76k35J21m95N10k37m24J55j78
3035d61J6L07k25K76Oj19l12K25L20j19k26j48K25P25n54l22Q3O71m0l56n6L78
3057B94m40m47J70P90j61o66l76O26K38o04k37L10N16k96m95J64K87j9m43J96
3077e93K85rj0L99j65K57l69M05m8M8P3j53m17J94N21M45p75p14P17N97l50n32
3099a94j74M39j50o34P6O77j19n86L61O09j89m94j30Q27M7p16P1P31O8m68j50
3120i8O94j2m32L93n2J7k80N7k16L72m88J40m00l84M34M60j80q82K74M34K91m68
3142c26m74Q28L20o42k66O83O52r73l28P52Q46o97o91Q87N57n64l79L38M7j85
3162C85o08N94M39n45m21J30O88k92l26K36j18P7L25J33k60m26N75M67o82j13
$$ plain form
3182 258 651 1190 672 350 572 1326 760 255 446 1360 526 -264 555 1278 805 -252 -72 661 916 170
3202 170 -86 -111 200 52 -158 -78 -304 -554 -576 175 -73 -514 -739 -260 -231 -553 -108 -141 -679 -597 116 241
3224 241 -559 -893 -14 238 -627 -610 -278 117 -748 -890 -497 -468 -1143 -1230 -366 -730 -1497 -1681 -763 -331 -815
3245 -815 -1449 -947 -513 -644 -763 -513 -157 -480 242 375 -1 114 2 250 77 259 389 480 50 -167
3265 -167 385 417 -376 -852 169 511 -223 -924 -118 399 -110 -735 -133 177 25 -359 94 766 -130 -22
3285 -22 385 825 925 139 148 536 391 -115 377 -163 -91 -372 -57 -138 -732 -629 -297 -382 -843 -699 -238 -467
3307 -467 -1058 -809 51 -157 -1491 -497 181 127 -704 -488 286 -4 -717 -633 268 101 -558 -889 -170 -425
3327 -425 -975 -605 -295 -166 -828 -656 -147 -135 -478 -414 -490 -469 -125 37 342 -41 -178 376 563 78 67 278
$$ packed form
3182B58L93N39n18l22K22P54n66n05J91R14q34p90Q19P23m73j057J80P33K55p46
3202A70k56k5L11j48k10Q0k26k50k2P51k48m41k25M79K9l22M45l3n38Q2P13J25
3224B41q00l34Q79K52q65J7L32L95q65j42L93K9o75q7Q64l64p67j84R18M32m84
3245h15o34N02M34j31j19K50L56l23P22J33l76J15j12K48j73J82J30R1m30k17
3265a67N52L2p93m76J021L42p34p01Q06N17n09o25O02L10j52l84M53O72q96J08
3285b2M07M40J00p86RL88j45n06M92n40P2k81L15q1n94J03L32q5m61J44M61k29
3307d67n91K49Q60k08j334R94O78n4q31K16P74k90p13Q4R01j67o59l31P19k55
3327d25n50L70L10J29o62J72N09J2l43O4p6K1L44J62L05l83j37N54J87m85j1K11
$$ plain form
3349 278 489 -178 -116 382 306 -108 -712 -16 448 -324 -669 59 513 -277 -780 234 351 -206 -562 315
3369 315 377 194 -300 252 222 -230 -127 100 71 -219 -398 -251 -383 -338 -388 75 -646 -939 -338 30 -256 -1110
3391 -1110 -414 381 -189 -546 31 629 192 -512 46 894 350 -307 169 745 677 -51 190 764 430 -232
3411 -232 52 614 460 55 403 500 267 370 466 1006 323 736 979 897 681 744 1388 1065 818 991 1728
3432 1728 1157 483 821 1205 1369 458 216 1396 1202 432 479 1229 1319 582 509 848 1038 250 394 762
3452 762 672 305 303 744 671 42 30 129 -138 -343 -95 -188 -537 -548 -144 -268 -825 -638 -229 -159 -808 -893 -547
3475 -547 -26 -609 -1061 -106 533 -271 -737 0 406 36 -409 27 470 -135 -688 -69 474 67 -448 -397
3495 -397 351 23 -224 -401 -143 45 -356 105 143 -149 137 472 516 355 381 1116 1225 346 584 937 980
$$ packed form
3349B78K11o67O2M98p6m14o04O96M64p72l45P28M54p90n03J014J17n57l56Q77
3369C15O2j83m94N52l0m52J03K27k9k90j79J47j32M5n0M63p21k93O01L68k86q54
3391a110O96P95n70l57N77N98m37p04N58Q48n44o57M76N76o8p28K41N74l34o62
3411b32K84N62j54m05L48R7k33J03R6N40o83M13K43q2k16O3O44l23k47J73P37
3432A728n71o74L38L84J64r11k42J180j94p70M7P50R0p37p3L39J90p88J44L68
3452G62r0l67kM41p3o29j2R9k67k05K48r3l49j1M04j24n57J87M09P0o49q5L46
3475e47N21n83m52R55O39q04m66P37M06l70m45M36M43o05n53O19N43m07n15N1
3495c97P48l28k47j77K58J88m01M61L8k92K86L35M4j61K6P35J09q79K38L53M3
$$ plain form
3516 980 424 1019 836 469 172 155 1098 586 -340 -344 258 469 -278 -851 -129 -98 -602 -324 283 -13 -646
3537 -646 -584 65 242 -160 -98 168 395 80 -247 -67 -44 245 -7 -34 -435 60 -281 -13 -672 -573 -600 -633
3559 -633 -455 -766 -334 -771 -940 -619 -266 -253 -681 -649 -416 -46 105 -457 -172 282 452 182 60 344 381
3580 381 227 -183 370 304 83 257 118 227 45 -456 -279 291 -124 -408 -771 -382 -171 77 -593 -420
3600 -420 -460 43 -245 -119 -216 -265 -201 -12 -55 -46 233 -224 -166 -294 0 -426 -482 -277 -330 -809 -743 -762 -390 -517
3624 -517 -832 -1145 -773 -642 -697 -1184 -731 -448 -572 -736 -632 -242 -242 -527 -522 -78 364 -381 -528 -51 -227 120
3646 120 -506 28 357 -350 -204 153 224 162 -146 -23 214 157 -115 40 21 171 91 165 -9 -37 164 538
3668 538 341 103 473 546 217 298 751 779 296 293 666 960 673 83 326 397 584 396 398 218 303 17 165
$$ packed form
3516I80n56N95j83l67k97j7R43n12r26mO02K11p47n73P22L1n04K78O07k96o33
3537f46O2O49J77m02O2K66K27l15l27J80K3K89k52k7m01M95l41K68o59R9k7l3
3559f33J78l11M32m37j69L21L53J3m28L2K33L70J51n62K85M54J70k70j22K84L7
3580C81j54m10N53o6k21J74j39J09j82n01J77N70m15k84l63L89K11K48o70J73
3600d20m0N03k88J26r7m9O4J89m3RK79m57N8j28K94m26n6K05n3m79O6j9L72j27
3624e17l15l13L72J31n5m87M53K83j24j64J04L90%k85NM44M42p45j47M77j76L47
3646A20o26N34L29p07J46L57P1o2l08J23K37n7k72J55j9J50q0P4j74k8K01L74
3668E38j97k38L70P3l29Q1M53K8m83lL73K94k87n90K43P1J87j88Kj80Q5k86J48
$$ plain form
3691 165 470 547 15 -150 472 267 159 -138 385 205 439 48 158 390 528 343 -8 82 466 430 216
3712 216 253 -122 255 293 56 196 295 -222 -269 38 319 231 -269 -317 -72 198 9 -173 -206 253 300 146 251
3735 251 284 367 39 -236 94 185 167 -136 -47 -17 -209 -185 75 197 265 -129 -346 -74 -22 -42 -179 -207 -218 242
3759 242 -79 -77 -94 -44 -183 -217 -233 -340 -408 -232 -393 121 0 -299 -146 -70 31 -129 -235 -11 253 83 38
3782 38 -380 202 205 5 62 490 521 -1 -18 454 537 38 -165 427 651 107 -64 26 585 305 205 50 317
3805 317 223 80 241 172 405 107 253 167 16 157 144 -190 65 86 101 -65 -336 30 54 -17 -660 -158 237
3828 237 -61 -670 -401 -83 -84 -573 -395 -217 -222 -767 -483 99 116 -601 -814 -399 -170 -692 -895 -366 -384 -374
3850 -374 -586 -379 -418 -591 -661 -254 -415 -330 -112 -301 -392 -320 -133 -221 -413 -274 -33 312 -438 -527 -216 67
$$ packed form
3691A65L05P7n32j65O22k05j08k97N23j80K34l91J10K32J38j85l51R0L84l6k14
3712B16L7l75L77L8k37J40R9n17m7L07K81q8n00m8K45K70j89j82l3M59M7j54J05
3735B51L3Q3l28k75L30R1j8l03Q9L0j92K4K60J22O8l94k17K72N2k0j37k8j1M60
3759B42l21Kj7N0j39l4j6j07o8J76j61N14j21k99J53P6J01j60j06K24K64j70m5
3782C8m18N82Lk00N7M28L1n22j7M72Q3m99k03N92K24n44j71R0N59k80j00j55K67
3805C17r4j43J61o9K33k98J46q6j51J41j3l34K55K1J5j66k71L66K4p1o43N02L95
3828B37k98o09K69L18jm89J78J78nn45K84N82J7p17k13M15K29n22k03N29j8J0
3850c74k12K07l9j73p0M07j61Q5K18j89r1P2J87q8j92J39K41L45p50q9L11K83
$$ plain form
3872 67 -151 -460 109 459 -194 -431 57 51 -107 -312 89 117 -218 -96 -170 9 -67 -225 -370 -162 -65 -257
3894 -257 -316 -29 45 -230 -178 -641 -578 -248 -3 -73 -369 -22 103 -308 -351 -196 224 28 -384 -286 120 -33
3916 -33 -468 -152 23 258 -482 -526 163 -108 -427 -124 139 -342 -453 -461 79 182 -205 -8 128 109 -57 140
3938 140 335 396 316 617 355 125 506 1096 428 249 415 755 988 146 -92 548 626 108 -100 452 491
3959 491 129 18 653 334 380 313 705 875 222 236 599 723 411 220 565 626 94 111 -45 369 292 107
3981 107 27 -136 3 93 -157 -254 -452 -223 -134 -240 -251 -368 -64 -260 -328 129 226 -177 -57 371 659 -31
4003 -31 -276 147 185 33 -216 71 61 -24 -470 -488 -115 -210 -373 -296 -43 -96 -277 -115 187 0 169 -20 66
4026 66 149 262 900 415 216 709 897 954 156 298 774 668 149 288 449 479 -140 19 551 546 -151 -270
$$ packed form
3872F7k18l09N69L50o53k37M88oj58k05M01K8l35J22p4J79p6j58j45K08R7j92
3894b57n9K87P4k75N2m63O3L30K45p0k96L47J25m11m3J55M20j96m12R8M06j53
3916c3m35L16J75K35p40m4O89k71l19L03K63m81j11qN40J03l87J97J36j9j66J97
3938A40J95O1q0L01k62k30L81N90o68j79J66L40K33q42k38O40P8n18k08N52L9
3959D91l62j11O35l19M6o7L92J70o53J4L63J24l12j91L45O1n32J7j56M14p7j85
3981A07q0j63J39R0k50r7j98K29Q9j06j1j17L04j96o8M57R7m03J20M28K88o90
4003c1k45M23L8j52k49K87j0q5m46j8L73r5j63P7K53n3j81J62L02j87J69j89Q6
4026F6Q3J13O38m85j99M93J88N7p98J42M76j06n19J39J61L0o19J59N32no97j19
$$ plain form
4048 -270 607 324 123 52 480 769 321 180 52 646 513 230 431 112 352 505 452 97 125 168 -91
4069 -91 -19 -207 156 -218 -400 -160 -34 28 -509 -399 22 48 -295 -357 -82 18 -145 -23 304 227 -28 -238
4091 -238 189 334 65 -253 367 699 -220 -354 -99 9 409 -49 76 -159 -204 5 -64 -337 -461 -107 -164
4112 -164 -165 -65 137 217 -292 -406 -293 167 -70 -331 68 207 -379 -659 -97 -25 -295 -571 -52 33 -149 -619
4134 -619 -194 236 -232 -432 -171 -342 -167 -334 -75 -215 -531 -431 -463 -463 -672 -603 -287 -409 -886 -277 -261 -767
4156 -767 -745 -475 212 -289 -708 -635 89 -161 -62 -122 355 312 -452 -218 220 93 -381 -181 303 249 -194 -141
4178 -141 87 41 -262 -105 -208 -40 -126 -237 -88 -116 17 -165 -142 301 434 564 273 486 220 618 739
4199 739 109 247 719 656 241 101 260 532 338 -3 240 428 222 -495 -349 72 -302 -647 -202 -172 -182
$$ packed form
4048b70Q77k83k01p1M28K89m48j41j28N94j33k83K01l19K40J53n3l55K8M3k59
4069i1P2j88L63l74j82K40J26O2n37J10M21K6l43o2K75J00j63J22L27p7k55k10
4091b38M27J45k69l18O20L32r19j34K55J08M00m58J25k35m5K09o9k73j24L54n7
4112a64jJ00K02Q0n09j14J13M60k37k61L99J39n86k80N62P2k70k76N19Q5j82m70
4134f19M25M30m68k00K61j71J75j67K59j40l16J00l2%k09O9L16j22m77O09J6n06
4156g67K2K70O87n01m19P3P24k50R9o0M77m3p64K34M38j27m74K00M84n4m43N3
4178a41K28m6l03J57j03J68q6j11J49k8J33j82K3M43J33J30k91K13k66L98J21
4199G39o30J38M72o3m15j40J59K72j94l41K43J88k06p17J46M21l74l45M45L0j0
$$ plain form
4220 -182 -1 -412 69 -11 153 -91 119 -58 70 76 140 -104 152 264 259 89 -57 93 -86 10 -99 -307
4242 -307 -145 -434 -540 -73 -302 -458 -181 107 -169 -293 -577 94 228 -78 -450 -354 98 313 129 236
4262 236 288 64 -186 479 585 257 256 452 349 323 -46 68 -130 -33 -9 -157 -123 37 -261 -230 -5 -155 130
4285 130 -60 -233 14 226 67 291 -10 -143 391 99 290 54 630 325 243 191 572 758 204 -320 120
4306 120 336 -42 -26 111 295 -79 -213 25 248 16 -135 34 81 107 -280 82 317 380 277 233 419 392
4328 392 567 286 267 465 409 550 179 506 420 667 98 226 354 490 160 -56 -111 53 -4 -197 -69 178
4350 178 -261 -325 -333 16 -25 -405 -73 11 308 2 -156 -188 285 -3 -259 -191 174 -56 -198 -87 -208 -169 -282
4373 -282 -90 -345 -85 -320 -626 -391 -350 -553 -321 -390 -688 -494 -196 -278 -582 -218 128 -530 -338 -337 -90 -472
$$ packed form
4220a82J81m11M81q0J64k44K10j77J28OO4k44K56J12nj70j46J50j79R6j09k08
4242c07J62k89j06M67k29j56K77K88k76j24k84O71J34l06l72R6M52K15j84J07
4262B36N2k24k50O65J06l28jJ96j03k6l69J14j98R7K4j48L4J60k98L1K25j50K85
4285A30j90j73K47K12j59K24l01j33N34k92J91k36N76l05q2n2L81J86n54n24M40
4306A20K16l78J6J37J84l74j34K38K23k32j51J69M7K6l87L62K35O3j03m4J86k7
4328C92J75k81j9J98n6J41l71L27q6K47n69J28J28J36l30k16n5J64n7j93J28K47
4350A78m39o4qL49m1l80L32Q4K97l06j58l2M73k88k56O8L65k30j42J11j21L9j13
4373b82J92k55K60k35l06K35M1k03K32o9k98J94K98q2l04L64L46o58J92JK47l82
$$ plain form
4395 -472 -339 -350 108 -298 -477 -101 -12 37 -280 -344 -24 232 -240 -401 10 -44 -226 -275 -476 -211 -125 -18
4417 -18 -48 162 -59 -9 76 -74 160 -344 -304 -395 -292 -187 -46 -199 -379 -119 -68 -300 68 76 109 82 -241 57
4441 57 64 -145 -375 174 66 -213 -45 -117 181 -37 -147 123 103 229 116 -245 -227 -16 90 -70 -217 -93
4463 -93 -69 244 -160 152 36 -58 256 -13 141 240 -17 113 361 613 61 -327 308 505 -248 122 -42
4484 -42 172 111 -141 -12 -241 -83 37 -20 -62 -170 -104 -466 84 -39 -4 -111 -125 -73 31 -94 -432 190 83
4507 83 -11 -418 -138 405 340 -383 -149 122 279 -123 -372 156 113 116 -169 -68 26 -268 -200 -286 -114 -3 -248
4530 -248 -502 202 295 72 115 -106 348 21 130 160 129 323 228 83 54 -110 439 407 192 526 412 48
4552 48 143 192 653 73 -87 118 534 382 -75 143 390 382 341 325 552 587 261 -17 833 363 76 248 677
$$ packed form
4395d72J33j1M58m06j79L76Q9M9l17o4L20K56m72j61M11n4j82m9k01K65Q6J07
4417a8l0K10k21N0Q5j50K34n04M0r1J03J05J41j53j80K60N1k32L68QL3k7l23K98
4441E7Pk09k30N49j08k79J68p2K98k18j10K70k0J26j13l61J8K11J06j60j47J24
4463i3K4L13m04L12j16r4L14k69J54R9k57J30K48K52n52l88O35J97p53L70j64
4484d2K14o1k52J29k29J58J20n7m2j08O6l62N50j23L5j07j4N2J04j25l38O22j07
4507H3r4m07K80N43o5p23K34K71J57m02k49N28m3Lk85J01R4k94O8q6J72J11k45
4530b48k54P04R3k23M3k21M54l27J09L0l1J94r5j45k9j64N49l2k15L34j14l64
4552D8R5M9M61n80j60K05M16j52m57K18K47qm1j6K27L5l26k78Q50m70k87J72M29
$$ plain form
4575 677 271 372 581 250 260 402 268 283 254 392 260 170 41 157 370 257 -185 -175 68 268 -38 40
4597 40 245 204 -114 278 255 283 -65 -351 101 474 -251 -316 112 39 95 -260 38 167 -252 3 242 100
4619 100 -65 -299 -70 -48 59 168 64 -18 -165 -45 421 -137 17 49 96 -29 17 363 -87 93 -249 84
4641 84 -17 35 -404 205 347 -9 -371 -292 161 157 -263 -411 223 151 -223 -244 332 -340 -212 52 -229 -119
4663 -119 -360 -201 -197 -35 -149 -531 -97 -206 -479 -321 -284 -597 -553 -230 -254 -456 -144 -302 -130 -104 -273 191
4685 191 85 -423 -381 -32 523 26 -559 230 74 -361 -231 96 -9 -244 -358 -81 -217 -184 -406 -107 2
4706 2 -155 91 198 323 78 311 199 46 206 451 738 315 -26 454 345 86 -113 139 192 -190 -62
4727 -62 -208 -9 -42 -275 -180 211 -136 -191 -527 -35 -186 -43 -125 29 -252 -154 -201 117 -278 53 -177 -320
$$ packed form
4575F77m06J01K09l31J0J42j34J5k9J38j32r0j29J16K13j13m42J0K43K00l06P8
4597D0K05m1l18L92k3K8l48k86M52L73p25o5M28p3N6l55K98J29m19K55K39j42
4619A00j65k34K29K2J07J09j04q2j47J20M66n58J54L2M7j25M6L46m50J80l42L33
4641H4j01N2m39O09J42l56l62P9M53mm20j48O34p2l74k1N76o72J28K64k81J10
4663a19k41J59MJ62j14l82M34j09k73J58L7l13M4L23k4k02L12j58J72K6j69M64
4685A91j06n08M2L49N55m97n85P89j56m35J30L27j05k35j14K77j36L3k22K99J09
4706Bj57K46J07J25k45K33j12j53J60K45K87m23l41M80j09k59j99K52N3l82J28
4727f2j46J99l3k33R5L91l47n5l36M92j51J43q2J54k81R8m7L18l95L31k30j43
$$ plain form
4749 -320 -76 -88 -91 -114 -82 22 128 -374 -134 -175 -259 -72 -475 -30 -97 -251 -316 -418 10 -4 -209 -304 -23 -229
4773 -229 -462 47 328 -66 -39 6 285 293 -118 -499 16 2 40 -12 122 -61 131 194 5 143 48 252 68
4796 68 -167 -156 267 423 283 105 423 506 -199 -36 299 256 -13 -125 612 240 83 222 126 487 232 52
4818 52 67 90 -11 164 257 107 205 327 123 222 192 156 87 283 118 148 -118 81 -31 322 45 -41 -25 29
4842 29 396 114 79 90 454 398 364 209 441 -180 166 537 261 76 68 200 510 391 326 -179 333 262 -103
4865 -103 215 -184 341 66 109 146 -237 -97 165 55 -240 322 60 -324 31 94 293 -45 1 380 83
4886 83 -141 -72 -30 230 209 21 -111 7 -90 -149 -466 -9 14 -286 -422 7 -54 -213 -609 35 274 -604 -568
4909 -568 -328 -50 12 -176 -218 -248 -58 19 124 -136 -94 21 159 -481 -121 -217 -276 -175 -73 68 -9 -123 -192
$$ packed form
4749c20K44j2lk3L2J04J06n02K40m1q4J87m03M45o7j54o5j02M28j4k05r5K81k06
4773b29k33N09K81l94K7M5K79Qm11l81N15j4L8n2J34j83J92O3j89J38r5K04j84
4796F8k35J1M23J56j40j78L18Q3p05J63L35m3k69j12P37l72j57J39r6L61k55j80
4818E2J5K3j01J75R3j50R8J22k04R9l0l6o9J96j65L0k66J99j12L53k77q6J6N4
4842B9L67k82l5J1L64n6l4j55K32o21L46L71k76j85qJ32L10j19o5n05N12p1l65
4865a03L18l99N25k75M3L7l83J40K62j10k95N62k62l84L55O3J99l38M6L79k97
4886H3k24O9M2K60k1j88j32J18r7n9l17M57K3l00j36M29o1j59l96O44K39q78L6
4909e68K40K78O2j88m2l0J90P7J05k60M2J15J38o40L60r6n9J01J02J41p7j14o9
$$ plain form
4932 -192 253 226 -278 -264 -112 65 -62 -19 31 66 57 -78 -59 -87 125 -60 -244 -1 33 69 93 -92 56 -21
4956 -21 27 -123 160 209 -87 -231 -35 133 243 17 -52 -153 -8 125 -86 85 172 -181 -222 -405 -43 54
4978 54 -35 -299 109 -13 -211 -169 -287 40 -376 -37 1 224 -103 -172 -309 -18 -440 9 -11 -219 -108 -219
5000 -219 -278 -165 -199 -308 73 35 -240 -43 -80 -344 -149 -6 -325 31 -165 -75 -99 -410 -195 -162 14 -152
5022 -152 -97 -261 -230 61 73 -435 70 137 -364 -377 -31 -115 -408 -368 -174 -28 -164 -15 -174 176 -67 -384
5044 -384 -25 -15 -67 -42 42 -363 -137 351 -53 -26 -42 -86 0 120 -47 188 16 189 -306 -16 99 -24 326
5067 326 62 128 100 78 -132 155 392 69 63 447 488 15 248 531 457 185 56 378 617 158 7 296
5089 296 337 292 104 194 465 239 -53 -141 366 175 -97 207 276 200 153 358 372 397 516 306 317 36 389
$$ packed form
4932a92M45k7n04J4J52J77j27M3N0L5rj35J9k8K12j85j84K43L4L6K4j85J48p7
4956b1M8j50K83M9k96j44J96J68J10k26o9j01J45J33k11J71Q7l53m1j83L62R7
4978E4q9k64M08j22j98M2j18L27m16L39L8K23l27o9j37K91m22M49k0k08J11j11
5000b19n9J13l4j09L81l8k75J97l7k64J95J43l19L56j96R0k4l11K15L3J76j66
5022a52N5j64L1K91J2n08N05O7n01j3L46q4k93M0J94J46j36J49j59L50k43l17
5044c84L59J0n2K5Q4m05K26M88m04K7j6m4Q6J20j67K35j72J73m95K90J15j23L50
5067C26k64O6k8k2k10K87K37l23oL84M1m73K33K83p4k72j29L22K39m59j51K89
5089B96M1m5j88R0K71k26k92q8N07j91k72L04O9p6m7K05J4K5J19k10J1k81L53
$$ plain form
5112 389 237 59 86 63 157 -227 192 -10 352 48 7 59 -26 -130 -261 48 241 147 -96 134 314 130
5134 130 112 188 435 506 -137 -188 35 270 4 -99 -146 13 -105 208 -133 -193 -130 -140 -50 -175 -182 -160 -244 -47
5158 -47 -321 0 74 -179 22 192 85 -157 30 218 142 -43 -129 -142 189 -299 -143 -13 343 15 -257 -174
5180 -174 17 -28 -575 178 -54 -109 -181 -265 -50 -402 58 -272 -187 -207 -26 182 -328 -82 333 285 -194 85
5202 85 155 162 -427 -46 141 152 110 -170 -12 -151 22 -387 -51 5 0 165 -243 148 -115 57 193 253 -45
5225 -45 158 157 129 247 251 47 -26 58 136 261 145 -91 -57 74 48 -102 219 284 -38 -274 59 255 -131 -279
5249 -279 185 107 -233 -338 32 -31 -207 -84 -243 183 -338 -182 -9 -111 -355 -232 -323 -385 -362 -317 -287 -314 -377
$$ packed form
5112C89j52j78K7k3R4l84M19k02L62l04m1N2q5j04j31L09J93r4k43K30J80j84
5134A30j8P6K47P1o43n1K23K35k66j03m7J59j18L13l41o0O3j0R0j25pK2q4J97
5158d7k74L21P4k53K01J70j07k42J87J88p6j85q6j3L31m88J56J30L56l28k72Q3
5180a74J91m5n47P53k32n5p2q4K15l52M60l30Q5k0J81K08n10K46M15m8m79K79
5202H5P0Pn89L81J87J1m2k80J58j39J73m09L36N6nJ65m08L91k63J72J36O0k98
5225d5K03jk8J18Mk04p3Q4P8J25j16k36L4J31k6j50L21O5l22k36L33J96l86j48
5249b79M64p8l40j05L70o3j76J23j59M26n21J56J73j02k44J23r1o2K3M5L0k7o3
$$ [...]
8191B53
##END NTUPLES=NMR FID
##END=
