##TITLE=1H_SAV-52-MeJ-f9
 CDCl3, 8 sc, 
 7.7.2020
##JCAMPDX= 6.0         $$ Bruker NMR JCAMP-DX V2.0
##DATA TYPE= NMR FID
##DATA CLASS= NTUPLES
##ORIGIN= UXNMR, Bruker Analytische Messtechnik GmbH
##OWNER= root
$$ XWIN-NMR		Version 3.5
$$ Tue Jul  7 10:00:18 2020 Russian Standard Time (UT+4h)  she@DPX200
##.OBSERVE FREQUENCY= 200.1315
##.OBSERVE NUCLEUS= ^1H
##.DELAY= (6, 6)
##.ACQUISITION MODE= SIMULTANEOUS
##.ACQUISITION SCHEME= undefined
##.AVERAGES= 8
##.DIGITISER RES= 18
##SPECTROMETER/DATA SYSTEM= spect
##.PULSE SEQUENCE= zg30
##.SOLVENT NAME= CDCl3
##.SHIFT REFERENCE= (INTERNAL, CDCl3, 0, 15.7039)
##AUDIT TRAIL= $$ (NUMBER, WHEN, WHO, WHERE, WHAT)
$$ ##TITLE= Audit trail, XWIN-NMR		Version 3.5
$$ ##JCAMPDX= 5.01
$$ ##ORIGIN= Bruker BioSpin GmbH
$$ ##OWNER= she
$$ F:/spectra/data/she/nmr/H-F/1/audita.txt
$$ ##AUDIT TRAIL=  $$ (NUMBER, WHEN, WHO, WHERE, WHAT)
(   1,<2020-07-07 09:59:04.96 +0400>,<she>,<DPX200>,
      <created by zg, POWCHK disabled, PULCHK disabled
       configuration hash MD5:
       00 E9 B6 7A A2 85 ED C7 34 08 36 98 17 FE 4E 26
       data hash MD5: 16K
       AF BB DE 9C 73 64 C4 97 F1 01 65 2E C8 AD E2 D4>)
$$ ##END=
$$ 
$$ hash MD5
$$ 06 A7 87 99 B5 C7 B7 F1 F5 27 3F 4B 02 7D 5D 84
##$RELAX= 
##$RELAX= 
##$RELAX= 
##$RELAX= 
##$RELAX= 
##$RELAX= 
$$ Bruker specific parameters
$$ --------------------------
##$DU= <F:/spectra>
##$EXPNO= 1
##$NAME= <H-F>
##$PROCNO= 1
##$TYPE= <nmr>
##$USER= <she>
##$AMP= (0..31)
100 100 100 100 100 100 100 100 100 100 100 100 100 100 100 100 100 100 
100 100 100 100 100 100 100 100 100 100 100 100 100 100 
##$AQSEQ= 0
##$AQ_mod= 1
##$AUNM= <au_zg>
##$AUTOPOS= <>
##$BF1= 200.13
##$BF2= 200.13
##$BF3= 200.13
##$BF4= 200.13
##$BF5= 200.13
##$BF6= 200.13
##$BF7= 200.13
##$BF8= 200.13
##$BYTORDA= 1
##$CFDGTYP= 0
##$CFRGTYP= 5
##$CHEMSTR= <none>
##$CNST= (0..31)
1 1 145 1 1 1 1 1 1 1 1 1 1 1 1 1 1 1 1 1 1 1 1 1 1 1 1 1 1 1 1 1 
##$CPDPRG= <>
##$CPDPRG1= <>
##$CPDPRG2= <>
##$CPDPRG3= <>
##$CPDPRG4= <mlev>
##$CPDPRG5= <mlev>
##$CPDPRG6= <mlev>
##$CPDPRG7= <mlev>
##$CPDPRG8= <mlev>
##$CPDPRGB= <>
##$CPDPRGT= <>
##$D= (0..31)
0 1.2 0 0 0 0 0 0 0 0.06 0 0.03 0 0 0 0 0.0002 0 0 0 0 0 0 0 0 0 0 0 0 
0 0 0 
##$DATE= 1594101544
##$DBL= (0..7)
120 120 120 120 120 120 120 120 
##$DBP= (0..7)
150 150 150 150 150 150 150 150 
##$DBP07= 0
##$DBPNAM0= <>
##$DBPNAM1= <>
##$DBPNAM2= <>
##$DBPNAM3= <>
##$DBPNAM4= <>
##$DBPNAM5= <>
##$DBPNAM6= <>
##$DBPNAM7= <>
##$DBPOAL= (0..7)
0.5 0.5 0.5 0.5 0.5 0.5 0.5 0.5 
##$DBPOFFS= (0..7)
0 0 0 0 0 0 0 0 
##$DE= 6
##$DECBNUC= <off>
##$DECIM= 24
##$DECNUC= <off>
##$DECSTAT= 4
##$DIGMOD= 1
##$DIGTYP= 9
##$DL= (0..7)
0 120 120 120 120 120 120 120 
##$DP= (0..7)
150 150 150 150 150 150 150 150 
##$DP07= 0
##$DPNAME0= <>
##$DPNAME1= <>
##$DPNAME2= <>
##$DPNAME3= <>
##$DPNAME4= <>
##$DPNAME5= <>
##$DPNAME6= <>
##$DPNAME7= <>
##$DPOAL= (0..7)
0.5 0.5 0.5 0.5 0.5 0.5 0.5 0.5 
##$DPOFFS= (0..7)
0 0 0 0 0 0 0 0 
##$DQDMODE= 0
##$DR= 18
##$DS= 0
##$DSLIST= <SSSSSSSSSSSSSSS>
$$ [...]
##$SUBNAM2= <"">
##$SUBNAM3= <"">
##$SUBNAM4= <"">
##$SUBNAM5= <"">
##$SUBNAM6= <"">
##$SUBNAM7= <"">
##$SUBNAM8= <"">
##$SUBNAM9= <"">
##$SW= 24.9337058887773
##$SWIBOX= (0..15)
0 0 2 0 0 0 0 0 0 0 0 0 0 0 0 0 
##$SW_h= 4990.01996007984
##$TD= 16384
##$TD0= 1
##$TE= 0
##$TE2= 300
##$TE3= 300
##$TEG= 300
##$TL= (0..7)
0 120 120 120 120 120 120 120 
##$TP= (0..7)
150 150 150 150 150 150 150 150 
##$TP07= 0
##$TPNAME0= <>
##$TPNAME1= <>
##$TPNAME2= <>
##$TPNAME3= <>
##$TPNAME4= <>
##$TPNAME5= <>
##$TPNAME6= <>
##$TPNAME7= <>
##$TPOAL= (0..7)
0.5 0.5 0.5 0.5 0.5 0.5 0.5 0.5 
##$TPOFFS= (0..7)
0 0 0 0 0 0 0 0 
##$TUNHIN= 0
##$TUNHOUT= 0
##$TUNXOUT= 0
##$USERA1= <user>
##$USERA2= <user>
##$USERA3= <user>
##$USERA4= <user>
##$USERA5= <user>
##$V9= 5
##$VALIST= <valist>
##$VCLIST= <CCCCCCCCCCCCCCC>
##$VD= 0
##$VDLIST= <DDDDDDDDDDDDDDD>
##$VPLIST= <PPPPPPPPPPPPPPP>
##$VTLIST= <TTTTTTTTTTTTTTT>
##$WBST= 1024
##$WBSW= 4
##$XGAIN= (0..3)
0 0 0 0 
##$XL= 0
##$YL= 0
##$YMAX_a= 202589
##$YMIN_a= -77114
##$ZGOPTNS= <>
##$ZL1= 120
##$ZL2= 120
##$ZL3= 120
##$ZL4= 120
##$ABSF1= 10
##$ABSF2= 0
##$ABSG= 5
##$ABSL= 3
##$ALPHA= 0
##$AQORDER= 0
##$ASSFAC= 0
##$ASSFACI= 0
##$ASSFACX= 0
##$ASSWID= 0
##$AUNMP= <proc_1d>
##$AZFE= 0.1
##$AZFW= 0.1
##$BCFW= 1
##$BC_mod= 2
##$BYTORDP= 1
##$COROFFS= 0
##$CY= 11.3945322036743
##$DATMOD= 1
##$DC= 2
##$DFILT= <>
##$DTYPP= 0
##$F1P= 16.9975609425685
##$F2P= -3.02152046262296
##$FCOR= 0.5
##$FTSIZE= 0
##$FT_mod= 4
##$GAMMA= 1
##$GB= 0.15
##$INTBC= 1
##$INTSCL= 1
##$ISEN= 128
##$LB= 0.24
##$LEV0= 0
##$LPBIN= 0
##$MAXI= 10000
##$MC2= 0
##$MEAN= 0
##$ME_mod= 0
##$MI= 1.114404
##$NCOEF= 0
##$NC_proc= 0
##$NLEV= 6
##$NOISF1= 3.799351
##$NOISF2= 2.8
##$NSP= 1
##$NTH_PI= 0
##$NZP= 0
##$OFFSET= 15.70392
##$PC= 1
##$PHC0= -9791.439
##$PHC1= 18.40087
##$PH_mod= 1
##$PKNL= yes
##$PPARMOD= 0
##$PSCAL= 0
##$PSIGN= 0
##$REVERSE= no
##$SF= 200.130013532006
##$SI= 16384
##$SIGF1= 3
##$SIGF2= 2
##$SINO= 400
##$SIOLD= 16384
##$SREGLST= <1H.CDCl3>
##$SSB= 0
##$STSI= 0
##$STSR= 0
##$SW_p= 3612.71676300578
##$SYMM= 0
##$S_DEV= 0
##$TDeff= 0
##$TDoff= 0
##$TI= <>
##$TILT= no
##$TM1= 0
##$TM2= 0
##$TOPLEV= 0
##$USERP1= <user>
##$USERP2= <user>
##$USERP3= <user>
##$USERP4= <user>
##$USERP5= <user>
##$WDW= 1
##$XDIM= 8192
##$YMAX_p= 0
##$YMIN_p= 0
$$ End of Bruker specific parameters
$$ ---------------------------------
##NTUPLES= NMR FID
##VAR_NAME=  TIME,          FID/REAL,        FID/IMAG
##SYMBOL=    X,             R,               I
##VAR_TYPE=  INDEPENDENT,   DEPENDENT,       DEPENDENT
##VAR_FORM=  AFFN,          ASDF,            ASDF
##VAR_DIM=   8192,          8192,            8192
##UNITS=     SECONDS,       ARBITRARY UNITS, ARBITRARY UNITS
##FACTOR=    0.0002004,     1,               1
##FIRST=     0,             0,               0
##LAST=      1.6414764,     0,               0
##MIN=       0,             -77114,          0
##MAX=       1.6414764,     202589,          0
$$ Real data points
##PAGE= N=1
##DATA TABLE= (X++(R..R)), XYDATA
0 0 0 0 0 0 0 0 0 0 -6 8 -8 8 -8 14 -16 16 -24 24 -32 34 -41 48 -56 65 -76 87 -98 113 -128 145 -163 184
32 184 -206 231 -257 288 -320 357 -396 438 -485 537 -595 659 -731 809 -897 1001 -1115 1249
50 1249 -1408 1595 -1823 2107 -2472 2962 -3661 4739 -6638 10980 -45135 59497 123535 -39867
64 -39867 -77114 28485 71530 -35008 -62113 35745 89812 19669 -7665 52933 71140 -7163
76 -7163 -38406 24841 69854 30620 -2688 11221 12074 -25576 -33167 4507 30042 18830 7728
89 7728 4544 -7162 -14581 1250 15106 10247 14082 36365 35120 9494 12622 43878 37651 2294
103 2294 14795 66379 52539 -26482 -43801 28754 64615 11572 -22702 16110 28798 -34541
115 -34541 -68457 -14376 27078 -15380 -51759 -10553 26389 -13181 -60864 -38751 1977 -2933
127 -2933 -14853 5084 9736 -28110 -44367 -3394 28843 7491 -12385 12735 30607 -2142
139 -2142 -35264 -19923 10948 11461 54 7394 17739 9057 -6465 -14068 -16141 -11755 5932 18396
153 18396 4900 -13986 -7616 9868 6350 -5323 3419 18700 9993 -8025 -2326 16369 14736
166 14736 1146 8418 29308 29925 11910 5946 14150 15423 8992 12434 23014 19987 5156 2555
180 2555 14534 19898 9859 1604 3362 2871 -7926 -15633 -8716 2307 371 -6927 -3787 4960
194 4960 -1049 -22149 -29515 -12239 5636 3365 -5816 -2469 6679 2928 -6027 -4578 3730 5764
208 5764 4211 6789 5489 -3820 -7388 2461 8416 343 -3513 7422 10626 -8910 -25541 -14516
222 -14516 2952 -1327 -10947 -3694 9622 5724 -6440 -5674 674 -2145 -2747 7741 14467 8300
236 8300 7332 18296 21158 8971 6954 20883 21999 2898 -2144 18233 26688 7673 -3951 11815
250 11815 22391 6177 -7519 2049 10218 -446 -8024 2058 6359 -3038 -4542 7527 8605
263 8605 -3074 -1140 11527 4419 -16051 -11224 14876 16355 -6159 -7088 16787 19015 -7957 -17909
277 -17909 378 6840 -10440 -13616 4496 8522 -9012 -13214 -900 -2595 -17646 -13199 4421
290 4421 -2632 -24003 -17136 8436 5159 -21513 -19418 10479 14152 -13775 -21231 1060 8523 -11271
304 -11271 -18205 2027 13548 544 -6912 1394 3905 -5333 -7487 -665 -2204 -7872 -704 9709
318 9709 3248 -6518 -638 7710 -2238 -12971 -3343 8763 520 -10740 -805 11216 3761 -7120
332 -7120 1085 8390 -2756 -10281 4052 12780 -4611 -15370 5181 19929 1660 -14526 3898
345 3898 20914 1325 -21512 -4688 20205 6805 -18406 -6470 21713 15432 -10498 -9122 11106
358 11106 7286 -12966 -9961 11412 12338 -6470 -7476 10083 12779 -2588 -7932 2039 4538 -3561
372 -3561 -2532 6622 5987 -3300 -3903 6941 9925 2318 -3493 -1299 1692 2067 1593 -129 -1803 2091
388 2091 8837 6776 -2219 -2652 6029 4704 -8399 -10791 4436 12322 323 -8969 359 9384 1105
403 1105 -9399 -3486 3618 -4359 -11201 -703 9871 867 -11893 -5183 7526 2955 -9261 -7038
417 -7038 1935 -2298 -9824 -1944 9600 2704 -11878 -6484 10137 8109 -8821 -12218 741 5860
431 5860 -3142 -6294 1155 4619 -244 -1794 657 -2182 -5847 -948 2038 -4822 -9742 1160 12170
446 12170 3496 -10165 -4537 7228 3512 -7852 -4055 6341 2978 -6456 195 12572 7588 -6029
460 -6029 -3886 8059 7232 -2065 -1661 4295 804 -2619 5668 12292 843 -9333 1013 12363
474 12363 1151 -13481 -4425 11343 4184 -10594 -4561 11124 7549 -7440 -7031 3839 3965 -2339
488 -2339 151 5084 314 -2545 7695 13194 2185 -6642 3185 11459 1514 -6964 3360 11860
502 11860 986 -8179 3664 14313 2373 -12063 -5723 7423 3365 -7275 -5223 3063 1264
515 1264 -2462 1977 3502 -2849 -3596 4990 4637 -5927 -5727 9181 12702 -3196 -8861 6234 14714
530 14714 1415 -10798 -3273 6341 505 -6330 -1803 1622 -4879 -6808 -296 1184 -8431 -11483
544 -11483 -3976 -1549 -8213 -8740 -287 1067 -7819 -7679 2729 4047 -6966 -11372 -1778 4842 -1761
559 -1761 -7984 -3714 1882 -26 -4547 -5593 -4979 -4572 -3242 -3856 -8563 -10045 -4020 1211 -3334 -10272
575 -10272 -7654 363 508 -6567 -7906 -2602 660 -1756 -1593 2352 3575 417 -1310 1464 3452
590 3452 1688 -1577 -1511 1481 3238 2711 981 -699 -1185 179 1200 395 -2642 -3432 -429 3387 2183
607 2183 -2217 -2171 4918 6224 -780 -4856 1490 7414 2518 -4701 -1396 6383 5622 -675 -1817 1516
623 1516 1332 -1484 -1780 -1126 -2911 -2300 1433 316 -3915 -3049 2504 757 -8212 -7399 3229 4614
639 4614 -6713 -10242 2150 7476 -2868 -9142 -1494 3679 -3085 -6168 -164 1324 -6143 -5830 4136
654 4136 4037 -7392 -7342 5547 6464 -7628 -9070 5999 9306 -5603 -9416 5920 12502 -1710 -9522
669 -9522 2232 8476 -1137 -6964 359 4537 -2083 -3778 2869 1714 -5556 -3235 5660 986 -8953
684 -8953 -2945 9568 4779 -9208 -3996 11805 8434 -7176 -5039 9490 7855 -5514 -3773 7449
698 7449 4127 -7429 -3269 7349 969 -11572 -5902 5055 -2823 -15580 -7255 5745 -3419 -16975
712 -16975 -6394 9952 547 -16294 -8229 10297 6124 -9589 -5216 9972 8039 -3059 422
725 422 9621 4435 -3468 3390 9970 180 -7648 3249 10870 -2899 -12434 10 10949 -2386
739 -2386 -14478 -2612 10048 -100 -11930 -1082 11838 4041 -5727 3054 13511 7050 -60
752 -60 7851 14326 6363 2478 13237 16774 3827 -1150 12324 16980 1837 -7193 4831 12921
766 12921 1501 -7899 390 6974 -885 -6798 8 3772 -3201 -4473 3345 4828 -3069 -2437 7676
781 7676 7467 -2196 -1483 10121 9294 -2543 -2630 9336 9477 -3445 -5911 5861 8427 -4103 -9519
796 -9519 -988 3403 -4245 -8922 -5006 -2455 -6244 -5656 -1270 -3945 -9256 -5912 2317 663 -6942
811 -6942 -5692 3012 4093 -2540 -3237 2927 3868 -873 -886 3357 3072 -751 -766 1658 1390 -627 -46
828 -46 610 -1723 -2224 1033 2042 -2786 -5092 386 4622 70 -5716 -2179 5015 4262 -2354 -3895
844 -3895 2393 6395 3443 -1101 -846 3145 5415 3200 -60 292 3678 4783 2714 623 1468 3120
860 3120 3117 2121 1216 1021 1477 2060 1867 322 642 1814 951 -1228 -997 2159 1910 -2586 -3680 995
878 995 4117 -376 -4233 -1845 2823 2823 -595 -1622 -911 804 2798 3233 -157 -2868 909 6528 3563
895 3563 -4035 -3527 4578 5873 -2567 -4996 1795 4737 -1204 -4586 204 2593 -2071 -4292 165
910 165 1808 -2563 -3674 660 2009 -1732 -1729 1677 1158 -2554 -424 5071 1627 -4642 -1561 6496
926 6496 4880 -4248 -4405 3767 4852 -2586 -4677 321 1232 -2521 -1850 826 -1736 -5108 -1321 3641
942 3641 -1980 -8894 -3213 5070 488 -8221 -4787 4534 2267 -6840 -5021 3749 2692 -5641 -5637 2346
958 2346 2957 -3817 -4496 479 1525 -2544 -2304 183 -2068 -4003 -342 2338 -2496 -6272 62 4841
974 4841 -408 -6547 -2210 4379 1225 -5244 -2880 2992 2203 -2294 -915 2268 457 -819 1805
989 1805 2614 -2053 -3079 3367 5936 -1339 -4635 2427 7876 761 -5465 398 7068 2576 -4145
1004 -4145 -315 6397 3980 -1895 -504 4162 3833 160 -30 2129 1226 178 2595 2369 -1034 -1041 3710
1021 3710 4023 -1982 -4331 1789 5339 -582 -4906 50 5508 1905 -3337 -836 3633 2207 -1916
1036 -1916 -1120 2030 1616 -598 890 2146 115 -902 2024 2456 -2033 -3540 1163 3124 -1679 -4951
1052 -4951 -523 4252 98 -5306 -3089 2402 1236 -4769 -5068 -142 1579 -1573 -3030 -1309 -321
1067 -321 -244 502 -335 -2915 -2210 1759 2088 -1813 -3001 1945 4062 -1479 -5136 363 4636 -998 -6844
1084 -6844 -3256 3475 1511 -4922 -4542 388 322 -3064 -2924 -1375 -2620 -4012 -533 755 -2865 -4691
1100 -4691 385 3947 -805 -5293 -519 5169 1096 -4983 -1512 5160 3703 -1803 -993 3472 2615
1115 2615 -1511 -602 1731 539 -1600 -63 1879 -510 -1270 1745 1334 -3067 -3268 2542 3907 -2884
1131 -2884 -5608 1618 6961 1331 -3785 726 5317 2080 -1440 2027 4710 1248 -656 3775 5795
1146 5795 1521 -58 3699 5020 -851 -2479 3413 4585 -2120 -4273 1703 5133 -1077 -5257 -264
1161 -264 2270 -2307 -5345 -943 1812 -1671 -3708 -485 1287 -918 -859 1424 -410 -3387 -407 4572
1177 4572 2361 -4218 -2962 4228 4922 -1774 -3927 1059 2243 -3093 -3882 -419 -145 -4033 -4662 -999
1193 -999 -899 -3550 -4254 -2281 -3804 -5488 -3167 389 -1877 -5286 -2144 2760 1679 -3678 -2410 2708
1209 2708 2659 -1797 -1893 2223 3634 817 -370 724 494 982 1737 -7 -3490 -4095 518 1829 -2660
1226 -2660 -5696 -2427 1690 -134 -4294 -3016 -258 -905 -2757 -1638 1783 1771 -341 -273 1724 2994
1242 2994 2656 1073 276 1247 3518 3435 927 -501 1936 4096 1480 -2206 -1381 1334 1247 -1509 -2965
1259 -2965 -1910 -157 770 -66 -1673 -2782 -742 2057 753 -1923 -1861 1320 3040 1270 957 2325
1275 2325 3277 1179 605 2114 3058 2228 776 670 2091 3169 3162 804 -1500 514 3189 1461 -3096
1292 -3096 -2770 2423 3033 -1975 -3726 1312 3738 -442 -3833 -949 2065 322 -1800 -319 933
1307 933 -549 -50 2671 2106 -1654 -1776 2419 2134 -1829 -1547 2647 2620 -2196 -2103 2748 2507 -2798 -3990
1325 -3990 230 1267 -2332 -2722 -91 -1099 -3537 -1332 1256 -2076 -6067 -2628 1928 -1090 -5247
1340 -5247 -1925 4012 765 -5175 -1367 5308 2471 -4471 -2654 4142 3779 -1945 -1490 3618 2628 -1561
1356 -1561 644 3395 -597 -4343 -481 3588 -1088 -5702 -1131 4150 85 -5333 -1931 3416 265
1371 265 -4140 -1356 3333 300 -2355 2317 5418 1448 -1999 2599 6198 1733 -1811 2503 5223
1386 5223 1047 -1226 3695 5099 -920 -3714 2053 5176 -1654 -5813 -986 3631 43 -3141 -398
1401 -398 1899 -632 -846 1945 1047 -2714 -765 4622 3437 -2128 -800 5943 5281 -1530 -1484 4968
1417 4968 4382 -2407 -2430 3965 4163 -2211 -3092 2856 3253 -2178 -3485 625 721 -3134 -2122 2360 460
1434 460 -4581 -1177 5181 2471 -4770 -3552 4114 4324 -2462 -4195 1617 4395 -20 -2587 327
1449 327 1879 -153 -1354 -259 -914 -1879 -594 17 -1760 -2016 88 1086 -2381 -3932 -167 1896
1465 1896 -2374 -5423 -1673 3181 756 -3642 -2585 706 493 -1684 -1358 -738 -1446 -1375 1047 1218 -2075
1482 -2075 -2278 947 1533 -1678 -2985 147 1958 -1421 -3305 247 3198 617 -2598 -952 2361
1497 2361 2093 -1012 -1732 8 1481 911 -155 -361 1129 2560 1581 -1058 -1542 1261 3006 462
1513 462 -1788 71 3129 3557 1277 -536 454 1777 2399 1207 122 723 1955 2123 1065 613 1470
1530 1470 2668 410 -1428 477 2603 1340 -1920 -2014 1589 2496 508 -1302 -276 991 510 -167
1546 -167 -940 -1208 642 1693 720 -1278 -287 1904 2161 -1154 -2333 -258 2167 623 -1580 -1318 670
1563 670 705 -36 -359 -1624 -1453 -445 44 -1033 -1348 157 536 -1533 -2941 -347 2366 -188 -4036
1580 -4036 -2307 2073 1487 -2347 -2239 776 1338 -1042 -1150 528 148 -1376 -1227 406 -147 -1320 127
1597 127 1721 -844 -3000 -352 2201 142 -3632 -2722 1408 1507 -1485 -1778 -190 112 -1660 -1227 443
1614 443 -179 -1493 -1049 124 -562 191 1166 120 -2200 -1726 2820 2744 -2342 -4104 402 3462 244
1631 244 -2995 -61 3184 944 -2280 -930 1471 599 -1656 -905 1206 519 -49 1381 1321 -1503 -1304
1648 -1304 1580 2830 -540 -2206 726 3249 1053 -1324 927 2886 1561 -1062 -223 2704 2244
1663 2244 -251 -1235 500 2147 2339 1267 -1015 -804 1352 2632 161 -2557 -655 2813 2193 -1046
1679 -1046 -1281 1616 2522 -575 -2767 -108 1884 970 -905 -791 672 1035 711 -30 -763 -1097 -228
1696 -228 1105 -17 -1204 -838 552 -356 -2135 -921 1401 330 -2844 -3227 364 2034 -1396 -3485
1712 -3485 -1339 1383 628 -1331 -1809 -896 -392 -601 -730 -808 -1450 -280 1156 -314 -2351 -1642 879
1729 879 1230 -2222 -3222 93 2244 -375 -3277 -1024 1266 44 -2179 -1437 861 416 -1877 -2017
1745 -2017 462 1238 -421 -1599 -747 866 1262 784 -948 -1891 -112 2143 1416 -1379 -1467 1633 3304
1762 3304 256 -2081 -595 1449 730 -254 264 1094 422 473 1284 719 -1073 -228 2037 1831 -496 -304
1780 -304 2488 2401 -707 -1108 2726 3053 -692 -1597 2044 3392 725 -1876 101 2816 1706 61
1796 61 444 1338 819 474 707 498 -725 731 2461 1171 -813 -38 1980 1581 -1367 -1134 1246 1546
1814 1546 -315 -944 1447 734 -867 -264 935 610 -1125 -360 678 -157 -1412 -330 1263 -861
1830 -861 -2167 -88 2558 543 -3186 -2195 1483 869 -2006 -1824 -111 150 -824 -642 -461 -1117 -1663
1847 -1663 -503 117 -769 -1117 99 458 -1476 -1606 431 927 -1630 -2771 342 1936 -389 -2536
1863 -2536 -692 1411 427 -1418 -956 418 255 -476 -222 -331 -1129 93 1675 410 -1751 -668 1678
1880 1678 1676 -889 -1805 555 1585 538 -348 77 765 430 -88 134 201 257 404 443 -219 342 1513 1075
1900 1075 -1151 -1239 1381 2396 245 -1911 -155 2160 1209 -1307 -1070 1295 1415 -167 -586 266 771
1917 771 747 207 -559 -643 417 1470 920 -982 -619 1057 928 -1275 -752 726 868 -305 -361 382 475
1936 475 127 -219 131 -246 -64 650 665 -929 -801 935 1421 -951 -2134 828 2117 -149 -2271 -626
1954 -626 1557 212 -1436 -738 449 316 -414 -694 -907 -828 -249 142 -562 -1948 -342 1134 -155 -2330
1972 -2330 -1753 1111 551 -2117 -2082 1006 1021 -1647 -1893 -116 -148 -1524 -890 -397 -611 -1795 -1158 559
1990 559 -1228 -2330 -822 1301 -643 -3144 -887 1733 -499 -3157 -1534 1613 608 -2063 -1714
2005 -1714 511 357 -726 -662 -103 -811 -1028 704 993 -1147 -1254 1265 1730 -1742 -2326 1377 2853
2022 2853 -739 -2851 688 2893 403 -1814 92 2002 194 -551 860 1718 -194 -724 1446 1826
2038 1826 -64 -546 1845 2341 -563 -852 2581 2621 -1090 -1678 1903 2834 305 -892 632 1403 259
2055 259 -156 860 550 -619 290 1603 391 -1255 482 2234 239 -2101 -282 2834 1157 -2709
2071 -2709 -1320 1999 1682 -1683 -1532 1435 1094 -1122 -1138 853 718 -1242 -674 722 -4 -895 321
2088 321 599 -1282 -2174 634 1908 -456 -2910 -1067 1994 182 -2274 -1232 647 422 -1272 -552
2104 -552 391 -3 -550 577 587 -894 -580 1215 1013 -1650 -1552 971 1575 -1282 -2604 240 1678 -861
2122 -861 -2416 -411 1386 -523 -2241 -1105 586 325 -470 -1092 -718 240 883 1054 -664 -1377 85
2139 85 2160 990 -1194 -788 1630 1766 -307 -700 1082 1544 -210 -105 559 531 -237 216 434 -332
2157 -332 -28 657 864 -120 -320 883 1773 263 -488 1082 2347 1062 -66 238 2027 2205 421
2174 421 -189 876 2306 1598 537 -359 138 1874 1518 30 -1033 416 1621 921 -844 -250 1062
2191 1062 953 -133 -423 785 1007 140 165 684 1079 589 651 316 -105 738 975 547 -690 -172 815
2210 815 675 -638 -1269 -198 742 -13 -1867 -1286 -219 49 -629 -1206 -1099 -592 307 -232 -1099 -1376 -81
2229 -81 851 -739 -1950 -733 1194 432 -1584 -1542 419 569 -792 -1321 -6 550 -353 -943 -1013 -96
2247 -96 -142 -259 -613 -1031 -390 478 348 -1141 -1494 305 1028 -484 -1413 -281 1069 477 -431 -504 607
2266 607 521 150 533 368 184 535 936 742 -240 -26 1228 1253 -548 -838 993 1435 -707 -1157 645
2285 645 1750 355 -1084 -222 1019 1222 -325 -963 -37 746 548 552 -189 324 860 1237 218 -743 325
2304 325 1429 1023 -503 -65 1161 1202 -341 -688 757 1083 -88 -564 349 778 115 -256 -450 29
2322 29 274 418 327 -153 -556 390 1152 125 -936 -353 1430 1583 -727 -1015 504 1863 415 -898
2340 -898 -390 690 1105 140 -918 -602 158 401 -186 -585 -350 115 320 -604 -1230 -304 585 -707 -1594
2359 -1594 -630 748 113 -1203 -1405 133 565 -265 -1307 -431 232 287 -526 -863 -155 -282 82 -220 -705
2378 -705 -1171 -299 269 -498 -1766 -1286 226 622 -892 -1608 -522 215 -311 -1406 -890 -171 260 -530
2396 -530 -341 -66 232 352 -150 -246 469 586 801 274 -313 431 1357 745 -566 189 1407 1277 -473
2415 -473 -558 1073 1503 98 -820 96 1073 765 -69 -210 46 534 720 652 239 -165 936 1462 674 -333
2435 -333 456 1159 1091 -200 -277 1001 1146 166 -493 379 1117 476 -250 -249 246 437 271 5 -729 -436 889
2456 889 964 -681 -1436 398 1604 -226 -1712 -444 1588 1052 -955 -1066 966 1097 57 -979 -172
2473 -172 609 -108 -93 -148 -182 -245 210 280 -528 -958 -106 651 -445 -971 -69 598 -535 -1510 -572 380 208
2494 208 -932 -513 -69 -171 -509 -253 -684 -1123 -244 527 -325 -1624 -846 740 477 -1290 -1846 269
2512 269 715 -1388 -1808 -484 191 -690 -1542 -692 -267 -201 -1162 -948 -720 -734 -184 -428 -900 -774 61 539
2532 539 -687 -1359 87 1080 67 -997 -86 1021 778 -481 -538 631 359 120 54 501 187 440
2550 440 1257 491 -512 -289 1452 1385 -3 -557 738 1966 785 -376 429 1665 1453 421 435 1170
2568 1170 1125 465 692 275 432 1122 1022 -77 -533 705 1358 254 -1631 -480 1235 199 -1516
2585 -1516 -1203 500 783 -856 -1177 -143 167 -226 -5 -729 -987 -700 389 99 -848 -1700 -273 317
2603 317 -1097 -1816 -759 144 -707 -1894 -1430 -662 -685 -1507 -1181 -1183 -1176 -851 -753 -741 -1322 -606 -48 -501 -1390
2624 -1390 -719 1282 191 -1427 -1154 1054 1701 -896 -994 212 1183 65 -501 -63 405 145 -101 27
2642 27 -389 -541 154 557 -323 -459 664 925 115 -500 451 1719 620 -583 -82 1536 1344 -459
2660 -459 -36 714 559 481 166 -81 -389 -262 657 288 -1378 -1340 648 696 -1299 -1604 252 750 -336
2679 -336 -1427 -183 951 259 -1108 -116 939 505 -229 -103 345 -34 368 693 -304 -890 497 1653
2697 1653 395 -1492 -407 1470 1030 -642 -1098 835 1366 -351 -465 502 654 363 243 665 418
2714 418 -154 720 1188 472 -626 602 1480 574 -750 646 1700 789 -578 -15 1721 985 -543
2731 -543 -137 1224 1133 325 -283 473 564 481 837 213 -896 59 1334 724 -1012 -1380 388 995 -646
2750 -646 -1375 -247 507 -645 -1566 -562 596 38 -635 -797 -249 -222 84 169 91 -856 -330 761 -254
2769 -254 -924 -802 363 120 -1498 -1060 149 521 -977 -1434 -249 -135 -446 -1143 -390 -538 -577 -18 123
2788 123 -250 -454 497 1111 -83 -698 489 1871 499 -681 328 1884 1257 -132 -396 562 1206
2805 1206 250 -80 60 -122 340 512 315 -413 -60 719 565 -11 545 1130 1285 258 584 1372 1900
2824 1900 892 353 840 1375 1423 687 731 313 646 870 1118 21 -371 554 766 -132 -840 -120 789 303
2844 303 -957 -761 682 1237 -341 -697 178 521 494 -40 287 146 468 798 338 -214 -98 194 92
2863 92 -919 -741 124 -180 -1094 -1795 -726 -389 -417 -1607 -1395 -531 -597 -650 -1174 -996 -725 -447 -339 -715
2883 -715 -706 197 884 -71 -912 -607 508 331 -716 -1278 -259 552 -14 -907 -342 -580 -171 -836 -779 -707
2903 -707 -476 41 -707 -943 -532 562 274 -557 -520 662 1264 88 -534 411 1425 961 102 66 684
2922 684 1083 558 12 127 259 455 580 326 -219 284 1026 170 -290 -540 446 858 168 -291 218 421
2942 421 247 -273 196 452 696 268 431 309 711 801 10 -231 -310 612 711 -92 -853 -236 516 135 -902
2963 -902 -993 -139 185 -426 -1150 -780 -50 -350 -675 -850 -278 -169 -74 -167 -216 94 118 -28 -156 -13 292 603
2985 603 191 223 -101 465 244 -202 -376 -101 333 -389 -555 -459 75 299 -151 -452 -630 -40 409 -269 -596
3006 -596 -464 385 678 -111 -615 158 577 514 -432 -462 597 1103 352 -417 39 440 773 -186 -508 -146
3026 -146 530 -219 -717 -814 -430 -312 -407 -787 -938 -202 -149 -591 -1010 -1022 -77 109 -453 -513 -320 111 182 -228
3048 -228 -38 396 257 -237 -139 -15 263 205 -5 -566 113 541 534 -189 -593 -200 752 611 -638 -684 272
3069 272 793 -172 -678 -304 467 645 -71 -17 323 931 646 407 105 604 1243 1299 469 533 956 1043 751
3090 751 168 755 1094 638 4 249 602 1023 13 -498 45 622 582 -26 -293 -100 10 218 313 -508
3110 -508 -60 306 813 -147 -491 183 816 425 -638 -432 896 553 -66 -817 -120 334 -207 -419 -1105
3129 -1105 -514 -49 -165 -1253 -1324 -788 -120 -659 -1368 -1290 11 -322 -1131 -1144 -530 227 -218 -764 -654 20
3149 20 -62 -668 -224 -184 -397 -81 -87 -180 -8 119 296 -318 -787 -263 728 510 -859 -1205 182 542 -218
3170 -218 -1008 -668 231 10 -96 -590 -419 342 546 280 -433 -64 836 779 -130 -119 560 1174 462 -304 780
3191 780 888 637 -225 438 788 224 -209 -60 552 63 310 17 -214 -170 100 361 -104 -994 -370 683
3211 683 686 -767 -1012 -42 749 197 -482 30 166 401 217 110 115 306 447 430 9 -541 161 490 -377
3232 -377 -743 37 460 -244 -1269 -569 222 -98 -1334 -1200 39 439 -482 -647 -527 159 658 -3 0 -391
3252 -391 97 958 696 -428 105 682 1221 309 -280 89 570 -205 -587 -358 484 -469 -775 -443 -608 -532
3272 -532 -350 -109 -562 -734 -410 378 71 -1188 -198 752 655 -625 -508 560 788 -306 -502 -110 429
3291 429 132 -488 -700 -594 -4 184 -328 -752 -723 -190 83 -540 -537 -41 300 -334 -682 -33 793 138 -377
3312 -377 -39 639 393 79 318 516 63 622 403 45 -407 6 693 310 -94 104 625 567 -259 -164 780
3333 780 1339 613 -250 529 1212 1020 656 535 770 759 1250 1134 583 392 709 984 122 -94 837 1266
3353 1266 578 -506 -15 776 695 -482 -389 528 743 226 -72 455 422 328 -159 176 45 160 597 158
3373 158 -191 -678 164 625 -368 -1232 -261 436 -451 -1267 -1022 -361 -312 -862 -790 -418 -474 -598 -50 -435 -561
3394 -561 -95 111 -85 -793 -222 485 371 -877 -1044 432 818 -82 -659 26 244 -119 -339 -144 -31
3413 -31 1 -112 268 110 161 529 645 -44 -1 617 973 313 -182 140 1017 410 -17 -127 521 965 330
3434 330 70 385 414 467 449 -50 -96 -60 371 440 -1 -198 357 954 44 -543 187 335 237 -311 -683 302
3456 302 186 -692 -487 -295 137 -151 -594 -600 -682 -254 -28 -476 -850 -86 989 48 -615 -208 647 554 -151
3477 -151 -337 47 1125 321 -58 231 379 416 149 -37 -30 -55 514 22 -11 -369 259 291 128 -490 -511 461
3499 461 269 -99 -59 423 752 265 36 489 687 846 638 470 372 526 766 314 57 -189 338 177 -656
3520 -656 -669 433 487 -624 -1169 -947 120 -609 -976 -1213 -446 -839 -560 -526 -532 -461 -187 -384 -547 -745 -548
3541 -548 72 -371 -817 -405 51 8 -298 -735 -638 -147 -281 -890 -988 -1055 -428 -862 -620 -731 -454 -91 -288
3562 -288 -835 -714 62 420 -316 -406 260 918 291 -96 70 1001 990 583 137 186 1034 781 325 2 376
3583 376 584 805 421 -81 670 949 532 -74 77 271 670 -88 -79 315 290 775 114 101 686 245 325 255
3605 255 161 643 518 529 -76 -100 142 328 206 -434 -47 583 -119 -455 -831 -12 443 -50 -512 -363 -304
3626 -304 -213 -432 -809 -595 40 107 -324 -675 -275 435 284 -106 -384 -358 346 50 -290 -74 72 62 -214
3647 -214 -74 93 341 -315 -508 -361 131 -20 -380 -466 -127 -244 -92 109 -475 -301 10 -62 56 -421 -63
3668 -63 656 426 -276 -400 -102 595 -52 -557 -39 69 433 84 -281 -252 93 109 -183 -356 -113 236 184
3689 184 -195 -430 179 19 -132 -558 -231 466 305 -99 -711 43 306 79 -234 -79 542 401 242 -115
3709 -115 156 217 367 113 -197 -157 272 367 51 -127 -117 408 380 121 -267 44 559 302 125 -22 104 599
3731 599 -67 -68 135 477 664 7 -183 74 417 437 165 -169 185 495 15 -260 112 538 206 -344 -340 -134
3753 -134 448 50 -656 -160 301 324 -94 -196 -108 -323 303 96 -373 -511 250 159 -197 -288 -315 396 72 -257
3775 -257 -35 -19 -60 -583 -176 -63 -61 -5 35 61 -162 222 84 -39 -669 43 134 -30 -600 -279 95 292 -154
3798 -154 -276 -186 538 49 -521 7 -94 72 -143 -228 -464 -118 170 -62 -419 -243 101 -72 -338 -654 -121
3819 -121 407 -294 -193 -394 45 293 -295 -434 -67 300 101 -167 -46 -154 -76 230 70 -244 -517 138
3839 138 626 -243 -616 -93 550 78 14 218 388 256 -262 -170 298 633 207 -122 146 291 468 388 -15
3860 -15 -100 204 788 586 54 411 985 491 -1 110 507 547 -87 122 282 498 275 51 320 211 202 31
3882 31 243 -179 -244 86 255 40 -557 -199 481 -56 -328 -176 393 27 -318 -170 -171 -139 -360 -564 -232 -179
3904 -179 340 299 -249 -504 -112 -94 -157 -402 -349 -57 -144 -431 -718 -360 -19 -249 -633 -424 -273 -154 -90 -305
3926 -305 -278 -140 265 81 -175 9 266 820 -101 -129 -43 553 258 -262 19 661 558 253 -233 15 335
3947 335 160 259 -341 -205 190 446 335 -408 -299 287 319 -227 -210 321 771 357 -104 -56 628 443 343
3968 343 189 459 611 225 225 268 -76 34 46 -215 -368 86 -69 -274 -256 -438 211 132 -342 -619 97 211
3990 211 89 -30 3 189 144 335 187 -145 214 527 602 73 -152 136 489 669 -896 -137 314 29 -428
4011 -428 -194 422 161 -116 -30 165 168 218 77 136 119 144 425 -88 133 386 793 612 -237 -260 503 668 -67
4034 -67 -582 -115 510 15 -584 -479 112 -165 -398 -256 -470 -254 -403 -127 -201 -360 -314 -162 34 -306 -607
4055 -607 232 238 -511 -437 95 330 -298 -343 -482 65 -230 -465 -249 -417 -375 -201 -567 -568 -332 199 368 -482
4077 -482 -841 -336 374 -59 -376 -287 195 587 -91 -27 433 103 -120 381 84 556 284 348 270 200 -195 491
4099 491 286 -209 -226 509 357 44 -159 336 463 183 136 -3 259 402 75 22 99 -199 268 352 -106 93
4121 93 480 365 -17 -294 38 309 366 -432 -175 261 341 -39 -260 -46 205 470 -137 -200 165 -11 303
4142 303 -219 -297 -136 -284 -56 -632 -467 5 -54 -152 -194 -199 74 230 -377 -283 195 202 136 10 -19 13 46 200
4166 200 120 0 163 -20 122 -284 -293 326 42 -213 -765 -301 267 -38 -507 -443 223 -239 -257 -276 -402 334
4188 334 122 200 -33 304 351 580 -46 104 196 308 243 67 203 136 344 43 -98 -358 53 -125 -634 -458
4210 -458 -373 -109 -117 -475 -508 -482 166 -115 -55 81 -52 17 170 -131 176 428 424 3 253 546 65 361 10
4233 10 -114 199 480 29 -111 -161 6 6 -127 -437 23 200 171 -256 56 101 392 440 -22 256 378 374 159
4256 159 135 -16 600 679 71 1 345 221 307 -27 110 221 254 219 169 -203 -122 -42 -409 -523 -446 -187 -167 -222
4280 -222 -322 -59 -158 -109 -533 -386 9 233 373 -347 -317 173 161 -86 -339 83 347 104 -237 -335 153 162
4302 162 -201 -329 -370 72 33 -26 -360 -192 -217 -274 -211 -406 -90 89 -192 -237 -318 36 -92 -324 -202 162 309
4325 309 154 115 -61 -37 464 -100 232 -58 -104 345 287 -50 -60 -139 232 107 -203 -50 83 121 -287 -316 -122
4348 -122 122 287 -213 -237 42 223 -93 -187 19 207 367 -297 -47 -157 153 34 74 52 376 430 -7 -164
4370 -164 -205 209 11 92 -339 97 27 360 120 -153 278 -155 -28 -34 126 339 -212 -10 -31 -51 238 192 118
4393 118 -78 31 563 239 95 -335 169 553 49 -322 -300 304 231 153 -220 34 213 39 -44 -147 -200 203
4415 203 148 166 -396 -142 -157 100 -46 -250 -63 156 -120 24 -7 -168 -459 -340 -215 168 243 -256 -326 -187
4437 -187 226 -36 -454 -61 -562 -130 94 -184 -140 -123 85 -260 -399 -269 -27 94 101 -213 -494 1 -107
4458 -107 36 28 -206 172 -5 -15 -67 122 189 82 -167 -64 266 403 -13 -76 11 513 171 21 242 296 187
4481 187 230 -162 -173 117 165 129 -295 -111 -110 118 -85 -13 -95 97 51 28 -34 -64 260 164 -70 124 113 46 120
4506 120 498 149 -33 253 -117 -65 -224 207 347 245 -38 39 72 222 142 -180 220 305 370 -62 279 284 209
4529 209 -71 238 -8 157 57 148 -139 1 108 68 -378 134 83 31 164 -266 -92 320 26 -268 -208 -136
4551 -136 21 0 -487 -15 -270 89 98 100 -152 -91 159 20 -191 -99 -180 143 -572 -309 140 -89 178 -506 -134
4574 -134 117 168 -230 -300 68 -13 -163 -123 -48 -230 142 -175 -465 -346 271 139 -207 -111 -242 131 185 -147
4596 -147 7 128 -9 82 98 102 335 -200 35 160 37 -77 205 40 -106 -271 136 435 -86 -145 339 863
4618 863 -1 -181 -81 245 524 -97 -175 118 392 317 189 37 147 286 332 178 88 31 122 -85 -211 -77
4640 -77 -100 303 -64 -223 295 118 -253 123 -3 89 -9 186 251 -109 4 64 84 -123 -319 134 370 7
4662 7 -445 -188 354 94 -331 -208 -65 76 -75 -112 -129 -97 185 -158 141 -61 35 -224 -15 -6 -2 84 279 -296
4686 -296 -295 267 116 74 -27 -83 -309 -82 -345 28 -194 90 -65 -96 11 -163 80 208 6 -119 118 108
4708 108 -12 -437 -260 44 156 3 51 195 46 130 -177 61 39 173 -298 -222 -135 197 -42 -259 -199 -405
4730 -405 45 154 -148 -535 -84 88 358 128 -332 307 476 165 -36 166 1 33 151 -184 110 -56
4750 -56 54 6 -34 321 220 -8 -67 -27 63 154 -95 -127 177 445 80 -460 77 -28 118 163 -268 93 277
4773 277 441 20 -8 20 179 68 196 -70 2 281 402 334 -298 29 77 -121 -62 -327 -2 339 251 -173
4795 -173 36 262 -355 175 -40 56 -86 76 -119 -190 -168 262 -198 -321 -129 109 137 -279 -273 -3 107 -96
4817 -96 188 -312 -49 151 -1 -447 -103 22 31 171 -168 -556 -127 -136 -193 -167 110 156 -182 -167 -108 -208 -121 -38
4841 -38 -32 -124 -123 -187 -76 165 73 225 345 309 -54 134 -28 241 -161 -99 161 -89 -44 -365 120 109 353 -316
4865 -316 -56 148 319 391 -29 -102 74 243 268 70 -53 1 105 -325 -55 -110 -143 164 14 129 -12 -79
4887 -79 151 69 39 15 155 -22 -460 -89 90 266 283 -234 8 141 37 174 -228 -9 -181 302 59 -217
4909 -217 397 438 -63 -280 121 -106 18 59 -222 -82 22 -196 -119 -249 -49 44 -56 -180 -109 81 253 -324
4931 -324 -44 -282 214 -199 116 -100 -89 263 -342 -73 -339 95 -52 -100 -423 -186 72 31 -157 -298 -266
4952 -266 343 -59 -301 183 87 85 14 -312 87 -216 158 133 -123 -116 72 122 -163 63 -160 90 -86 -330 -245
4975 -245 157 99 29 -201 131 227 31 186 42 82 -21 235 -121 -232 -97 252 12 -148 -210 190 -160 -278
4997 -278 30 81 -98 315 -97 56 226 -40 230 -273 -192 131 107 184 -141 -112 393 389 279 -315 87 -5 309
5020 309 303 -108 -125 423 672 220 -131 334 198 -44 70 -200 199 10 -27 -487 184 -51 -36 -131 -229 -30
5042 -30 280 127 -115 226 -107 212 28 -25 79 94 31 81 -99 57 217 -357 2 -7 289 -261 -42 -326
5064 -326 -82 -136 196 160 -81 -332 27 36 -127 285 -10 -77 130 -407 -20 -91 143 -96 -344 -143 -110 -127 51
5087 51 -110 36 -73 -169 145 -230 -194 -302 -122 -277 -16 190 241 233 -286 145 96 -11 -148 -545 164 -37
5109 -37 -156 104 -270 -29 18 -208 -238 36 -97 -17 -17 97 -327 44 279 -34 143 181 182 62 -77 120 268
5132 268 -44 -118 94 213 21 236 -105 -72 531 385 18 -58 118 127 79 -70 -181 450 -233 178 14 -273
5154 -273 223 -44 -3 -81 -145 167 -165 34 168 57 -199 447 -27 -220 -48 -258 171 28 40 -365 -62
5175 -62 113 -218 -565 -65 -213 -92 -359 258 -1 -66 84 192 97 12 114 -172 -170 -53 10 83 -5 -198 118
5198 118 -38 166 -183 -222 -153 -37 143 -137 5 22 -94 -188 -76 1 120 -233 68 102 134 302 60 -320
5220 -320 387 102 82 294 -2 68 58 295 7 86 -79 105 -92 -223 150 114 144 -62 -19 29 -154 -89 -292
5243 -292 -54 -145 225 257 -306 64 136 90 -90 -295 -203 137 -60 -128 90 116 31 49 183 -147 9 75 17 -350
5267 -350 113 100 -31 -97 -98 49 215 -12 -23 -67 188 466 265 238 -244 122 -148 91 198 -89 -106 8 79
5290 79 -358 363 117 368 25 185 219 180 15 41 -233 111 439 137 203 18 123 34 226 -391 -1 183
5312 183 -21 -64 -251 75 -88 -300 -407 121 82 -164 -407 -277 -92 222 -230 159 105 -222 -39 -241 -393
5333 -393 -12 38 65 -130 118 -412 -8 351 73 126 -157 -20 -422 18 -366 23 -200 -16 -163 -211 -38
5354 -38 -296 -103 -41 -21 -22 104 -16 -52 307 424 164 -172 15 330 110 48 265 48 -125 39 71 -190 289
5377 289 -106 309 -198 -61 274 -13 174 -29 87 278 196 323 -51 343 276 92 -1 -176 11 327 -45
5398 -45 292 181 116 224 272 -22 -168 -247 47 46 -241 66 -17 112 62 -225 274 84 -4 24 -25 143 282 -62
5422 -62 89 -130 391 103 154 -207 -98 -173 -249 38 -56 108 28 282 93 166 1 -47 -120 -5 613 268 -112
5445 -112 -368 -106 -43 293 -266 126 99 45 27 -91 -97 -453 184 114 97 -206 -199 -164 -189 -353 -384 12 -162 228
5469 228 -156 -318 -9 272 -30 -181 -27 64 -137 -17 115 -18 121 48 -137 -105 43 -26 -139 -8 -43 -12
5491 -12 114 143 -168 -203 134 -155 166 -201 79 -32 -160 155 370 -160 355 152 -73 79 80 193 82 136
5513 136 -117 216 73 70 -324 -53 -138 -240 -134 -181 -59 325 -29 -236 -35 134 179 147 -141 196 -105 192
5535 192 48 -53 153 87 93 62 213 -113 23 208 76 -138 94 -25 -68 169 219 342 -2 -136 -70 119
5557 119 191 156 -74 181 -60 17 -31 177 -26 76 -89 307 248 -166 106 152 -176 19 -41 -19 60 -150 164
5580 164 270 -31 -32 136 45 193 -250 -52 204 114 -122 -64 -40 -135 288 151 -108 -175 -272 119 467 -13 -229
5603 -229 103 23 75 -99 -75 -185 -243 134 -25 6 80 164 129 -18 -265 8 49 -16 -152 -222 -211 -176 -78 57 -20
5628 -20 78 -239 -43 208 227 446 -346 -81 4 184 -15 -14 17 86 276 78 64 -15 337 122 19 12 34 33 -52
5653 -52 77 -15 -294 24 -118 206 -401 -115 99 -103 -28 -9 -30 90 -110 -21 201 71 35 116 138 -68 18
5676 18 -43 -168 132 415 132 -12 -135 -199 -184 -48 -267 32 -227 50 -42 -56 87 -72 57 -358 190 -46
5698 -46 -27 -35 -123 17 18 376 -143 -187 -114 -127 -125 -148 -11 109 -50 -214 149 -39 -44 -98 87 240 -106 -18 24 -61
5724 -61 -278 42 195 65 227 3 -426 101 -70 148 -24 -24 48 318 -124 -92 188 -160 -94 -222 36 83
5746 83 175 -138 -189 76 143 35 300 -260 165 -101 137 -139 -58 -61 347 -95 83 43 -299 -70 277 94 -17
5769 -17 -89 117 122 -289 -246 -321 212 200 252 105 -261 -40 89 -249 -269 93 150 -170 -57 101 58 -220 61 -24
5793 -24 81 -48 218 -13 6 368 53 -55 362 311 148 -214 -50 4 66 396 55 125 148 143 52 131 -14 57
5817 57 84 -155 -223 48 90 59 -45 -272 80 54 55 -313 -241 69 81 -211 -79 172 -124 -221 98 63 295 -138
5841 -138 -93 -12 -1 -91 159 151 -5 -142 64 340 122 -327 -79 249 -100 138 -149 77 -4 -47 -93 -48 98
5864 98 -22 -92 -348 -146 -6 21 -339 281 -72 -34 -141 -31 -8 286 -220 -182 -83 29 -199 77 -3 -285 240
5887 240 59 210 45 -205 211 160 282 -106 212 139 -3 -156 -253 88 179 117 -98 294 57 327 78 278
5909 278 154 -77 37 30 -314 1 99 17 -261 -217 -233 -184 -37 -47 -52 -221 53 -18 -321 4 -93 233 -96 -277
5933 -277 67 24 33 -42 -39 -175 77 314 15 -51 169 1 173 -153 58 -165 34 -275 148 -86 -176 34 -121
5956 -121 48 -40 -298 15 16 -144 -27 74 244 264 -144 -52 395 200 -10 -147 -166 -279 122 -64 106 -101
5978 -101 -306 -44 -153 89 13 -141 85 -130 -120 130 -129 -284 -329 153 70 -144 81 87 -135 55 37 74 0
6001 0 216 -105 81 223 96 261 39 265 -179 163 -89 31 -42 158 -151 32 -255 -139 83 247 0
6022 0 5 90 342 -132 -103 -121 240 292 42 -32 70 12 23 -75 -6 -41 -72 -175 -251 1 176 7 110 -123 -5
6047 -5 223 538 87 -21 94 251 69 66 63 222 -158 -215 162 208 -10 -79 160 299 87 250 127 -101 -94 29
6071 29 17 -69 173 -49 191 -278 -14 -4 -14 91 -139 271 -1 266 -159 33 -256 -27 -157 16 0 -357
6093 -357 184 387 -125 -172 167 -52 10 -192 -83 -28 256 -87 -271 -37 -386 -156 -20 -53 -92 -55 -119 74
6115 74 188 -35 -485 -164 -242 -337 99 -118 142 -85 233 -299 136 -137 113 156 -96 106 113 -74 -39 -170
6137 -170 44 -314 -205 55 -82 69 -132 226 -125 -79 -37 -43 -174 -237 217 78 248 104 -60 144 -7 -464
6159 -464 -67 59 -208 213 139 400 -163 242 -14 -285 -256 101 -294 -124 -29 467 45 402 166 218 6
6180 6 -178 -46 -114 366 170 24 233 -8 89 -38 -78 -119 -272 194 -145 216 -80 -93 -22 317 -20 35 -47
6203 -47 6 -108 -250 79 -197 163 225 -35 -63 -72 -161 157 141 53 69 -224 110 -188 240 123 -59 357 229
6226 229 41 414 -6 10 -245 411 101 -197 127 -195 -266 -58 -367 -88 26 310 -108 -284 18 189 -98
6247 -98 -38 -38 -19 12 -1 131 59 161 -212 144 -62 -100 90 -128 -111 -142 40 -26 141 -57 -9 -537 -296 102
6271 102 38 -125 -191 21 8 -20 232 25 -1 152 9 100 134 343 88 -39 -88 94 -12 -5 -39 82 365 -58
6295 -58 -62 -165 -17 -119 207 320 160 -146 -194 282 138 51 239 -115 64 137 -340 95 -164 -212 -102 -81 -22
6318 -22 -298 -128 136 -208 -82 -49 -71 -37 378 228 -24 -35 -189 70 27 241 33 188 136 -398 26 272
6340 272 -25 137 -2 10 62 -115 118 -151 -194 -241 -76 -103 -16 28 32 -14 -190 221 -313 -68 -3 86 26 -307
6364 -307 -227 -73 104 161 -147 -177 88 367 -247 106 18 163 174 179 235 110 74 -89 221 147 33 141 -23
6387 -23 -63 54 43 -118 -24 7 -127 83 -46 51 -131 21 -158 -258 -283 -34 253 114 85 74 163 127 -25 119
6411 119 36 260 -48 -89 148 -258 152 81 -93 325 -102 -11 -250 132 -324 -36 -66 90 -170 197 49 22
6433 22 145 -257 -25 119 158 -172 -183 13 -65 292 43 -216 19 -153 -43 -173 218 234 -102 158 275 51
6455 51 -24 -283 -64 -192 182 177 -98 131 -109 -118 -130 -263 478 -141 22 -73 -159 112 23 43 111 186 -1 -71 -157
6480 -157 75 -86 -216 -4 92 -21 58 -59 -205 -60 69 -8 -156 88 107 -234 129 -99 11 -152 21
6501 21 45 -292 -108 -31 15 -186 169 -2 434 232 -106 107 188 -264 58 54 -241 253 29 17 2 65 -199
6524 -199 -266 168 -332 -126 220 116 -33 -104 105 -138 -37 14 279 22 -226 22 -151 -58 291 119 -111
6545 -111 123 -26 -304 -203 23 72 -181 7 39 371 -73 -4 -372 241 253 -234 219 -279 -58 163 -287
6566 -287 72 -21 -143 -106 -61 -395 -152 136 -165 -341 61 -59 37 -398 -56 399 -292 230 -11 -7 -58 -92 -382
6589 -382 -74 15 -132 -418 -208 246 133 85 68 161 12 146 457 256 147 -35 106 7 -65 -316 70 129
6611 129 120 -60 -235 -15 48 54 -30 -176 135 -74 -79 -64 60 -316 190 -172 116 97 14 -129 -6 -47 98 115
6635 115 -272 -37 401 -169 -518 -6 -167 145 -36 46 124 94 117 161 -132 -79 156 -199 -24 -239 115 118 -146
6658 -146 112 35 -28 -19 54 234 132 -64 -108 -48 -110 165 -398 16 -56 -156 48 122 -80 106 -46 -359 105
6681 105 -74 169 -40 -35 238 51 -279 -70 44 12 112 -36 -131 3 207 303 -29 81 -94 49 -114 -149
6703 -149 -71 25 24 80 -88 -27 173 -62 -39 -31 -81 -97 0 324 139 -25 41 -46 -96 -242 -226 -59 42 -48 -75 -12
6729 -12 -59 -89 -392 4 301 -136 -179 -36 55 -54 90 2 87 135 -20 -173 -95 86 -79 -148 -58 81 -180 50
6753 50 -79 171 -58 -24 -121 -109 82 17 -201 -103 8 -273 343 -244 -40 253 -139 -118 -42 197 245 -101 -436
6776 -436 120 -301 -103 -204 173 358 -159 247 25 -185 -177 77 -386 498 24 63 269 -92 6 -52 -34 325
6798 325 286 -144 -4 82 -5 64 3 -153 27 -95 -278 -7 -3 12 -115 -151 -199 36 25 178 -88 142 -98 -138
6822 -138 213 230 -237 176 -44 -50 99 -102 98 -95 194 -124 146 -240 -195 -217 130 175 -20 -14 256 150 -254
6845 -254 -26 -233 479 -34 -172 18 -149 193 -52 -58 205 -137 -71 144 -115 365 1 163 162 -320 223 -134
6867 -134 177 -41 -3 234 -298 -133 -9 -93 34 272 263 -21 -122 -42 34 -262 66 -130 6 48 -160 216
6889 216 46 -41 -118 38 370 112 -235 219 -149 -138 50 37 53 7 105 -6 -201 47 308 -148 248 96
6911 96 -231 26 -41 23 -136 -113 -37 241 272 -5 -93 -22 218 110 -101 -290 89 -125 14 -98 292 295 87
6934 87 159 122 21 -102 54 14 -19 -36 410 70 -156 -69 -83 20 49 592 127 -281 -123 248 3 -102 33
6957 33 -182 -95 -126 70 -105 4 -18 33 113 -5 -14 -137 43 -224 -83 135 356 85 309 124 104 114 -186
6980 -186 8 90 82 95 -152 -33 -110 -448 17 171 41 -31 74 8 408 -3 -26 156 133 2 21 353 -53
7003 -53 -170 41 140 86 -22 116 -162 38 -81 199 18 -92 -57 111 44 15 74 14 -39 117 -93 80 -124
7026 -124 -1 48 -59 102 276 77 -81 305 -266 -219 162 188 -58 137 34 -233 109 -1 -12 -162 -29
7047 -29 94 -293 40 84 -12 -173 -148 39 -102 103 255 -143 -19 -1 -15 149 127 228 -162 145 382 77
7069 77 -114 -74 -109 38 227 168 225 -170 -151 327 -210 249 -200 -320 -285 -156 210 -71 -8 -101 -109 62 204 264
7093 264 -45 -51 -354 23 233 -26 96 -214 -149 -9 269 5 -161 -251 -177 130 -184 -39 198 84 -93 172
7115 172 -261 8 149 -83 314 19 246 -148 -117 -82 106 280 137 -129 226 213 -6 -250 -39 -2 -186
7136 -186 -271 -253 -107 -181 -102 -199 149 119 -30 -37 -391 52 134 -80 -83 -38 205 253 454 104 -302 -5 150 -70
7160 -70 82 -26 -214 192 82 -186 40 171 63 -106 -60 30 427 -88 -43 220 122 -151 115 -28 12 84
7182 84 15 183 -319 -100 -10 -250 -166 -13 -18 275 -240 -142 -187 -48 25 -148 -91 -131 -38 -112 156 -82 -137 60 -206
7207 -206 -215 6 95 131 -255 -33 -113 175 -334 10 127 -60 269 193 112 -266 -64 -307 -141 -373 -115 -45 246
7230 246 17 -166 -46 -102 356 87 -74 133 -58 34 -428 -20 81 145 -180 -213 -264 -60 327 147 163 -43
7252 -43 -295 -175 -83 -122 -41 -179 -97 191 -202 -145 106 40 -1 -27 26 126 -211 -415 249 165 171 -31 -32 -321 -149
7277 -149 65 -141 74 16 -58 -118 9 -81 289 -125 4 56 116 11 -319 -313 132 8 377 64 156 -327 -143
7300 -143 -137 -45 -245 -133 -3 236 13 -26 83 -148 29 -3 -156 23 -22 163 85 -262 -212 -214 46 81 272 124
7324 124 79 -72 4 81 288 84 90 -293 -14 -86 68 -37 53 -176 230 122 209 -18 -149 270 -167 -397 107
7347 107 -15 -285 -140 -219 15 -98 96 -234 -111 91 108 13 -160 -92 -234 34 -36 45 -61 -94 -277 -21
7369 -21 -73 -101 209 7 -2 -96 -47 -127 -179 5 49 60 -15 -133 136 -428 130 -7 29 133 -227 240 253 101 55
7394 55 332 -208 314 256 4 -47 77 -46 -114 29 -51 -176 61 -135 -113 103 112 -68 -106 -29 -276 -51 -137 -65
7418 -65 -120 118 39 108 446 -6 -143 -68 51 -293 396 -115 39 -276 81 -26 51 0 -77 -154 -66 -138 -124 -59
7442 -59 -49 21 119 -103 71 -67 40 39 -102 27 -121 159 87 -164 -85 244 -182 1 -24 1 173 51 22 -102
7466 -102 -7 40 -181 4 12 -130 172 222 -424 234 -192 160 -47 -13 196 -248 15 -321 195 143 107 88 -47
7489 -47 39 -142 14 -70 -45 -282 118 -11 -69 77 -240 148 -97 -45 -83 62 -36 274 136 188 376 173 -153
7512 -153 -195 -57 -110 -101 -332 54 20 -122 -93 -46 117 -142 73 56 -129 52 146 -102 25 -217 61 -45 -43 -219
7536 -219 130 -38 193 96 31 -32 128 50 -228 165 -48 203 2 -178 -116 -92 -28 226 260 330 -83 -317 -116
7559 -116 35 -128 -18 -359 -191 -270 -7 -17 127 144 108 -401 -10 58 130 114 327 162 -42 -227 130 149 122
7582 122 9 -120 -33 -60 100 68 35 31 -206 4 -252 -25 249 -209 92 -72 -207 -19 73 -441 22 -109
7604 -109 265 97 -163 62 -84 87 48 -77 -122 84 108 12 -80 51 233 71 46 -59 164 -107 -412 -208
7626 -208 -73 240 -1 -24 -311 162 158 -115 23 -242 317 -1 -43 -35 107 -85 -198 -57 196 107 122 316 -112
7649 -112 -333 167 -80 123 23 15 32 -139 -248 -197 -109 -112 -5 109 -153 236 138 123 -41 -52 353 -74 -118 -37
7673 -37 -86 171 52 90 25 -243 -28 -34 -276 16 -51 36 -55 -279 72 75 -143 -31 162 119 98 -287 -162 223
7697 223 -104 -48 181 11 175 -66 -1 -8 42 -34 -226 94 -57 83 26 26 76 116 3 -96 -62 -167 -127 -60 -4
7722 -4 39 -53 -186 -85 63 -334 103 45 102 -15 38 118 133 161 237 -152 147 179 44 371 19 172 38 -79
7746 -79 268 -89 63 49 263 -195 179 7 -330 -113 -60 -56 58 -41 -149 90 -14 232 -83 137 117 15
7768 15 133 -35 77 -73 166 37 -99 93 83 -37 35 34 387 463 -22 -49 -49 66 89 188 -139 -180 158 188
7792 188 216 323 66 202 216 -75 -59 -139 -17 177 88 -85 -81 43 -152 109 36 -66 38 129 139 -26 276
7815 276 281 54 -221 -40 -74 -42 5 -138 -7 185 181 -127 -86 82 -103 11 -171 -108 146 53 277 -182 -180 203
7839 203 -117 -101 -286 -25 -9 45 -25 179 44 26 129 -26 -6 124 -129 -166 -455 182 77 -66 278 -172
7861 -172 -99 54 25 -281 -120 -146 153 -76 61 38 -85 -1 82 -65 -143 -3 4 -130 -257 41 148 -155 -134
7884 -134 121 -71 -52 -471 -321 -211 -87 -47 -133 -92 93 -127 -184 205 58 -27 238 -256 7 -77 -181 15
7906 15 -35 -138 84 -46 2 -202 -78 -1 104 44 133 82 267 99 -23 251 -265 52 174 187 -26 -183 -203
7929 -203 -49 147 97 -207 136 43 -131 194 -102 -42 192 190 79 -227 -46 -40 344 281 -138 -17 -131 -51 -272
7952 -272 29 235 -107 158 26 -66 148 80 105 108 179 -243 32 -148 -8 130 -152 11 -3 235 -166 -433
7974 -433 -454 145 109 -186 -208 158 -117 -295 79 -108 -90 37 2 -69 -85 132 269 126 69 46 -10 205 64
7997 64 14 -13 -47 -11 -10 -316 110 -166 128 -24 -43 181 -166 45 -166 -218 56 0 -1 47 -259 -133 71 108 -71
8022 -71 -93 168 371 -55 -24 -306 95 -110 -38 -136 -237 -40 35 -37 -258 -164 338 -52 52 20 202 -75 307
8045 307 220 51 5 33 321 77 -36 -37 -213 -175 -254 -13 48 99 2 144 11 20 172 100 138 -77 -32 -20 -157
8070 -157 90 105 -76 -16 28 -126 -136 26 157 -126 0 -229 -358 -314 112 -413 -73 39 -10 204 -54 -167
8092 -167 -61 30 -130 34 -68 101 -95 -204 218 39 331 169 -78 21 -4 215 10 298 50 -18 -117 79
8114 79 -23 39 -140 182 139 -52 -232 -50 123 -214 -175 -114 -50 -101 -182 165 -104 132 -198 127 23 -155 74
8137 74 -297 27 -10 283 -294 222 -36 -37 310 -120 -200 191 56 -122 -294 187 -93 -72 293 -80 -15 -119
8159 -119 -85 -10 -204 4 160 100 282 -51 307 -151 -108 -89 -245 -89 124 60 64 100 -41 -66 -217 122 -130
8182 -130 -149 216 -124 -390 -375 -35 58 103 -5
8191e
$$ Imaginary data points
##PAGE= N=2
##DATA TABLE= (X++(I..I)), XYDATA
0 0 0 0 0 0 0 0 0 -8 8 -8 8 -16 16 -16 24 -27 32 -40 48 -56 65 -75 86 -101 115 -131 151 -170 194 -218 246
31 246 -276 310 -347 387 -431 479 -532 591 -654 725 -804 887 -984 1090 -1210 1346 -1499
48 -1499 1677 -1882 2126 -2421 2782 -3241 3844 -4675 5901 -7895 11701 -21583 102263 202589
62 202589 -13625 -48158 63807 114896 867 -24512 72049 117713 25607 -17576 35769
73 35769 54364 -22540 -44925 24569 65076 8894 -34715 -15163 1529 -22741 -19657 22927
85 22927 43542 18529 -2015 -2096 -2292 -2395 16132 29846 22049 16223 28101 21978 -4471 -5222 20164
100 20164 14100 -21229 -15225 23616 4208 -64065 -65493 12759 40907 -23849 -63753 -22495 -1771
113 -1771 -51809 -71176 -7123 35866 -9108 -46806 -4368 32939 -7584 -48073 -13658 35988
125 35988 27093 2157 12381 18195 -11107 -19268 24211 51102 19930 -8801 10600 26074 -5498
138 -5498 -31409 -5289 30710 25521 4548 6483 13762 3105 -12286 -11487 -2734 6774 20222 24331
152 24331 7609 -9583 407 20246 16353 2372 8410 21344 11634 -5468 2233 21090 18185
165 18185 2454 6745 22553 16652 -5656 -11385 222 4077 -3551 -3318 4188 -1032 -15377 -16236
179 -16236 -3554 -388 -12869 -21205 -17373 -13296 -19011 -20671 -9410 2299 -497 -9330 -7537 -326
193 -326 -5960 -19893 -18013 4995 20962 13125 -524 1349 9661 5424 -3685 -1208 7951 8384 2743
208 2743 1772 241 -6609 -7339 3187 8389 -1052 -6563 1848 4080 -12508 -21394 -3750 16095 11483
223 11483 -593 5524 17065 10478 -2421 -89 9699 9910 8081 15651 19164 10292 5726 12687
237 12687 12438 -695 -4647 6682 6618 -10866 -14093 5029 10947 -9710 -21163 -4868 5165 -11539
251 -11539 -23585 -11355 30 -9315 -16210 -5002 1477 -7737 -9799 1202 2393 -9962 -10382 1185
265 1185 -3560 -19532 -12408 12205 10500 -14151 -16614 5204 5080 -21760 -28669 -5443 4162 -12315
279 -12315 -16407 1411 4578 -13420 -17883 -3014 -1427 -14089 -9444 7227 2163 -16265 -8019
292 -8019 16447 11763 -14069 -10819 17659 18436 -11048 -17440 8086 16835 -3419 -9971 10743 19583
306 19583 2911 -7633 1310 5903 -3243 -5056 3801 4685 -796 3909 11952 4398 -6329 -1228
320 -1228 7415 -118 -9447 635 12935 4570 -6917 1953 13974 4819 -7353 -367 8472 -566
334 -566 -7856 4985 13009 -2883 -11688 7319 19885 168 -16242 1475 17756 -1621 -21833
347 -21833 -2975 21885 6968 -18110 -4990 21532 11870 -16558 -13967 9362 6914 -12487 -8565
360 -8565 13513 12452 -7902 -9103 8663 10109 -7124 -11546 1104 5796 -2457 -3089 5258 4959
374 4959 -5280 -4942 5015 6381 -3169 -8797 -3488 870 569 -1088 -1763 -2363 498 4359 998 -7438
390 -7438 -7453 923 412 -10487 -10306 5118 10901 -3591 -13143 -2691 6729 -2810 -12709 -5949 3202
405 3202 -2970 -9091 1312 9873 -236 -12400 -4483 8258 3179 -9870 -6212 4224 1906 -5317
419 -5317 1084 10802 2744 -10700 -4169 10812 7361 -10111 -10899 4985 9793 -896 -4673 3210
433 3210 6288 -109 -2739 126 -637 -2879 788 4382 -878 -4181 5513 13314 2696 -9865 -3155
448 -3155 9628 5749 -6386 -2171 8882 5823 -3719 1408 12114 5465 -8338 -5226 7696 6237
462 6237 -4847 -4369 3265 1293 -2759 2736 6673 -3906 -12439 -1684 9348 -1773 -14138 -3764
476 -3764 12007 4251 -10629 -3921 10694 5759 -9887 -7986 5333 5686 -2290 -904 4856 1193
490 1193 -2394 4337 8079 -3379 -11001 -1054 7589 -2376 -10990 -852 7306 -3387 -12380 -1435
504 -1435 8157 -4448 -17335 -7708 6617 1887 -9794 -6245 3429 2063 -3742 -453 1409 -4110
518 -4110 -5151 2418 2976 -7065 -6478 6709 7765 -8170 -13301 1521 8098 -7224 -18252 -7568
532 -7568 3181 -3271 -10803 -5810 -1183 -6483 -8676 -2055 -305 -8482 -10391 -1434 2669 -3483 -4424
547 -4424 2979 4262 -3903 -4613 4644 5429 -5716 -8843 2316 8052 -326 -6637 -1545 4603 1255
562 1255 -4574 -4335 -2030 -771 37 -428 -2715 -2591 3916 7656 2111 -3772 544 8261 7037 -8
578 -8 -417 6184 8758 5090 4176 6957 6841 2472 258 3059 5117 1771 -929 456 3082 4284 2451
595 2451 -370 -1391 -324 1201 2115 743 -1225 -1175 2509 5499 3240 -1489 -427 5400 5380 -2070
611 -2070 -4911 1519 6681 796 -5822 -2166 5460 3265 -4051 -4800 -255 -275 -3146 -3186 -1649 -2172 -1652
628 -1652 1344 783 -3516 -2406 2424 1260 -5937 -4202 5779 6534 -4655 -6720 4917 9479 -1620
643 -1620 -8058 628 6817 -62 -3954 2560 4620 -1632 -1912 6938 6840 -3870 -3416 8526 8739 -4846
659 -4846 -5931 8889 11312 -3613 -6937 7879 12815 -2714 -10258 2437 9658 -932 -7636 1088
673 1088 6578 -218 -3334 3353 3349 -3691 -1667 6532 3296 -5527 -180 11323 6057 -7433 -2287
688 -2287 12331 7486 -8586 -6507 8905 6664 -8005 -7246 5316 2808 -9006 -5490 5769 169
702 169 -11554 -5250 6725 603 -10572 -1946 11550 3483 -8979 1643 16903 7496 -8682
715 -8682 428 18974 12831 -4589 -170 15445 11815 -1532 160 9545 4841 -3895 1186 7840
729 7840 -603 -8323 2110 9638 -2315 -10878 2283 13107 473 -10468 2930 15975 5413
742 5413 -5934 5362 17894 8662 -2528 5727 15410 7474 -1925 4670 10917 1967 -3310 4703
756 4703 7357 -5508 -10443 1939 6147 -9114 -16719 -2622 5932 -5941 -14730 -4792 3816 -4034
770 -4034 -9934 -2166 3119 -2845 -5104 2821 4406 -3247 -3160 5640 5016 -5357 -4890 5539 3953 -8237
786 -8237 -8870 2852 2337 -10705 -12544 -50 2494 -10094 -14458 -3518 1712 -5622 -10017 -3534
800 -3534 450 -2745 -2935 1645 856 -3779 11 7769 5254 -2779 -1148 7411 7664 4 -1066 4881
816 4881 5111 -144 -1015 2962 2969 -1364 -1467 1663 1132 -1215 -755 614 -610 -1216 1545 2872 -1685
833 -1685 -2818 2612 6119 847 -3901 581 7271 4937 -2218 -2438 3779 6820 2226 -2460 -1246
848 -1246 3230 4262 552 -2095 -1178 1891 2325 -598 -2685 -1526 251 -386 -1699 -2073 -2052 -1583 -965
865 -965 -1430 -2567 -2644 -1235 -1589 -3095 -2596 270 111 -3250 -3931 902 2859 -1292 -4666 -1584 3002
882 3002 1818 -1819 -2764 -356 1216 1591 1221 -1904 -3756 151 4023 432 -6413 -5153 2959 3243
898 3243 -5221 -7137 442 3239 -3096 -6412 -816 1808 -2802 -4520 72 2336 -1913 -3343 1270
913 1270 2819 -1357 -2173 1303 1362 -2489 -1036 3452 450 -5512 -2287 4939 1839 -6774 -6142 2217
929 2217 2813 -4995 -6906 -570 1206 -3149 -3320 19 -1744 -4556 -996 3325 -1467 -7161 -1422 6355
945 6355 1637 -6817 -2714 6692 3690 -5566 -3699 5130 4021 -4645 -4258 4487 4688 -2640 -3251 2557
961 2557 3211 -1001 -1237 1299 443 -1598 1713 3974 -329 -3535 2609 6760 989 -4578 415 6953
977 6953 3095 -3889 -369 5717 4272 -1077 32 3663 2077 -171 2119 3073 -718 -1649 4113 5868
993 5868 -1168 -4191 3008 7350 189 -5690 547 7166 1907 -5030 -1126 5802 2728 -4015 -2485
1008 -2485 3255 2055 -2705 -2678 470 -182 -1327 167 370 -2591 -2850 1789 1628 -4144 -5167 902
1024 902 3525 -2055 -5656 -442 4798 525 -5038 -2068 2817 623 -3796 -2358 1208 818 -1790
1039 -1790 -1333 92 -1728 -2574 -464 -221 -3482 -4686 -121 1887 -2664 -5823 -915 3112 -1000 -6080
1055 -6080 -2974 2685 1275 -4653 -3707 1934 3197 -497 -2149 -172 1238 483 411 -285 -1873 -834
1071 -834 2652 2331 -1726 -2700 1952 3170 -2467 -5305 11 3960 -1205 -6806 -1820 4717 1700 -4835
1087 -4835 -3517 2244 2551 -1761 -1780 1073 897 -474 1882 3753 338 -1370 3460 6026 913 -3242
1103 -3242 2007 6646 1884 -3554 259 6506 3970 -2297 -1675 3037 2468 -2197 -1513 1812 1018 -1317
1119 -1317 -485 1702 72 -947 973 1535 -2330 -1864 3853 4856 -1829 -3780 4086 7569 1280 -4079
1135 -4079 824 5748 1927 -2336 611 3708 -20 -2589 1213 3014 -1388 -3518 38 881 -4236
1150 -4236 -5960 -55 1450 -4646 -6454 -98 2966 -3622 -6830 -1645 1902 -2906 -5293 -532 2735
1165 2735 -909 -3173 384 2503 153 -1154 295 107 -2655 -517 4054 1238 -5302 -3873 3222
1180 3222 3119 -4451 -6045 -453 804 -3996 -5027 -594 276 -3161 -3482 302 1057 -2164 -2305 388
1196 388 402 -1002 1319 4501 2337 -1116 1848 6186 4120 -1256 -157 4870 4216 -559 -773 3344
1212 3344 3635 174 -1710 -36 486 -184 -400 -1103 -3673 -2874 1548 2977 -1659 -3770 510 4520
1228 4520 1713 -1891 -139 3477 2793 579 2041 4868 4409 1526 1202 3108 3525 2223 -21 -290
1244 -290 1325 2581 1715 -1114 -1767 419 1897 -1043 -3557 -2241 1068 882 -2008 -2530 -123 1489
1260 1489 1733 509 -606 -547 1615 3628 2317 -665 -61 3264 4425 1951 575 1629 2389 92
1276 92 -1009 640 1282 -176 -1167 -837 476 602 -374 -2521 -3399 -1097 1145 -538 -4327 -3101 2235
1293 2235 2274 -2935 -4292 1150 3256 -1755 -4599 -800 2880 796 -1950 -149 1602 246 -338 1528
1309 1528 790 -2644 -2344 1563 1464 -2683 -2386 1733 1229 -3155 -2848 1316 1229 -4418 -4676 427 1461
1326 1461 -1891 -2925 67 362 -1795 -218 1752 -309 -3567 -303 4507 1356 -2771 756 6428
1341 6428 2785 -2773 595 6635 3233 -3722 -1603 5222 4138 -2094 -1427 3445 2037 -1859 -836
1356 -836 2062 -926 -4286 -80 3669 -379 -4476 508 5423 1218 -4142 -219 5311 2499 -2682
1371 -2682 716 5572 2467 -840 2848 5872 1128 -2412 1551 5151 73 -3749 398 3280 -767
1386 -767 -3339 848 2351 -3223 -5729 714 3368 -2890 -6641 -372 4361 295 -3195 -41 2435
1401 2435 248 -912 1726 1794 -1664 -523 4539 2735 -2520 -1690 4429 3247 -4106 -3936 2258 2258 -4716
1418 -4716 -4621 1772 2070 -4579 -4923 1398 1532 -4160 -4956 -20 884 -3070 -2059 2238 881 -3503 -1108
1435 -1108 4450 1706 -5166 -3565 3977 3852 -3892 -4806 1807 3951 -1680 -4456 -755 1317 -1012
1450 -1012 -2946 -1296 -821 -1705 -802 38 -997 -1927 383 715 -2144 -3380 785 2556 -1402 -3986
1466 -3986 822 4685 1215 -3242 -1508 2357 1952 -1034 -841 731 308 387 2000 1812 -823 -1294 1810
1483 1810 2605 -724 -1708 1799 3768 447 -1371 1898 4263 1166 -2312 38 3757 2347 -796
1498 -796 -1135 1483 2748 889 -47 364 1265 2481 809 -1404 -1056 1971 2795 714 -1474 440 3256
1515 3256 2922 -446 -1823 -442 1589 1176 -46 -1202 -463 556 795 -769 -1422 -58 -183 -1251
1531 -1251 -2821 -701 1385 -249 -3583 -2160 1012 1349 -1323 -2768 -1246 92 -333 -1264 -1559 -559
1547 -559 348 1068 -57 -1546 -1377 797 263 -2314 -3361 -592 1588 -17 -2472 -1846 92 35 -1070
1564 -1070 -1545 -1736 -1054 -140 58 -963 -1285 49 858 -759 -1869 491 2360 -479 -3361 -1207 2893
1581 2893 2087 -2214 -1822 1720 2111 -535 -1480 474 503 -1427 -884 755 520 -886 304 1436 -388
1598 -388 -2658 -242 2567 459 -2771 -1245 2561 2697 -1004 -1456 907 1106 -525 261 1282 854
1614 854 -443 70 751 1050 1003 1338 650 -1482 -336 3082 2372 -2327 -3045 2014 4656 562 -2685
1631 -2685 288 3409 888 -2168 -518 2625 1268 -1114 -309 2249 1146 -65 795 776 -933 -1177
1647 -1177 2197 3071 -519 -1977 1057 3472 655 -1592 74 2178 734 -1795 -918 2054 1228 -1627
1663 -1627 -2206 72 1507 1100 -685 -2223 -1644 456 908 -1042 -3502 -1114 2180 1111 -2241 -2563
1679 -2563 634 1077 -1858 -3722 -225 1770 -118 -2117 -1511 123 32 -815 -1270 -1481 -1346 -625 11
1696 11 -693 -1759 -1294 204 -254 -1762 -1152 919 184 -2716 -2338 1013 2232 -1280 -3166 -56 2605
1713 2605 891 -1682 -1289 271 873 97 169 247 35 773 1585 463 -1440 -897 1650 1465 -1272 -1768
1731 -1768 1843 3228 46 -2196 -275 2772 1025 -1358 -1 2167 1323 -774 -179 1978 1998 268
1747 268 -354 789 1804 1779 476 -594 -786 1122 2953 1711 -951 -1083 2329 3035 19 -2079 73
1764 73 2296 1316 -446 341 1325 836 344 1046 388 -510 181 1732 1515 -647 -945 1895 1767 -1815
1782 -1815 -1290 2372 2155 -1396 -2358 1624 2690 -1111 -2718 -111 2230 771 -1589 -901 202 -523
1798 -523 -924 -128 -573 -1136 7 1391 206 -2289 -1481 554 97 -2774 -2223 744 820 -1501 -1958 6
1816 6 -334 -1753 -1452 164 -321 -1998 -1199 164 -454 -1906 -875 409 -844 -2231 -534 1767 -387
1833 -387 -3358 -1889 1901 1075 -1700 -2082 565 795 -467 -783 -440 -787 -979 362 611 -76 -655 552
1851 552 1037 -681 -923 983 1438 -1037 -1948 1427 2863 103 -1894 211 2019 1123 -1016 -490 1543
1868 1543 1241 -173 -255 287 281 1173 1456 457 -1044 -269 2138 1716 -1034 -1479 948 2211 765 -1011
1886 -1011 366 831 655 -289 372 522 341 110 452 152 235 757 487 -1571 -1234 1267 1873 -600 -2205
1905 -2205 -90 2295 595 -1951 -1039 849 1234 -846 -1050 -459 252 386 -608 -1201 -717 259 954 -481
1923 -481 -1499 -1094 658 251 -1425 -1194 553 659 -548 -880 -101 -138 -798 -532 -471 -325 -127 165 -75
1942 -75 -1245 -1324 426 613 -1540 -2202 160 1401 -893 -2464 -620 1214 -181 -2077 -1271 745 61
1959 61 -1153 -1245 -513 -701 -166 330 -665 -1034 -383 1060 -332 -2170 -1067 1030 594 -2187 -1072 1178
1977 1178 1547 -1470 -1927 342 671 -654 -526 419 -21 -915 -18 1464 13 -1282 279 2131 565
1994 565 -1450 285 2933 652 -1964 -234 2964 1783 -1139 -467 1668 1779 -145 565 1278 193
2010 193 233 1355 1909 -233 -730 1967 2399 -697 -1392 2280 3555 -444 -2051 1363 3886 741 -1834
2027 -1834 261 2556 916 -877 925 1596 -92 -543 1412 1796 -597 -631 1230 1214 -1304 -1173 1630
2044 1630 1737 -1783 -2178 1218 1875 -921 -2215 253 1084 -791 -1073 31 182 -967 -203 1084 -156
2061 -156 -1907 -564 1416 -597 -2769 -491 2617 620 -3041 -1463 2089 1317 -2476 -1835 1169 972
2077 972 -1765 -1472 739 481 -1337 -1152 345 -43 -1132 -129 299 -1397 -1908 702 2085 -477 -2747
2094 -2747 -204 2722 747 -1860 -992 1672 853 -593 -364 899 653 -357 323 852 -595 -590 988
2111 988 917 -1309 -1230 1544 1950 -931 -1898 989 2195 -592 -1732 387 2504 480 -1341 107 2065
2128 2065 1510 53 -215 660 1021 1374 1038 -263 -529 1262 2722 607 -1110 -134 1980 1637 -538
2145 -538 -1094 719 1093 -271 -550 332 832 306 40 522 444 145 757 959 255 -418 1135 1818 380
2164 380 -283 1158 1651 596 -1130 7 1517 1159 -791 -1251 -7 859 285 -873 -1481 -236 329
2181 329 229 -1349 -1966 -229 1020 -210 -1830 -985 625 277 -1270 -991 -40 346 -605 -883 -502 -231
2199 -231 -212 -865 -523 -978 -586 -668 -821 -1190 -1280 -100 -111 -1704 -2102 -729 18 -732 -2291 -1158 -97
2218 -97 195 -705 -1337 -441 287 474 -126 -1018 -904 671 1014 -212 -1583 -26 1569 832 -1342 -857
2236 -857 1166 1165 -558 -1228 222 1214 -110 -770 -486 290 461 135 27 -337 208 965 348 -315 -178
2255 -178 1235 1592 123 -682 579 2067 904 -134 198 1336 928 153 116 577 288 275 680 681 -558
2274 -558 -138 673 239 -1225 -1060 703 850 -729 -1475 730 1488 -6 -1352 -456 1553 770 -484
2291 -484 -626 614 600 509 -74 -567 -105 683 1017 -212 -1237 -340 1091 490 -1365 -490 511 607 -714
2310 -714 -845 182 684 -812 -1201 -43 431 -129 -729 -503 91 -276 -98 -64 -348 -356 74 1004 -456 -1577
2330 -1577 -810 1269 279 -1161 -1613 410 1198 -333 -1719 -768 793 319 -697 -1250 -1000 -273 191
2347 191 -635 -1062 -783 -387 215 -964 -1243 -132 375 -673 -1369 -59 898 470 -934 -986 643 834
2365 834 -482 -743 -185 690 324 -120 -728 -462 245 617 193 -600 -655 447 851 -351 -1203 -377 910
2384 910 946 -548 -1015 660 1489 479 -391 78 1617 1544 396 202 584 1143 1019 739 429 430 885 1042
2404 1042 -188 -137 550 1253 155 -690 -376 1072 912 -674 -874 730 1135 -231 -1127 -14 1230
2421 1230 423 -444 -735 395 104 343 -183 -474 -405 246 1160 88 -1062 -467 647 269 -1332 -1065
2439 -1065 121 343 -617 -1224 -434 269 -749 -1133 -1194 137 -318 -444 -586 -1239 -376 371 730 -1201 -1484
2458 -1484 122 868 -341 -1888 -398 1197 739 -1697 -1351 810 841 -930 -1776 -490 203 -259 -653
2475 -653 -667 -478 -762 162 -384 -969 -1181 -141 414 -816 -1134 -564 407 -537 -1384 -501 728 -5 -1167
2494 -1167 -763 206 -144 -211 -421 -706 -797 -5 473 -308 -1149 -258 1203 419 -1589 -1128 1176 1075 -618
2513 -618 -1416 181 1169 30 -971 -161 491 327 251 452 433 297 651 887 96 -245 1015 1337 320
2532 320 -575 675 1562 801 -980 269 1504 1386 -121 80 883 1162 180 343 519 265 412 826
2550 826 441 -389 -309 1407 972 -294 -717 751 1580 290 -872 -305 1071 443 -279 -862 388 372
2568 372 -540 -480 -464 -511 -376 -682 -1402 -1642 -603 204 -1580 -1860 -939 506 -600 -1919 -1567 498 201
2587 201 -1018 -1507 -229 -195 -444 -787 -513 -831 -194 9 -201 -781 -1367 -240 390 -832 -1725 -312 647
2606 647 -302 -1545 -590 149 732 -271 -315 830 544 536 715 191 442 1014 1528 647 -298 746 2107
2625 2107 1341 -440 -236 1782 1961 -247 -520 1074 1583 367 -687 384 1082 534 229 567 426
2642 426 274 841 941 276 404 1062 1273 391 -276 644 1642 645 -810 122 1306 734 -594 -492 439
2661 439 120 -328 -200 -333 -851 -490 542 -133 -1400 -966 1076 1104 -808 -1155 757 1326 -368 -1275
2679 -1275 733 1476 346 -570 280 1493 431 -211 -103 786 600 616 268 -23 -420 590 1398 147
2697 147 -1274 -201 1971 1109 -1176 -613 1206 1630 142 -479 501 1065 333 181 662 200 26 601
2715 601 921 72 -851 291 985 26 -1220 -372 871 324 -1035 -432 958 338 -1457 -705 447 342
2733 342 -580 -693 -115 202 -123 -366 -360 -1283 -627 434 86 -1630 -1931 120 681 -959 -1505 -150 774
2752 774 -366 -1018 -134 774 106 -606 -266 611 -130 -147 351 178 -609 -277 876 83 -910 -456 520 239
2772 239 -831 -682 552 726 -385 -688 632 995 398 -73 491 991 649 1351 990 338 580 1374 1583
2791 1583 580 -304 984 1797 432 -779 309 1388 839 -835 -863 610 635 -226 -432 6 377 181
2809 181 278 272 -120 -96 681 655 -32 141 831 1142 184 -131 833 1044 -243 -791 -36 325 -149 -837 -699
2830 -699 -608 -753 -762 -631 -1260 -1262 -489 -317 -1102 -1696 -790 533 -156 -1582 -936 349 656 -765 -1413 -342
2850 -342 257 -128 -582 -736 -592 -306 -481 -665 -1118 -963 -535 -996 -1156 -845 -286 -259 -1017 -1541 -520 374
2870 374 -403 -1182 -627 170 538 -352 -340 59 308 409 355 -34 -13 251 1163 164 -716 92 913 673 -269
2891 -269 -783 407 831 139 -987 -323 230 428 145 154 185 785 367 385 504 625 1420 1049 -182 231
2911 231 1273 1435 307 -415 179 1428 649 -403 -141 578 1237 82 -443 -59 284 133 -136 -628
2929 -628 -289 -31 134 362 -580 -565 288 455 -162 -718 74 673 175 -210 -328 106 445 -261 -426 -384 140
2950 140 -147 -279 -787 -639 126 144 -867 -1161 -579 369 -543 -1293 -1101 329 310 -845 -939 -179 259 302
2970 302 -495 -264 289 634 258 -138 80 280 614 214 -329 30 380 630 32 -387 -32 299 18 -588
2990 -588 -457 96 265 -335 -395 -465 -21 90 -131 -644 -391 730 560 -64 -570 -12 549 404 -36 -481
3010 -481 349 878 311 -868 -672 502 385 -209 -616 45 572 -259 -903 -1050 -223 -131 -527 -870 -708 115
3030 115 -54 -26 -776 -38 172 338 -40 -635 65 451 555 46 283 695 625 349 270 251 663 534 234
3051 234 105 670 554 465 201 -106 -65 877 623 -396 -660 92 757 354 -583 -453 395 1080 485 -317
3071 -317 165 960 564 -36 0 593 1014 652 298 180 540 616 302 -185 -322 105 390 -11 -617 -409 362
3092 362 -445 -1099 -680 -145 110 -646 -714 -566 -52 -529 -543 -930 -588 85 99 -362 -594 -707 395 209 -594
3113 -594 -537 -115 319 -402 -989 -707 35 16 -1167 -1110 -500 53 -557 -967 -1312 -571 -421 -414 -1006 -1121 -317
3134 -317 575 -496 -1084 -165 641 366 -687 -637 391 1164 333 -169 111 854 739 243 -21 451 152
3153 152 239 375 298 -93 290 311 -268 -597 431 761 320 -530 -473 829 1043 -19 -366 240 1031 1036 106
3174 106 -406 338 635 725 431 -223 311 1149 931 -36 -228 603 926 254 -260 64 777 -68 -1019 -379
3194 -379 362 88 -764 -603 -48 144 -330 -515 -428 -308 166 456 -444 -1015 -102 947 604 -784 -730 495
3214 495 835 25 -749 -143 625 101 -189 145 -5 -145 117 47 -541 -524 55 -11 -643 -844 -314 667 -89
3235 -89 -900 -229 714 338 -666 -365 693 790 274 -321 606 981 658 304 -268 -499 536 763 314 -343
3255 -343 -367 600 352 -363 -902 -215 581 -369 -780 -442 12 -49 -510 53 237 -418 81 179 140 -360 563
3276 563 937 617 -14 -12 1050 379 -425 -476 600 654 -320 -677 210 777 -28 -311 -481 238 413 500 -62
3297 -62 -265 63 736 815 -19 -187 949 1125 581 -142 820 1648 779 -110 418 894 807 240 -81 511 457
3318 457 74 231 332 -192 117 540 435 2 180 696 516 -24 -136 534 1299 361 -346 78 1025 636
3338 636 25 -364 214 -141 596 17 -496 -568 -87 -210 -723 -893 -435 609 -427 -1494 -1004 360 162
3357 162 -1137 -871 298 410 -454 -832 -250 -267 -244 -328 -153 -722 -752 28 -568 -1007 -833 -77 -143 -705 -1475
3378 -1475 -577 395 -285 -1235 -716 276 -98 -430 -300 -168 231 127 480 128 -187 301 846 572 -31 114
3398 114 1226 608 -341 -540 782 1067 63 -294 376 775 -62 -422 312 488 425 5 222 201 282 656
3418 656 219 133 -246 340 950 420 -471 67 424 173 -653 -317 146 261 -405 -453 208 103 15 -374 -478
3439 -478 -450 -309 -144 -331 -747 -942 -155 192 -582 -941 -210 254 -66 -1029 -452 -55 -52 -944 -630 105 57
3460 57 -180 -271 -614 -221 282 244 -124 -307 178 942 363 -479 53 911 714 -66 -283 699 882 -27 -534
3481 -534 12 509 343 -171 -399 -177 -192 -48 -95 -681 -506 -94 271 22 -508 -88 583 335 -368 -115 297
3502 297 247 -79 -513 -14 209 -61 -122 -800 -372 -155 -181 -571 -1241 -1108 -727 -571 -1339 -1228 -211 -184 -828
3523 -828 -1342 -728 209 -96 -687 -766 -90 97 -105 -160 101 101 610 171 -63 -254 -29 428 310 -255 -306 244
3545 244 224 -439 -442 -289 163 -164 -175 -203 252 633 -45 290 451 761 889 292 397 745 1315 1233 648 382
3567 382 1039 1291 692 286 293 1023 1208 447 123 670 779 115 -99 -342 -253 365 489 -220 -333 198 224
3588 224 -179 -475 -31 -67 278 82 -503 194 626 213 -142 193 -26 288 -85 -238 -370 93 -117 -161 -528
3609 -528 -715 -386 167 -484 -759 -667 -76 -560 -798 -924 -287 413 -329 -927 -257 48 100 -364 -724 215 371
3630 371 346 -450 -410 -126 810 699 -363 -197 289 687 -239 -388 -196 228 168 -517 -58 -122 364 5 -281
3651 -281 -54 316 212 -243 43 263 93 532 388 -94 380 308 355 106 -169 366 586 402 -287 -197 54
3672 54 587 -183 -575 -281 97 295 -104 -523 169 409 182 -215 -620 257 320 9 -116 20 371 432 -179
3693 -179 -307 -127 337 656 -51 -230 -30 551 81 7 -42 50 352 -160 -46 38 340 204 -199 126 -28
3714 -28 324 107 -130 -377 79 471 412 -14 -369 253 452 144 -473 -17 73 121 -262 -347 30 341 -256 -521
3736 -521 -649 224 94 -394 -669 -706 125 29 -261 -848 -262 285 -182 -524 -391 -232 59 -338 -369 -637 -19
3757 -19 -167 -83 -449 -78 267 344 -185 -292 -250 483 -67 -412 -342 -68 229 -87 -328 -200 173 -48 -112 -265
3779 -265 9 124 -13 -15 -116 190 469 459 -139 -789 234 229 33 -355 -38 361 586 -346 -304 -38 637 18
3801 18 -299 -449 417 208 219 -157 -424 128 266 232 -41 -80 393 387 -114 -368 239 737 -6 -269 -86 560
3823 560 644 321 -255 199 205 277 152 -2 334 326 601 350 -406 288 370 852 66 -192 261 796 341 -262
3845 -262 193 889 604 -296 -189 577 802 405 134 160 373 337 441 103 -365 267 641 92 -601 -83 387
3866 387 122 -487 -423 154 107 -7 -746 67 -144 -233 -388 -453 -305 -455 -151 -69 -469 -548 -83 258 -619 -643
3888 -643 -83 69 -229 -673 -482 174 115 -267 -569 -472 -63 -2 122 -146 -137 168 346 203 -432 -61 510 23
3910 23 -511 -714 449 545 -262 -395 459 892 -76 -351 40 194 294 234 146 548 259 627 489 256 554
3931 554 417 708 515 3 220 495 539 -152 -75 445 516 183 -135 -67 131 126 44 -195 -115 248 407 71 -519
3954 -519 80 346 431 -263 -332 362 661 156 -553 -132 662 451 -557 -413 217 -58 -379 -380 -648 -221 -251
3975 -251 -414 -423 -57 -212 -13 -66 -419 -236 556 -117 -370 -316 332 579 277 -84 19 260 324 26 -92 89
3997 89 -85 534 208 -10 -287 -154 -13 -107 -651 -159 151 46 -276 -576 -197 97 -37 -482 72 111 298
4018 298 -232 -91 46 51 68 -132 64 37 481 53 -763 -672 103 243 -555 -1068 -206 89 -434 -841 -851 -331
4040 -331 36 -332 -206 -605 -162 -60 -193 -358 -101 37 236 -40 -384 -36 198 312 -356 -555 176 182 -193
4061 -193 -447 -43 224 -202 -157 196 -118 237 -140 136 47 101 378 618 -20 -208 370 736 460 -187 12
4082 12 728 515 -99 253 475 374 160 34 62 295 185 207 405 -209 -154 181 178 -297 59 254 265 29
4104 29 -60 372 344 273 -413 -7 -6 167 -216 -9 -104 25 109 -319 -173 -3 411 66 -181 -270 -536 282 -4
4127 -4 -609 -407 -3 -221 -501 -607 -344 181 -165 -200 -539 -237 -306 -338 -221 -521 -5 132 -129 -98 -181 275
4149 275 538 158 -361 -6 458 156 -102 85 531 317 116 125 -64 250 304 -106 -48 -148 140 14 -216
4170 -216 -441 -415 -71 316 -186 -619 -343 412 213 -384 -129 336 385 -309 -149 112 193 233 265 -292 250 475
4192 475 426 -14 -183 -29 90 -185 -313 -278 -253 -196 -290 -718 -201 106 -122 -86 -67 116 166 274 154 249 395
4215 395 368 285 166 107 866 384 445 -179 287 702 537 20 194 60 123 -45 -208 -162 390 8 -120 -298
4237 -298 -272 287 68 -151 -101 -107 193 141 -122 35 275 112 205 25 -3 491 210 -75 -7 500 242 52 -77
4260 -77 -103 -391 34 -107 -687 -503 -325 18 -178 -433 -296 -430 -240 -443 -446 -47 134 -422 -295 -307 52 -145
4282 -145 -41 -473 -83 -174 180 254 -408 -94 6 254 -84 -334 197 -117 -157 -314 -368 0 -63 -317 -334 -321
4304 -321 69 -176 -388 -232 -63 387 -81 -270 -278 418 595 376 7 165 432 274 109 12 647 653 415 82
4326 82 333 -37 190 90 -263 -100 -163 204 -260 -91 -47 -25 -81 180 -134 -203 106 265 -129 -340 181 444
4348 444 -62 49 210 526 322 -22 -174 19 425 46 47 -304 283 232 -44 -11 -172 296 187 -47 -105 -68
4370 -68 99 85 -101 -462 -140 369 46 -123 -238 -224 508 168 -19 -88 248 243 -80 134 -88 315 87 -310
4392 -310 -275 -67 99 -26 -247 -660 -8 256 -16 -367 -312 74 266 -336 -303 -115 372 -114 -307 -128 28
4413 28 99 55 -125 -354 119 140 103 -124 -116 157 48 -293 -127 95 -7 -110 -429 64 235 219 329 -149 157
4436 157 202 -60 188 -16 -231 -106 62 -13 -288 -246 525 230 215 -327 156 196 324 -402 -112 475 211 223
4458 223 -291 180 456 513 -74 134 348 459 227 75 -74 209 641 51 -225 231 264 197 -212 -381 116
4479 116 -66 34 -94 161 -81 -153 106 481 148 -44 226 -11 -71 264 327 -127 57 -134 181 250 -62
4500 -62 -174 -111 521 53 404 -222 40 10 202 -358 -334 121 115 242 -174 -384 -185 -78 -114 -454 -118 65
4522 65 390 -428 -13 8 148 145 -159 43 -50 124 -373 -423 -64 250 42 -300 -230 28 262 262 -155 -221 185
4545 185 1 -395 -391 -41 33 290 -148 -363 127 -221 -157 -252 -56 -239 -6 153 42 -298 66 267 -17 -147
4567 -147 -469 36 97 -342 -460 -138 116 -28 -242 -144 -122 183 -128 -262 -147 -52 223 125 -357 -139 120 438
4589 438 348 -222 -26 414 228 67 -123 -7 276 102 -30 217 167 459 203 146 108 195 264 188 35 -173
4611 -173 312 256 -83 -153 58 575 60 -329 285 337 47 -38 -209 -356 195 214 -300 -88 -396 327 261 -164
4633 -164 -146 -63 153 -93 -359 -112 568 520 -31 -194 83 272 -99 -272 -1 174 -212 -459 -263 -227 68
4654 68 -163 34 -192 -295 145 75 -363 -69 -199 -139 20 -410 -272 148 128 -134 -303 -233 216 -15 -105 219
4676 219 -45 -187 -144 138 -243 -303 255 105 -207 -208 -217 239 -149 -306 63 47 -99 32 -297 -180 334 209
4698 209 16 299 276 -60 272 81 170 195 -3 147 102 180 448 339 113 -462 300 -16 373 -29 -310 138
4720 138 -153 139 -8 -398 -107 292 97 -45 194 152 -12 -57 -370 549 565 71 -11 -2 487 214 -67 -58 224
4743 224 315 -54 -19 -193 246 -7 447 56 62 8 -124 62 -75 -146 509 228 -158 -28 -17 315 69 -274
4765 -274 130 267 -90 -157 -372 -203 -125 -195 363 -5 -18 -223 5 -148 -437 -2 5 -25 -169 -106 -323 103 30
4788 30 -381 -326 -172 213 98 -357 -41 98 -65 -295 -204 35 -57 39 -141 -172 76 386 -63 -399 -64 299
4810 299 -66 -228 -233 314 154 193 -31 198 112 42 136 -286 -152 -263 148 -134 -297 -69 -57 31 42 133 -83
4833 -83 33 -37 143 171 -18 80 413 375 256 302 342 420 -141 102 52 377 2 -196 128 245 -14 -100 -109 338
4857 338 243 21 -81 -250 202 139 86 -239 6 200 222 -120 13 65 187 188 -134 84 46 377 -9 -167 76
4880 76 -204 99 -168 162 -22 -37 20 -151 -374 -41 -200 -3 -247 -110 165 69 -213 -449 355 117 37 -68
4902 -68 -126 56 208 136 -263 -124 122 -32 145 -192 22 160 -48 -118 -362 -335 85 166 -477 -68 26 204
4924 204 167 -479 -369 166 245 -145 -113 -30 -50 -59 -252 191 -353 207 -134 -302 -338 3 215 -211 -45 -20 -161
4947 -161 215 -48 72 50 324 -48 48 -144 -111 110 -179 100 -46 57 118 130 -287 220 107 112 -39 -240
4969 -240 140 -40 399 -75 -70 293 107 189 147 69 -22 216 -244 154 158 198 69 -17 109 -106 195 -386 134
4992 134 136 82 46 59 -42 -106 -18 18 29 -72 49 50 145 51 -17 247 203 159 -384 120 74 15 45 -69 -295 54
5018 54 187 -304 -406 117 129 -131 -310 -367 67 251 229 -308 -173 463 201 -283 -25 164 28 -22 8 -203
5040 -203 9 246 -234 -175 -159 71 -59 -110 -60 -116 83 141 -211 -57 75 -20 -212 181 2 3 -57 -39 -412 10
5064 10 72 120 86 -220 -155 46 163 -187 -196 50 62 -77 23 -220 18 166 24 -174 68 116 87 -331 -151
5087 -151 -67 91 -52 76 107 -39 121 60 108 160 -77 418 2 38 214 214 232 -86 232 225 254 -215 -324 -110
5111 -110 471 255 -163 259 38 127 70 21 29 49 -55 222 203 -211 126 -45 -78 103 -114 60 -164 -457 6
5134 6 125 83 -173 437 -56 -17 245 -62 73 -277 94 406 221 -249 117 35 529 398 -229 -114 -116 -158 -153
5157 -153 -255 35 -177 -203 -188 -67 -5 -81 213 -293 -374 152 -91 -359 -247 214 133 -233 -344 -496 -5 277
5179 277 231 -93 8 -38 -1 -166 -222 -91 154 -237 235 -374 -23 29 -120 -134 -118 70 116 -281 46 21 -13
5202 -13 -130 -76 -498 -129 110 -70 -112 62 123 76 268 182 -258 -75 -86 14 40 124 145 25 50 -260 297 75
5226 75 -170 -207 10 -81 -146 -38 74 171 -88 170 -197 -338 173 337 294 -135 -197 141 302 247 62 -135 131
5249 131 41 -30 -268 269 57 339 -139 -168 52 -6 138 -45 181 -53 38 25 68 43 -260 46 242 -196 21
5272 21 164 14 -455 -155 118 41 -140 269 -6 99 162 84 -241 161 48 66 -15 46 7 262 -195 -568 401
5295 401 18 161 -134 -103 -102 11 78 35 -221 -221 -255 115 66 116 -138 -179 39 -54 -199 -244 -55 -71 -153 -83 14 -17
5321 -17 -171 -2 -106 102 -15 -75 -126 332 191 324 80 28 -65 27 -213 -210 35 -125 -77 -410 -95 -134 -51 124
5345 124 -11 -145 -86 20 245 299 144 26 166 529 5 -112 280 -55 -334 -194 266 199 -1 -331 -195
5366 -195 160 246 -31 113 22 46 400 81 87 -21 346 214 -152 -86 -167 313 203 -171 88 180 308 -175 64
5389 64 138 352 43 -502 144 166 77 66 -129 20 -208 -185 -9 -51 -151 57 102 -50 -168 85 75 157 -166
5412 -166 138 37 162 53 -186 239 189 -409 77 10 -1 33 44 179 -188 -208 -153 -168 116 160 54 -55 -19
5435 -19 -138 -85 -163 70 -92 71 193 -68 285 -378 42 180 133 -122 -239 -157 150 213 -195 -113 -64 28 162
5458 162 182 4 100 137 4 -369 135 158 218 -353 -232 17 82 116 6 -269 -44 16 192 31 -121 -224 -216
5481 -216 -74 -144 117 -44 -196 -79 -187 191 171 72 -107 69 146 472 20 41 129 120 -23 -129 105 350 265
5504 265 -118 -28 -53 -86 85 137 138 -88 -52 334 163 -140 279 172 370 151 -18 113 -19 -38 27 -406 85
5527 85 167 286 -62 167 353 168 -89 -138 48 93 -5 120 54 29 322 147 286 185 37 145 63 -265 92
5550 92 -78 -142 -28 -226 -131 38 123 418 152 -106 75 -413 -45 12 -80 -176 201 27 -84 -175 -104 32 -277
5573 -277 -394 185 -83 -77 -298 -219 -241 116 -32 -167 180 93 -82 -200 41 102 123 -95 94 -82 408 100
5595 100 -92 -177 114 351 -53 45 -218 -144 -77 -183 -67 172 153 168 -125 148 514 -55 -74 62 -185 79
5617 79 31 82 -52 -224 4 112 251 -191 -92 -98 -43 72 -316 122 191 20 -191 144 474 -189 137 -261 123
5640 123 115 49 174 82 18 -58 -275 -331 -118 57 220 58 189 -75 117 4 4 91 140 -178 150 -303 -117 326
5664 326 284 -76 326 -145 160 17 118 -105 -88 105 64 -386 -108 -169 61 -223 -247 -309 -123 134 -55 -260
5686 -260 79 279 -60 -143 -182 106 69 234 -61 118 177 147 -134 -62 -281 149 -228 105 -163 -8 -54 -18 -59
5709 -59 -320 -95 270 118 -110 -117 131 133 56 -84 -127 79 -8 130 77 102 -344 87 -76 -163 -118 33 -81 258
5733 258 -362 108 101 74 -32 243 36 -207 -20 -19 -91 -81 -8 147 90 -138 -74 -9 24 -369 -136 75 -42 -121
5757 -121 76 -172 143 -21 -93 447 117 -142 -313 -26 161 223 -150 11 -164 -44 58 -89 60 -176 182
5778 182 77 225 197 379 255 72 94 26 152 44 -85 161 104 166 76 53 -118 -64 140 251 61 13 62
5801 62 22 -173 98 -13 13 143 -246 -376 11 86 128 -70 -38 267 9 -240 198 151 -82 289 -203 -259 -249
5824 -249 123 102 245 158 34 13 -56 -143 -217 -144 -305 17 -38 -57 147 -108 13 -134 102 59 94 -91 54 -110
5848 -110 -258 -364 264 265 25 -71 -11 -228 -284 30 115 79 -75 -132 -117 -207 96 31 1 -58 84 -1 -76 90 -103
5873 -103 94 99 -17 275 149 -124 203 311 -71 -97 65 127 -165 91 -298 -107 196 13 114 11 354
5894 354 -35 199 65 -42 166 73 68 212 144 93 -76 89 -87 -142 48 -178 -7 -287 -85 -183 -6 -149
5916 -149 -183 305 -117 24 -33 -267 -125 10 -56 -70 2 -47 178 -247 -28 -126 324 37 -188 -320 -122 266
5938 266 65 -22 89 3 -178 208 198 -427 52 104 41 -221 -125 58 44 -16 -3 -49 77 5 32 -32 -84 153 83
5963 83 117 251 14 64 149 -77 67 105 -3 -157 -203 4 62 104 85 -56 -394 354 -113 109 -197 -129 -11
5986 -11 244 -145 87 -74 56 18 28 -38 -323 112 153 -319 139 12 122 18 -17 288 158 -210 229 102
6008 102 -15 190 -175 -5 90 -59 -67 21 6 37 146 55 169 -247 -80 194 105 21 76 320 220 -151 -250 156
6032 156 -50 91 397 -196 162 132 -363 -429 136 -75 89 116 -33 -194 -1 -173 -21 148 206 332 146
6053 146 77 55 -34 234 13 88 -36 -92 84 -149 -198 403 -116 -122 -25 -56 -2 -74 -26 -338 -105 142 520 -67
6077 -67 3 -97 176 -164 -93 66 -179 -487 -90 -435 -192 474 402 -209 -35 -144 -214 -1 105 -58 37 151
6099 151 -126 219 148 -142 -23 -72 36 -2 126 -135 -369 -38 258 51 -118 161 276 -124 -141 244 85
6120 85 -109 -58 246 -224 -239 -3 90 158 140 -38 355 184 -56 -104 -44 -216 168 -18 -38 -246 -56 -34 -129 -2
6144 -2 197 -140 -27 -193 -147 -85 -59 335 19 -330 241 137 -150 11 -46 101 68 14 162 -267 -100 228 142
6167 142 -40 51 184 -243 -47 13 -23 54 17 -207 -162 144 244 -214 -38 -240 -29 206 -7 -20 -87 46 184
6190 184 99 132 70 -111 41 12 282 157 105 -13 -68 -251 -15 33 343 228 -68 379 -115 134 -335 112
6212 112 169 107 153 93 -176 -34 113 -133 -12 31 -313 -257 -81 -153 135 -139 138 9 -13 56 -53 -5 -176
6235 -176 268 40 -75 -61 180 -92 -1 -357 -137 126 59 227 14 -60 260 -42 -20 107 -153 73 41 -348
6257 -348 274 12 31 187 -82 146 -232 -86 -74 141 293 148 -23 155 263 36 140 47 250 225 -111
6278 -111 152 92 88 159 -487 130 -184 -44 -165 -167 320 39 99 -212 -12 157 5 -18 17 -16 242 47 97 -118
6302 -118 -94 -45 -299 27 307 63 280 209 143 335 -218 -69 -83 99 -12 -52 52 -175 102 -73 65 180
6324 180 113 -4 156 92 -325 13 123 -151 -158 -161 -112 -29 47 73 301 -203 -178 269 112 -107 -5 -80 -124 -166 -109
6349 -109 329 52 29 -78 -110 -17 359 -158 -92 18 -291 148 91 82 96 -162 60 14 -68 186 10 -205 110
6372 110 -101 -202 -90 206 -33 -320 61 241 -208 204 150 2 -83 293 2 144 213 -22 217 -184 36
6393 36 -401 -52 2 82 -120 -177 181 37 70 38 171 182 202 -92 -109 -349 -88 -43 131 -61 159 79 175 -51
6417 -51 -77 -86 -213 87 -285 -363 29 288 104 -214 -70 -175 -296 340 -197 -297 -134 273 -105 112 174 -22
6439 -22 -25 -11 -80 203 81 -157 -85 -343 46 -63 18 170 84 -157 133 -18 155 125 -59 133 87 18 -19 312
6463 312 199 80 -123 -258 -102 -137 135 -220 212 127 5 228 -278 -136 200 -33 97 53 -71 436 -209
6484 -209 216 -162 76 10 172 391 -113 -32 -205 -163 -176 115 303 -8 -108 76 121 -198 21 -243 -48 -64
6506 -64 -34 115 4 93 237 46 -216 47 -46 -276 -71 -57 135 156 -201 129 -112 -292 266 177 143 21 213
6529 213 65 123 -89 45 -25 -66 -97 4 139 -114 -265 159 65 -95 -133 -68 69 249 -246 353 106 50 135
6552 135 47 55 -28 -4 111 -174 -227 33 -173 -1 -142 -68 33 -170 145 -214 200 43 237 27 91 -73 296
6575 296 -13 -34 248 -117 -170 -167 299 -86 -97 74 162 20 15 -193 152 6 -254 -79 37 -197 16 132 74
6598 74 -136 307 -162 35 1 -180 44 -139 -289 -7 -59 306 -212 139 -123 186 -215 127 -100 -155 72
6619 72 141 19 -158 -37 -87 -21 129 119 -191 -199 -204 69 -59 -167 258 -20 -28 173 174 -207 126 96 14 -55 -130 172
6645 172 -271 -116 179 -72 179 -23 -64 -29 155 -166 -413 -283 -100 -60 -38 70 47 275 135 -22 335 61
6667 61 11 -194 -125 20 184 13 -11 28 12 -223 -105 48 -4 72 -147 -59 -57 -18 -23 -45 187 -197 89 -214 -130
6692 -130 209 -95 -135 -72 140 -119 -65 204 -351 -81 168 -265 6 -153 -103 -54 -144 -195 -115 54 80 -107 -107 55
6716 55 -283 -27 -102 -28 -22 -110 -44 209 450 -2 -63 61 164 -163 -235 -346 -158 -34 167 -123 135 150 68 137
6740 137 180 -21 170 78 -180 -131 77 -169 -60 -182 -24 -118 251 358 -237 11 77 -119 295 123 -145 195
6762 195 -50 102 179 -165 -184 181 -77 93 1 192 -34 220 251 -122 -33 261 79 23 -35 -114 -9 179 275
6785 275 -276 -28 64 -151 -41 -340 51 -102 246 230 17 -231 28 271 -193 -105 104 -56 -69 -39 47 -196
6807 -196 198 -391 -231 97 117 112 -178 10 223 177 348 43 -39 -280 1 -39 -31 88 59 -134 231 -158 165
6830 165 -59 59 -10 199 308 -32 47 8 138 -116 14 12 -43 36 9 204 -100 -189 -13 61 -297 438 -149
6853 -149 168 20 94 16 -63 -91 -43 -422 203 269 22 136 -112 -68 -85 -54 -100 76 -48 -59 -252 52 181 172
6877 172 -164 154 -68 314 -166 251 170 160 -1 -10 65 -5 112 49 -235 -29 31 129 -124 -136 55 474 295
6900 295 -280 154 -54 56 42 248 -310 133 -37 153 -176 -54 71 57 86 36 -143 -127 -63 62 165 139
6922 139 180 -40 -22 101 -207 -24 111 5 -41 -252 -181 -33 14 -57 -28 21 -52 45 61 96 -189 37 117 -73
6946 -73 124 -266 -89 246 -27 -258 -17 104 204 -92 202 23 -207 -183 6 -229 41 50 288 -156 -22
6967 -22 -51 115 119 95 45 95 -13 -124 -174 122 92 -265 59 -438 13 -29 175 -240 -405 -67 76 -91 -213
6990 -213 32 -33 -20 -42 124 -43 265 -72 -79 -76 -283 -68 -92 -110 -14 -152 -67 131 -88 -76 37 261 -69 100
7014 100 -73 -3 -32 -40 261 -25 61 -187 31 -231 -291 -131 387 4 -337 116 49 -15 -116 22 -141 127 -378
7037 -378 -90 -23 180 99 -47 -95 5 218 -57 128 -16 -143 -92 181 -73 -107 -88 56 -280 217 -191 125
7059 125 -20 11 89 88 134 29 168 -19 277 -169 -35 -4 -209 -185 32 54 -175 -148 -129 -106 -7 4 -106 12
7083 12 -78 264 -28 120 158 -157 -54 140 -6 -9 -182 -93 -299 137 -183 -16 -98 -52 -184 -96 -289 -21 -96
7106 -96 100 112 60 3 -125 -60 111 122 75 32 332 -113 -140 -98 -98 -348 178 -138 31 -241 170 -171 -58 -87
7130 -87 37 -50 -99 -7 -38 52 45 125 107 -79 102 177 78 154 45 97 -185 54 -141 192 262 -309 -25 -9 -197
7155 -197 -280 7 -18 71 -106 104 77 -252 289 -51 244 -23 -21 32 -317 18 67 275 -199 -110 -18 122 42 29
7179 29 -76 -187 -231 -168 77 1 -201 23 -39 0 -97 -231 -236 191 -83 -81 77 -291 197 280 10 -142 52 -81
7203 -81 -154 -141 16 26 -60 116 -249 90 -25 167 -141 433 -36 106 -116 -8 136 -276 152 -113 285 -289
7225 -289 -297 163 142 94 -16 -209 -288 148 162 -28 -134 -68 54 -149 128 45 -364 -42 463 11 -138 286 -3
7248 -3 169 119 108 -356 98 -71 -225 148 178 14 -165 122 87 -20 125 170 217 14 -221 58 140 -5 3 -146
7272 -146 -44 -106 -210 83 171 -227 233 -62 34 -69 233 -162 -306 386 29 -408 -28 -180 111 -311 -68
7293 -68 14 148 160 92 74 48 -53 187 74 -366 -89 -11 110 152 32 -80 -125 106 120 207 44 -422 119 -15
7317 -15 -220 -229 -23 -15 -250 24 -14 198 14 20 44 8 34 196 -218 160 -301 -200 -73 130 -119 -235 -174 -179 206
7342 206 310 -85 -300 -127 282 -45 -75 -89 -65 -79 -25 -19 -290 22 -67 -4 44 86 -247 163 -201 32 -141 -92
7366 -92 34 -213 -37 84 106 -126 -24 -168 -79 236 -268 -100 -11 -98 318 263 105 -30 -10 -81 119 182 265
7389 265 86 -41 -151 -137 233 84 -203 -79 -74 386 77 -53 -276 181 -197 272 48 153 72 -309 -43
7410 -43 -49 -100 258 84 -33 -66 123 57 -117 2 177 -87 162 -19 -137 121 62 -44 224 94 -16 85
7432 85 -25 -77 81 -247 -85 -64 -27 -145 -26 -33 -309 62 2 -347 10 -164 252 105 37 58 -18 -48 -120 86
7456 86 6 -170 -79 -101 -361 -116 185 46 -94 128 -231 98 8 -121 75 -127 44 -170 -127 276 -229 -54
7478 -54 60 -320 -96 94 -208 -74 -96 -21 -237 -181 41 154 96 -83 -44 -120 -114 -271 -3 -18 -85 166 -185 83
7502 83 -14 152 112 -12 -78 -42 188 138 -110 -175 268 83 43 -83 95 -37 259 18 119 349 -268 -385 -251
7525 -251 -100 -360 284 107 266 -31 275 28 63 252 110 -87 22 258 110 63 -50 -284 261 88 -315
7546 -315 -138 14 -343 173 -81 -164 107 30 -63 -159 95 8 44 -50 -107 -204 29 -35 -150 13 38 -180 80 -68
7570 -68 -86 -104 -234 143 -156 118 -206 -163 -186 -260 -286 -58 317 165 5 -246 5 -479 -17 -48 -58 -133 1
7593 1 -101 -237 -15 162 206 340 -202 -73 -367 -11 -153 59 35 -312 63 -121 -90 -94 67 -95 -176 -67 41
7616 41 75 -66 157 -249 77 -93 116 -168 -62 106 85 295 -119 179 17 271 100 -57 -73 -53 18 -31
7638 -31 -2 16 141 -69 -253 25 156 3 158 -88 9 -50 -72 -137 3 -175 22 116 -145 219 274 84 16
7661 16 -72 265 -75 -272 28 320 -334 296 354 -62 -32 191 -28 178 53 7 -30 48 -28 72 -155 164 -61
7684 -61 68 -30 306 -166 -88 187 -138 4 -49 57 192 25 252 250 83 -44 -218 110 38 -58 -42 -112 -72 32
7708 32 -219 19 -15 152 -90 -27 -224 -55 471 -56 -62 320 33 -23 137 -42 -9 242 -363 -136 -1 87 330
7731 330 160 -26 -129 -170 -138 -19 -12 111 112 28 -46 -10 275 -13 -132 97 -166 9 -69 -139 16 -46 84 118
7755 118 -278 -15 54 334 -36 227 209 -48 -186 -79 -104 346 -25 92 53 -37 164 232 77 142 43 86 200
7778 200 -44 -247 -30 -119 -26 57 99 -49 13 64 -101 54 -87 57 -159 177 130 178 -3 -247 7 -28 -130
7801 -130 -75 -108 -18 -64 -271 -212 -368 -292 62 -20 -98 153 30 52 -213 9 -5 104 379 -224 -61 -156 -85 -196
7825 -196 -189 -98 -68 -27 127 -84 -135 -2 -65 9 -224 71 109 222 7 -156 127 -159 -35 -73 473 73 85 -56
7849 -56 -163 -188 36 -84 181 -279 -120 -23 -183 163 -28 -21 -38 -115 -244 58 -118 297 -1 -55 96 85 -85
7872 -85 -189 -22 -267 -17 241 161 -400 -137 -45 28 61 20 8 -132 59 23 73 -173 -143 -169 39 96 6 166
7896 166 111 22 114 -210 243 -199 -116 42 35 -7 310 -15 -109 200 -238 -73 -82 31 88 -160 -123 99 231 125
7920 125 -56 -178 177 -88 45 248 -254 256 -88 37 294 70 -107 64 33 171 -118 -38 324 -17 95
7941 95 -85 -137 -292 -81 -102 12 185 42 -46 112 -150 -50 130 -202 14 22 -57 90 -275 216 -58 -71 28
7964 28 -63 -79 -159 -120 -169 9 87 15 222 35 -163 -126 -5 -118 -111 -83 81 126 -247 64 40 85 28 -77 125
7989 125 73 -68 308 241 -13 104 -177 -113 -109 -23 4 110 -50 -172 73 14 -2 -9 -145 -112 105 -205 179 212
8013 212 72 -121 -86 94 466 -59 -71 287 -57 -103 -160 -283 13 120 151 -210 4 146 44 142 75 204
8035 204 -232 117 96 50 -47 -165 -10 -82 -181 -82 105 -116 79 195 -152 146 -163 -240 -55 56 95 -78 -275
8058 -275 -51 280 -72 239 -25 291 92 -87 -475 35 -60 -105 6 -154 82 62 119 -97 -202 250 82
8079 82 132 -230 9 0 369 -17 -143 -61 -236 73 225 -97 40 -106 104 -117 -21 -55 105 -337 109 -224
8101 -224 168 -160 -91 -79 191 19 -223 231 -321 127 20 183 -152 33 -129 -78 -131 -5 468 100 -33
8122 -33 -4 -143 -57 -175 40 87 62 116 92 130 -112 -114 243 -52 -347 -105 123 97 214 288 -46 -126 81 -57
8146 -57 32 -129 14 -102 107 -66 151 179 127 43 19 -78 -96 162 90 1 149 238 5 135 -36 125 -90 -27
8170 -27 398 32 -104 47 210 -5 -60 106 524 156 -79 -84 281 2 -34 -239 236 93 -65 31 -47
8191d7
##END NTUPLES=NMR FID
##END=
