##TITLE=1H_SAV-51-f7
 CDCl3, 8 sc, 
 5.2.2020
##JCAMPDX= 6.0         $$ Bruker NMR JCAMP-DX V2.0
##DATA TYPE= NMR FID
##DATA CLASS= NTUPLES
##ORIGIN= UXNMR, Bruker Analytische Messtechnik GmbH
##OWNER= root
$$ XWIN-NMR		Version 3.5
$$ Wed Feb  5 16:37:59 2020 Russian Standard Time (UT+4h)  she@DPX200
##.OBSERVE FREQUENCY= 200.1315
##.OBSERVE NUCLEUS= ^1H
##.DELAY= (6, 6)
##.ACQUISITION MODE= SIMULTANEOUS
##.ACQUISITION SCHEME= undefined
##.AVERAGES= 8
##.DIGITISER RES= 18
##SPECTROMETER/DATA SYSTEM= spect
##.PULSE SEQUENCE= zg30
##.SOLVENT NAME= CDCl3
##.SHIFT REFERENCE= (INTERNAL, CDCl3, 0, 15.7039)
##AUDIT TRAIL= $$ (NUMBER, WHEN, WHO, WHERE, WHAT)
$$ ##TITLE= Audit trail, XWIN-NMR		Version 3.5
$$ ##JCAMPDX= 5.01
$$ ##ORIGIN= Bruker BioSpin GmbH
$$ ##OWNER= she
$$ F:/spectra/data/she/nmr/H-F/1/audita.txt
$$ ##AUDIT TRAIL=  $$ (NUMBER, WHEN, WHO, WHERE, WHAT)
(   1,<2020-02-05 16:36:55.73 +0400>,<she>,<DPX200>,
      <created by zg, POWCHK disabled, PULCHK disabled
       configuration hash MD5:
       00 E9 B6 7A A2 85 ED C7 34 08 36 98 17 FE 4E 26
       data hash MD5: 16K
       29 50 C7 EF 61 58 FA 97 73 4D 6F 78 E1 98 22 0B>)
$$ ##END=
$$ 
$$ hash MD5
$$ 0E 0D 74 F4 EF BE 08 2F FB 7F 5A 68 7F E9 8C D9
##$RELAX= 
##$RELAX= 
##$RELAX= 
##$RELAX= 
##$RELAX= 
##$RELAX= 
$$ Bruker specific parameters
$$ --------------------------
##$DU= <F:/spectra>
##$EXPNO= 1
##$NAME= <H-F>
##$PROCNO= 1
##$TYPE= <nmr>
##$USER= <she>
##$AMP= (0..31)
100 100 100 100 100 100 100 100 100 100 100 100 100 100 100 100 100 100 
100 100 100 100 100 100 100 100 100 100 100 100 100 100 
##$AQSEQ= 0
##$AQ_mod= 1
##$AUNM= <au_zg>
##$AUTOPOS= <>
##$BF1= 200.13
##$BF2= 200.13
##$BF3= 200.13
##$BF4= 200.13
##$BF5= 200.13
##$BF6= 200.13
##$BF7= 200.13
##$BF8= 200.13
##$BYTORDA= 1
##$CFDGTYP= 0
##$CFRGTYP= 5
##$CHEMSTR= <none>
##$CNST= (0..31)
1 1 145 1 1 1 1 1 1 1 1 1 1 1 1 1 1 1 1 1 1 1 1 1 1 1 1 1 1 1 1 1 
##$CPDPRG= <>
##$CPDPRG1= <>
##$CPDPRG2= <>
##$CPDPRG3= <>
##$CPDPRG4= <mlev>
##$CPDPRG5= <mlev>
##$CPDPRG6= <mlev>
##$CPDPRG7= <mlev>
##$CPDPRG8= <mlev>
##$CPDPRGB= <>
##$CPDPRGT= <>
##$D= (0..31)
0 1.2 0 0 0 0 0 0 0 0.06 0 0.03 0 0 0 0 0.0002 0 0 0 0 0 0 0 0 0 0 0 0 
0 0 0 
##$DATE= 1580906215
##$DBL= (0..7)
120 120 120 120 120 120 120 120 
##$DBP= (0..7)
150 150 150 150 150 150 150 150 
##$DBP07= 0
##$DBPNAM0= <>
##$DBPNAM1= <>
##$DBPNAM2= <>
##$DBPNAM3= <>
##$DBPNAM4= <>
##$DBPNAM5= <>
##$DBPNAM6= <>
##$DBPNAM7= <>
##$DBPOAL= (0..7)
0.5 0.5 0.5 0.5 0.5 0.5 0.5 0.5 
##$DBPOFFS= (0..7)
0 0 0 0 0 0 0 0 
##$DE= 6
##$DECBNUC= <off>
##$DECIM= 24
##$DECNUC= <off>
##$DECSTAT= 4
##$DIGMOD= 1
##$DIGTYP= 9
##$DL= (0..7)
0 120 120 120 120 120 120 120 
##$DP= (0..7)
150 150 150 150 150 150 150 150 
##$DP07= 0
##$DPNAME0= <>
##$DPNAME1= <>
##$DPNAME2= <>
##$DPNAME3= <>
##$DPNAME4= <>
##$DPNAME5= <>
##$DPNAME6= <>
##$DPNAME7= <>
##$DPOAL= (0..7)
0.5 0.5 0.5 0.5 0.5 0.5 0.5 0.5 
##$DPOFFS= (0..7)
0 0 0 0 0 0 0 0 
##$DQDMODE= 0
##$DR= 18
##$DS= 0
##$DSLIST= <SSSSSSSSSSSSSSS>
$$ [...]
##$SUBNAM2= <"">
##$SUBNAM3= <"">
##$SUBNAM4= <"">
##$SUBNAM5= <"">
##$SUBNAM6= <"">
##$SUBNAM7= <"">
##$SUBNAM8= <"">
##$SUBNAM9= <"">
##$SW= 24.9337058887773
##$SWIBOX= (0..15)
0 0 2 0 0 0 0 0 0 0 0 0 0 0 0 0 
##$SW_h= 4990.01996007984
##$TD= 16384
##$TD0= 1
##$TE= 0
##$TE2= 300
##$TE3= 300
##$TEG= 300
##$TL= (0..7)
0 120 120 120 120 120 120 120 
##$TP= (0..7)
150 150 150 150 150 150 150 150 
##$TP07= 0
##$TPNAME0= <>
##$TPNAME1= <>
##$TPNAME2= <>
##$TPNAME3= <>
##$TPNAME4= <>
##$TPNAME5= <>
##$TPNAME6= <>
##$TPNAME7= <>
##$TPOAL= (0..7)
0.5 0.5 0.5 0.5 0.5 0.5 0.5 0.5 
##$TPOFFS= (0..7)
0 0 0 0 0 0 0 0 
##$TUNHIN= 0
##$TUNHOUT= 0
##$TUNXOUT= 0
##$USERA1= <user>
##$USERA2= <user>
##$USERA3= <user>
##$USERA4= <user>
##$USERA5= <user>
##$V9= 5
##$VALIST= <valist>
##$VCLIST= <CCCCCCCCCCCCCCC>
##$VD= 0
##$VDLIST= <DDDDDDDDDDDDDDD>
##$VPLIST= <PPPPPPPPPPPPPPP>
##$VTLIST= <TTTTTTTTTTTTTTT>
##$WBST= 1024
##$WBSW= 4
##$XGAIN= (0..3)
0 0 0 0 
##$XL= 0
##$YL= 0
##$YMAX_a= 272694
##$YMIN_a= -190821
##$ZGOPTNS= <>
##$ZL1= 120
##$ZL2= 120
##$ZL3= 120
##$ZL4= 120
##$ABSF1= 10
##$ABSF2= 0
##$ABSG= 5
##$ABSL= 3
##$ALPHA= 0
##$AQORDER= 0
##$ASSFAC= 0
##$ASSFACI= 0
##$ASSFACX= 0
##$ASSWID= 0
##$AUNMP= <proc_1d>
##$AZFE= 0.1
##$AZFW= 0.1
##$BCFW= 1
##$BC_mod= 2
##$BYTORDP= 1
##$COROFFS= 0
##$CY= 11.3945322036743
##$DATMOD= 1
##$DC= 2
##$DFILT= <>
##$DTYPP= 0
##$F1P= 16.9975609425685
##$F2P= -3.02152046262296
##$FCOR= 0.5
##$FTSIZE= 0
##$FT_mod= 4
##$GAMMA= 1
##$GB= 0.15
##$INTBC= 1
##$INTSCL= 1
##$ISEN= 128
##$LB= 0.24
##$LEV0= 0
##$LPBIN= 0
##$MAXI= 10000
##$MC2= 0
##$MEAN= 0
##$ME_mod= 0
##$MI= 1.114404
##$NCOEF= 0
##$NC_proc= 0
##$NLEV= 6
##$NOISF1= 3.799351
##$NOISF2= 2.8
##$NSP= 1
##$NTH_PI= 0
##$NZP= 0
##$OFFSET= 15.70392
##$PC= 1
##$PHC0= -9785.919
##$PHC1= 13.40081
##$PH_mod= 1
##$PKNL= yes
##$PPARMOD= 0
##$PSCAL= 0
##$PSIGN= 0
##$REVERSE= no
##$SF= 200.130013532006
##$SI= 16384
##$SIGF1= 3
##$SIGF2= 2
##$SINO= 400
##$SIOLD= 16384
##$SREGLST= <1H.CDCl3>
##$SSB= 0
##$STSI= 0
##$STSR= 0
##$SW_p= 3612.71676300578
##$SYMM= 0
##$S_DEV= 0
##$TDeff= 0
##$TDoff= 0
##$TI= <>
##$TILT= no
##$TM1= 0
##$TM2= 0
##$TOPLEV= 0
##$USERP1= <user>
##$USERP2= <user>
##$USERP3= <user>
##$USERP4= <user>
##$USERP5= <user>
##$WDW= 1
##$XDIM= 8192
##$YMAX_p= 0
##$YMIN_p= 0
$$ End of Bruker specific parameters
$$ ---------------------------------
##NTUPLES= NMR FID
##VAR_NAME=  TIME,          FID/REAL,        FID/IMAG
##SYMBOL=    X,             R,               I
##VAR_TYPE=  INDEPENDENT,   DEPENDENT,       DEPENDENT
##VAR_FORM=  AFFN,          ASDF,            ASDF
##VAR_DIM=   8192,          8192,            8192
##UNITS=     SECONDS,       ARBITRARY UNITS, ARBITRARY UNITS
##FACTOR=    0.0002004,     1,               1
##FIRST=     0,             0,               0
##LAST=      1.6414764,     0,               0
##MIN=       0,             -190821,         0
##MAX=       1.6414764,     272694,          0
$$ Real data points
##PAGE= N=1
##DATA TABLE= (X++(R..R)), XYDATA
$$ [...]
2855C759k399n957K249N428j640n234J560N175k107m791K152N326k494n737K078
2870b632O243j594o484J283O475m23o063n42N574O71n058m07M623J73m690J4N501
2887B664l40n221l31N164J254n626j384N445J428m873j686M728K172m362k736
2902c704M236L138m030k400L124K910l668k511L855K463l446k984L873L275l386
2917G45m097L681M113k634m736J833N388j826m428J093M155r63m013J262M086
2932C659j456m367J713M741j153n257R01N187k51n467m33N545L60m796j162N263
2948C027R80m754j227M599J027m190j241M532R37m738r93M658J513n077j717M780
2964B116K282n158k829N098L122m700l283L895L909m061l305L422K711k965l307
$$ y = [3759, 1360, -4597, -2348, 3080, 1440, -3794, -2234, 2941, 834, -3957, -1805, 3521, 1027, -4710, -2632, 3611, 2017, -4467, -3184, 3291, 2868, -3195, -3737, 1837, 2508, -2550, -2957, 1666, 1839, -2851, -2837, 2664, 2324, -2897, -3228, 1936, 3190, -2436, -3820, 1625, 3053, -1820, -3506, 1222, 3394, -968, -3704, 532, 3670, -360, -2760, 364, 3274, -394, -2905, 950, 3413, -33, -3017, 856, 4131, 745, -3352, 329, 4442, 1808, -2928, -1095, 4293, 2467, -1961, -868, 3287, 2324, -1689, -427, 3659, 2203, -2164, -451, 4290, 3137, -2120, -1219, 3968, 3717, -1750, -2183, 3362, 3722, -1074, -2236, 3027, 4007, -747, -1974, 2625, 3652, -538, -1779, 2753, 3690, -1048, -2041, 2617, 4130, -947, -2664, 2116, 4398, -760, -3589, 1509, 4631, -69, -3352, 543, 4452, 391, -2914, 508, 3219, 254, -3053]
2979c053L464K855l412l280L639L867l730m667L711M720k885n045K229M708j223
2994A898m949J341M289j631l830J512M232j743m496J765M883j834m908J027N288
3009B844o94n209L66N005O56n441m98N122Q32m777j158M502J107m263j232M404
3025A566J085m677o71M609Q39m878j163M911K071n170k334M514L093m068l390
3040c663L316L528l090l358L176K791l087k477K911K983l151l658L862L360l367
3055G6l948K934M247k804m275K463M102k100m070J732M370j946m503J795M204
3070B277j646l935J180M708j681m584J517M732j206m893M78N035M2m948p36M978
3086A318L46l994n70L875K62l561m31L913O78m658o02M711Q25m450j344M563J250
$$ y = [-3053, 411, 3266, -146, -3426, 213, 4080, 350, -4317, -606, 4114, 1229, -3816, -1587, 3121, 1898, -3051, -1710, 2579, 948, -2882, -1370, 2862, 1119, -3377, -1612, 3271, 1437, -3471, -2444, 2844, 2150, -3059, -2693, 2312, 2968, -2473, -2971, 2151, 2983, -1794, -2952, 1550, 2657, -1606, -2838, 1566, 2651, -2026, -2697, 1912, 2751, -2127, -3290, 1621, 3692, -1478, -3812, 702, 3795, -273, -3663, -347, 3181, 91, -3267, -91, 2700, -387, -2864, 47, 3030, -121, -3779, 83, 3443, 76, -3872, -938, 3309, 505, -3770, -1307, 2795, 695, -3375, -1643, 2727, 781, -3722, -1927, 2277, 631, -3304, -2124, 2584, 903, -3681, -2164, 2568, 1362, -3531, -3053, 1982, 2024, -2924, -3660, 1318, 1664, -2330, -2900, 975, 1237, -2324, -2755, 1158, 1836, -2822, -3424, 1287, 2112, -2338, -3682, 881, 2131]
3103B131l817k191L542K675l191k587L373K407k777k671K503K559k193k756K280
3118g13K627k640k759L080L044k763l390K186M095k071m295J573M119j269l730
3133b906J139L770r07l904Q99L945r46l816O65M009o95m148P37M163k6m569j48
3150b738M429R45m861r79M482J234m196j446M140J438m030j223L950J875m943
3165a923j302M667J686m668j937M805K718m976l089M628L317m200l084L708L243
3180C593l444l034L443L160l272l319L414L342l267l280L329L579l560l762L431
3195C53M168k937m678K777M716k166m729K203L992j445m339J800L909j601l980
3210a957J723L880j419m114J428M513j732m215Q00M781n12m575J22M022P5l703
$$ y = [2131, -1686, -3877, -335, 2340, -851, -3438, -65, 2342, -435, -3106, -603, 1956, -237, -2993, -713, 1914, -726, -3485, -405, 2639, -124, -3514, -1328, 2767, 696, -3599, -2026, 2093, 824, -2906, -1767, 2003, 1096, -2808, -1909, 2036, 1090, -2726, -2061, 1948, 1253, -2895, -2158, 2005, 1979, -2590, -2738, 1691, 2636, -2225, -3204, 1278, 2512, -1684, -3130, 1010, 2448, -1582, -2805, 1145, 3020, -1923, -3225, 1442, 3128, -1540, -3477, 1328, 4046, -930, -4019, 609, 3926, -274, -3358, 350, 3593, 149, -2885, 558, 3718, 446, -2873, 541, 3883, 616, -2664, 665, 4244, 684, -3078, 353, 4521, 1584, -3094, -317, 4399, 2233, -2496, -293, 3699, 2254, -2085, -285, 3624, 2023, -1957, -234, 3646, 2227, -1887, -459, 4054, 2322, -1893, -1093, 3688, 3176, -1399, -1277, 2745, 2820, -883]
3226h83l96L721J1l817J25L540K48l411p44L716O48l334j292L771J072l522j438
3243a985L222J880l543k069L006K221k644k268K586K031k284k496K389K284k278
3258E2k168K225K354k349k929K353L622j949l923J177L785o60l575O12L443l88
3274A682l702N04L709o49l276M4L676J68l765k57L888M91m407m04M373R33m511
3291a503q70M153J330m220j275L951J326m023j366L913J909m262j393M007J609
3306C286m347j701M298K167m163l106M331L162m123k732L305L149l478l063L321
3321C06K940k998l108K951K982l008l051L246K977l361l557L168L899k858m127
3336c599K335M143k047l753J858L239j738l460K001L219j599l541J413L744j838
$$ y = [-883, -1279, 2442, 2453, -1364, -1239, 2301, 2549, -862, -1606, 2110, 2758, -576, -1868, 1903, 2975, -547, -1985, 1237, 3117, -426, -2495, 511, 2732, 88, -2180, 406, 2437, 153, -2343, 46, 2330, 52, -2116, 109, 2463, 114, -2815, -462, 3160, 1211, -2712, -1535, 2250, 1590, -1985, -1373, 2070, 1682, -2020, -1516, 2193, 1544, -1732, -1688, 1988, 2156, -1609, -1866, 2022, 2513, -1894, -2298, 2075, 3008, -1503, -2373, 1780, 3110, -1110, -2385, 1566, 2892, -1131, -2497, 1416, 3325, -937, -2330, 1677, 3286, -1061, -2762, 1536, 3703, -460, -3566, 765, 3927, -196, -2928, 377, 3526, 48, -3015, 306, 3246, 248, -2860, 91, 3073, 65, -2986, 260, 3237, -124, -3681, -513, 3386, 528, -3599, -1264, 2879, 832, -2921, -1063, 2176, 438, -3022, -1021, 2198, 599, -2942, -1529, 2215, 377]
3351C77l306J166L879j600l625J010L846p39l794N14L548j45l473j41L375M63
3367A355l463n53K928Q45l079m85L223nk657j010L251J409l444j565L055K157
3383A962k528k815K554K228j806k142J918K008k028j907K051K065k029j913J099
3398a283L286j752l494J997L121j529l040J010L593j164l255Q13L447k08l655
3413b113J74L307k00l076O2L764q71l093J78L958l42m165P1M045P60m320q73M193
3431A459Q13l250j581L790J031l434j271L732J167l568j354L736J233l582j710
3446b789M256J774l859k462L516K931l768k277L273L017l665k434L083K465k882
3461A79k731L217K415k723k800L067K864l014l152K612L277k108l622K370L168
$$ y = [377, -2929, -1763, 2116, 516, -3109, -2099, 1747, 1008, -2786, -2272, 1276, 1131, -2342, -2483, 892, 1355, -2108, -2661, 267, 1112, -1967, -2452, 771, 766, -1891, -2901, 350, 1759, -1685, -3250, -195, 1962, -566, -3381, -827, 1401, -405, -2547, -629, 1379, -649, -2556, -505, 1560, -469, -2382, -1283, 2003, 251, -3243, -1246, 1875, 346, -2694, -1684, 1909, 745, -2510, -1697, 1750, 1542, -2113, -1939, 1368, 1168, -1908, -1846, 1918, 1047, -2046, -1868, 2090, 1748, -2417, -2346, 1699, 2459, -1861, -2734, 1459, 2272, -978, -2559, 1231, 2262, -1172, -2443, 1289, 2456, -1112, -2466, 1270, 2503, -1079, -2789, 1467, 3241, -618, -3080, 436, 3367, -401, -2678, 595, 3612, -53, -2487, 596, 3061, 179, -2552, 665, 3080, 357, -2443, 624, 3488, 474, -2678, -66, 3211, 1103, -2519, -149, 3019]
3476C019j651l351J457L411j167l537J272L213j270k933J123L031j138l317J330
3491e08L332j002l488M50L488l07l194l50L142O03l137q00L174M56k860m20K740
3508A319L99k640l31K602R22l424r24L286J186k847j447K415K034k701j855K361
3524C55K032j992k469K169K199j913k438J945K378j691k371J656K815k177k701
3539b203K014K452j283l213J675L225j437k943O93L394o41l282L59L486o70k991
3555a365J82L393l54l556K59L816Ol690k79L674L90l597p31L508J027l677o42
3572a636L062J252l614q83L369Q51l078j017L282J000l504j423L591J474l506
3587g80j655K857K386l191j890K907K006k642k035K224K311k575k508K191K632
$$ y = [3019, 1368, -1983, -526, 2885, 1718, -1819, -547, 2666, 1396, -1537, -414, 2617, 1479, -1838, -508, 2824, 1822, -1666, -1216, 2272, 1965, -1229, -1579, 1563, 2166, -971, -1771, 1403, 1859, -1001, -1421, 1319, 1718, -922, -1253, 1349, 2271, -1153, -2077, 1209, 2395, -452, -1899, 516, 2550, -151, -2006, 355, 2387, 395, -2074, 95, 2294, 381, -2057, -112, 2266, 575, -1796, -140, 2675, 498, -2203, -189, 2263, 980, -2233, -558, 2667, 1230, -1713, -1020, 2374, 1733, -1549, -1190, 2296, 1626, -1365, -1183, 2210, 1856, -1700, -1441, 2375, 2381, -1309, -1588, 2086, 2476, -1121, -1852, 1656, 2683, -994, -1636, 1426, 2678, -936, -1819, 1550, 2401, -677, -1694, 1588, 2588, -916, -2339, 1252, 2726, -780, -2435, 422, 2808, -383, -2273, 634, 2640, -2, -2037, 187, 2498, -77, -2585, -394, 2238]
3602B238k309k352K208K496k413k568K187K674k032l167K053K834j505k780R10
3617a526L233j240k970P55L263j075k693O72L032j157k896O15L486o17l367RL637
3634A161k94l452L49L052M11l186o22L202P33l324m88K753R19k744j050K804J378
3651A602l496o72K689J821l490j267K992J445k441j906K331K003j996k484K668
3666b01J949k071k051J972J999k217k074K625K358k388k576J848K814j733k849
3681b595J571K999j507k651Q92K956p51k847Q07K571l59k867N43L087q08k969
3697a928M39L134p37k781J14L492m2l370p0L169J41k968m27K993R99k756j147
3714a745K738L70k227l81K353J051l197n86K582J572k998j471K131K377k392j986
$$ y = [2238, -71, -2423, -215, 2281, -132, -2700, -513, 2161, 129, -3038, -985, 1849, 344, -2436, -1526, 1707, 467, -2503, -1748, 1515, 440, -2253, -1581, 1451, 294, -2602, -1987, 1499, 882, -2485, -2476, 1161, 867, -2585, -2236, 816, 1227, -1959, -2581, 621, 1354, -1970, -2458, 295, 1214, -1530, -2580, 224, 1602, -1894, -2566, 123, 1944, -1546, -2813, 179, 1624, -817, -2723, -392, 1611, -385, -2869, -201, 1748, -323, -2374, -402, 1597, -620, -2694, -69, 2289, -99, -2675, -827, 1987, 254, -2595, -1024, 1975, 468, -2183, -1291, 1665, 914, -1933, -1126, 1445, 1086, -1781, -1238, 1849, 1041, -1928, -1489, 1645, 908, -1873, -1759, 1733, 1691, -1679, -1749, 1420, 1561, -1407, -1834, 1159, 2158, -598, -1745, 993, 1363, -864, -1245, 1108, 2159, -1038, -1624, 958, 2530, -468, -1939, 192, 2569, 177, -1809]
3730a809J893K095j856k143K191J671j587k276J808K293j615k671J786K431j532
3745F79k774J665K850j580k581J399K796j165l283Q53L277n99k740K90K641l70
3761A358k683L40K886k66l282O53L177l40l341J76L061L05l218k96L082N44l420
3778a264l29L058O09k797p38K920O54k880r40K875J049k975j059K700J403l035
3794g49j032K587J797k920j439K327J831k448j866K365J923k207j991K271J727
3809B176j842j786J767J962j915k244K078K214j646k451J617K179r77k309Q49
3824c28K355j031k156O02K685q92k064N43K520j185j971K17K808p40k741R77K256
3841A855j93k730J50K614K25k619m71K352K23j815o71K040N24k001q84K236R98
$$ y = [-1809, 84, 2179, 323, -1820, 371, 2042, 455, -1821, -13, 2280, 665, -2006, -220, 2211, 679, -2095, -430, 2420, 840, -1741, -342, 2454, 1289, -1994, -1141, 2136, 1537, -1203, -913, 1728, 1358, -1325, -985, 1901, 1635, -1647, -994, 2183, 1843, -1498, -1322, 1739, 2044, -1174, -1470, 1612, 2156, -1264, -1593, 1465, 2074, -723, -1461, 1459, 2113, -767, -1707, 1168, 2217, -758, -1817, 883, 2286, -749, -1781, 806, 2603, -317, -1756, 571, 2402, -46, -1912, 453, 2376, 169, -1822, 449, 2176, 334, -1452, 315, 2277, 362, -1882, 196, 2410, 764, -1687, -70, 2109, 1132, -1177, -328, 2027, 996, -1160, -558, 2127, 1235, -829, -286, 2234, 1049, -922, -705, 2103, 1363, -1378, -401, 1855, 1662, -1068, -918, 1696, 1921, -698, -1169, 1183, 1406, -409, -1080, 960, 1484, -517, -1401, 835, 1833]
3858A833k379r30K066J412k324j138J906J384k202j315J760J804j826k273J684
3873e38K168j378k160J639J775j551k165J238K479j422k307J442K511j403k680
3888b352J098K948j080k793Q17K556m75k544J70K854r48k249L97K595n0l160N76
3905a640L082n45k961M6L243o3l303r0L025N96l456l12L069P51l013p95L185N14
3923A333k659r71K712R47k926n53K747R91k622j364K717J494k919j096K240J548
3939A619k179j453J924J535j900j650K265J310j845k090K841J280j977k004K139
3954a85J803j460j939J275K187j378k129J509J836j150j848P15K250j056j985
3969a555P58K113n34k135O04J801n43j670L33J961K36k688m9K550K88k492k16
$$ y = [1833, -546, -1476, 590, 2002, -322, -1460, 446, 1830, -372, -1687, 73, 1877, 51, -2222, -538, 1630, 252, -1908, -269, 1506, -45, -2210, -972, 1507, 85, -2222, -780, 1731, 328, -2352, -1254, 1694, 614, -2179, -1362, 1194, 719, -1825, -1655, 1199, 251, -1998, -1601, 994, 944, -2216, -1640, 1442, 897, -2064, -2018, 1225, 1162, -2141, -2231, 794, 1390, -2066, -2378, 691, 1442, -1571, -2366, 819, 1333, -1326, -2297, 415, 1362, -1564, -2117, 630, 1621, -1001, -2365, 352, 1846, -1073, -2169, 71, 1619, -560, -2013, -89, 1446, -454, -2104, 161, 1471, -374, -2464, 377, 1657, -320, -2324, -185, 1618, 158, -1781, -506, 1681, 303, -1826, -317, 1519, 369, -1479, -764, 1486, 430, -1555, -797, 1316, 782, -1353, -749, 1052, 509, -1161, -828, 1133, 1369, -1319, -1368, 1182, 1470, -1022, -1238]
3986a238K091K99j932m40J843O96k406m9K112L56j632j435K017J414j968j347
4002a619J949J479j951j604J687J780j780j796J753J897j521k066J527K255j695
4017B95j954J356J921j078k303J157K596j333k350J046K324r57k232Q68K831r73
4033A214k804P33K664m99k911Q32K297j65k805N06K628l48k669M01K608k23k541
4050a082K32K425q1k480l33K849J93k738l81K813L99k430o87K627M97k401r49
4067a527K741P69k610n95K190J221k499j001K255J046j847j213J711J655k084
4082B12j628K070J194j731j343K053J005j594j671J949J364j505j442J159K030
4097B122j292j823P71J871q55j900R61K069j073j701N97J925p23k124R76J548
$$ y = [-1238, 853, 1152, -780, -1220, 623, 1319, -1087, -1136, 976, 1332, -300, -1735, 282, 1696, -272, -1619, 330, 1809, -142, -1746, -59, 1721, -59, -1855, -102, 1795, 274, -1792, -265, 1990, 295, -1659, -303, 1618, 540, -1763, -606, 1990, 657, -1693, -647, 1677, 720, -1512, -644, 2187, 1214, -1590, -857, 1807, 1308, -1603, -771, 1526, 1361, -1444, -938, 1690, 1342, -1327, -926, 1682, 1459, -1082, -850, 1575, 1494, -986, -1319, 1530, 1723, -1015, -1396, 1417, 1816, -614, -1301, 1326, 1823, -578, -1527, 1214, 1983, -627, -1222, 968, 2189, -310, -1311, 944, 1990, 143, -1070, 641, 2296, 212, -1416, 654, 1848, 117, -1226, 827, 1832, 238, -1433, 516, 1880, 375, -1067, 92, 2122, 830, -993, -222, 1649, 794, -1106, -145, 1924, 851, -850, -253, 1672, 949, -1175, -199, 1349]
4113A349m36j635M4K207k88k261Q9J920M74k458K10J738L36k108k69J716M29j579
4131e22q78J892O46j747q15J743Q82j914r08J661J325j825j375J843J586k000
4147d06j189J528J439j481j678J600J203j231j541J239J861j562j532J185K090
4162A525j656j749Q24K432j002k029O92K106o46k166O02K387r82k216J064J960
4178A146p21k258P36K301l91k414L47K046k09k275J67K527k30k471J08K064N40
4195A013k362l38K297L85k568K05K005L88j932n97K112K48k143n71K668M40j982
4212g32j266K228J067j755j126J623J172j496q86J136J305j238j845J824J405
4227A416j560j666J340J723j343j679J288J689j291j596J415J669j027j856R56
$$ y = [1349, 913, -722, -678, 1529, 1241, -1020, -931, 989, 1463, -995, -785, 953, 1289, -819, -1088, 628, 1057, -522, -1400, 492, 1138, -609, -1424, 319, 1201, -713, -1621, 40, 1365, -460, -1835, 8, 1594, -406, -1595, -67, 1372, -109, -1787, -187, 1016, -215, -1756, -517, 1344, -218, -1750, -565, 1525, -131, -1880, -1056, 1376, 374, -1655, -963, 1143, 497, -1669, -1067, 1320, 338, -1878, -814, 1146, 425, -1833, -1097, 1204, 813, -1601, -1254, 792, 583, -1692, -1525, 1002, 772, -1699, -1591, 473, 1013, -1349, -1687, 610, 995, -1573, -1368, 637, 1025, -907, -1504, 608, 856, -1287, -1858, 810, 1250, -732, -1998, 230, 1297, -458, -1584, 39, 1211, -285, -1171, -35, 1270, 32, -1813, 11, 1416, -144, -1810, -470, 1253, -90, -1769, -481, 1208, -83, -1679, -264, 1405, 378, -1478, -522]
4242e22J995j220j385J82J934m14j597L51J725n33j966M79J950Kk347K71K194
4259A099j46k230J40J891J86j929k80J786N70j700p38J711R80k194o02J782J053
4276A379j929q43J989J008k141j108J882Q63j338j501J876J326j705j010J211
4291d1J509j773j166J725Q75j185j362J328J760j266j921J051J745p74j755R36
4307c14J980q83j755Q86J577n29k361J162J870n58k092M60K065o77j531J42J913
4324A355p4k210M43J917l75j914L68K009Mk357P9K102k06j543l60J886K81j674
4342b69n41K165L52k071o75K254N42j818j078K007R43j866q19J592Q79j488j257
4359a148J750J329j748j335J756J177j380j448J321J490j556j489J623J426j305
$$ y = [-522, 1473, 253, -1132, -950, 984, 570, -1027, -676, 1049, 516, -1450, -971, 979, 981, -1366, -1095, 1099, 953, -1277, -1137, 754, 940, -989, -1269, 517, 1087, -613, -1351, 360, 1340, -854, -1456, 326, 1379, -550, -1393, 596, 1604, -537, -1645, 237, 1100, -238, -1739, 137, 1463, -242, -1252, -41, 1468, -305, -1471, 254, 1129, -56, -1418, -90, 1670, 404, -1517, -466, 1279, 505, -1250, -314, 1666, 783, -972, -86, 1491, 962, -1399, -237, 1633, 1075, -1017, -557, 1508, 831, -700, -558, 1355, 1281, -929, -486, 1431, 1056, -858, -490, 1519, 1523, -834, -755, 1347, 1141, -402, -762, 1124, 1405, -269, -810, 1355, 1707, -364, -1039, 1215, 1757, -61, -1139, 868, 1811, -55, -874, 718, 1597, 109, -1148, 602, 1931, 183, -1152, 604, 1781, 401, -1047, 274, 1764, 208, -1281, 342, 1768, 463]
4374D63j606J176J616j190j548N72J878q03j659N83J843q39j652Q72J339l40j883
4391a178M74J950n96j800J85K153k88j996K26J484K75j915j31K077P9j921o9J446
4409D55L83j697j15J350P66j808q50K099L56j622r96K095J000k189n44J600N61
4426H44j323j001J631O15j221r92J229J091j018j200R64J594j487j267J167J414
4442A040q97j657J293J352j077j571R54J412l79j663P85J069m38j708P16J757
4458I88m79j655J76J904l79j722J16J865j86j795M9J814K52j731m20J690N98j867
4476g82o08K101k4j239o91J618N61j631p47J624Q11j629j038J679R98j333j284
4493a614J856O94j359r86J620P28j492j007J594J238j266j815J758J180j334j201
$$ y = [463, -1143, 33, 1649, 459, -1089, -517, 1361, 558, -1101, -518, 1325, 486, -1166, -294, 1045, 705, -1178, -704, 1246, 650, -1150, -965, 1188, 900, -1096, -870, 614, 889, -1026, -1157, 920, 999, -922, -991, 455, 838, -859, -974, 376, 1142, -666, -1516, 583, 939, -683, -1679, 416, 1416, -773, -1317, 283, 844, -479, -1480, 151, 766, -455, -1447, -218, 873, -145, -1345, -381, 1213, -274, -1541, -374, 1040, 143, -1514, -221, 1131, 54, -1517, -563, 849, 470, -1193, -408, 661, 223, -1485, -769, 988, 509, -1146, -970, 934, 555, -1167, -1051, 814, 628, -1167, -1118, 696, 948, -783, -1203, 487, 1085, -782, -1390, 711, 687, -552, -1243, 375, 936, -695, -1442, 182, 993, -636, -1674, 5, 1003, -330, -1614, 242, 936, -423, -1409, 211, 939, -553, -1560, 34, 1272, 6, -1809, -51, 1129, -205, -1406]
4509a406O58K077j568j178J181J071l72j821P96J663r02j490O82J824j033j547
4525a365M81K038q60j690P27J599o52j408K38K000n49j766M63J662q7k182K28
4542a123J535K68j412n09J832N8j574N5J499K86j720k87J815L02j528o02J706
4559F01O35j757m04J559N08j617o43J315Q39j534p70J581J200j432j157J321Q59
4576A104j032j191J431Q67q06j150Q05J453j200j206Q51J296l37j692O97J533
4592A423o47j381O35J326j66j834N39J386l49j569J99J476J90j697k70J813J88
4609A262j769k03J988n0j631j49J565K49j030q91J514R59j892o46J653N57j649
4626a63r34J791R96j684q51J410Q61j313r94J260J187j484j203J398J134j222
$$ y = [-1406, -748, 1329, -239, -1417, -236, 835, 463, -1358, -562, 1101, 199, -1291, -609, 1215, 182, -1365, -884, 1154, 294, -1396, -669, 930, 278, -1130, -892, 1108, 559, -1207, -744, 918, 831, -1351, -1123, 412, 680, -732, -1241, 591, 649, -925, -870, 629, 915, -805, -1092, 723, 1025, -503, -1105, 601, 1236, -521, -925, 634, 1142, -475, -1118, 197, 1036, -498, -1268, 313, 1513, 81, -1076, 245, 1104, 72, -1119, 312, 1179, 373, -777, 28, 1481, 281, -925, -74, 1222, 885, -807, -110, 1423, 776, -605, 30, 1356, 1190, -644, -105, 1281, 932, -637, -438, 1038, 1228, -469, -739, 1074, 1262, -507, -710, 1278, 1228, -403, -552, 1013, 1262, 232, -659, 855, 1814, -78, -724, 929, 1486, -163, -1097, 694, 1690, 6, -845, 565, 1426, 113, -881, 379, 1566, 82, -1121, 277, 1411, 189]
4642A89j127J077J050p97j228O80J375r51j496J265J427j210j426O87J708q20
4658D03j524M79J730o94j568Q62J362n85j582O23J526l45j934P79J226j69j696
4675a107K60J696n32r53j64J659o31j180L16J284j86j226j3J203K70j568L2J198
4693C58O44j638m32J503L62j533n2J164N73j508n37J484O34j119j007J372L69
4710F37q36p95R23R91j198p07Q48J025j136q36Q73J197q35r84M08J239n82j194
4728i62O00J433j095j335Q80J195m27j300J92J540n66j333L47J590l51j360K02
4745g50J395J39j698K25J267n3r48p07J433M58j505j87J235M32j518l29J211P02
4763H02j203o98J109O05j233o14J217P04j491n67J155R01r15r86J255P05r51j206
$$ y = [189, -938, 139, 1189, 392, -836, -156, 1219, 268, -1228, 37, 1464, 254, -1172, -485, 1223, 403, -1121, -642, 1088, 394, -1174, -312, 1050, 465, -1117, -494, 1032, 687, -1247, -468, 758, 589, -1107, -847, 849, 317, -636, -800, 859, 228, -952, -636, 648, 462, -764, -777, 426, 696, -872, -840, 358, 1002, -636, -1068, 435, 797, -736, -788, 376, 949, -559, -1096, 388, 1022, -97, -1104, 268, 637, -199, -994, -71, 920, -278, -985, -137, 888, -248, -1084, -211, 986, 151, -833, -425, 814, 232, -962, -362, 1071, -24, -1359, -479, 716, 289, -1011, -819, 721, 155, -1178, -831, 759, 408, -952, -750, 645, 784, -914, -689, 578, 525, -423, -1130, 303, 761, -744, -931, 304, 736, -782, -1111, 100, 802, -401, -1099, 10, 615, -618, -1232, -15, 689, -802, -1369, -214, 687, -228, -1214, 41, 746, -205, -1411]
4781a411J491N62j128p44J078R42j019j094J032J279j181r43R56J083o72j544
4797a313J009J224q66j352P47J049k25j262M72J348o32j308J74J852p02j312M06
4814f91J293j21j512L24J274L8j296Q4J085P7j143k03J384j97r39N4J034J79j402
4833f78m9J344M91j323m84Q37Q57r94p27J494J72r65m87R22P30r88q45J074O29
4852A010p78r19P42J061o62j156P13J001l44j269K57J531r05p60O18J268q53j158
4870f03O79J011l00j267J82J384k89j503Q08J132k89j295K04J150n14q78K36J173
4888A021j37j210L4J082L58j250l96J005O24j508l08J474K71j403n42J305O13
4905A033j193m57J224N82j371p66J420M94j289n58J331P85j333r79J440O58j087
$$ y = [-1411, 80, 642, -486, -1230, -152, 790, -229, -1323, -291, 988, -193, -1136, -180, 903, 231, -1313, -304, 920, 54, -1298, -551, 498, 273, -989, -517, 831, 199, -1109, -935, 917, 215, -1097, -691, 602, 481, -1031, -707, 567, 605, -691, -607, 478, 555, -588, -791, 593, 396, -543, -489, 545, 724, -678, -727, 617, 1108, -215, -699, 138, 995, 1, -726, 768, 940, -25, -512, 410, 1140, 152, -693, 381, 1010, 232, -687, 55, 1116, 454, -702, 11, 1012, 668, -601, -344, 1187, 282, -478, 140, 1408, 555, -603, 76, 1087, 787, -480, -298, 1086, 797, -706, 102, 1234, 945, -350, -146, 1004, 490, -388, -152, 1021, 884, -326, -292, 790, 1148, -102, -498, 507, 1131, -377, -685, 789, 1060, -343, -885, 420, 1033, -160, -617, 607, 1189, -182, -948, 472, 966, -323, -881, 450, 1235, -98, -1077, 363, 1021, -66]
4922f6p46R95P39r02j207J368P21q92j015Q76J153j178r25Q89J161o37r16M04
4940a78R04n83q26K44J416r16j053N59R97k91j039J48J253r1j208j32J215J19
4958E38j204J42J230k76q30j67R60K45j172l37J259M37j058l21J075K34j251m48
4976i44J322M30j193l09Q79L62p36n46Q47O33j028n45J059P70j157n20O64Q47
4994H35j425j90P39P97o05j246Q60J255r60r54O67J011o52j377P47J167k89j268
5012h88M77R63o56o82J17J279k33j498K18J454n03q78k83J401m8j118j35J570
5030E57k00j293L0R95K50q18o99J604m5j302o3Q60P06j233l23J219L48j417o38
5049a462J632L46j341k15J011K27n37p13R49M98n22p80R19P78j123l62N78P66
$$ y = [-66, -812, 183, 922, 20, -1187, 181, 902, 10, -1005, -129, 1024, -154, -1079, -190, 971, 334, -582, -178, 726, 143, -683, -439, 977, 61, -992, -433, 564, 273, -766, -618, 635, 544, -664, -796, 419, 538, -666, -524, 706, 430, -400, -567, 393, 638, -534, -871, 388, 825, -233, -554, 521, 755, -496, -944, 378, 808, -385, -694, 185, 547, -189, -735, 112, 745, -283, -828, 231, 1001, -156, -676, -12, 835, -590, -780, -41, 756, 151, -1095, -235, 1020, 60, -894, -227, 784, 132, -1245, -498, 669, 380, -888, -411, 552, -104, -786, -669, 610, 377, -1121, -903, 551, 48, -830, -1113, 288, 240, -878, -1013, 557, 357, -936, -906, 89, 339, -479, -1178, 426, 381, -921, -984, -124, 582, -651, -974, 245, 593, -824, -1462, 170, 516, -825, -1040, -29, 198, -339, -1052, -103, 395, -127, -907, 12, 790, -333, -695, -117, 649]
5067F49o06j066J066O60o77r66Q07P86q53q22P17R46p46o95M79Q97m15q72p0J096
5087C15J74j300M23J285l96j178J89J104k56p12j69J189N5j408J97J348r0r41
5105a71k37J081K86j365j40P40M11r92M2J087M13j435o12J557j6r01l54J107M19
5124I20j173k08O60P70q92r30J182P81j088p05Q84P70q60p51P57Q85p73r10O59
5143b2R47m70j152N33J228n70j067O96R77p22j106N25J068k99j157K95J082j6
5161G70j408M36J198o22q38J63J011Rj051kR64l4r16k25J132L47j165m76J450
5180G43m05n75m72R28L76r35k0O73J94q08n58J054O63p76p70R84J17p25l09N98
5200b3Q62q66o32R06K99m89o29L85J031p29p73P43O19m34r40O19O26l03p67M08
$$ y = [649, 43, -1023, 43, 703, 26, -940, -133, 653, -200, -1022, -305, 641, -105, -800, -321, 576, 161, -711, -781, 315, 489, -811, -388, 897, 501, -677, -488, 616, 360, -352, -521, 668, 723, -685, -488, 860, 770, -171, -408, 673, 959, -406, -546, 194, 605, -387, -345, 742, 1155, -280, -892, 665, 649, -252, -606, 501, 920, -253, -461, 199, 969, 77, -853, 329, 1110, 22, -683, 201, 971, 111, -640, 117, 1002, 229, -681, -22, 925, 455, -697, -164, 1064, 494, -573, 123, 1100, 378, -728, -203, 865, 566, -591, -296, 786, 770, -638, -202, 996, 374, -464, -301, 710, 719, -332, -334, 630, 596, -320, -545, 587, 934, -231, -707, 743, 338, -237, -709, 219, 595, -340, -360, 313, 507, -301, -859, 195, 858, 82, -688, 296, 413, -312, -621, -23, 839, -27, -659, 247, 546, 57, -572, -187, 844, 115, -658, 85, 704, 270, -670, -51, 575, 272, -495, -87]
5220h7O62k95r33J59J008j25j017J60J092n3j079L05J039j14j124j1Q39L40j199
5239d33L0J182O1j195j44R54n9q93N7R16K22j120j9R33L41j400l24J211M38q97
5259a39p35J263M94j044o17R10N20q75o14R05O11j226l79Q75O20p04o00P83N92
5278F40q87o15O71Q12o69q79P46O72l93j163Q33N41n49l56p8J426p43r65K15J070
5298C29n82m54M16P06l05j051L72O82J81r50J32R68k68j179L57J118k22n81k17
5317e48O80J74r73J07P09J95q09l59R18M11r59j14N72K01m09m67Q28N95r18m64
5337f30M37J082j145p09P72Q39n09q74O36Q11n55p76N04P62m14q12M44N92J9j121
5357f47L50J016n90p69L27Q60j92j046J68J214k57p09n9Q88k77p43P6J128k29
$$ y = [-87, 575, 280, -653, -494, 514, 389, -628, -468, 624, 571, -508, -203, 836, 722, -402, -413, 426, 766, -433, -403, 779, 840, -355, -499, 455, 396, -497, -440, 476, 698, -422, -441, 492, 833, -567, -891, 320, 758, -139, -874, 389, 883, -161, -778, 132, 652, -223, -837, 68, 679, -547, -926, -51, 569, -135, -735, 48, 640, -247, -862, -191, 621, -48, -927, -181, 491, 98, -1065, -232, 309, -240, -596, -674, 752, 9, -956, -741, 329, -253, -707, -291, 415, 110, -941, -569, 113, 294, -656, -524, 444, 176, -1003, -646, 472, 250, -331, -548, 132, 306, -667, -560, 149, 344, -465, -824, 94, 505, -454, -568, 4, 205, -204, -671, 157, 752, -166, -630, -193, 889, -256, -965, -193, 646, 137, -737, -101, 710, 155, -621, -117, 645, 231, -581, -137, 455, 474, -647, -297, 719, 129, -640, -313, 547, 355, -691, -523, 691, 434, -275, -334, 554, 277, -466, -390, 738, 509]
5376E09j133L21J022nj308K62R22J58j208j81J063J52j004K97M98L68j137O0R60
5395F16J20r80k09P85L43r79l07R92L91o89m06R22J13n85o49N99Q50r48m81O00
5415I8P72o55o93M04P64m51o30K93J144q31q70P82M64n75n54P18P16o50p89L70
5435a73J001l73j109M05P97r3o26p1R73n05m44N9N14O9r83M18O10J02j222K88
5455c63J073l00o60j89Q56J38n64n56Q68N03p41n05O66M25q28l81N92M44o82n11
5475g15J111K37q27m11P43L26k60m23M35N49q11m97N28J096q87o79O67N88l54
5494D16p36K14J041q32l52M49N15l96p84K48R42m89r16L01J091k01q52Q1J040
5513G80k19r42R8R78q9j194M11O89p6r96L27P55l60n81K06N49K83j257M9J069
$$ y = [509, -624, -303, 719, 714, -594, -332, 590, 748, -460, -641, 422, 574, -430, -133, 365, 733, -404, -344, 616, 736, -244, -453, 332, 675, -304, -611, 381, 772, 83, -323, 599, 712, 127, -522, 77, 927, -21, -502, 98, 870, 215, -478, -74, 690, 239, -391, -98, 1046, 215, -655, 127, 591, 16, -538, 180, 896, 246, -543, -173, 828, 455, -654, -249, 548, 455, -171, -242, 731, 226, -218, -159, 355, 424, -559, -141, 469, 571, -651, -363, 710, 410, -250, -439, 417, 555, -9, -565, 303, 806, 65, -440, 226, 651, -177, -558, 34, 478, -204, -715, 396, 633, -194, -605, 138, 464, 204, -219, 216, 765, -46, -543, -15, 1081, 194, -485, 182, 770, 416, -320, -106, 935, 103, -249, 200, 715, 319, -465, -217, 725, 236, -680, -379, 712, 511, -341, -260, 780, 561, -381, -283, 695, 606, -588, -177, 512, 436, -560, -233, 522, 162, -419, -213, 336, 619, -638, -589, 480]
5533D80K2q18n54Q78M05q61r0L88M76r90nQ34J49p78k44O57L42o76o44R69Q4j42
5555a18p66O06O99m86p17O80L59l67l48J42N44l94n87J87R43n83p38P16O60n68
5575a36o38L87O25jq53L26Q57m90p39K27R44l11o20O5O82k34m54j75P65m1n67
5596c81m4O28K18n87k71P63k9o22j57L76M51o39j14N73K46m82k92M79L99r07k70
5617f62R62O80j191k66O72N43p86p29Q19M27o40m16N63L02n45j49N70O59n05p57
5637d49M7Q76m66m46K77O39m00n05O0P51j18n49J27N22o3o20K62O85l71n20j09
5658c70O35L66r52M38K52K11p59n1O60l9o71m18J124Kn68j29O91J89j100j54Q39
5679A96K61p48j46L97L55m53l67P09M32o53n17O73N56o87m76N95M57p92j82N69
$$ y = [480, 502, -316, -870, 8, 413, -448, -538, -150, 326, -664, -669, 165, 314, -464, -708, -51, 291, -385, -1029, -60, 24, -118, -884, -278, 421, -65, -782, -102, 257, -110, -458, -316, 228, -166, -753, -566, 377, -206, -944, -228, 432, -136, -774, -387, 238, 237, -616, -290, 567, 77, -662, -435, 509, 198, -422, -357, 325, 91, -363, -538, 227, 186, -381, -425, 203, 421, -166, -437, 326, 297, -325, -482, -106, 345, -294, -408, 165, 411, -71, -363, 116, 515, -392, -662, 300, 980, -211, -477, 195, 738, -48, -777, 42, 469, -171, -587, -24, 278, -267, -416, 154, 813, 308, -449, -402, 474, 8, -438, -161, 478, 78, -427, -367, 384, 266, -283, -156, 366, 303, -317, -55, 630, 259, -261, -370, 265, 631, -321, 117, 369, 580, -179, -230, 430, 391, -280, -698, 426, 428, -140, -269, 422, 611, -489, -643, 196, 457, -291, -437, -40, 315, -138, -505, 204, 636, -17, -534, 139, 695, 8, -468, 127, 584, -208, -390, 179]
5699A79L24k67q40O41P40j030k92N73R90p22n57K42P35m49n13R2O98O1q93K71
5719a7N77j58p45M88M02j28o50j08Q64j78n54K92N59N2r69PO50n2n81j9P86o3
5741D55o55k58P62K88q07l65R97L9o13q3O02K81o53l92Q14K14n22k52L50K38l97
5762D3m64M91K84k70m28M85M28n63m91O39O37j120j91N34M57l91m84M30O93m63
5782B56o83K05R55q38m67J89P05j99n45L08L86k13n35p8P05K54p93J09L11M47
5802D79j048J83N14L87r22l56R81O8o39k78N49J73o05l16J168Q2j016N9M07M76
5822C46n05l70M74P76j065m35N29N67p66k44L84Q22m88m22L99J16k37o58K97Q84
5842D04n62n52N36K25k0o95L41P08o27o11N04Q98n21n72M98M27n11n37J90Q32
$$ y = [179, 503, 236, -604, 37, 777, -253, -545, 28, 1018, 296, -261, -19, 716, 267, -246, -154, 544, 605, -288, -17, 560, 402, -343, 145, 547, 419, -231, -339, 525, 347, -207, 85, 644, 696, -273, -266, 384, 332, -249, -268, 518, 455, -200, -458, 304, 592, -215, -580, 417, 456, -157, -240, 362, 643, -10, -402, 412, 626, 104, -148, 202, 440, 43, -421, 70, 354, 84, -344, 141, 569, 6, -485, 154, 791, -329, -520, 14, 471, 80, -404, 26, 719, 256, -427, -222, 733, -105, -572, -383, 322, 123, -422, -114, 272, 59, -476, -554, 151, 405, -388, -279, 32, 479, -569, -386, 128, 515, -407, -763, 218, 286, -353, -631, -82, 91, -514, -830, 338, 420, -596, -537, -130, 346, -159, -529, -55, 721, -344, -779, -250, 317, -449, -693, -309, 513, 25, -397, 2, 118, -119, -777, -480, 404, -158, -710, -174, 51, 31, -664, -323, 385, -242, -853, -349, 549, 28, -544, -46, 381, -130, -667, -477, 355]
5862C55l21m61j51J003k31q34J89R71m9q41l1O76O2l83k92O33J29q72O4O01J88
5883D05o99p7O43L60j011J4N74K83n84j51K15M95n96l56Q47p3n17o9K17N46l53
5904A13p01P74J02n13k23L25M02m65l26O19K37l80j12j12O08R6q81K90L19L47
5924E19p84M3Q09j5j014L23J64J6n40L03Q44n17l75j4O85p4p99J44O19J57r01
5945d07J65L97K20p13k49Q69j9m48j00N60R6m86J22L74j06l32k09M40L95m87p52
5966f70Q34N15o59m25N99L83o35k15K14O48m95o04M80M08l09n08L32M96m16m67
5986d94M49L88j87l24K06O36o85j87L02N32j45r08K78R88l29n72o6Q27o10m40
6006c41J10P96j42r49L57P19j45o31L2N11K63n77J07L32J9m82l63N77M04q38l1
$$ y = [355, 34, -427, -578, 425, 194, -640, -451, 520, 471, -370, -401, 275, 337, -46, -338, 295, 424, -448, -384, 217, 405, -294, -371, 272, 632, -379, -365, 209, 492, -92, -243, -28, 467, -129, -485, 362, 289, -228, -297, -80, 466, 113, -588, 186, 288, -225, -448, -123, 279, -186, -512, 107, 344, -36, -148, -260, 348, 444, -437, -147, 172, 519, -265, -222, 587, 572, -442, -119, 45, 61, -479, -176, 668, 151, -224, -238, 447, 373, -426, -282, 337, 494, -407, -242, 155, 375, -338, -587, 282, 263, -185, -285, 275, 371, -115, 7, 381, 275, -57, -266, 174, 569, 82, -670, 164, 679, 20, -405, 194, 577, -58, -273, -59, 589, 94, -510, -30, 378, 69, -439, -107, 389, -27, -494, -45, 343, 156, -168, 38, 674, -11, -198, 104, 636, 491, -417, -139, 849, 520, -52, -118, 709, 99, -341, -231, 565, 423, -526, -169, 550, 405, -226, -194, 317, 580, 3, 110, 442, 461, -21, -384, 193, 597, -241, -272]
6027b72O06l46q8l15O87K7l04l79O55N9l29k35M41Q5j60o90P60L20n64k27N7O12
6049D00j66p30N60K79m91k51M85J84k31m37K28Q26o37n98L17M35j71n08L94M76
6069C64m07o07J06O84j24o16K41M98Q0p67J31N62J47r92Q4R92K2j020j12R82L8
6090B86o65p3O87J27q57M4O56K17o16k12K06M54n85j52M34M52o33j80K30N22n90
6111b48k94N13N78o04m01N06K48o36j06L92L57m70l74M26L09l00o29N26P42j36
6131C99r48L75N97m31k03n1N48j92o31J2O70n7m93J95O03l87n42j88R09q9n27
6152d31K0Q47j44o57q9P00k12m86L29J66J23l33k61K67L61m56J5N94P6o59j43
6173c73M27K40m54m15N67L61o32k46O00N85p06k28L11L65l90l45M67L40l71n82
$$ y = [-272, 334, -12, -100, -415, 272, 299, -5, -384, 271, 330, 1, -234, 207, 292, 132, -558, 202, 522, -42, -269, -212, 400, 234, -496, 64, 343, -148, -399, 86, 270, 39, -398, -170, 656, 19, -579, -262, 173, 2, -506, -112, 364, -43, -650, -544, 140, 16, -600, -359, 139, 219, -548, -417, 145, 292, -700, -616, 376, 398, -622, -734, 248, 286, -379, -452, 235, 362, -495, -451, 205, 422, -194, -406, -200, 254, -331, -483, -49, 403, -230, -410, -180, 342, -248, -542, -29, 549, -55, -456, 50, 298, -338, -444, -52, 305, -165, -539, -113, 196, -104, -733, -207, 535, 399, -549, -174, 423, -8, -211, -262, 286, 94, -537, -525, 145, 88, -405, -210, 393, 6, -536, -724, 185, 96, -431, -411, 436, 292, -365, -454, 246, 34, -452, -123, 43, 166, -167, -428, -161, 200, -256, -241, 353, 429, -230, -373, 54, 294, -160, -575, -8, 353, -279, -525, 75, 660, -46, -274, 37, 402, 12, -333, 134, 474, 103, -479]
6193d79M64M89m62k71J53O84n51k04J86K13l25j35m2Q51l58l89J63M83l74l54
6213b58K01M77j26p28J84L24K49o72J59O93k06m70K33N93l5o34m00O64K62l73
6233A37m00P94j68l33l49N40L39m94j24M61J17o68R2K57L91m67k93N49J86m65
6253A02k81L44L08l44m32O71L29r77L16K00Q7m28k16L22L41j77r6j8M67k2p06
6274b10K06M45l57m32k7P57j71l30K08J74p2l33l95R36lq69L41K88M33p88j54
6295c53P24N7n71j39P08k11n78L49M22m9n71j40Q21J48j060L21K12J13l18K1K57
6316A63O7l97j98L25K03m84J52M12P6o04j51J43M38k48n13L68N78j90o08L89J67
6337H8r6n81N82K22J06n04L3N83n39j99j43R78k64o48k15N87Q8k95R6O39k53p99
$$ y = [-479, -15, 474, 12, -259, -106, 578, 27, -177, 9, 222, -103, -238, -280, 571, 213, -176, -13, 470, 96, -258, -57, 420, 294, -434, -250, 74, 323, -349, -190, 503, 297, -173, 60, 653, 618, -16, -416, 248, 510, 137, -263, 531, 363, 30, -319, 221, 560, 66, -58, 403, 520, -148, -56, 201, 592, 125, -168, 381, 567, 102, -179, 165, 473, 129, -303, 368, 697, -280, 36, 236, 323, -105, -321, 1, 342, 165, 69, 51, 518, 496, -210, -4, 441, 84, -348, -375, 382, 211, -119, 89, 263, 191, -142, -537, 399, 396, -473, -132, 156, 589, -199, -353, 371, 428, -143, -282, 426, 215, -363, -14, 408, 359, -212, -352, 469, 617, -443, -122, 90, 203, -115, -94, 163, 230, -167, -365, -40, 163, -321, -169, 243, 319, -285, -436, -293, 145, -103, -616, -248, 330, 140, -468, -79, 88, -8, -589, -7, 215, 321, -183, -150, 433, -106, -305, -448, 530, 266, -382, -597, -10, 78, -217, -121, 518, 265, -534]
6359e34L04M53m2p72Q8O78j87j75J61J30m4n48O5N69j82k24k88P01R4n42j22J95
6381b22N24m58j5L12L01q98R0L14K80k87m34N34J18k81m54O81L46o48m67Q72J97
6402D05l73m35K24M44n31j06L82L98n51m81J69N56K07o72J35O57k02n59J42L20
6422A29j95k65j97N68o6l37K00K76j07l52J3O96k64l36j25O16J83j100O1P79p4
6443A03l66j74M87N59q43O8M17L77q68J96K84o7l33n6J34K22k88n55Q65K54m03
6464A3k89M1P28m78k50L17l5j61j53K33N01k62o16M30K57Q4p33J52M89J58q13
6485c87O20K20l22n33K44M55M2p30J27Q92k44o69K50M66l59Kj25L46K66n29l20
6506b88P48J64q09j8O21o6l95l4M98no26P0O86k19m99m6M19N6k70k05L33L25n87
$$ y = [-534, -230, 223, 181, -591, -503, 175, -12, -187, -26, 104, 60, -488, -423, 146, -36, -260, -548, 153, 247, -295, -417, -222, 302, -156, -171, 141, 442, -456, -366, -52, 228, -59, -493, 41, 159, -122, -576, 105, 451, -197, -664, 208, 405, 32, -403, -179, 265, -266, -372, 10, 408, -143, -624, -455, 101, 308, -364, -229, 428, 226, -333, -191, 129, -66, -331, -528, 40, -26, -363, -163, 113, 6, -346, -333, 363, 99, -237, -362, 254, 437, -663, -602, 177, 103, -263, -437, 50, 609, -234, -166, 251, 628, -240, -44, 240, 173, -160, -216, -82, 140, -148, -703, 162, 416, 13, -276, -235, 493, 15, -235, 82, 47, -114, -267, -34, 467, 205, -411, 19, 276, 360, -373, -221, 268, 426, -387, 233, 453, 131, -402, -158, 297, 339, -391, -264, 628, 384, -285, -35, 431, 72, 74, -51, 295, 561, 32, -288, 460, 624, -185, -203, 418, 352, -43, -77, 421, 416, -210, -140, 546, 327, -172, -218, 201, 257, -13, -218, 115, 440, -147]
6529a47k88L30N59m79m80N93M50l40o73P75L13k50m03J43M62l30n54O34K12q5
6549D42r78N95O46j75p98K49L80k29l86L04N32m55n75J67N39k18m25L3O97n9m09
6570a23N1L41O8o62L68M25m25k72j24O16J95q33L0O38P7q26kO39m6l52l34Q56
6592C05j50n21N1O13j00J07o37L76K08l53n9J09O21n79o38M57O55o84m09P98L55
6613E25n49m11K82P60o46n58O43J45k08l59J99L95o2q16K48L54M6k97K88J71k10
6634f0n80M05Q98n56m53J76L29j90j24j80N78k3l81k30O18K13n87k36O23j3l20
6655i3k57N37K36n54l46K52L33n25j93P29J38m65PJ40L27l36j34L6M92k86j57
6676a19k3L80l76m51N42L01l64k46k2N44k37m65M71L49m95nM3J91k13m05O18L88
$$ y = [-147, -435, -105, 454, -25, -505, 88, 538, 198, -475, 300, 613, 363, -40, 103, 565, 235, -319, 315, 527, 442, -536, 59, 705, 530, -268, -19, 361, 132, -254, 50, 582, 127, -448, -281, 258, 40, -385, -352, 345, 286, -123, -72, 269, 337, -325, 43, 468, 43, -229, -353, 263, 458, -375, -345, 293, 370, -456, -458, 181, 135, -217, -551, 305, 155, -366, -315, 298, 198, 305, -332, 44, 252, -101, -160, -51, 570, -9, -647, -190, 465, -219, -628, 170, 525, -24, -435, -153, 607, -39, -597, 46, 191, -17, -376, -177, 218, 156, -660, -412, -58, -12, -309, -21, 150, -60, -640, -235, 663, 107, -346, -170, 159, -31, -155, -335, 243, 220, -161, -391, 227, 440, -147, -383, 240, 227, -93, -350, 187, 423, -131, -477, -225, 108, -417, -610, 119, 257, -208, -201, -61, 266, -70, -204, -168, 324, 38, -119, -142, 238, -138, -589, -47, 254, -110, -356, -378, 166, -71, -536, -65, 284, -211, -216, -173, 18, -195, -600, 18, 406]
6698D06r3p65N6N79j48m59J76L69p9k63j26O63m45pk23L45O0l57L3M97J94p80
6720c67j19Q94J0n03n82Q93Q1q82K48M70K78o71k03N54J23k60m22P64J6m71j24
6741b73L17M58p03J2M32J91k40n62N90L91o74k15M65K74n60k71N15K41n69R8J94
6762A11L02k07l73K08O36o04L8j1K72Po10K95M55q5n19K13N68j70o98k36P08J02
6784D02p27J67L98R9l50j00K86J34k75j71O84l09k54n33Q15K05o37O8N43K60p79
6805g4q7L23K97k44m61L85M16o25j92N74J19l86k66N45M24o20m22L94L11m88k44
6826c21N47N09p42m06L49L74N3n88Q7M96J8p34J70N00k31q29N76M54L6p33L17
6847i8L72j81p46N29L62k73k95QM52J98m58mM04l6o71J60L98K0k57j42M45J79
$$ y = [406, 313, -452, -396, 183, 35, -424, -248, 121, 42, -221, -347, 316, -129, -136, -359, -14, 46, -311, -278, 219, 413, -367, -486, 408, 418, -85, -667, 226, 307, -575, -327, 143, 421, -250, -453, 101, 224, -36, -458, 306, 322, -149, -273, 44, 502, -201, -189, 243, 434, 194, -368, 222, 613, -61, -276, 189, 463, -97, -368, 147, 388, -181, -83, 111, 413, 206, -167, 41, 677, 73, 111, 100, 372, 379, -231, 64, 519, 434, -85, 128, 696, 526, -172, -408, 300, 402, -325, -158, 240, 339, -11, -111, 175, 309, 34, -137, 547, 238, -16, -549, 266, 471, -166, -98, 445, 705, -74, -161, 162, 459, 215, -246, 139, 555, -70, -262, 312, 431, 45, -221, 324, 748, 128, -294, 100, 411, -77, -321, 226, 735, -7, -413, -64, 310, 363, -225, -138, 358, 376, -358, -188, 312, 81, -748, -172, 282, 318, -415, -98, 274, 93, -653, -124, 238, -35, -330, -322, 130, 328, -130, -134, 270, 234, -437, -277, 121, 141, -116, -258, 187, 366]
6869C66o38j84O07M50r10k28O64L96n70k97R3O08n02L7L86J50n79j89O62o1k31
6890C0m01L29M73o39k35N39K66l37k73j14N99k6o74M40K54j00m48J79M93k17k70
6911a32O2L33j53n02kO13l39j75K62K16J50o26q3O40o8n92j98P23J00m32k13L84
6933c2J18m17j57K21L10k98j40O46o2o90n53R79K50m10OJ44M29o70rN36R8k98
6955An09M29L87o52L1J70J62N3m67K16J71K3k56l1O85k68n57K74M34Q1p56K65
6977a14J96k20l37J46O90l97l10J38N33l65l99K6P09n9l32rO12l11l11n05Q41
6998B22j93Kk75N17J1m36j83Q41j86o57P2M22M70p74j33M93J26n28K43N5K13m36
7020a14j10L61K63j74l84J93N03n58r3K85L65l15m27M60K61n19n16R21N5l61m99
$$ y = [366, -272, -456, 151, 601, -309, -537, 127, 523, -47, -344, -251, 357, -145, -108, 278, 428, -151, -340, 322, 261, 30, -371, -42, 431, -208, -443, 96, 362, 25, -248, -362, 237, 211, -463, -23, 231, 131, -317, -138, 355, 138, -132, -70, 263, 110, -392, -394, 219, -120, -295, -33, 183, 333, -293, -376, 264, 196, -396, -594, 129, 229, -203, -416, -32, 86, -331, -488, -267, 43, -255, -395, 251, 189, -501, -1054, -75, 175, -235, -229, -85, 344, -326, -335, 201, 299, 1, -508, -79, 308, -344, -313, -143, 19, 72, -395, -179, -8, 15, -241, -272, 413, 145, -412, -138, 296, 377, -379, -114, 82, -138, -475, -329, 361, -36, -346, -208, 325, -40, -439, -413, 296, 237, -95, -104, 508, 197, -114, -619, 222, 29, 31, -244, 273, 284, -152, -335, 506, 320, -337, -265, 157, 627, -147, -280, 213, 339, -189, 54, 109, 322, -114, -224, 137, 400, 226, -158, 35, 538, -20, -113, 172, 537, 222, -205, 255, 516, -3, -519, 402, 457, 96, -403]
7041d03L11Q29q07q3L3O62q2p09J78L70J4l59K5M77k30k91j95M62J59o21rM01
7063A32J97p25M24J49L68o21k25N79K42m61k51O77q6o37p2P14q9m07j80K18M50
7084C96m12l68Q58l81K1m41M23J72m11j55M86q4l5n6K5L73o77j26N60K91k31l95
7106a67K17L51j24o59K68N25j11o42M30j4L2k0k01K20o1n08M44K09p4l52Q7N95
7128D45k56k29l37Q06m1o16o2N92O6m37O7L21Q9o88n1M60M08r47K15J42L30n43
7150b66m9M11K27m91K3N01J59n27n15O31J33l48m77L94M24m17k07L63L92l50l90
7171c79M70M80p26l72P78L3l31m42N01M71n70m00K16N84m36m19L40N10l08n00
7191e00J90M52k3o31J88O57k99l10K7M97k45m99M0M24P3p67L83N63j62m99k9N34
$$ y = [-403, -92, 737, -70, -153, -120, 542, 460, -249, -71, 299, 313, -46, -21, 456, 226, -65, -260, 202, 361, -260, -269, 132, 329, -396, 28, 177, 545, -76, -301, 278, 520, 59, -192, 485, 399, -238, -310, 404, 315, -92, -272, -54, 396, -16, -384, 474, 93, 114, -327, 96, 268, -143, -298, 188, 104, 69, 13, 38, 411, -266, -392, 168, 459, 228, -167, 50, 401, 277, -382, -114, 411, 300, -342, 88, 74, 106, 86, -115, 105, 44, -464, -20, 189, 115, -237, -150, 445, 189, -40, -377, 429, 388, -228, -290, 302, 368, -69, -2, 319, 408, -280, -331, 129, 537, -410, -195, -53, 277, -266, -315, 96, 323, -168, -145, 356, 515, -12, -527, 104, 237, -111, -588, -194, 230, -187, -394, -31, 361, 11, -379, 91, 571, -155, -527, 251, 284, -47, -489, 12, 483, -87, -487, -271, 313, -123, -542, -202, 308, 0, -500, -310, 142, 119, -512, -324, 333, 34, -276, -249, 248, 3, -496, -456, -32, 41, -726, -343, 220, 58, -441, -470, 64]
7213F4j15l31l01N71L06n23N6K60K47n50j37L29J20k04l18M19M9j41l27N33K31
7234B38l73l39L37K78l12j97J83Q34p35l00K05N53l45o77O91M8M3q00P01K24k67
7255a0m35K63N04j81k15j34O73o04k24J69M85o02l1J39N40r4n12J70O03m72n7
7276b5P3J95J14p24l2O83L09n50j8J06K62m02o7P42k72n07Q5P36l43n74r1O25
7298C25Lo03k28M82P33q00n3K67N04n83l39L81M76m36o75O62M74n59k85L54K76
7319C76m1p86P09J53j42k72n1L34l4l10K7L35J5k89l43N39ql10J86N63j29p10
7341a88K39J56j55o7k49N04O4n15QM91kk45m39P86J60n69k37M11K43k96k68L57
7363A89O1m02Q9L67Q2l71n25N90K85j58n49M20K97n41k65M90L77m07l17K74L04
$$ y = [64, -51, -382, -683, -112, 194, -329, -273, -13, 234, -316, -453, -124, -4, -208, -526, -107, -58, -199, -526, 7, 238, -135, -474, -137, 141, -171, -368, -185, 649, -86, -386, -181, 372, 27, -650, 41, 89, 132, -668, 33, 257, -10, -445, -182, 322, 141, -74, -208, 465, -139, -363, -194, 291, -311, -342, -203, 337, 243, -269, -99, 504, 32, -25, 48, 243, 357, -367, -399, 284, 593, 43, 25, 131, 393, -9, -76, 666, 394, -113, -28, 708, 365, -209, -300, 325, 328, -275, -503, -21, 712, -88, -141, 126, 630, 47, -292, 89, 565, 129, -546, 116, 590, 31, -254, 100, 376, 335, -451, 258, 411, 269, -3, -54, 280, 246, -64, -37, 298, 313, 24, -319, 220, 212, -98, 88, 651, 522, -188, 51, 207, 52, -15, -264, 240, 304, -211, -203, 288, 286, 41, -398, 388, 548, -21, -258, 153, 396, 100, -168, 189, 250, -152, -63, 304, 386, 15, -510, 80, 365, 207, -342, 78, 375, -166, -431, 59, 436, 29, -288, -14, 290]
7384B90j54l60K2N31R6n24k45M81j30l49Q7O20m6p57K90N21J31q40J62L58n2m80
7406c48J99M23o8j60k2M56l92l44m5L89J6L4m14N67j73j86J22J8J54o29L27L89
7428C13J73n79m39P14K70o63j43Q15k72n41j01L39N57q72K13L02P8m03k47M13
7448g3M47k08p62N71K32l5o62N45K85l86o63N28P02m55m13rL63J31o19M47L29
7469B95l64o03J82P01n7n73R5O50l85m67J88N15k06k12j18M11j3k21j69N14L60
7490E23p81k65M27L98p89J79M53J08o03P9K12K89n05l84P35j35j02j84L53L32
7510C40n63l43M68L35m4q33L58Q61n83l04L52O49n02n85K70L50k93m36L41N99
7530D37l35j27k77Q41l49m42M69L06m62o14M35M61q7m62k6M83J97p21J21J24L4
$$ y = [290, 136, -224, -202, 329, 425, -99, -344, 137, 7, -342, -255, 365, 319, -438, -148, 373, 504, -336, -174, 184, 132, -348, -149, 274, 206, 46, 24, 480, 88, -256, -301, 88, 104, 138, -276, 291, 118, -68, 54, 72, 226, -403, -76, 313, 486, -93, -532, 182, 452, -211, -354, 461, 189, -352, -453, -114, 443, -429, -216, 86, 164, -239, -486, -73, 374, 166, -596, -25, 207, 172, -490, 55, 340, -46, -709, -181, 521, 66, -347, -356, 7, 138, -481, -34, 295, -69, -672, -490, 211, 154, -419, -324, 326, -59, -526, -338, 177, -29, -241, -359, 52, 39, -182, -351, 163, 523, -258, -523, -96, 302, -487, -308, 145, 253, -350, -271, -59, 230, -275, -659, 76, -59, -161, -345, 8, 340, -223, -566, -98, 237, 193, -640, -282, 579, -4, -308, 44, 693, 191, -394, -124, 226, -67, -503, -162, 437, 102, -25, -302, 539, 190, -252, 217, 523, 61, -553, -118, 343, 256, -206, -232, 251, 448, -273, -152, -28, 6]
7551Fn61K66N60J2m52m2O05j1n87o8M27k5j96l70R99k83m46l34N88L49n30r4L78
7574A91J08k24l01L33L40n51k92Q32k35k38n5K04M01l53o10O27L17l84k93L38
7594A55K32k08m57M43K84m58k80K60L01j12k15L8N22j58n16k4N58r9o44L29L24
7615B75on40L41K47k0m39p5K75L26o51p4P37K39p28M0M96q3m03j11M82j52l11
7637a35j68N09J39m74J44L21L28q94K17M24j01m19j46N46P7k51l80N99J47l56
7657A27m36O65L65o82m53K74M26l48m38O42K67j63m82K9R62n49n73L47N71n98
7677d7j42J48M23k11m08o0M90l9k59j51N35j29l05m8J79K46o59M64O7j69k11j41
7699d27N58L07r30J76N29qo16L43K04J79l40n88O69J29p23m1N87lj47m22N33L54
$$ y = [6, -555, -289, 271, 283, -169, -211, 394, 383, -204, -272, 155, 130, -66, -436, 563, 280, -166, -500, 88, 437, -93, -187, 191, 299, 75, -226, 107, 447, -104, -396, 436, 201, -37, -92, 112, 513, 160, -450, 177, 494, 110, -183, 155, 387, 179, -278, 165, 449, -9, -289, -29, 272, 160, -55, -17, 505, 347, -169, -193, 365, 266, -378, -49, 275, 269, -271, 70, 317, 297, -142, -217, 58, 384, -267, -341, 396, 635, -93, -53, 443, 360, -43, -154, 328, 176, -135, -303, 206, 345, -129, 15, 336, 664, -230, -13, 411, 310, -109, -255, 291, 368, 117, -263, 336, 483, 127, -309, 356, 721, 39, -414, -140, 286, -62, -500, 142, 409, 246, -236, -207, 755, 206, -367, -20, 551, -47, -189, -41, 382, 171, -237, -297, 193, 154, -105, -256, 279, 150, -155, -203, -24, 222, -437, 27, 94, -75, -286, -427, 131, 438, -492, -316, 213, 205, -411, -68, 136, 315, -25, -613, 56, 185, -538, -579, 8, 5, -142, -564, -31, 323]
7721C23p18q6M73K71m46R4J64j32n4l69K87M52l89n29L38P05o12k14L16L82n48
7742b92r3J66K08K68o64J28L09j15k30J74J54L24q49K48L22K9m82J99L53j6l04
7763a63l76Q05k21m07J49L21N1o75O7K89K11j06k68L79J93n89JM89m4j42l26O79
7785C17Ro18j22L30L85o39M4K23O15p11l49N09J98k28n88L96O32o45j68M62J91
7806B43Rp21L57L14j96n27M65L68k3k99j47L23k00k68R4M71J35q09L37L13k10
7827B9l61q3N88j28l33J64P64k14p49k77P03J05l52OM65L2p99J01L46K48m80p2
7849b97K96K85l86j83N38l3j33l11J14M23l32n38P06K07j75p27O06N6m6k66L64
7870A68L4k41j22L13M14n70k76M17M53m85j77l6O40l84j11L3K75J31p17L78J60
$$ y = [323, -395, -481, -8, 263, -183, -89, 75, -57, -111, -480, -193, 259, -130, -659, -321, 384, -228, -442, -126, 256, -292, -385, -219, -11, 257, -407, -279, 30, -85, -315, -141, 13, 337, -512, -264, 58, 87, -395, -196, 157, 141, -163, -539, 266, 45, -362, -213, 108, 159, -516, -449, -160, 51, -55, -323, 56, 249, -340, -339, 150, 106, -36, -362, 317, 326, -292, -414, -84, 301, -338, -294, -71, 544, -167, -516, -7, 191, -37, -625, -229, 403, -242, -410, 52, 243, 252, -469, -112, 202, 6, -521, -56, 312, 289, -10, -157, 166, -34, -302, -208, 263, 398, -411, -74, 239, 29, -332, -415, 173, 45, -288, -124, 640, 426, -323, -600, 103, 208, -144, -138, 327, 359, -440, -339, 7, 255, -225, -297, -1, 284, -102, -285, 253, 220, 87, -224, -110, 313, -19, -557, 149, 356, 181, -546, 60, 116, 70, -196, 168, 202, -39, -161, 152, 566, -4, -280, 137, 590, 105, -72, -108, 532, 148, 37, 70, 345, 476, -241, 137, 297]
7891B97q7l84m3N64l0p30J19P17j20m95j52R79k9r78L67K92J45p63J89L37J99
7912C94m92j05M37j2m18J81L62J04n13P1J97K66k69n99M30M92o86j40N98K20o31
7933a13k67N19K45l52m10N46P7k27j88L09J94j1o88M37M22j27p32L09O88n89k38
7954a96N51l74J18m37O9O73k70n31N5N61q4m45K08J67k17j38j03M82K87m48j62
7975b34L69j73m34J33N83Qq20R2N78k37j01j53N35P0m13k27J58N03n10J61J32
7996B0j5j61m11P01M01p22k67M22R9p8l58M07K43m0q82O78K86k54l17K23M43m19
8018am65P8P45m82m57L74N16k17l89Q7L34m2p47N17O52l10o65K52N88k61m82j51
8040e26P85P4q14K94K77J93n48N4L05k9Qk99M76j2l85j13L95K77q72j11Q03K0
$$ y = [297, 210, -174, -217, 347, 317, -413, -294, 423, 303, -192, -344, 635, 606, -372, -5, 287, 432, -331, -142, 195, 394, -98, -203, 234, 222, -196, -15, 347, 451, -62, 9, 206, 472, 203, -396, 34, 526, -160, -300, 298, 518, -113, -380, 139, 384, 32, -378, 168, 245, 18, -170, 139, 333, 322, -366, 71, 493, 366, -366, -57, 631, 42, -196, 355, -19, 99, -338, -269, 404, 134, -397, -342, 219, 135, -310, -102, 65, -152, -290, -393, 89, 376, -72, -234, 135, -38, -472, -339, 244, 252, -568, -476, 102, -135, -236, -389, 146, 216, -197, -424, -266, 237, -273, -112, 20, 5, -156, -567, 134, 535, -187, -454, -32, 67, -11, -369, 38, 281, 241, -641, 37, 323, 69, -248, -25, 418, -1, -466, -388, 357, -125, -582, -208, 308, 91, -298, -211, 123, 81, -666, -149, 503, 193, -472, -220, 368, 107, -375, -526, 259, 333, -481, -187, 90, 283, -265, -211, 94, 65, 73, -226, 250, 238, -147, -260, 135, 412, -460, -571, 232, 252]
8062B52n99l2M16R4l40kN1O16o78j32M31K72l18p00P34N18o50l65M77K63n22k06
8084d20J78P51k83m52K13K64k6m92J11P03j98p74m1P47Q8n90%O81n97j98P7K83
8106B5M2j35l45P95j65m44j98P26M5n75j62O23J8n96R0N11j85m28J65L32J88m27
8128a00l77M86K96m41k25L35N52n19k92O31L22o90j30R9L89j57l14K01M93o29
8148g0j08M99mq8k97K08L6N7n80K84K78l2k32J84K33k6m36L68J72k67k08J79N9
8171B09J50n27K21N56k85m24nN21mn39J46K30J03k43j72L71K86r77j20Q26
$$ y = [252, -347, -379, 37, 131, -209, -211, -160, 456, -222, -354, 77, 349, 31, -669, 65, 583, -67, -432, 45, 308, -214, -420, -242, 509, 226, -226, -13, 251, 225, -267, -156, 547, 349, -425, -466, 281, 369, -221, -221, 460, -137, -335, -258, 25, 67, -68, -413, 382, 217, -227, -425, 301, 346, -229, -391, 232, 250, -346, -256, 255, 70, -358, -193, 139, 327, -100, -477, 9, 305, -136, -361, -26, 526, 7, -285, 346, 668, -22, -152, -53, 336, 179, -135, 66, 559, -70, -178, 321, 317, 229, -68, 140, 176, 233, -347, -63, 215, 183, -49, 135, 368, 342, -94, 274, 446, 179, -29, 150, 209, 359, -168, 53, 609, 324, -100, -105, 416, 412, -127, 19, 249, 352, 109, -63, 308, 594, -383, -503, 323]
8191C23
$$ Imaginary data points
##PAGE= N=2
##DATA TABLE= (X++(I..I)), XYDATA
0@%%%%%%Qj6J6j6K4l2M0m8N6p2Q8j04J20j43J69j94K25k62L03l46L93m48N10n75
30c04O48p30Q19r16J022j139J269j410J563j734J922k128K354k607K891l205L558
47A873l961M424m959N588o343P261q410R902j1921J4823j9376K7593m6981J70822
61A40335J32359l89085m3836K69999R7018k48170o8046J94914O5870j88785k6298
72f3725J89940L4459k05779m3924J83524M9205j80312m1632J74631M8172j80533
83c5974o2122J65892Q2740j42810q4834J11502P3951r8896o7349P4742M5019p1309
95i448k4761P9453K3370p9681j6915P6311k81j04108j8682J08605M5600q8030
107h567n0426O8901M8069n1934m0440L1532J1546l9579P663O1412n175p6685m576
$$ y = [0, 0, 0, 0, 0, 0, 0, 8, -8, 8, -8, 16, -16, 24, -24, 32, -40, 48, -56, 64, -79, 90, -104, 121, -141, 162, -184, 209, -239, 271, -304, 344, -386, 433, -483, 539, -600, 669, -741, 822, -912, 1010, -1118, 1236, -1371, 1520, -1685, 1873, -2088, 2336, -2623, 2965, -3378, 3883, -4527, 5375, -6546, 8277, -11099, 16494, -30487, 140335, 272694, -116391, -160227, 109772, 206790, -41380, -109426, 85488, 151358, -37427, -63725, 126215, 160674, -45105, -89029, 94495, 143700, -36612, -78244, 96387, 144559, -35974, -98096, 67796, 150536, 7726, -77108, 34394, 108345, 9449, -57900, 16842, 61861, -9448, -34209, 45244, 68614, -11067, -27982, 48329, 48048, -56060, -74742, 33863, 79463, -8567, -58993, 9908, 57977, 6043, -34397, -2865, 8681, -30898, -23235, 38177, 33002, -43683, -48259]
120d8259Q6749J9678q9453l5062Q8372N3807p8115p2022N3221P3002l1819n8293
132c8194L0721N7642k3144n0181K3255M2783l5638n6877L3205O9104j7702n9268
144b4294K8516P0702l4314r7294J5151J12393Q548j19412l5827J17382O8568r0676
156A9443p9104O3898O9527n5083o1301N5419N9583n9304o7460N1909O9005m3300
168B3232o0010M7708N8035n6954o7345N6291P1745o1644r1788M8157J05285j7354
180E5358q9203N359O6779j5508o4596J3357N4896k0927m9093L2382N6543l2505
192A2842o0502L1416N7438l9416o8012L6909P6964k6546p9155J4758P2885o361
204B3220n9781Q420N1955j3349m7571J7991M1549l1084m8467L9536O4072l2157
$$ y = [-48259, 38490, 58168, -31285, -66347, 22025, 75832, -2283, -74305, -21084, 51918, 20099, -38194, -7473, 50169, 27025, -23156, 99, 42882, 7244, -49633, -16428, 52676, 34974, -24294, 4222, 74924, 40610, -56684, -41533, 70860, 79408, -40004, -75831, 41551, 110119, 19443, -59661, 4237, 73764, 18681, -42620, 12799, 72382, 13078, -54382, -2473, 66532, 23232, -36778, 10930, 68965, 12011, -55334, 957, 72702, 11058, -80730, -32573, 72712, 55358, -33845, -28486, 38293, 22785, -41811, -28454, 26442, 5515, -43578, -11196, 45347, 12842, -47660, -16244, 41194, 1778, -66234, -29325, 47639, 21093, -58062, -43304, 29581, 23220, -36561, -28141, 23814, 10465, -37106, -19115, 22434, -8650, -57117, -17581, 46491, 14334]
216A4334o7245L1554P6276k5643q9883L379Q3285J1994o7854j1621O4335J9394
228D2305n1965k0777L8431J0441l8579l916M1450L106m4156j203N4970R519o1238
241b1612k5095N8831M1735m7813n4839K7068N2855j2261m7091N875M4532L499
253B5684l5356o256K5375j705l0408j732K9782J276k7422P731M1118l491n5153
266c0557j4874N2416K5480n1948l8373M4430N0463k8187m9106J6267M1736j2596
278E151l5529R738K5967j3663k1329K1509J9706l0562k2350M2480L6055m3894
290f721m8319L7707N4681l3788o3239K2904O6673p198n3695O790M7335p734m2491
303b7095Q754L2875k0723l2290L6355M6329l6597n4279L7312O4070l3804p3685
$$ y = [14334, -52911, -21357, 54919, 29276, -60607, -57228, 26057, 38051, -29803, -41424, 22911, 42305, -9660, -30437, 7994, 18435, -20144, -24060, 17390, 20496, -23660, -24863, 30107, 39626, -21612, -46707, 12124, 53859, 6046, -48793, -21725, 31130, 18869, -28222, -22347, 22185, 25684, -9672, -15928, 9447, 7742, -22666, -24398, 5384, 6660, -20762, -13031, 28087, 24596, -30557, -45431, 6985, 32465, -19483, -57856, -13426, 37037, 8850, -40256, -23989, 17747, 5151, -30378, -20640, 5327, -8336, -29665, -8156, 11550, -19012, -41362, 1118, 37173, -6721, -55040, -17333, 37348, 3560, -59679, -36775, 29898, 22700, -30995, -24205, 23130, 15396, -27095, -18341, 14534, -6189, -38479, -2124, 44205, 7608, -46671, -9359, 54711, 20907, -52778]
315e2778K5036P7666j6851p6984J1327P8194l174p1963J446O8356j096o4274M692
328b0403O2340j3034p1989J3396Q4903k557q7571n005R0626J4791r1304k8788
340e4595Q0854L1855p5155l2305P2346L9004o3174l7022N5179K8335o1206k6885
352d2769O5762K8230p3321l5984P8077N1166p3814o4045O1820O8796n1169p1559
364e8810L7431O6463l0165o1636K4960N6414j9623m6231K2687L7871l2716m2504
376d5859L7755M5992m1070n2784M2146O4887l3257o8609K4940O7441k1961p0348
388e0727J2514O9635k447o0289L44N1271q61m1483J0539L9217k4694m9292L0811
401a5462O4732k6827p5093J6891Q2575k112p8999n172P3414P797p1984j2529O7679
$$ y = [-52778, -27742, 49924, 33073, -43911, -32584, 45610, 42436, -29527, -28081, 40275, 39179, -25095, -20403, 41937, 28903, -43086, -29690, 55213, 52656, -34915, -39920, 50706, 65497, -25807, -54595, 26259, 58114, -17041, -49346, 23000, 62004, -1170, -38192, 16987, 45322, -15884, -42769, 22993, 51223, -22098, -58082, 19995, 71161, -2653, -66698, -4878, 63918, 12749, -58810, -21379, 45084, 14919, -46717, -21757, 34657, 15034, -31197, -8510, 29361, -3355, -45859, -8104, 37888, -3182, -55966, -13820, 51067, 17810, -50799, -25859, 41582, 19621, -50727, -38213, 31422, 28975, -31314, -30970, 20301, 19440, -22043, -11504, 27713, 3019, -46273, -15462, 49270, 22443, -52650, -35759, 46816, 44704, -34295, -39467, 33947, 41744, -30240, -42769, 24910]
414B4910J5698o2687j1889O3730J1797o4670j1602O7829J1287p6446k0652P8026
426B5331L2384p2475l7007O8170M0878o3828m5277N8180M6221n5560n0598M7598
438e983N0013l8786m3547L8544L5913m3281l5845M9816L9884n6877n3998N2243
450a1904O5111m0797o7855L0271O7272k0399o4524J0010N5656p997m8773O914
462b7015M0961q952l3485J9688L4574k7779m5355K8466N4247k3807o1514J3922
474c6049O3196k856n7079r07N4487K803n2746o839M8449Q618m4144p618M0840
487A0155N303l7444K372M3326m765n2499j82N7882O961o0013j4617O0075K3247
500C9801n5642k6760N2767L1746m8484l6521L9011L3898l3184k6737L4667K1017
$$ y = [24910, 40608, -22079, -33968, 29762, 41559, -23111, -34713, 33116, 44403, -32043, -52695, 25331, 57715, -14760, -51767, 16403, 57281, -6547, -51824, 6356, 52577, -2983, -53581, -5983, 44030, 5244, -38303, 241, 36154, -7127, -42972, 6844, 46728, -10149, -64147, -11904, 53207, 12410, -55445, -25174, 42098, 21699, -42825, -32815, 22841, 14844, -33929, -27015, 13946, 4994, -28491, -8803, 25771, -2008, -47363, -18897, 35350, 11543, -49971, -36049, 27147, 24291, -32788, -33695, 20792, 23595, -29151, -35990, 12459, 21077, -23067, -30685, 10155, 15458, -21986, -19614, 23712, 18947, -33552, -33734, 24148, 31109, -28904, -43521, 16554, 39801, -15841, -42601, 10166, 41912, -6572, -43093, -4082, 29816, -3368, -30105, 4562, 25579]
512B5579m0546j9223N0763K6443n7982m0461N2335N0642m3568n4975L4125N4407
524C7539k5178m9992K1286M4735k1020m3376J8899L8333k0383l5672K4948L7809
536B7928k8093m1574K8258M6803k5920n1941J8751N1480j3573m9551J0400M9688
548B2656n411m6006L6M1693J986l3896k439K5447m618k1576J6179K8904j9045
561C910l8313J6483M6666p332m8692m636M3770J3125l3748j2674K7769J3080k1120
574a712r955J7643O559j7004k418J8210J500k0775j170K6976O958k7134j3643
587a5965K5398J9281k0606k3965J4127K6144p269k5241K958K5558M264k2335r455
600g106J5702P902j1539l870J0822q00j4178M183K3341k150l2007o736L4734J5811
$$ y = [25579, -14967, -34190, 16573, 43016, -14966, -55427, -3092, 47550, 3982, -50993, -16868, 37539, 12361, -37631, -16345, 28390, 7370, -36006, -17107, 21226, 843, -34829, -9881, 27928, -165, -41739, -13481, 33322, 7402, -44539, -25788, 25692, 12119, -37432, -27032, 22656, 17245, -28761, -28725, 12968, 14954, -18942, -21381, 4066, -552, -22128, -5949, 22955, 3910, -34403, -17920, 28746, 21414, -27278, -31914, 11856, 24981, -8767, -21441, 6328, 19408, -1712, -11667, 5976, 12535, -4469, -6887, 11323, 12823, -7952, -9122, 17854, 24812, -2322, -15965, 9433, 28714, 8108, -15857, -1730, 24414, 17145, -8096, -5138, 20420, 24684, 2349, -7106, 8596, 16498, 4959, 1089, 11911, 11111, -3067, 1116, 24457, 22307, -9700, -16436, 18298, 34109]
614C4109l5078k4303L0587L0694k5102l2957J8951L2830j4501l0587J0356K5372
626B0371j2858k2199J7015K1768k2328k4857K7401L1019k8037l8260K4957M1552
638C5544k2523m4797J8724M7776j2959m7008Q572M3676n718l9328N646L3508j0032
651A1081l1084J7163L5254k1396m1447K2041M8662j7572n3441J1067N3410m853
663B8885n1303J470M7956J445m2941n03L9383j337l7098M445L6652r058m0122
676b2126J1541M6065q327n0547M322N2943J505n3128q709M9634J3549m4451j5900
689b3629L8880J6624l2598j4306K8527Q925k8344n606L1370L490l6448n671M0723
702B1937J1997m2177k0018L9754K7047l4475l2253K5423L3352j8567l0535J2972
$$ y = [34109, -969, -25272, 5315, 36009, 10907, -22050, -3099, 29731, 15230, -15357, -5001, 20371, 7513, -14686, 2329, 24097, 1769, -23088, 4313, 35332, 7295, -30965, -6008, 35544, 13021, -31776, -13052, 34724, 21765, -25243, -16671, 27005, 21287, -18041, -12395, 21113, 11081, -20003, -2840, 32414, 11018, -30429, -8388, 40274, 22702, -30739, -19672, 33738, 28885, -22418, -20948, 27008, 28453, -14488, -14991, 24392, 23055, -14043, -9598, 27054, 17996, -22126, -10585, 35480, 27153, -23394, -19072, 33871, 35376, -17752, -26461, 23173, 36722, -7729, -23629, 15251, 31875, -723, -15029, 13498, 22423, -5921, -11527, 19843, 23333, -13115, -18786, 21937, 33934, -8243, -28261, 11493, 38540, 4065, -28188, -2765, 30587, 12020, -18515, -5543]
714e543K6909j0827k2245J1407J9314j4582k1114J6398K4045j6750k8653J6367
726e274L3242j3312l7613Q153M0210k958m1836m153M0284J0463l6015j3815L0547
739G923J2943k6564r509K6335M549l0556l228L6511M992m2489j0658M5857J7609
752C3715m5429k5046M2343K8804l8227l1249L2796L0353l0055k7026K9413K3803
764B4195l1964k2724L4653K2515l8890k5009M1523K9157m3257l4162M3256L8620
776C7913m1182m4030L7231M6189l1859m6012K5889M2721k2786l7862K3638L3083
788B2933k6946l1584L2215L3674l6427m0114L7890M6405l4111n1271K8519N3855
800C5038k1363n1824J4676M7102j1808m1025J3065L7181j5623l6009J9731L7710
$$ y = [-5543, 21366, 10539, -11706, -299, 19015, 4433, -16681, -283, 23762, 7012, -21641, -5274, 27968, 14656, -22957, -14804, 25406, 22448, -19388, -23541, 16743, 27206, -8809, -22624, 7923, 20866, -5698, -15207, 11128, 15677, -14879, -18107, 18404, 23396, -19093, -29751, 16106, 33715, -11714, -36760, 5583, 34387, -3840, -35089, -2293, 28060, -1995, -29021, 392, 24195, -7769, -30493, 4160, 26675, -12215, -37224, 4299, 33456, -9801, -43963, -707, 37913, -3269, -47299, -10068, 36121, 4262, -41750, -15861, 26860, 4074, -33788, -10150, 22933, -4013, -35597, -3382, 30292, -6135, -46249, -8359, 38046, 3935, -47336, -18817, 35038, 13675, -38149, -23473, 23629, 11821, -29204, -16139, 21042, 5419, -30590, -10859, 26851]
812B6851k1306m0592K0776M3998j8281m5765J5426M7549j1841m7609P763M6990
824B3959k119m4509j366L9784L040l3829j870L0154j407k8787N099L1128o772
837A2505l4661N161L8658j162m0528n234M0481J1823l5989j7200K9203J9241k1558
850G40j7439J5882J2166j3857p384J6577M250k0955n303K4041J0035k5182j6084
863b2513K3887K0246j9829k3497J4961K5021r869k5130N698K3283k391k0139Q25
876i447J7207j781j5333L894J5511n795j7661P130K0748o889k4226M906K8157
889A6421j036l0528m415L0275J0574k7171j4959K2136J5825j5897j2645J2828
901A408P365j3803k832J8553J761k4680m287K9138R848l0060j5868K8431K1055
$$ y = [26851, 5545, -35047, -14271, 29727, 11446, -34319, -18893, 28656, 16815, -30794, -23031, 23959, 21840, -22669, -24035, 15749, 18789, -15040, -16910, 13244, 11837, -16950, -11851, 19277, 12505, -22156, -16995, 21663, 20501, -20027, -25261, 15220, 27043, -8946, -26146, 3057, 22298, 740, -16699, -817, 11349, -2508, -9892, 6685, 10935, -10020, -15323, 8718, 18753, -6429, -22513, 1374, 21620, 1791, -21706, -6745, 18276, 8407, -16723, -11025, 12258, 9867, -10272, -9447, 7760, 5979, -9354, -5460, 10051, 4256, -13405, -6275, 14473, 7584, -16642, -11736, 16421, 15385, -15143, -19558, 10717, 21291, -5880, -20839, 1297, 17122, 1225, -11420, 1408, 8773, -5030, -7862, 10691, 12452, -12228, -16515, 12623, 22471, -7589, -23457, 4974, 26029]
914B6029k4485k3756J9237K4198j5010k1759J1924J8898j1516j5561J3426J3556
926A5181j6086j4276J8634J6310j9799j9597J9846K3257j8492k5775J5553K8255
938B3011j1233k9790O196K7824j643k3922k29J9157n94j5356L957J4400q026j6848
952a3096R847K1318r328k5342N745K8905n2k8943o396K6892J0800k2196j3181
965a5027J6265J2551j1332r195R615N313j0367k779J3793L384j8130n793J9517
978G815R662j9640j3475J8862J6771j5483k0219J1721K1685p707k1729L679J9066
991A1008j493j5380J615J2903l838j2472O861J3268r157j7017R051K1438q382
1004H405k5262M701K8019J53k8471m850K5346P993k1849r903J7905P807j5366
$$ y = [26029, 1544, -22212, -2975, 21223, 6213, -15546, -3622, 15276, 3760, -11801, 1625, 15181, -905, -15181, 3453, 19763, -36, -19633, 213, 23470, 4978, -20797, -5244, 23011, 11778, -18012, -11816, 16008, 14365, -9557, -9786, 9371, 8777, -6579, -2622, 11778, 3752, -13096, -3249, 18069, 8741, -16601, -10856, 18049, 17997, -10946, -17342, 9550, 20350, -1846, -15027, 1238, 13789, 2457, -6738, 2877, 8190, -2177, -4956, 8837, 12221, -5909, -11702, 7815, 17477, -2163, -15638, 3224, 19995, 4512, -15707, -3986, 17699, 9992, -11737, -8058, 11008, 9515, -5865, -4250, 8653, 4815, -7657, -796, 12472, 3315, -13702, -4651, 16787, 8405, -16857, -12156, 15863, 16016, -12455, -17305, 8041, 16034, -5815, -15718, 2187, 9994, -5372]
1017e372m058J5822J146j9040j360K2564J834k6169n368K7439R858k7301j3808
1030b3813K5598J6885k2948j9101J8503J8321j5455j6387J3560J3695j4322j0991
1042a6455J7012J0961k0364j3417K2739J6078k3563k0767K2575K5339j9257k8473
1054b7592J5510K9890j0207k8793N722K4770l818k0829N280J8639p613j7871J1208
1067e704K0279j2727k4585J2314K8285j0393l0582O717L3597k851l2413j634L1486
1080A1789N351k8538p226K4911O492k2190m125K2175K644k3471p46K6695J160
1093A4921k9643m388L1504P828l2035j1648L1122J5805k7677j7498K3752J7144
1105A9187k0982j6215J9642J3499k0423j1338K2670J2052k4715j4075K6432J6423
$$ y = [-5372, -9430, 6392, 7538, -11502, -12862, 9702, 11536, -14633, -20001, 7438, 17296, -10005, -23813, 1785, 18670, -4278, -23379, -4876, 13445, -2010, -18397, -4837, 8858, -5464, -16455, 557, 11518, -8846, -22263, 476, 16554, -7009, -27776, -5201, 20138, 881, -27592, -12082, 17808, 7601, -21192, -15470, 9300, 5482, -15347, -10067, 8572, 959, -16912, -5704, 14575, 1848, -22737, -10423, 17862, 7469, -23113, -16396, 17201, 14350, -18063, -19697, 11789, 17140, -11398, -18624, 6287, 12779, -9411, -13536, 8639, 11283, -12188, -12934, 13761, 14921, -14722, -19110, 12394, 20222, -11813, -23461, 7661, 23466, -4211, -21709, 2043, 19187, -1795, -18010, 1632, 15131, -5292, -16630, 6040, 18092, -6623, -20698, 5734, 22157]
1117B2157k6799k0163K5912K2284k3616k4928K0697K6127j6114k4769J3477K1503
1129A5768j2982j8984J3463J6983j6682j6676K0140J9667k0880k3308K0806K6045
1141B3360j9343k9696J6321L1665j1774l1503P779L0105l873k6051K775K1731
1153A1496n017j9320P784K0208r988k2227J0721K5879q501k7488N851K8486l329
1166A4555k9177J91K8379L300k5772n801K4050P269j9432o988J5989M216j5707
1179d928j823J6827J809j9001k253K1673N116k2605r221K1446J2187j9351j4600
1192a4724J5222J6484j0647j5227P991J2527o986j0070P957Q450j0623j0011J2335
1205B678J2273j1650j5014J1405J7341r206j9100O459J9369m602k0187J359J9842
$$ y = [22157, -4642, -24805, 1107, 23391, -225, -25153, -4456, 21671, 5557, -19212, -5735, 15768, 2786, -16198, -2735, 14248, -2434, -19110, 1030, 20697, -183, -23491, -2685, 23360, 4017, -25679, -9358, 22307, 10533, -20970, -13191, 16914, 13041, -13010, -10235, 11496, 6479, -12841, -5057, 15151, 5163, -17064, -6343, 19536, 11035, -16453, -10602, 17884, 14555, -14622, -14431, 13948, 17248, -8524, -14325, 9725, 16994, -2438, -9426, 6563, 10779, -4928, -6751, 10076, 11885, -7116, -9369, 12304, 17420, -5185, -14406, 7040, 19227, -124, -14724, 498, 16982, 6335, -8892, -901, 11626, 4640, -5430, 2527, 10977, 354, -9657, 2678, 14951, 3301, -11713, -308, 17033, 7827, -11273, -4814, 14555, 9953, -10234, -8875, 10967]
1218A0967J787j7305k214J5454J403j4402k23J3661j671j4821K623J7916k326
1231A0849j9962K017K2458L53k5302l924K5332Q586k3509j1961J9424J2971j4738
1244B594r628J3575O025j5591m467J8610M594k2249o973K3295J1134k2072j2889
1257a4042K0867J4294k0011j6456J7743J6776j5238j6950J3154J5875j1290j3362
1269h640J0783J1252j3214j1172J4006J1818j5298j3367J4984J5431j4425j7102
1281a4944J2983J7447j0189j9809O272J7934l212j5084J272J1797j802q516M285
1294a566O840q006q690Q578J0429q638j3466P782J5604m272j6567Q73J4948K586
1308F435j3493n137R991N147n930l440M947J247m965m94O942P96q718k832R283
$$ y = [10967, 12754, -4551, -6765, 8689, 10092, -4310, -4533, 9128, 7457, -7364, -4741, 13175, 10849, -9113, -7096, 15362, 15715, -9587, -13511, 11821, 20407, -3102, -15063, 4361, 17332, 2594, -7034, 6541, 12566, -3025, -7492, 11118, 15712, -6537, -13510, 9785, 20919, -1153, -14042, 6825, 21119, 1108, -15348, 2395, 19171, 3933, -13017, 137, 16012, 4722, -8640, 2143, 13395, 181, -10991, 3015, 14833, -465, -13832, 1152, 16583, 2158, -14944, -1961, 15486, 5297, -14512, -8240, 9694, 6482, -8602, -7330, 4467, 2665, -5851, -1566, 5274, -2732, -11422, -2844, 7585, -1053, -14519, -6737, 8867, 4595, -11972, -11099, 3849, 6435, -7058, -12195, -2204, 2943, -2987, -6427, -1480, -233, -5198, -5692, 1250, 2046, -6672, -9504, -221]
1323b21M782q898n504Q495Q307p313j0159N932J1837m370j2920J090J3188Q42
1337E088j0359r40R749M20r380O83R801j741j2184K323J4861j291j6973n80K0324
1352I801L891k1081q734J8910J1767j5737j2370J1508J0738r086o737J0498M044
1365G412j3995m240J6773N741j9593q630K0128J1059j9101j2781J8825J4346j8012
1378b068j6456J5387J6673j3435j6117J1653J4975j1030j2448J1751J0964j3635
1390c786j0660J5007J0558j7376j1953J8862J5420j8563j8390J6896K0894j3666
1402C243k1089R699J8910p982j5766Q475J4383r859j3756J2525J4995j3375j7282
1415a6879J1990J8678j0696j9275R468K0196p232j9799N930J9689m092j8386K278
$$ y = [-221, 4561, -4337, -9841, -1346, 6961, -352, -10511, -4579, 7258, 2888, -10032, -8942, 4246, 5088, -5271, -6211, 3538, 3958, -5422, -4739, 5062, 3321, -8863, -6540, 8321, 7030, -9943, -10523, 9801, 13692, -7389, -16123, 2787, 14554, -1183, -13553, -2045, 8693, -393, -7130, 3368, 7412, -6583, -10823, 5950, 11691, -7902, -16532, 3596, 14655, -4446, -17227, 1598, 15944, -2068, -18524, -3137, 13536, 101, -16016, -4363, 10612, -418, -12866, -1115, 9849, -3786, -14446, 561, 11119, -6257, -18210, 652, 16072, -2491, -20881, -3985, 16909, 3243, -17846, -8147, 10763, 2781, -12985, -4510, 9873, 14, -13742, -1217, 13778, 403, -16879, -4889, 13789, 3093, -16182, -6714, 13482, 6250, -13549, -7619, 12070, 7978, -10408, -8130]
1428h130J6295j698j4873K221J5396k867j5176L543J6190l101j8112J355J9263
1441A0306J133j9197m351J8905Q066j6377r680J2592R872r930q851P802P449q137
1455c98n335R488N084j0220n904J1716P363j2816j0074J2123J3220j1328j5183
1468a2264R193J7266n929j6749L320J5089j759j3815J089J2404j643j1184L766
1481a216J1453m603j2631O001J3954o235j7623N558J9898k200k0891m57K0743
1494A1751K968j8992l926J6708L090j5561k011J5465R90j6360K53J7913P38j9747
1508f721j412K0633K600k2435m747K1657P765k0415r154J9397R429j7482r897
1521a0782J5862Q146j5622p373J6044P181j7287o458J8549P305k0187r745J9755
$$ y = [-8130, 8165, 6467, -8406, -6185, 9211, 6344, -8832, -5289, 10901, 7800, -10312, -8957, 10306, 11439, -7758, -12109, 6796, 14862, -1515, -11195, 1397, 11269, 1339, -7512, 290, 7739, -398, -5733, 3755, 8839, -1381, -7285, 4431, 11794, -1022, -11096, 1027, 14247, 2919, -12264, -3071, 14195, 8266, -8483, -5163, 9926, 8167, -5648, -4559, 7845, 6202, -4982, -1216, 10237, 5634, -6997, -996, 12958, 6723, -10900, -5342, 14556, 12356, -8535, -8992, 11751, 14719, -4273, -8199, 8509, 11599, -3962, -5973, 9492, 10482, -5878, -5625, 12288, 13026, -6721, -8133, 12500, 15100, -7335, -12082, 9575, 17340, -3075, -12229, 7168, 16597, -885, -10782, 5080, 13226, -2396, -9769, 6275, 13456, -3831, -10289, 8260, 15565, -4622, -14367, 5388]
1534E388J2366j9050j4888J6008J6102j2967j5372J0364J3731r676j1823Q986
1546h31J0267j0442r928J1315J0100j2097j0609J2919J2467j2703j5207J0385
1558d364J5997p834j6162N449J5273k735j3606K243J1076k151j0449K608R209
1571D554l163q815M576R322n306j0956N440J3135l457j4842j7J4378L464j2560
1585d247m992R991M447o743k847O634J110p380j016P809J003r194p49J1021K081
1600F928j1213m694J2002O528j1340r430R219J0747o855j0362N494R516m325q965
1614f750L760Q561l998q033M149P326n414p693O832R591p202j2226O535J4547
1628I985m151j6039m9J4896K309j2679k406J1319K251r586k072Q721P39r879J29
$$ y = [5388, 17754, -1296, -16184, -176, 15926, 2959, -12413, -2049, 11682, 2006, -9817, -831, 9436, -1006, -10934, 381, 10481, -1616, -12225, 694, 13161, 458, -14749, -4364, 11633, 3799, -12363, -6914, 8359, 5624, -7982, -5739, 5337, 3186, -7263, -4655, 4554, 1391, -7424, -2848, 6474, 1168, -9788, -4348, 8787, 5330, -9512, -9529, 4849, 8313, -4247, -9239, 752, 5199, -1544, -4391, 2243, 3353, -4027, -5043, 2766, 3769, -5425, -6174, 4847, 6928, -4285, -8979, 3023, 9551, -1789, -11219, -2000, 8747, 1892, -8470, -2976, 6540, 2215, -6750, -2990, 5571, 1573, -6460, -2311, 5015, -399, -8092, -1260, 8331, 1129, -11097, -4562, 9985, 5834, -10205, -10254, 4642, 6951, -5728, -8134, 3185, 5436, -4150, -6222, 2499, 3238, -6641, -6512]
1643f512J0578o53j1740P69J3672J195j5282m346J4407O487j1989p545R980O324
1657E345q048n625Q534M466q251m548Q803M655r385n003R367M990r579n971J1342
1672A092Q184j0902j0465Q755J1103o521j1544M462J1344k725q970K622P478l147
1686G66o390L684O055n541o831P926R331q073j2966O176J6130k802j6003r31J4309
1701D840K498j1254l235R645K616r268j056R957J070j0164j561J0227R70j1097
1715e812r75J2983K579j3550m589J4106O209j2927q351J1366R052r749q896R193
1729F39R257p867r005O705P838o067o707P713N649r532o753J1097J0014j0772
1743B209j2104P851J4186m857j2990K234R965k164q195L625Q197m147q511N093
$$ y = [-6512, 4066, 3413, -8327, -7558, 6114, 7309, -7973, -12319, 2088, 8575, -3414, -10959, -979, 5345, -2703, -8328, 206, 4672, -3579, -8127, 676, 5331, -4054, -9057, 310, 5300, -4279, -10250, 1092, 9276, -1626, -12091, -3336, 7767, 1246, -10298, -5836, 5508, 2783, -6187, -3565, 3913, 766, -5624, -1940, 4115, -1426, -8257, -331, 9000, 927, -12039, -5863, 10267, 7465, -8538, -9469, 4840, 7338, -3916, -7151, 2494, 5110, -4158, -5214, 4743, 5813, -4351, -5912, 4315, 5285, -5812, -6787, 6196, 8775, -4775, -9364, 4742, 10951, -1976, -10327, 1039, 10091, 342, -8554, 639, 9896, 2029, -6976, -271, 7567, 1500, -5207, 2506, 8155, -1377, -8130, 2967, 12981, 2209, -9895, -2044, 12142, 7285, -5705, -3471, 6494, 4330, -3865, -240, 7957, 3810, -4701, 392]
1757C92R075n502j0466N453J1056m982j2115M386J4090k875j4453j4J3706J444
1771I195j1943j930R692K141r150j479Q790N26q732P16R412j234j1134K81J2717
1786G868J064j4811l340J5028O203j3101q135J0666Q283r233q823P720Q138o319
1800A208p381O658O382p440n985Q130N892r880p698J1073J0393j0079j2979Q258
1814c448J3693o032j3568L939J3114l440j1856K250J1552k515j0805L146J0944
1827F974l383j1412M311J2279m844j4219L063J6016o50j5866q70J5030J589j3138
1841e120k621J2326J740j1554j458J1932J327j1813r24J2168K21j3256J28J4728
1855G824O79j6352k354J6489N110j5798p097J3678P951j1536o791J0015M759r742
$$ y = [392, 9467, 3965, -6501, -1048, 10008, 5026, -7089, -2703, 11387, 8512, -5941, -5955, 7751, 9195, -2748, -4678, 5014, 7155, -1995, -3474, 5316, 5842, -2890, -2174, 7238, 6004, -5130, -4849, 7868, 8932, -5879, -9219, 5809, 12012, -1089, -9224, 1442, 9725, 492, -8331, -611, 7527, 1208, -6173, 485, 6867, -573, -6558, 1572, 7464, -2416, -10114, 959, 11352, 1273, -11706, -3448, 10245, 4213, -9355, -5416, 7698, 4258, -7598, -5348, 6204, 3689, -7116, -3970, 6974, 3591, -7821, -3510, 8769, 3925, -10294, -7231, 8785, 8135, -7731, -8601, 6429, 8018, -5120, -7741, 4585, 6325, -5229, -6687, 5245, 6572, -5241, -6165, 6003, 6224, -7032, -6904, 7824, 8503, -7849, -10203, 6286, 11396, -4402, -11499, 2179, 10130, -1406, -8197, 1818, 6577, -3165]
1869c165l864J0628L003j1644k917J2558M189j3833o087J3793P438j3112q690
1882a1703J2028R248j0214r862Q767R120p517q502O657P241o242o272O697N978
1896E424q280o508R046P973q694r828P655J0595n603j1150L728J0852k489r272
1910f551J397Q152n78p604O64O444j272o406K936P110k769q732J950R829k57j0285
1926e972j891R791L750q710m407P453M847o321n115N597M565m322m395M364L619
1941B853m993l024N777L984p395m912Q339O707p842r184O391J0264m451j0531
1955h017L135J0062j685r495J496Q255k047p521K747P970l702q956M689R816l643
1970C104j1832K932J2521j529j2557O2J2929O40j2018j478J0924K626j0483j592
$$ y = [-3165, -7029, 3599, 6602, -5042, -7959, 4599, 8788, -5045, -11132, 2661, 10099, -3013, -11703, 325, 9573, -641, -10503, -1736, 7384, -133, -8635, -1978, 5263, -979, -7251, -554, 5424, -2856, -9364, -318, 7655, -1039, -10867, -3212, 7383, 1780, -9370, -5642, 5210, 2721, -6551, -5154, 2998, 2420, -5184, -4520, 1924, 652, -5754, -2818, 4292, 1523, -7209, -5259, 4570, 4313, -5972, -7863, 1928, 5678, -3032, -7439, 14, 4861, -1460, -6575, -978, 3587, -735, -5130, -766, 2853, -2140, -5164, 613, 4597, -2798, -7710, 629, 7336, -506, -9690, -3299, 6965, 2514, -8017, -4882, 5180, 3495, -6000, -4504, 3751, 1704, -5817, -3070, 4900, 1198, -7758, -3069, 6747, 3104, -8728, -5796, 6725, 5196, -7361, -7299, 5630, 6270, -5748, -7226, 3698, 6324, -4159, -5751]
1984e751R598P93r309M11J0308j006j1614O22J2999J287j3019k828J2271M507
1998I269j1770m815J0771N700r350n183Q082M668p048l722P227K333p811j884
2012c533R765K598j0745l946J0361O224r869o331Q334O941p547p028O104P029
2026H357m614p265M217N806l109m595L227L295m819l751O236N627o399p449N231
2041eP989l003q832J262P880k10o659p27N656J081n816l48M982M5n168O0N790
2058C977J29o593j873P570K270o925l743O372M551o419n043N808O435n826p242
2073f552N002P197l123o691K347N655k953m800M655M834n639o760O343R145n323
2088C337j1134M355J1376k623j1038J091J0386O01r909j95Q790l43q358J959Q446
$$ y = [-5751, 3847, 4640, -4669, -4258, 6050, 5044, -6570, -5948, 7051, 8338, -4681, -7509, 4762, 9269, -2501, -7316, 3455, 9155, -195, -5378, 2704, 7372, 324, -3398, 3829, 6162, -1649, -3533, 6232, 8830, -1915, -5861, 4500, 10724, 855, -5476, 2858, 9799, 2252, -4776, 1328, 8357, 3743, -3522, 695, 6501, 3392, -1203, 2024, 5319, 500, -3251, 2985, 8612, 2213, -5236, -5, 7984, 4981, -3851, -2589, 5291, 5081, -1578, -2305, 3351, 4432, -1384, -1732, 3250, 3295, -1873, -1813, 3977, 4106, -2487, -4360, 3210, 5480, -1445, -5188, 1184, 5735, -684, -5727, 81, 6516, 690, -6552, -1550, 5647, 2524, -4167, -1820, 3835, 882, -3918, 737, 5571, -68, -6828, -485, 8660, 3337, -7797, -3442, 7934, 5311, -5727, -4636, 5750, 6351, -3558, -3753, 5037, 4694, -3664, -1705, 6741]
2103F741k747r594K864J1117k193j1429M21J2168o1j1755q36J2048O72j2272j205
2118f061J1985K612j1470l118J0027K768r127j544R050L14j0437k14J1768J108
2132G661j2736k654J2346M043j1730n298J0723N453r266n809Q293M724p723l964
2146e937P540L497q514l553R531M106j0016n472R193O929q580p625P613P117o562
2161g33p578O013P649n341p090M090P101l790o033L549N552m156o005M621O714
2176D563m241p823L519Q674k739q776J342R320m49q806q60Q118J669p030j631
2191e150O067J251n632k36N766o1p192k62Q215J602q735k770Q898L674p435n334
2207g334O763N810o370n612N299N739m859n446N319M374n073m718O087M864o578
$$ y = [6741, 3994, -5600, -2736, 8381, 6188, -5241, -4820, 7348, 7287, -4468, -5304, 6744, 7416, -4856, -6061, 5924, 8536, -2934, -6052, 3975, 6743, -2384, -3928, 5122, 5436, -5001, -5215, 6553, 7661, -5075, -7729, 4617, 8660, -3070, -8368, 2355, 7808, -1458, -7267, 1026, 5750, -1973, -5937, 1603, 5100, -3414, -6967, 2564, 6670, -3346, -8818, 375, 7304, -1276, -8901, -1288, 5829, -733, -8311, -2298, 5351, 10, -7080, -2990, 4111, 321, -5712, -2163, 3389, -767, -6772, -2151, 4563, 322, -7501, -3982, 4692, 1953, -6823, -5481, 3839, 3390, -5416, -6276, 1842, 3511, -3519, -5150, 917, 2168, -3464, -3700, 2066, 2005, -5187, -5449, 2766, 4368, -4367, -7137, 1761, 5435, -2000, -7334, -571, 5239, -1131, -6743, -1444, 4295, -564, -6010, -691, 3683, -1390, -6108, -21, 4843, -1735]
2222a735n900O725P249o646p935N632Q514m887q881M534Q948l536q830K860P987
2237D099k344p198K647P143l797p170L952Q519l748r716L463J0572k967j0257
2251f802J554J0602m70r969l56R577J146q858p87P999K60p698K51Q273k95q960
2267d533J51R856N09r943j756J0262K328r193l531Q810M105p730m233O980L930
2282F012n907l728N757K936o111k605O666L255p554l769P639M782p120n734O002
2297E21O625n509o666M197O788l532o307K990N771l030n151K615N388l492n254
2312d046L510N891l570p084L006P890k309q239J658P732m62p717m15P041J118
2327D004o505j164N693P42n340l03N800K8o634m13P729R41p980j994Q086K931
$$ y = [-1735, -7635, -910, 6339, -307, -8242, -2610, 5904, 1017, -7864, -3330, 5618, 2082, -6748, -3888, 4099, 1755, -5443, -2796, 4347, 550, -6620, -2668, 5851, 2103, -7613, -4150, 6422, 3455, -6802, -5248, 5354, 4884, -5085, -5441, 4136, 5282, -3576, -4363, 3636, 3896, -3802, -3551, 4722, 4427, -4533, -4382, 5474, 5983, -3960, -5716, 4546, 6874, -2319, -5850, 2960, 7065, -665, -4898, 2082, 6012, 105, -3623, 2134, 5070, -1041, -3646, 3020, 6275, -1279, -5048, 2591, 7373, 253, -5481, 521, 7146, 1637, -5029, -832, 5956, 2424, -3883, -893, 4878, 1848, -3303, -688, 4700, 1208, -4046, -536, 5355, 1785, -5299, -2293, 5597, 3288, -4951, -3293, 4439, 3977, -3740, -4155, 2886, 4004, -2501, -3665, 2028, 2770, -2570, -2873, 2927, 2955, -3679, -4092, 3637, 4578, -3402, -5396, 2690, 5621]
2343E621p311m080P165M249o114m475N578M374n064l629M608L432m542l307M881
2358A386L709n664l906O038M878n901n741N353O558m217o762L087P065k350o642
2373c109J784O133j884n229K045N089k778n103K908N516k507p031K560P041j375
2388D060p717O05P781j4p304j023O685J620o146k001N653J505n817j331N824Q77
2404C257n939j295O533R82o735k116P217L068p521l919O587N000n911n555M798
2419a549N496m514m691M127M400m733m123M985M450n646m967N644O259o030o377
2434g269M560P339l816p592L176P167k027p158K050O735j905o421K291O357k472
2449A015o875K815O874k254p489K232P857j308q874R74R319o01q442o34Q087J312
$$ y = [5621, -1690, -5770, 1395, 5644, -470, -4945, 633, 5007, -57, -3686, 922, 4354, -188, -3495, 1386, 5095, -569, -4475, 1563, 6441, 540, -5201, 152, 6710, 2493, -4269, -1182, 5883, 3533, -3109, -1325, 4808, 2924, -2305, -260, 4829, 2051, -3052, -144, 5372, 2865, -4166, -1606, 5435, 4060, -3657, -3052, 4729, 4715, -2589, -3612, 3073, 4693, -1453, -3454, 2199, 3704, -2113, -3444, 2380, 3257, -2682, -3977, 2556, 3538, -3197, -5313, 1904, 4972, -2549, -6468, 119, 5119, -792, -6347, -1549, 3947, -567, -5258, -1131, 3269, -1464, -5587, -602, 3848, -1798, -6765, -1121, 5138, -892, -7269, -2709, 4630, 814, -6778, -3602, 3565, 1538, -5620, -3570, 3165, 1260, -5161, -2870, 3487, 1015, -5860, -3045, 3829, 1575, -5914, -3682, 4175, 2867, -6007, -5033, 4286, 3685, -4757, -5391, 2696, 4008]
2465D008p238j756O805J075o400o27O529N23o826m78P061J234q270j224Q285K166
2481D867q270k901P276L895o293m094N569L749n294l191M961K909m982l074N221
2496C48L485n582l867N678M323n449m900M912N793m737n553L432N690k762n246
2511d435K104N286j894m934K194M584j929m872K417M946j918n624K310N863j531
2526B567o689M21P956j34o907j256O443K108n767k048M865K262n061j234N131
2541B657J281n875r04N969J944o594k971P157L773o223n227O277M845m965n422
2556d278M771N119m509m830M475M894m594n339M856N532m748n678M783N777n206
2571A025o262M903P268m679p697L860P855l012p705K429O975k038o368J842O187
$$ y = [4008, -3230, -4986, 1819, 2894, -3506, -4133, 2396, 2919, -3907, -4385, 2676, 3910, -4360, -5584, 2701, 4867, -3403, -6304, 972, 4867, -1426, -5520, 49, 3798, -1496, -4687, 274, 3183, -1799, -4873, 348, 3833, -1749, -5616, 62, 4385, -1064, -5964, -1052, 4741, 4, -5549, -2117, 3573, 811, -4435, -2331, 2955, 1061, -3873, -1679, 2905, 976, -3896, -1479, 3467, 1549, -4075, -1765, 4098, 2567, -4122, -3701, 4255, 4121, -2786, -4042, 2401, 4509, -1258, -3306, 1559, 3821, -1240, -2474, 2657, 3938, -1937, -2841, 3128, 5072, -1522, -4493, 2664, 6437, 214, -5013, 1264, 6109, 1144, -4278, 493, 5612, 1103, -3727, 748, 5642, 1048, -4291, 565, 6097, 1349, -4329, 454, 6231, 1025, -5237, -334, 6934, 2255, -5442, -1582, 6273, 3261, -4444, -2015, 4960, 2922, -3446, -1604, 4583]
2586D583k843o116L161O531l175p747L289Q249k578q206J221Q835o55q384J39
2601c696P769j05o928Q9O723m36o479O16O783m68p114N50O999Pp459O2P078J144
2619E135p568j149P006K278o486k404N346L127n135k827M853K412m816j761M689
2634B700K018m846k171N098K602n091l338M726M236m022m992L189M698k119m325
2649a637J648L400j314l208J700K968j404m065J790M136j681m675J220N104q65
2664C117n343l12N955J70n525j246N056J928m928k080M388J773m337j437M162
2679A341J532m628j957N025K061n397k487N554L126n786m049N430M489m796m982
2694e524M407M758l933m380L372M277l606m324M489M077m781m257M310N349m872
$$ y = [4583, 1740, -4376, -1215, 5316, 2141, -5606, -2317, 5932, 3354, -4852, -3631, 5204, 4549, -3835, -3696, 4073, 3968, -2960, -2871, 3852, 3416, -3063, -2447, 4336, 3868, -3246, -2696, 4303, 4310, -3149, -3087, 3991, 5135, -2433, -3582, 3424, 5702, -784, -3188, 2158, 5285, 150, -2677, 2176, 4588, -228, -1989, 2700, 4718, -128, -2299, 2799, 5401, 310, -3028, 1698, 5934, 1912, -3080, 109, 4807, 2688, -1637, 11, 3411, 2097, -1111, 589, 3557, 2153, -1912, -122, 4014, 2333, -2342, -1122, 3982, 3117, -2226, -2538, 3417, 3587, -1938, -3184, 1872, 3800, -1128, -3208, 1180, 2953, -1384, -2821, 1341, 2873, -1755, -3712, 1313, 3374, -2023, -4510, 1044, 4170, -1616, -5665, -235, 4254, -542, -5524, -1117, 3641, -292, -4672, -1300, 2977, -629, -4953, -464, 3613, -1168, -5425, -1115, 4234, -638]
2709f38n804M635O275m056o813L322O918k761o614K559O029k023n695K197N570
2724C101k399n622K574O222k798o406K368O920j944p429J936P025o35p361M03
2739d045O737p3n986l15N727J08n605L65N536n63n466K81N762K29o173m50O154
2756B223J182n980j685N642K044n088k381M414K390l430k659L550J986l558j995
2771c345L876K030m053k524M236K729l838l153L685L794l365m164K159M947j961
2786A053m154P94M304j020l503P38L857j503l288J037M178j286m354Q69N050n75
2802B197n307J15N265P84n681j137N317K076n631j599M988J817m293k252M665
2817A324K037n236j587N407J706n368k590N694L299n559l661N280M388n232m471
$$ y = [-638, -6442, -1807, 4468, 412, -6401, -3079, 3839, 1078, -5536, -2977, 3052, 1029, -4666, -2469, 3101, 702, -4920, -2346, 3876, 1078, -5328, -2960, 3960, 2016, -5413, -3477, 3548, 2913, -4448, -4045, 2692, 2619, -3367, -3682, 2045, 2153, -3452, -3087, 2449, 1886, -3580, -3299, 2463, 2692, -3481, -3931, 2223, 3405, -2575, -4260, 1382, 3426, -1662, -4043, 371, 2761, -669, -3328, 222, 2208, -1350, -3345, 531, 2561, -1492, -4016, 220, 2949, -889, -4042, -357, 3437, 72, -4092, -1933, 3014, 1053, -3101, -2307, 1997, 977, -2526, -1788, 2069, 566, -2722, -1685, 2493, 1207, -3147, -2278, 2772, 2197, -3110, -2995, 2270, 3054, -2627, -3764, 1553, 3629, -2002, -3601, 1387, 3204, -1089, -3341, 1324, 3361, -1875, -3462, 1945, 3651, -1717, -4307, 1387, 4686, -873, -4534, 746, 5134, -98, -4569]
2832d569M123M950m228m180L567M139l750l878M240M110m238m992M546M926l987
2847G79n349L730N467l388n725L119O153k893n955K297N402j414n330J632N041
2862C566k001m689J886N281k382n902K657O324j924o548J460O585m96o736J45
2877b774N946N06n517l53M906K45m910K74N020j79n244k55N780O65n666j097N376
2894B723J284m868j651M880K039m918k042M278K781m062k853L486L149l766k566
2909b106L607K353l471k732L750L290l951m029L988M143l306m593K520N290k277
2924B476m982J195M592r97m084J083L528j075m307J503M484j468m929R09N516
2939C444p19n601L69N290k5m937r46N094R92m980j340M714J291m337j433M531
$$ y = [-4569, -446, 4504, 276, -3904, -337, 3802, 52, -3826, 414, 4524, 286, -4706, -160, 4766, 779, -4570, -840, 4627, 1239, -4486, -1367, 4786, 1893, -4062, -1765, 3637, 2223, -3107, -1475, 3566, 1565, -3124, -1238, 4043, 1661, -4241, -1584, 4740, 2816, -3732, -2272, 4313, 3817, -2919, -2774, 3172, 3678, -1839, -2192, 2714, 2959, -1951, -1677, 3343, 3164, -2080, -2335, 3445, 4110, -1556, -2653, 2723, 4007, -861, -2512, 2368, 4407, -511, -2553, 1725, 4506, 444, -2409, 1077, 4226, 460, -2106, 1501, 3854, 383, -2349, 1401, 4691, 740, -3289, 699, 4842, 1536, -3057, -537, 4753, 2476, -2506, -1311, 3281, 2284, -1800, -717, 2811, 1736, -2571, -1068, 3416, 1948, -2981, -2072, 3444, 2725, -2876, -2507, 2783, 2758, -2179, -3125, 1969, 2961, -2019, -3359, 1355, 2646, -1691, -3124, 1407]
2955A407J066m692j144M739J451n290j661M972K220n199k051M572K913m715l144
2970d556M541L235l926l317L252L047k963l048L468K873l678k943L576L380l738
2985g97l893L407M909l408m463K231M900j763m984J796M220j144m270J619L949
3000B309j749m093J812M824j891m925J561N048j219n249P00N550l81n070j49M870
3016A948P61m780j142M789J061m682j028M394R46m142p14M072Q16m603r78M636
3032A354J665m849k098M589K975m729k708L790K851l044l145K969K626k993k762
3047c509L543K819l607l282L640L529l505l913L381M058k723m528K599M285k283
3062E04m056J740M136j504m459J923L873j147m207J473M283j197m869J766M859
$$ y = [1407, 2473, -2219, -3363, 1376, 2827, -2463, -4124, 848, 3068, -2131, -4182, 390, 3303, -1412, -4556, -15, 3220, -706, -4023, -771, 2276, -687, -3735, -267, 2606, -1072, -4015, -439, 2941, -797, -4690, -1283, 3626, 218, -4245, -2014, 2886, 1123, -3861, -2065, 2155, 1011, -3259, -1640, 2309, 560, -3533, -1721, 3103, 1212, -3713, -2152, 2896, 1677, -3572, -2872, 2678, 2297, -2773, -2922, 1948, 2709, -2071, -3213, 1576, 2637, -2045, -3073, 1321, 2267, -1875, -2589, 1483, 2299, -2304, -3282, 1354, 3019, -1830, -3928, 661, 3636, -1093, -3801, -11, 2840, -204, -3349, -380, 2246, -747, -3509, 34, 2853, -754, -4036, -396, 3133, -372, -4285, -904, 3154, 431, -4097, -1498, 2787, 504, -3552, -1812, 2324, 820, -3639, -1716, 2157, 1010, -3197, -1724, 2559, 1362, -3507, -1741, 3118]
3077C118j752m825R14N146l05m995o5M630N22m350o12L931O29l429q58L992N83
3094B274m074m75M343P23m503j014M398J799m853j910M441K465l866k662L441
3109E27K832k772k936K450K808k214l242K869K545k816k670K850L101k857l031
3124b556K363L988k550m087J607M449j403l830Q04M269r28m033J074L728q82m222
3140b209J125L719l63m180Q32M102m12m342j7M778n2m192j037M268J525m460j191
3157b106M203J489l850j513L963J319m145j234L902K013m926j566M934J742m290
3172f5l298M955K711l749l508L993L260l898k985L579L245l390l282L218L460
3187D246l523l135L308L268l378l614L284M073l315m283K748M641k432m776J845
$$ y = [3118, 1366, -3459, -2545, 2601, 2296, -2699, -2764, 1866, 2388, -1962, -2574, 1357, 1986, -1443, -2301, 1691, 2274, -1800, -2275, 2068, 2791, -1712, -2726, 1672, 3471, -1382, -3292, 1149, 3614, -252, -2914, 527, 3359, 587, -2349, 101, 2909, 695, -2547, 322, 2867, 51, -2619, 231, 3332, 475, -2556, -193, 3795, 1245, -2842, -1235, 3214, 1811, -2019, -1215, 3054, 2126, -1907, -833, 2895, 2013, -2209, -1084, 2635, 2272, -1908, -1076, 3026, 2614, -1728, -1745, 3033, 2981, -1211, -2248, 2020, 3545, -915, -2106, 2097, 3586, -264, -1777, 2186, 3505, -640, -1874, 2028, 4041, -885, -2451, 2483, 4225, -65, -3363, 1592, 4303, 554, -2954, 1039, 4299, 401, -2584, 995, 4240, 850, -2432, 786, 4246, 723, -2412, 896, 4164, 786, -2828, 456, 4529, 1214, -3069, -321, 4320, 1888, -2888, -1043]
3202a043M682j851m481J932M090j871l786J526L751j756l816J720M065j510m692
3217c040J186M741m36n263N90M212k22l560m49L777K33l892k2L761J94m027j79
3234b396L481Q00l933o60L495J200l995j251L837J674l839j918L510K144k852
3249g03k330K839K127k352k112J962K556k464k258K240K646k538k866K854K841
3264B442j935l622J562M028j161l766L61L998n05l548M81L375j34l910M87L814
3280A967j61m137L34M238l12m559K09M681M24m577r60M183J285m245j520M288
3296A138J321l944j707M140J738m112j907M022J659l816k193M739J767m202k538
3311c895M069K867l897k951L552L020l517l037L181L261l374k780L185K590l251
$$ y = [-1043, 3639, 1788, -2693, -761, 3329, 1458, -2328, -802, 2949, 1193, -2623, -903, 3162, 1652, -3040, -1854, 2887, 2451, -2812, -2222, 1990, 1768, -1792, -2241, 1536, 1769, -2123, -2145, 1616, 1810, -2217, -2396, 1085, 1885, -2048, -2708, 787, 1987, -2008, -3259, 578, 2252, -1587, -3505, 5, 2149, -703, -3033, -194, 1933, -419, -2531, -569, 1987, -477, -2735, -495, 2151, -387, -3253, -399, 2442, 507, -3115, -1553, 2475, 1314, -2452, -2091, 1907, 1402, -2146, -1665, 1710, 1576, -2334, -1847, 1967, 1806, -2331, -1997, 2241, 1929, -2630, -2421, 2260, 2684, -1893, -2853, 1330, 2615, -1630, -3150, 1138, 2459, -1485, -3192, 948, 2686, -1426, -3333, 689, 2348, -1468, -3661, 1078, 2845, -1357, -3895, 174, 3041, -856, -3807, -255, 2765, -752, -3789, -608, 2653, -721, -3501, -316, 2274, -977]
3326i77k557K978L252l582l360L570L725l365l760K576L921k189l654J948L478
3341B004j470l698J895L351j845l542J824L631j490l853J721L779j444m111J286
3356a962L861p72l778M83L862j27l886K7L616J58l063o51L581L54k666p43K604
3373H98O28l097l59L388P64l196j400L027K292k926k248K225K337j855k008J730
3389B00J902j909j705J885J917j765k134J847K388j832l118K020L149j216l704
3404b075J255L839j282l421M98L500l58l638N80L515l25l254O9L467l70l410N00
3421i10L280j53l838m8M637q8m047j081M238J238l994j361L911J030l166j619
3437a971L608J209l585q21K919J904l809k122M393J987m082k132L762J970l226
$$ y = [-977, -3534, -556, 2696, -886, -4246, -676, 3049, -316, -4076, -1500, 2421, 232, -3422, -1474, 2004, 534, -3164, -1269, 2082, 237, -3305, -1481, 2150, 660, -3193, -1472, 2307, 863, -3248, -1962, 1899, 1127, -2651, -2168, 1694, 1567, -2319, -2292, 1324, 1482, -1581, -2232, 1349, 1703, -963, -1706, 898, 1526, -1571, -1930, 1458, 2222, -974, -2374, 653, 2945, 19, -2229, -4, 2333, 478, -1530, 200, 2102, 193, -1512, 373, 2290, 525, -1609, 238, 2626, 794, -2324, -304, 2845, 1629, -2075, -820, 3019, 1737, -1684, -1186, 2314, 1956, -1682, -1102, 2413, 2088, -1166, -1097, 2370, 2000, -1410, -910, 2370, 2217, -1621, -1669, 2968, 2880, -1167, -2248, 1990, 3228, -766, -2127, 1784, 2814, -352, -1971, 1637, 2846, -739, -1560, 1359, 3263, -546, -2668, 1725, 3712, -370, -2502, 1260, 3230, 4]
3452Dk385L556K357l513k367K804L087l377k334K804K479k873k418K805K386k636
3468C79k968K786L087k577l566K357L307j827l226J432L432j571l332J544L086
3483B343j348l243J512L108j231l455J423L186q29l711Q85L420o52l480K83L452
3499A663J17l394l65L250J28k733o64L000P27l014o16L071N61k991j078L243J044
3516A949k800j791L005J973k859j725K286K422k452k299K158K314k054k556K174
3531b55K129j675k702K413K155j643k954K260K591j398l318J437L485j543l203
3546b221Q36L190p23l293Q17L286n39l290M59L236l36l319K59L404l29l358l21
3563b242L903K18l982l98L814J65l083p56L202Q25l254o29L020Q92k992j288L164
$$ y = [4, -2381, 1175, 3532, 19, -2348, 456, 3543, 166, -2168, 636, 3115, 242, -2176, 629, 3015, 379, -2589, 197, 3284, 707, -2859, -502, 2805, 978, -2248, -816, 2616, 1045, -2287, -743, 2343, 995, -2248, -736, 2372, 1141, -2314, -891, 2295, 1466, -2245, -1360, 2060, 1408, -2072, -1789, 1663, 1780, -1614, -1979, 1271, 1399, -1334, -1998, 1002, 1729, -1285, -1901, 1170, 1731, -1260, -2338, 905, 1949, -851, -2642, 363, 2336, -523, -2248, 38, 2460, 8, -2291, -133, 2181, 127, -2429, -255, 1874, 199, -2503, -90, 2065, 422, -2532, -272, 2319, 921, -2397, -960, 2525, 982, -2221, -1385, 1805, 1082, -2211, -1394, 1892, 1353, -1937, -1478, 1758, 1422, -1897, -1638, 1766, 1437, -1921, -2242, 1661, 1879, -2103, -2501, 1313, 1478, -1605, -2361, 841, 1666, -1588, -2217, 803, 1695, -1297, -2585, 579]
3580E79J087l025j435K976J613l226j995L479J964l239j716K741K215k627k598
3595c207K779K483k721k321K370K354k544k294K401K603k634k320K207L025k146
3610C5l104J890K785j366l294J657L337j307l037Q70L091q76l133J223L021j311
3626D81k841J133K959m84l498L37L525rl385k28L187P66l516m35L198M05k841
3643a246o05L002R19l155p64K841J088l199o45L108J093k888j683K911J563k534
3659a94j832K635K017k494k073K143K344j960k455J976K160j937j946J741K431
3674B556k138k467J910K777j681k694J363K909j168l134J233K790r59k844J241
3689c06K582p99l072J039K559m21l175O59K956k40l034K40L358k12l458M0L123
$$ y = [579, 1666, -1359, -2794, 182, 1795, -1431, -3426, 53, 2017, -1222, -2938, -197, 2018, -609, -3207, -428, 2055, -666, -2987, -617, 1737, -807, -3101, -700, 1903, -731, -3051, -844, 2181, 35, -3069, -1179, 1606, 240, -3054, -1397, 1940, 633, -2404, -1534, 1557, 681, -2452, -1229, 1792, 481, -2360, -1227, 1732, 1248, -2250, -1913, 1612, 1603, -1782, -2010, 1177, 1943, -1573, -2008, 1190, 1595, -1246, -1851, 1151, 2070, -1085, -1849, 992, 2080, -1119, -1764, 1344, 2437, -451, -2134, 777, 2340, -194, -2026, 609, 2626, 132, -1941, 202, 2546, 586, -1869, 107, 2267, 330, -1616, 125, 2556, 418, -2049, -139, 2638, 957, -1737, -374, 2535, 1367, -1767, -534, 2256, 1297, -1547, -306, 2276, 1477, -1595, -556, 2003, 1582, -1593, -934, 2022, 1782, -1252, -1012, 2346, 2134, -1324, -1284, 1839]
3706A839O55l617k72K825R01k823q09K207J344k458j221K776M96k405j277L137
3722A298J285l092j466K942J401k411j596K232J687j955j913J906J862j867k073
3737a760J899K179k005k059J560K693j669k603J554K682j834k300J248K675j106
3752A154l175J209L010p69k903L38L040m66k983N60L004q34k694M02L040m31l390
3769a888L70K971N08l283m07L174M84l134n70L171N84l213k72K694N67k833q12
3786a889L144Q60k923j095K705J381l130j128K811J589k784j591K572J866k599
3801b11j897K354J802j957j847J994J706k310j601J970K402k318k531J953K744
3816B253j941k454J596K621j536k630J327K302p42k567O28K587p11k599Q46K021
$$ y = [1839, 2494, -1123, -1395, 1430, 2331, -492, -1301, 906, 2250, -208, -1429, 1347, 1843, -562, -1839, 1298, 2583, -509, -1975, 967, 2368, -43, -1639, 593, 2280, 325, -1588, 318, 2180, 313, -1760, 139, 2318, 313, -1746, -186, 2507, 838, -1765, -211, 2471, 637, -1663, -415, 2260, 1154, -2021, -812, 2198, 1429, -1474, -1136, 1904, 1438, -1545, -985, 2019, 1185, -1509, -1107, 1933, 1502, -1888, -1518, 1453, 1961, -1322, -1729, 1445, 1929, -1205, -1775, 1396, 1980, -1233, -1505, 1189, 1756, -1077, -1889, 1255, 2115, -808, -1903, 802, 2183, -947, -2075, 736, 2325, -459, -2050, 522, 2388, -211, -2108, 246, 2048, 91, -1756, 238, 1944, -366, -1967, 3, 2405, 87, -2444, -491, 2253, 312, -2142, -546, 2075, 539, -2091, -764, 1538, 796, -1771, -1143, 1444, 733, -1866, -1020, 1001]
3832A001m68k230N21K129o3k544q3L067o33k459j5K704q5k355m84K423M96k091
3850a169o85K252K49k169l82J864J188k556q46K372J107k377j488K352J363k176
3866a101j110J654K230k352j772J751J835j488j896J413J920j538j827J492J970
3881A181j311k285J785K002j176k688J480K650o71l293Q44K907p53k564M67K883
3897A458m71l259J190K555k82l309R15K889m48l051R6L331k81k922K69K805J96
3914A681l129k24K893K68k406r62L149N93k919n34K548P69k580o77K845N37k474
3931f22q13K345J283k723j384K612J573k642j306K098J635k117j628K288J552
3946B151k249j443J945J866j938j811J763J570j429j967J635J986j628j849J334
$$ y = [1001, 533, -1697, -1176, 953, 890, -1654, -1737, 1330, 697, -1762, -1777, 927, 842, -1513, -1997, 426, 922, -1169, -1854, 398, 647, -1522, -1904, -40, 1148, -1408, -2254, 118, 1225, -1152, -2640, -288, 1075, -1101, -2211, -557, 1673, -679, -2451, -700, 1135, -353, -2249, -836, 1084, -454, -2281, -789, 1181, -130, -2415, -630, 1372, 196, -2492, -1012, 1638, 967, -2326, -1482, 1425, 672, -1892, -1425, 1458, 987, -2272, -1082, 1473, 1191, -2118, -1203, 1686, 1238, -1813, -1717, 1614, 1333, -1589, -1320, 1485, 1681, -1448, -1672, 1221, 1489, -917, -1879, 1270, 1863, -1056, -1590, 958, 1727, -853, -1530, 1315, 1852, -622, -1435, 910, 2193, -530, -1914, 698, 2271, -371, -1677, 421, 2056, -61, -1689, 599, 2151, -98, -1541, 404, 2270, 332, -1479, 284, 1854, 425, -1542, 93, 2079, 451, -1398, -64]
3961f4J416n13k069Q91J887n84k106Q50J745p70j826O26K118m72k275N02K555
3978A911o14k284j24K432L6j889r85K372O42k024n99K026L14j870k66K009N53
3995A640k252m18J931O47j604j536J795J551j580j527J568J754j905j663J635
4010C6K351j750k252J661J765j074k439J590J912j197k105J293K346j373k236
4025a472R94K550j156k269P22K407n13k772P10K700p57k191L16K893p81k681K18
4042a082K904l60l045O39K801k94l084M19K963l62k642j78K668L47k502m53K368
4059A107L46k225p25K451O94k685m02K370Q75k464j028K510J129k841p69K166
4075E09J164k506o77J995J197k058j315K109J096j979j172J909J076j643j643
$$ y = [-64, 1352, 839, -1230, -339, 1548, 964, -1142, -292, 1453, 683, -1143, -517, 1601, 1129, -1146, -644, 1911, 1297, -987, -1111, 1321, 1357, -532, -1517, 855, 1497, -527, -1126, 900, 1214, -656, -922, 1087, 1640, -612, -1030, 901, 1548, -56, -1592, 203, 1754, 174, -1353, 215, 1969, 64, -1599, 36, 2387, 637, -1615, 46, 1811, 737, -1702, -112, 1800, 603, -1502, -209, 2137, 764, -1472, -478, 2072, 916, -1353, -631, 1776, 1263, -1509, -799, 1901, 1144, -1047, -731, 2162, 1381, -1300, -1082, 1822, 1462, -1583, -944, 1857, 1563, -1521, -1102, 1861, 1499, -1143, -1321, 1347, 1694, -808, -1261, 1107, 1453, -772, -1497, 954, 1648, -1037, -1439, 931, 1806, -658, -1686, 824, 1953, -888, -1657, 509, 1673, -833, -1510, 485, 1682, -376, -1691, 418, 1514, -465, -1637, 272, 1348, -295, -1938]
4090a938J832J607j724j533J584J494j481j674J214J658j076j525N92J936q31
4105A35j765Q44J565o78j526O85J788j036j876Q32K039n03k248K43J974j1k143
4122a681J89J652M12j861l21J688Q77k341n34J918Q78k057n89J977Q11k097q56
4139a935K078R13j906j217K075J669k232j393J832J407j669j630J399J693j215
4154a31j640J392J312r43j948J619J708j129j959J093K191q22k572R27K398r53
4170E43k286R11K430j028k145Q35K264q24k227Q66K076m56k425O7K438J93k515
4187a283J06J856O06k481K27J884L38k161q3K214L28k291o66K301O01k281k50
4204a035J865M68k049m00K023Q90k666l68J881J051j910j156K146P53j592j085
$$ y = [-1938, -106, 1501, -223, -1756, -172, 1322, -159, -1833, -619, 1039, -37, -1562, -970, 966, 135, -1630, -786, 779, 101, -1425, -740, 1048, 12, -1864, -1032, 1007, 504, -1744, -1501, 473, 462, -1681, -1492, 160, 572, -1289, -1610, 78, 955, -1386, -1920, -2, 876, -1181, -1770, 207, 1018, -1079, -1935, 143, 1056, -850, -2067, 8, 1677, -555, -1948, -116, 1291, -378, -2008, -609, 1084, -131, -1771, -379, 933, -10, -1958, -339, 1369, 240, -1719, -626, 1565, 743, -1829, -902, 1496, 543, -1743, -832, 1598, 570, -1575, -740, 1524, 700, -1527, -661, 1415, 959, -1466, -1399, 1039, 1232, -1283, -1177, 679, 1285, -1196, -969, 915, 1253, -908, -991, 1223, 1551, -740, -1406, 895, 1496, -785, -1035, 830, 1298, -751, -1151, 872, 1762, -904, -1272, 609, 1660, -250, -1406, 740, 1493, -99, -1184]
4220a184J425J650j953r76J526J051j488j454J313J532j427j495J400J530r02
4235E48j914R61J947q83k109J121J748o74j914Q10J699q74j792R33J625k85k165
$$ y = [-1184, 241, 1891, -62, -1038, 488, 1539, 51, -1403, -90, 1442, 15, -1480, -80, 1450, 548, -1366, -405, 1542, 659, -1450, -329, 1419, 745, -1169, -359, 1340, 466, -1326, -393, 1232, 947, -1218]
$$ [...]
8191I
##END NTUPLES=NMR FID
##END=
