##TITLE=1H_SAV-4b-NaOH
 PY-d5, 8 sc, 
 18.11.2019
##JCAMPDX= 6.0         $$ Bruker NMR JCAMP-DX V2.0
##DATA TYPE= NMR FID
##DATA CLASS= NTUPLES
##ORIGIN= UXNMR, Bruker Analytische Messtechnik GmbH
##OWNER= root
$$ XWIN-NMR		Version 3.5
$$ Mon Nov 18 14:21:35 2019 Russian Standard Time (UT+4h)  she@DPX200
##.OBSERVE FREQUENCY= 200.1315
##.OBSERVE NUCLEUS= ^1H
##.DELAY= (6, 6)
##.ACQUISITION MODE= SIMULTANEOUS
##.ACQUISITION SCHEME= undefined
##.AVERAGES= 8
##.DIGITISER RES= 18
##SPECTROMETER/DATA SYSTEM= spect
##.PULSE SEQUENCE= zg30
##.SOLVENT NAME= Pyr
##.SHIFT REFERENCE= (INTERNAL, Pyr, 0, 15.7039)
##AUDIT TRAIL= $$ (NUMBER, WHEN, WHO, WHERE, WHAT)
$$ ##TITLE= Audit trail, XWIN-NMR		Version 3.5
$$ ##JCAMPDX= 5.01
$$ ##ORIGIN= Bruker BioSpin GmbH
$$ ##OWNER= she
$$ F:/spectra/data/she/nmr/H-F/1/audita.txt
$$ ##AUDIT TRAIL=  $$ (NUMBER, WHEN, WHO, WHERE, WHAT)
(   1,<2019-11-18 14:20:38.56 +0400>,<she>,<DPX200>,
      <created by zg, POWCHK disabled, PULCHK disabled
       configuration hash MD5:
       00 E9 B6 7A A2 85 ED C7 34 08 36 98 17 FE 4E 26
       data hash MD5: 16K
       47 72 DE 23 F2 E6 D6 97 FC 56 27 6F F6 15 3F 38>)
$$ ##END=
$$ 
$$ hash MD5
$$ AF EE 16 46 80 2E 15 AB 73 B5 44 3B 2F E4 97 3F
##$RELAX= 
##$RELAX= 
##$RELAX= 
##$RELAX= 
##$RELAX= 
##$RELAX= 
$$ Bruker specific parameters
$$ --------------------------
##$DU= <F:/spectra>
##$EXPNO= 1
##$NAME= <H-F>
##$PROCNO= 1
##$TYPE= <nmr>
##$USER= <she>
##$AMP= (0..31)
100 100 100 100 100 100 100 100 100 100 100 100 100 100 100 100 100 100 
100 100 100 100 100 100 100 100 100 100 100 100 100 100 
##$AQSEQ= 0
##$AQ_mod= 1
##$AUNM= <au_zg>
##$AUTOPOS= <>
##$BF1= 200.13
##$BF2= 200.13
##$BF3= 200.13
##$BF4= 200.13
##$BF5= 200.13
##$BF6= 200.13
##$BF7= 200.13
##$BF8= 200.13
##$BYTORDA= 1
##$CFDGTYP= 0
##$CFRGTYP= 5
##$CHEMSTR= <none>
##$CNST= (0..31)
1 1 145 1 1 1 1 1 1 1 1 1 1 1 1 1 1 1 1 1 1 1 1 1 1 1 1 1 1 1 1 1 
##$CPDPRG= <>
##$CPDPRG1= <>
##$CPDPRG2= <>
##$CPDPRG3= <>
##$CPDPRG4= <mlev>
##$CPDPRG5= <mlev>
##$CPDPRG6= <mlev>
##$CPDPRG7= <mlev>
##$CPDPRG8= <mlev>
##$CPDPRGB= <>
##$CPDPRGT= <>
##$D= (0..31)
0 1.2 0 0 0 0 0 0 0 0.06 0 0.03 0 0 0 0 0.0002 0 0 0 0 0 0 0 0 0 0 0 0 
0 0 0 
##$DATE= 1574072438
##$DBL= (0..7)
120 120 120 120 120 120 120 120 
##$DBP= (0..7)
150 150 150 150 150 150 150 150 
##$DBP07= 0
##$DBPNAM0= <>
##$DBPNAM1= <>
##$DBPNAM2= <>
##$DBPNAM3= <>
##$DBPNAM4= <>
##$DBPNAM5= <>
##$DBPNAM6= <>
##$DBPNAM7= <>
##$DBPOAL= (0..7)
0.5 0.5 0.5 0.5 0.5 0.5 0.5 0.5 
##$DBPOFFS= (0..7)
0 0 0 0 0 0 0 0 
##$DE= 6
##$DECBNUC= <off>
##$DECIM= 24
##$DECNUC= <off>
##$DECSTAT= 4
##$DIGMOD= 1
##$DIGTYP= 9
##$DL= (0..7)
0 120 120 120 120 120 120 120 
##$DP= (0..7)
150 150 150 150 150 150 150 150 
##$DP07= 0
##$DPNAME0= <>
##$DPNAME1= <>
##$DPNAME2= <>
##$DPNAME3= <>
##$DPNAME4= <>
##$DPNAME5= <>
##$DPNAME6= <>
##$DPNAME7= <>
##$DPOAL= (0..7)
0.5 0.5 0.5 0.5 0.5 0.5 0.5 0.5 
##$DPOFFS= (0..7)
0 0 0 0 0 0 0 0 
##$DQDMODE= 0
##$DR= 18
##$DS= 0
##$DSLIST= <SSSSSSSSSSSSSSS>
$$ [...]
##$SUBNAM2= <"">
##$SUBNAM3= <"">
##$SUBNAM4= <"">
##$SUBNAM5= <"">
##$SUBNAM6= <"">
##$SUBNAM7= <"">
##$SUBNAM8= <"">
##$SUBNAM9= <"">
##$SW= 24.0689530833862
##$SWIBOX= (0..15)
0 0 2 0 0 0 0 0 0 0 0 0 0 0 0 0 
##$SW_h= 4816.95568400771
##$TD= 16384
##$TD0= 1
##$TE= 0
##$TE2= 300
##$TE3= 300
##$TEG= 300
##$TL= (0..7)
0 120 120 120 120 120 120 120 
##$TP= (0..7)
150 150 150 150 150 150 150 150 
##$TP07= 0
##$TPNAME0= <>
##$TPNAME1= <>
##$TPNAME2= <>
##$TPNAME3= <>
##$TPNAME4= <>
##$TPNAME5= <>
##$TPNAME6= <>
##$TPNAME7= <>
##$TPOAL= (0..7)
0.5 0.5 0.5 0.5 0.5 0.5 0.5 0.5 
##$TPOFFS= (0..7)
0 0 0 0 0 0 0 0 
##$TUNHIN= 0
##$TUNHOUT= 0
##$TUNXOUT= 0
##$USERA1= <user>
##$USERA2= <user>
##$USERA3= <user>
##$USERA4= <user>
##$USERA5= <user>
##$V9= 5
##$VALIST= <valist>
##$VCLIST= <CCCCCCCCCCCCCCC>
##$VD= 0
##$VDLIST= <DDDDDDDDDDDDDDD>
##$VPLIST= <PPPPPPPPPPPPPPP>
##$VTLIST= <TTTTTTTTTTTTTTT>
##$WBST= 1024
##$WBSW= 4
##$XGAIN= (0..3)
0 0 0 0 
##$XL= 0
##$YL= 0
##$YMAX_a= 292611
##$YMIN_a= -128327
##$ZGOPTNS= <>
##$ZL1= 120
##$ZL2= 120
##$ZL3= 120
##$ZL4= 120
##$ABSF1= 10
##$ABSF2= 0
##$ABSG= 5
##$ABSL= 3
##$ALPHA= 0
##$AQORDER= 0
##$ASSFAC= 0
##$ASSFACI= 0
##$ASSFACX= 0
##$ASSWID= 0
##$AUNMP= <proc_1d>
##$AZFE= 0.1
##$AZFW= 0.1
##$BCFW= 1
##$BC_mod= 2
##$BYTORDP= 1
##$COROFFS= 0
##$CY= 11.3945322036743
##$DATMOD= 1
##$DC= 2
##$DFILT= <>
##$DTYPP= 0
##$F1P= 16.9975609425685
##$F2P= -3.02152046262296
##$FCOR= 0.5
##$FTSIZE= 0
##$FT_mod= 4
##$GAMMA= 1
##$GB= 0.15
##$INTBC= 1
##$INTSCL= 1
##$ISEN= 128
##$LB= 0.24
##$LEV0= 0
##$LPBIN= 0
##$MAXI= 10000
##$MC2= 0
##$MEAN= 0
##$ME_mod= 0
##$MI= 1.114404
##$NCOEF= 0
##$NC_proc= 0
##$NLEV= 6
##$NOISF1= 3.799351
##$NOISF2= 2.8
##$NSP= 1
##$NTH_PI= 0
##$NZP= 0
##$OFFSET= 15.70392
##$PC= 1
##$PHC0= -9427.112
##$PHC1= 13.20087
##$PH_mod= 1
##$PKNL= yes
##$PPARMOD= 0
##$PSCAL= 0
##$PSIGN= 0
##$REVERSE= no
##$SF= 200.130013532006
##$SI= 16384
##$SIGF1= 3
##$SIGF2= 2
##$SINO= 400
##$SIOLD= 16384
##$SREGLST= <1H.CDCl3>
##$SSB= 0
##$STSI= 0
##$STSR= 0
##$SW_p= 3612.71676300578
##$SYMM= 0
##$S_DEV= 0
##$TDeff= 0
##$TDoff= 0
##$TI= <>
##$TILT= no
##$TM1= 0
##$TM2= 0
##$TOPLEV= 0
##$USERP1= <user>
##$USERP2= <user>
##$USERP3= <user>
##$USERP4= <user>
##$USERP5= <user>
##$WDW= 1
##$XDIM= 8192
##$YMAX_p= 0
##$YMIN_p= 0
$$ End of Bruker specific parameters
$$ ---------------------------------
##NTUPLES= NMR FID
##VAR_NAME=  TIME,          FID/REAL,        FID/IMAG
##SYMBOL=    X,             R,               I
##VAR_TYPE=  INDEPENDENT,   DEPENDENT,       DEPENDENT
##VAR_FORM=  AFFN,          ASDF,            ASDF
##VAR_DIM=   8192,          8192,            8192
##UNITS=     SECONDS,       ARBITRARY UNITS, ARBITRARY UNITS
##FACTOR=    0.0002076,     1,               1
##FIRST=     0,             0,               0
##LAST=      1.7004516,     0,               0
##MIN=       0,             -128327,         0
##MAX=       1.7004516,     292611,          0
$$ Real data points
##PAGE= N=1
##DATA TABLE= (X++(R..R)), XYDATA
$$ [...]
2728F19J545j17k390j776K84K256J599k63j548j871o55K205K048J94j764k432
2744b066j50J610K132O08j194k047j412J535K309J101r84k267j236N31K446J335
2760B251p04j795j959J76K275J765k72j869j332o73J894K242J31j913j740m18
2776a941J468J878R01j452k405n63J119K318J076j278k210j227J151K229J108
2791B172q37k045j162N46J673J883k84k154j805J39J883J988j44j773j850l66
2807b136J522K543N25j716k157o02J231K283O17j069k159q48Q38K180J343j267
2823A128j886j353O34K004J691n75k129j575N91J783J645l3j876j819p2J633J821
2840A612L49j853k182LJ447K044R54j521k157q26J113K103Q38q17j979j244L67
$$ y = [619, 2164, 2047, -343, -2119, -1835, 421, 2020, 1757, 209, -1662, -2317, -112, 1936, 2130, 366, -2066, -2216, -606, 1526, 2134, 940, -1107, -2519, -984, 1325, 2426, 1442, -825, -2061, -1530, 916, 2251, 1547, -248, -2207, -2031, 244, 2009, 1737, -132, -1464, -2137, -243, 1999, 2130, 217, -1523, -1941, -473, 1405, 2306, 854, -1551, -2114, -995, 1323, 2399, 1121, -1089, -2316, -1165, 1064, 2172, 1335, -710, -1872, -1326, 347, 2230, 1946, -208, -2013, -1874, 9, 1997, 1853, 80, -1770, -2136, -614, 1929, 2454, 738, -1419, -2021, -790, 1493, 2110, 1041, -1118, -1966, -1128, 1052, 2395, 1128, -758, -2111, -1477, 527, 2218, 1643, -486, -2061, -1470, 313, 1958, 1925, 49, -1770, -1842, -209, 1612, 1961, 108, -2074, -2071, -624, 1420, 2374, 853, -1304, -2130, -1017, 1086, 1924, 1107, -872, -2116, -1749]
2857a749K630J573j268j822j671O21J880J724l3k264j324l30K225J848l13j651
2873G6j384q08J346K018P44j336k261o82J652J637R60r34k093j089Q97K386J015
2890B144n90k398j047K94K007J451k58j923k091M27J863J823J5j783j401l81J480
2907c68K134N53j977j922k25J000K176O34j050k313r39J279J837J054q97j730
2923g54j159J06K230J791n56k113j416L95J520J624l67j137k187K21J642J892
2939A732R7j688j455m92R56J988R26j088k318m67R13J826R86q14j767j462O30
2956a497K299J503j094j782j456N32J554J902j20j844j779k12J991J737l6j170
2972E28k087m87J849J444Q61j663k035J08P33J747Q45q24j769j222P85J741J147
$$ y = [-1749, 881, 2454, 1186, -636, -2307, -1686, 194, 1918, 1885, -379, -1703, -2033, 192, 2040, 1727, 76, -1308, -2116, -770, 1248, 1992, 656, -1605, -2287, -635, 1002, 1962, 1028, -1065, -2154, -1257, 1129, 2144, 1554, -844, -1891, -1597, 410, 1861, 1603, -320, -2411, -1984, -121, 1702, 1717, -66, -1467, -1848, -368, 1766, 2319, 342, -1580, -1805, -805, 1371, 2005, 955, -1358, -2297, -1018, 819, 1873, 976, -754, -1913, -1807, 423, 2214, 1658, -455, -1871, -1476, 44, 1668, 1301, 164, -2023, -1802, -160, 1732, 1829, 141, -1314, -1806, -850, 1138, 2064, 976, -1342, -1809, -896, 930, 1916, 1102, -665, -2127, -1497, 802, 2305, 1211, -571, -2027, -1495, 59, 1961, 1841, -3, -1782, -1994, -3, 1734, 1698, 528, -1559, -2046, -197, 1247, 2108, 445, -1590, -1482, -749, 998, 1843, 1019, -750, -1972, -1187, 554, 1701]
2989A701o31j561j227M86J901J236k35k040j323OJ743J163P10j711j653l66J329
3006d72K210Q6j541j542m95J186J588P01q47j702j558J313J965Q03o95j799j087
3023a886N28J862J035j87j663j274K62J204J662O3j702j639K12J414J499K18j342
3040B66j770k08J298J963K78j213j586o93Q93J517J058r32j801j060O93J906J188
3057A797j021j189j265K68J914J524p15j667j198n9J723J479J96j555j860k08
3073a836J215J603O89j490j330n65R36J733R57j174j653r25P53J845J176p63j781
3090f10j222O02K002Q39l00j476j598L07J559J691m04j282j591k29J839J347L44
3107A818j420j620q06J459J762L24j188j420q41O20J998R81n59j741j167Q14J775
$$ y = [1701, 1070, -491, -1718, -1232, 669, 1905, 1670, -370, -1693, -1687, 56, 1219, 1929, 218, -1435, -1801, -472, 1738, 1824, 283, -1259, -1754, -568, 1020, 1721, 874, -828, -2386, -1073, 892, 1695, 1000, -799, -1886, -1358, 504, 1539, 1352, -311, -1585, -1323, -119, 1543, 1606, -96, -1735, -1523, -109, 1390, 1608, 266, -1504, -1712, -414, 1549, 1827, 614, -972, -1665, -772, 745, 1803, 871, -930, -1990, -1297, 609, 1797, 776, -413, -1678, -1410, 504, 2028, 1313, -354, -1552, -1611, 112, 1591, 1787, 232, -1628, -1836, -621, 982, 1671, 181, -1149, -1714, -778, 955, 1912, 738, -915, -1840, -1087, 758, 1934, 1171, -610, -1832, -1230, 772, 1611, 1311, -165, -1763, -1456, 103, 1794, 1390, 108, -1483, -1712, 127, 1474, 1818, 398, -1222, -2028, -569, 1193, 1517, 329, -1091, -1932, -1312, 686, 1667, 1108, -633, -1800, -986, 789]
3124G89J058l74j518j307j17J831J324r7j720j457M0J581J212N39j531j632m09
3141a788J662J331M50r24j706q52J074J600J161j221j504j071P04J769P38p04
3157G19j553p52L28J549J194r4j831j002r0J561J110L79j361j601qJ207J102N01
3175A358r61j463q52J053J896O45j105j401r17J027J461J286q40j916r18M58J749
3192E60R98j05j524j628P9J886J515J6j888j271K6J070J647L56j367j524n30J270
3210d14J917J38r90j583o80P78J681Q32o04j892p42M61J698J063m15j486j208
3227a446K98J246J430n60j063j438J7J205J571K61j321j183n59J180J168O37r38
3244E05j526p77J093J643Q85j195j419m72N82J359P73l23j488j353N18J329J269
$$ y = [789, 1847, 1473, -45, -1352, -1469, 362, 1686, 1589, -131, -1588, -1548, 33, 1245, 1784, 253, -1379, -1788, -126, 1205, 1655, 731, -975, -1827, -753, 847, 2008, 787, -717, -1788, -1084, 685, 1423, 719, -834, -1586, -1258, 291, 1485, 1391, -440, -1442, -1532, 29, 1139, 1518, 157, -1444, -1452, -245, 857, 1358, 397, -1066, -1918, -865, 1031, 1676, 571, -830, -1747, -720, 741, 2027, 1187, -729, -1647, -1189, 560, 1558, 1453, -71, -1699, -1620, 266, 1781, 1797, -91, -1362, -1336, -266, 1381, 1737, 370, -1154, -1684, -414, 1503, 1641, 651, -932, -1612, -834, 847, 1679, 1075, -817, -1559, -1098, 600, 1663, 1248, -238, -1446, -1148, 98, 1528, 968, -95, -1533, -1516, -311, 1260, 1521, 200, -983, -1542, -362, 806, 1443, 505, -1021, -1798, -705, 938, 1823, 628, -791, -1263, -681, 678, 1451, 1128, -360, -1713, -1195, 134, 1403]
3261A403k39j337j228k8J380J456k9j295j725J66R97J683J70r31j293j027J295
3278e82J516O29r75j239r06N91J473J092o00j418j133L62J555J090m54j214j265
3295a478L81J170J357P4j520j092j08J137J334K78j215j474m57J131J427M73p26
3312F92j551p51Q68J522P13o71j448m96R6J188J327n36j294j018K61J429J026
3329A357l27j239r20k39J063J574P8j097j450j10J090J432K88j277r30n89N89
3346g07J593N76j027j049q26O75J228J198q53j610n73M98J212J225k42j325j264
3363a271o9J474J351k25j257r88m30J005J696N31j309j384p73J293J526M06r22
3380F54j338p16M72J663Q57p85j249q08J6J616J046k84j272j020k49J894J088
$$ y = [1403, 1164, -173, -1401, -1429, -49, 1407, 1378, 83, -1642, -1476, -479, 1204, 1374, 443, -850, -1877, -582, 934, 1563, 588, -651, -1557, -966, 507, 1599, 999, -419, -1552, -1190, 365, 1455, 1001, -213, -1478, -1097, 73, 1430, 1504, -16, -1108, -1216, -79, 1255, 1533, 318, -1156, -1613, -482, 945, 1418, 692, -859, -1610, -742, 780, 1493, 822, -626, -1122, -1026, 162, 1489, 953, -341, -1359, -1098, 331, 1357, 1030, -209, -1129, -1368, -305, 1269, 1347, 250, -1200, -1310, -220, 1212, 1500, 223, -707, -1296, -707, 886, 1462, 435, -614, -1440, -765, 463, 1661, 808, -802, -1375, -877, 335, 1560, 1318, -7, -1271, -1340, 134, 1485, 1260, 3, -985, -1415, -410, 1286, 1817, 508, -876, -1649, -356, 1170, 1576, 654, -684, -1400, -928, 735, 1592, 807, -442, -1250, -1234, 382, 1428, 1144, -128, -1148, -1397, 497, 1585]
3397A585l02j185j025n24J308J406o8o21j767j03R09J118N35p85j325q37J027
3414f54J311R07r77j343n61L93J495R31p70p90j550L80J301J302j67j310j311
3431a413K35J079J250Qq85j215n61R06J572N56r89j493k52Q14J352N03q00j292
3449f25q40P25J256Q20l77j225r88J47J395J231k74j314j105OJ449Q69L32r31
3467E51j700k12P99J387O77j018j510l87J106R80J148j276r51j179O37J357J026
3484A435n86j550l94L02R66R45Pj438j215L65J018J219j27j138j139J04Q16J614
3502A204q6j076r36n50P82J485L05q35r57r21P93J371P07n30j378j009O99J386
3520D54Q82m93j122j143K36J123J212Kj503j019K46R55J276L49j191j038o32R56
$$ y = [1585, 1283, 98, -927, -1451, -143, 1263, 1195, 574, -1193, -1296, -387, 731, 1266, 481, -844, -1681, -654, 657, 1564, 587, -756, -1317, -924, 571, 1502, 732, -58, -1608, -1228, 73, 1375, 1208, -102, -1413, -1178, -99, 1151, 1159, 274, -941, -1502, -596, 976, 1532, 543, -950, -1202, -388, 964, 1467, 667, -625, -1465, -740, 516, 1336, 959, -266, -1254, -1107, 288, 1519, 1245, -69, -1174, -1168, 281, 1150, 1482, 551, -1149, -1361, -562, 825, 1502, 484, -1026, -1413, -307, 673, 1821, 545, -406, -1585, -948, 409, 1435, 849, -701, -1095, -793, 173, 1118, 1125, -313, -1528, -1163, -145, 1074, 947, -191, -1330, -1226, -410, 1204, 1118, 42, -894, -1444, -662, 823, 1128, 293, -664, -1585, -792, 579, 1286, 756, -622, -1631, -932, 454, 1336, 843, -279, -1422, -1186, -63, 1149, 1151, -352, -1371, -1125, -170, 1106, 1455, 264, -774, -1406, -450]
3538d50J414K82j075r24k49O11J125M44o92j218n66O54J298Q48p08j204q92M09
3556h93J103J110J41j504j165n2J264J179J35j462q77m23J375Q07O10q89j398
3573i39q49J134J314O64o31j529m16O61J155Q44o64j368o71QJ453Q04j22r75j225
3592a352M88J128R15K31j307j052N4Q48J004M13j185j223m94J214J147K79n90
3609E18j279o27R04J122O55m74j355p91Q58J088O02l67j188n69j89J024J286j59
3627A059q80j250P3J372R01J91j261q40l95P26J481J49o48j190q50Q55J162M03
3645A058l50j350q68Q31J014J123p73j152n11j35J524P72k19j226j048L07R29
3662g4J062P6j260q44k26R92J225p4p80p69p16J010J164N02m70j506l61K59J435
$$ y = [-450, 964, 1246, 171, -753, -1002, -391, 734, 1178, 486, -732, -1298, -644, 654, 1502, 794, -410, -1302, -893, 210, 1320, 1461, -43, -1208, -1260, 4, 1183, 1318, -144, -1021, -1444, -69, 738, 1348, 459, -939, -1788, -654, 660, 1324, 693, -836, -1252, -591, 564, 1408, 744, -624, -1295, -1287, 166, 970, 848, -127, -1352, -864, 264, 1179, 1410, 103, -949, -895, -47, 957, 1370, 185, -1038, -1532, -318, 829, 1108, 518, -761, -1388, -484, 638, 1293, 819, -536, -1327, -469, 619, 1221, 854, -334, -903, -1092, -68, 1218, 1059, 179, -1071, -998, 374, 1275, 1466, 205, -635, -1030, -304, 1177, 1326, 678, -512, -1362, -507, 655, 1058, 708, -642, -1510, -679, 335, 1458, 685, -467, -978, -1113, 411, 1183, 964, -262, -1310, -1003, -74, 988, 1064, -196, -1040, -1266, -274, 951, 877, 97, -672, -1388, -378, 786, 1288, 818, -688, -1049, -790, 645]
3681F45P23o02r91r24M3J336Q18l74n58j170R3J394P68k46o78j136k88J137J095
3700A085P1o37j157m11R37J057K39n23j286n53P82J303N74p13j288n37M07J134
3718D84R00l66j082q95L43O57P88L78j246q10o1Q20Q88J97p37j385J07R04P99
3737F83O57r96p51r14N74J111Q78n97j458m03P23J072Q01o51j067q95L70J065
3755B02Q55m1j140r05n9R27J102l1q92q34j38Q86P58N70p62j397k69P22J332K57
3775A143o31j003o22M78J008O86l14j285n23L77R05R37j83r67j155L50R82J007
3793A190l0r50j044QP53R11J90r06p83m59R45P95L26n26j272m14N97J088P03n36
3813E86j215n43M91Q86Q01j76j108r34n6J036J284n17l83q69l39Q32O77J98o06
$$ y = [645, 1368, 766, -225, -1149, -1106, 230, 1048, 674, 116, -1054, -961, 433, 1201, 955, 277, -859, -1147, -10, 1085, 1156, 519, -638, -1049, -112, 945, 1184, 661, -625, -1178, -396, 907, 1481, 768, -520, -1057, -650, 484, 1384, 1018, -64, -959, -616, 41, 829, 1207, -39, -849, -910, -90, 798, 995, 258, -1127, -1020, -116, 683, 1340, 344, -407, -1321, -747, 364, 1242, 645, -813, -1216, -493, 579, 1380, 729, -338, -1233, -863, 202, 1057, 1016, -124, -1029, -1088, -161, 941, 910, 18, -816, -954, -68, 690, 1260, 498, -899, -1168, -446, 886, 1143, 512, -491, -1113, -635, 373, 1059, 745, -540, -1063, -686, 219, 1156, 973, 6, -1149, -799, 183, 1190, 1160, 210, -834, -826, -73, 838, 1028, 122, -661, -1120, -175, 620, 946, 420, -852, -1266, -669, 419, 1122, 586, -629, -1172, -681, 205, 1006, 830, -278, -1212, -1268, -232, 1052, 535, 152, -717, -1056, -224, 453, 651, 45]
3832D5j007l70J119Q33O86j110r11o86P76J206Q33o38j703k77M52R66R90m05j332
3851e33o44J54J108O53j0j017p98m2J330Q55K01j413r07qP96J017N33p86j074
3870e85l12N73J323J30p16j079l81M85Q00R42m94p27r22J80R32J208n08r72q84
3889a007K00R30R41m9r49r28j45R96P77O34j001j221k85O29J402J32o10r78o61
3908a193N87J007Q02p20p99n14K76Q46Q27l11j214p03L86P83Q30K15r82j011j46
3927a034Q37Q74M67j114q99j41O83J186L92p49j214k94L30R83N00j40j069p50
3945a152O32J089P05k25q40j456K40J340P35j00p08r27l64J115R28j02p82o42
3963e14n85R91J013K39n44j173k91L18J077P09o71q85o27L34J289M83l02r00j067
$$ y = [45, -962, -1332, -213, 620, 1306, 196, -715, -1401, -625, 581, 1414, 776, -927, -1204, -752, 214, 1204, 799, -533, -1177, -1023, 85, 738, 728, -289, -1087, -1129, 201, 1056, 1257, -156, -1063, -1071, -275, 742, 1275, 489, -585, -897, -324, 999, 1129, 413, -666, -1047, -562, 238, 1180, 686, -41, -963, -783, 149, 1357, 849, -123, -1007, -807, 123, 1064, 1015, 66, -862, -1007, -11, 766, 1400, 399, -822, -1107, -478, 924, 1056, 446, -532, -1193, -606, 401, 1203, 483, -316, -830, -554, 292, 1119, 808, -406, -1109, -723, 60, 890, 1105, 123, -888, -1034, -197, 677, 1144, 30, -869, -1010, -327, 859, 1251, 502, -712, -1006, -676, 307, 807, 667, -402, -1152, -520, 569, 1274, 1049, 209, -1247, -1007, 333, 1068, 968, 260, -667, -1031, 84, 1012, 910, 128, -514, -1099, -108, 905, 1144, 600, -573, -864, -546, 531, 1240, 569, -316, -943, -609, 680, 1163, 861, -39, -1106]
3982a106L57J070P15qq84j024K02N11J078Q3q74q23k02P01J029N8m20j186j24
4001h47J93J303M67l50j102o59Q40O13L29Q3j169q70N02N86J307m30r15q78M5
4020i52R48J055k76q25p64J03M99J014L1o89r59m77R33R33N41n79j290o7O15O88
4040D82N19j10j321m97J25J225O39l47q73q28K88P99R93k78q37q87J88O61R55
4059H96j02l76j270R5Q22N23M35o39j027n96N72J122M39k26p90q55K99J034N50
4078I06n09p59p27L00J207L60M9j004r13M39M30J066o2n28j113K8N06R64M71q10
4098C01j144j26N97P01O77m95j175o64O59R30P38j34j470l04K93Q54N58k45n82
4117c1r70J95Q78O33K52q67j010m3Q52N66N57q30o28o05O01J164K51n92q45m14
$$ y = [-1106, -749, 321, 1036, 1028, 144, -880, -678, -167, 911, 994, 120, -703, -905, -204, 825, 883, 463, -723, -847, -654, 649, 1116, 766, -336, -995, -155, 458, 787, 870, -299, -1169, -667, -81, 1226, 796, -119, -997, -952, -4, 1051, 775, -50, -814, -711, -212, 802, 833, 144, -815, -1292, -359, 574, 1115, 536, -754, -821, -206, 482, 1001, 891, -430, -927, -802, 423, 1062, 715, -158, -986, -698, 101, 1094, 816, -21, -908, -720, -59, 896, 794, 418, -852, -757, 65, 588, 1023, 384, -643, -1239, -667, 455, 894, 668, -122, -977, -678, 356, 906, 397, -362, -1089, -789, 418, 778, 827, -177, -1090, -651, -221, 845, 783, 255, -858, -830, -324, 640, 1111, 301, -843, -969, -372, 329, 1006, 511, -664, -1328, -669, 261, 999, 865, -605, -909, -616, 238, 796, 551, -31, -1001, -806, 72, 705, 957, 90, -920, -963, -111, 455, 1012, 182, -446, -1051, -450, 714, 965, 373, -472, -886]
4137h86N05O95M59k25j079n31L66R76N13j35q19q64K13Q95Q10j63n23j141O4O43
4157b27J036Kn05r40m89O09J085K60o36r72m90J028O85N61l64j346m24P73M64
4176A10O77p6r63p25J53J044N26J53j069o51k98R57J005L8q91o38l61Q49O76N63
4196A079o53q16m36L79J090N63q31n77p27M10J002P18n21j251o32M22J099N72
4214H90k56q41p69L38O01P85J28p66o27l49P86Q83J53o22p94n21N90J084J60l31
4234E22j040k67O38O86P49p31j003n30L31Q15Q49m8j037r91M75P16O78J55r97
4253c0n49k70P69R04J96o25q63l18N45J157L34p25j170l38J41J437N58p07n15
4272f9q59K87Q07O49m0r11o70J90Q61M71J61r69o14J88L42J044J35p64q53j00
$$ y = [-886, -381, 314, 773, 548, -531, -1062, -696, 280, 793, 658, -161, -1025, -812, 83, 893, 730, 207, -934, -870, -227, 809, 811, 306, -634, -1123, -514, 571, 831, 195, -777, -1267, -239, 446, 1007, 643, -703, -1127, -354, 110, 787, 711, -252, -977, -824, 220, 746, 899, -170, -821, -1119, -162, 843, 881, -10, -648, -1009, -160, 516, 1079, 426, -390, -826, -447, 643, 1206, 375, -202, -929, -519, 483, 1201, 680, -571, -1203, -781, 318, 890, 634, -207, -976, -638, -37, 748, 876, 110, -517, -866, -80, 803, 956, 334, -460, -981, -391, 693, 853, 522, -518, -785, -147, 539, 1288, 557, -446, -976, -645, 170, 1019, 971, -66, -1057, -582, 134, 812, 967, -30, -579, -849, -80, 824, 1020, 395, -468, -786, -241, 916, 1250, 525, -645, -983, -842, 595, 1153, 446, -69, -928, -641, 166, 815, 775, -136, -806, -616, 245, 716, 877, -92, -706, -518, -176, 868, 1003, 239, -614, -714]
4292g14J89J160N11p37q88l22L23J001M85n44r48m84M73J041L44J7j199n63M01
4311d54M06R20l48m01p19l2Q86P47l80o94o36M2M54Q09N05j039o48n58J128M29
4331D17M61l33j236j69K97R38Q57m92j140l47J92N18P59Q0r04m63j05Q70N24N6
4351G80n49q79J8N72Q34J34r13q97J74M44O23M93o11o92l35N41P02N64o10o81
4371b88o86M67P46M38j41q64l79r0O76P73K89q42r37M7N73J081j94n85r19Q3K68
4392d84J131M9n20n67m44M72R63K72m57r11l23J39O67P23R6j417m04J26P32J119
4412I62j57r15q99L83P36O07l4n56j128L8N95P38O62n43j202N1P4R69N44n29r13
4433e17n17O79M36Q07k99o65q75K05R70O55m34m51o07j30O09P73J64p73p66m7
$$ y = [-714, -525, 635, 1146, 409, -479, -801, -478, 523, 1008, 464, -484, -968, -495, 546, 890, 907, -292, -855, -454, -48, 872, 524, 123, -596, -628, 258, 1005, 625, -69, -705, -663, -209, 600, 1105, 66, -582, -1140, -12, 417, 878, 545, -691, -860, -563, 375, 1232, 740, -400, -747, -555, -37, 722, 802, -102, -565, -670, 200, 724, 780, 231, -648, -630, -58, 776, 910, -3, -900, -726, -282, 341, 834, 223, -469, -804, -263, 439, 1003, 393, -288, -974, -507, 239, 677, 536, -328, -707, -797, -121, 652, 941, 99, -838, -791, -218, 863, 669, 84, -835, -752, -484, 647, 696, 176, -391, -835, -363, 600, 872, 415, -496, -819, -680, -13, 710, 806, -611, -1015, -889, -157, 962, 805, -110, -1009, -626, 110, 717, 683, 127, -1001, -963, -368, 370, 1032, 489, -713, -662, -588, 381, 925, 396, -517, -1034, -355, 81, 888, 589, -76, -951, -746, 224, 879, 445, -6, -613, -743, -134, 639, 803, 30, -736, -783]
4453g83N48J007J67o74q50j50M60N90N53m37j003n43O10R91M99l99q96m20J04
4472f26R08N64j49o90p87j6P19Q54j63m86r14J59L14R24M22r22p63j07L45R10
4492D96N18o06q60o68N80J083J83j92p85m65%J270J42Jq69p84K98O65Q88j66o26
4513A03j200K08R05P53J81o66q64j51L70Q49L38m27r87m58P21P94N87p25o92l41
4533g02N00L78O12k70o94p21J99Q89P60q2q16q56j21R26O15J58o98q58J65N00
4553a16N88L12n39q01l80N14J046K52n25o70n46L48P01O56j67o34n58p3N97P26
4573G31L66j444n39K72Q33N80j01o16p61K9N09O19K70n09n12n30P52Q42J65o01
4593C55o92o18O32O86O86o18q00l28K9J017N08m62p08o04J05J065N09j09o73n56
$$ y = [-783, -235, 772, 939, 265, -585, -735, -275, 315, 868, 431, -572, -1115, -505, 486, 985, 586, -310, -730, -626, 282, 846, 697, 7, -780, -796, -77, 777, 614, 128, -786, -627, -313, 611, 1033, 111, -652, -759, -414, 496, 1014, 408, -452, -1120, -540, 543, 726, 534, -251, -716, -716, 554, 696, 697, -172, -956, -658, 7, 895, 729, 103, -1097, -889, 16, 769, 950, 284, -580, -731, -361, 488, 826, 399, -588, -1046, -325, 469, 1056, 331, -361, -702, -202, 176, 788, 518, -176, -897, -698, 191, 951, 869, 53, -803, -924, 2, 617, 775, 77, -781, -616, -116, 472, 784, 245, -556, -936, -422, 624, 876, 351, -319, -865, -517, 184, 840, 673, 39, -519, -592, 5, 731, 1097, -347, -886, -614, 219, 799, 698, 82, -679, -650, -141, 478, 748, 239, -273, -803, -51, 791, 956, 355, -337, -955, -323, 363, 1049, 431, -369, -697, -668, 349, 857, 395, -313, -917, -812, 253, 762, 653, -20, -576]
4613e76j98Q68P07O4o39n75p43Q99Q61L98r06p66l77N19J101K10m59p20n24J13
4633g43J143K56j72n45p10M24M13N49J91o77q78r4R01O81k6m48r19j84P68P15
4653F45K21m50j027l19P04O68M86k45j289l01P50M68O62m79m18q13M0M67R07j14
4673E63o95m59j39P18P00J40n47r71K0N20N96O03q94o28l38N66O90M03l90r98
4693e40k36J86J021N86o06p97p31P18P16L38L31j170q24K47M93Q71J73j007m48
4712f79j77R46L54L75q06p92k29O58J025M27r52o45o53J043P33J86l39j076m78
4731a079O36Q52M95n10o03o59L39Q62O40l36p32n58k74R60R06r4k97j178j15M67
4751b78P70O66r89q78l40N39J169L73p63p39l68L26Q24M75k38m71j134K45J167
$$ y = [-576, -774, 94, 801, 865, 226, -349, -1092, -193, 668, 1066, 160, -606, -983, -464, 637, 847, 388, -332, -856, -743, 400, 656, 484, -61, -771, -347, 66, 615, 806, 129, -749, -843, 58, 739, 713, 265, -654, -838, -70, 645, 866, 416, -611, -930, -226, 442, 928, 683, -606, -907, -157, 311, 973, 494, 76, -737, -697, -230, 677, 563, -132, -591, -730, -12, 688, 828, 281, -690, -670, -150, 446, 1049, 155, -473, -811, -245, 445, 848, 458, -540, -776, -590, 431, 1017, 411, -386, -1117, -399, 317, 655, 986, -184, -1008, -761, -268, 603, 776, -231, -679, -856, 90, 444, 819, 13, -779, -1008, -350, 675, 1102, 150, -495, -1148, -105, 628, 814, 475, -601, -1079, -443, 409, 904, 394, -209, -868, -529, 333, 973, 637, -95, -653, -927, 33, 939, 845, 548, -630, -745, -278, 492, 1158, 169, -709, -1049, -510, 659, 1032, 269, -470, -838, -512, 312, 787, 549, 78, -1056, -811, 356]
4770C56L56j5j042l08l6N38J024qo84o10k17O65M21L24l77j020m96O90R79L77
4790I17n25o95m47L79R62J23k48p14n85L34J050J76j34o70q59M98N06N64Pm58
4810A81p79j98P15N59M16q26r39J60M67P27L69n49o38n87M54J101J53n57n04m76
4830g51L45J018N32m33r01m16k24J178M89l12o55q36K09O95R87o9p51p27Q6L99
4850a37Q57L9n21p16n06O79Q18N77r44q03K8J82Q35N49m38o98k48k05J021N16
4870H85j38o24r80n8Q50Q91l34k38o09n64P07O68K78l60q60k77O03P95M08o35
4890D08p42m17M98N69O67o53n62m39qO58Q06k8q31p41K25R13N62m32l59q59j37
4911i02R81L03L06n27o46k73M68P94J50m37q37k58M64Q03K94l24n93n05R0J035
$$ y = [356, 712, 697, -345, -653, -689, -151, 873, 865, 181, -429, -646, 19, 440, 764, 387, -633, -1129, -439, 540, 917, 392, -303, -750, -371, 591, 714, 466, -248, -833, -499, 551, 727, 593, -77, -936, -438, 68, 632, 639, 181, -598, -796, -81, 478, 894, 68, -871, -711, -244, 483, 852, 303, -335, -922, -468, 633, 786, 229, -275, -751, -406, 612, 1144, 711, -190, -606, -830, 348, 837, 525, -130, -966, -757, -62, 925, 856, 105, -622, -536, -137, 720, 759, 238, -478, -984, -305, 513, 1090, 146, -657, -629, -447, 388, 937, 499, -199, -447, -652, 369, 885, 747, 123, -857, -915, -65, 826, 492, 254, -355, -919, -212, 456, 734, 374, -486, -763, -160, 635, 1043, 408, -334, -751, -253, 316, 983, 330, -232, -671, -679, -21, 785, 757, -74, -815, -590, 323, 885, 453, 94, -765, -902, 79, 382, 688, 161, -485, -758, -290, 504, 654, 217, -620, -878, -414, 389, 683, 359, -234, -739, -649, 386]
4931C86N45n15n13l76j86P52O31Lq47n54N4Q34L95j09m22q66K97K75R18K30n21
4952D11q57k46K68R63N58r19o65n27N95P61O76p59q71m55N06J313L54n54q54l35
4972f37Q2M28J020l01m76q59K93M30O68J10p34r51M2P51Q67K11o18o52q80O10
4992e96Q60M62l02p66o75N66P57L55j88m82p08L28L06O87L5m51r26K26L36Q61
5012F85J5m01o83m28N59J006k0l18r55l83Q85L19O00k79j405k86M68Q83N05j01
5032F66q09p44L84Q41K80j7m64q02j54R65N53J58j006m41o06R28Q45L38n34r76
5052e95j64K84R64K9j83o02k89J32Q12N52l30q77n68J47J055J81J60r27n93N3
5072g59R44M15K41r92l68k58P07P13K1o21n34l04O50N68L08l32q30n62N54J009
$$ y = [386, 931, 416, -97, -473, -659, 93, 724, 727, -120, -674, -620, 214, 609, 500, 78, -788, -491, -216, 702, 932, 411, -446, -692, -424, 539, 1097, 178, -487, -1014, -419, 342, 1018, 259, -612, -1067, -561, 752, 1106, 552, -302, -637, -555, -127, 893, 592, 116, -743, -450, -20, 648, 758, 24, -927, -885, -134, 733, 944, 326, -326, -1206, -596, 264, 726, 424, -342, -1017, -451, 306, 661, 473, -9, -717, -389, -83, 604, 639, 188, -738, -512, -176, 685, 700, 299, -384, -812, -253, 753, 733, 415, -540, -923, -38, 281, 881, 602, -803, -1089, -621, 262, 767, 666, -143, -887, -503, 338, 618, 601, 137, -665, -819, 146, 699, 857, -149, -590, -1196, -268, 577, 915, 381, -595, -759, -475, 489, 518, 335, -267, -556, -424, 388, 940, 610, -267, -835, -688, 367, 548, 708, -219, -812, -759, 185, 600, 841, -151, -519, -777, -70, 643, 664, 43, -491, -795, -145, 423, 731, 399, -431, -993, -439, 570]
5092E70L6j3n56n21j61J211K84k80p40l04rM85O72k10k35j032k8O65P94L23p88
5113A63p39k12P66N45M42n80r04l30L63Q29O77o63n37m22J97O18M79J61j164p41
5133a052N32N21Q03k96l73o02k29O22P01J69r62l11m01P98N44L07n83o55k07J98
5153d76J035L20m99q92l91M57J013q1R6q97m28j1P95O81J70r07q76K32P44O35
5173G20o7n51p17k01P65R75m58l25r45l6M58Q39L30l75q90k83L13R24L43j87j004
5194c72m07L50O87P07l69p20n85n7Q32Q10k14p83l97k2N97O05q9l96j009N9N25
5215b48J114J04n10j002j61j0J294K65n80m94p36M23R65N41n41o31n27J37M22
5234a75Q94K9q65n31J1N34Q48J00o54q85lN87O87K71n86o62l66M60N70P63p14
$$ y = [570, 606, 593, 37, -484, -645, 566, 850, 570, -170, -474, -483, 2, 674, 464, 229, -803, -831, -166, 628, 951, 163, -576, -788, -22, 523, 965, 385, -519, -849, -486, 343, 1020, 357, -180, -602, -405, 213, 692, 853, -311, -1052, -520, 1, 804, 508, 135, -467, -696, -74, 627, 796, -166, -477, -878, -80, 464, 771, 188, -467, -674, -476, 559, 879, 380, -512, -903, -446, 567, 486, 582, -315, -743, -754, 41, 722, 892, -15, -891, -659, 85, 720, 653, 102, -615, -816, -51, 924, 466, 141, -804, -840, -382, 457, 787, 412, -478, -761, -448, 476, 819, 632, -372, -779, -429, 258, 965, 596, -124, -709, -766, 66, 876, 662, -121, -518, -540, 57, 662, 573, 177, -832, -773, -248, 866, 970, 460, -542, -703, -713, 581, 846, 266, -228, -964, -541, 424, 965, 424, -207, -734, -597, -175, 719, 748, -117, -648, -637, -103, 745, 845, 191, -694, -697, -110, 577, 848, 262, -400, -766, -306, 264, 1027, 313]
5255C13r75k21K04J063M84j13j030n40L78N84L91m4m19r07L34Q07N26k95p40j84
5275c84n00P22O75L75p96m81n30P06P36J97n56o86l44M15Q82L38l20p08p99O05
5295d53O41Q80o17m45r89M98N64O57o1j025m13l08J217L60L66r01l51l16M33O84
5315D21L42m97r52O3M29N97L52n81l66o59M88O87L48k34q38m63K19J046N85m43
5335E44o38p15J9P12P28j17n05p68P9L24P07M25o29o11m81N72P14M96n33q87j08
5356f72L07O93M02j16q02q50L42R40N00p5p78p69J73Q28O65k28o95m11n7N16Q42
5377G55q6n97n35j68K79J003qk21p90o01M49P18O09l08q37m00J58L99J108k80
5397F47p12n05oP66M95M94j548k53l22Q24R05P9j167o9k55O13O86om34o18k98
$$ y = [313, -662, -883, -679, 384, 868, 755, -275, -815, -437, 147, 538, 494, 75, -832, -498, 309, 835, 540, -200, -384, -884, -162, 513, 888, 92, -389, -919, -213, 523, 720, 164, -522, -866, -451, 431, 769, 449, -259, -1058, -453, 188, 1068, 451, 6, -983, -485, 79, 736, 675, -350, -763, -1071, 146, 506, 872, -29, -380, -696, -263, 421, 763, 266, -686, -623, -194, 403, 755, 174, -192, -851, -363, 324, 672, 438, -400, -863, -644, 402, 987, 544, -94, -809, -790, -78, 650, 533, 28, -740, -661, -337, 370, 795, 166, -445, -926, -354, 360, 856, 323, -564, -672, -365, 328, 730, 614, -188, -1038, -696, 244, 744, 669, -109, -878, -705, 123, 788, 560, -135, -546, -603, -87, 755, 669, 72, -463, -631, -352, 651, 643, 422, -368, -969, -520, 198, 807, 499, -338, -738, -580, -181, 927, 647, -65, -570, -576, 190, 685, 1179, -369, -622, -944, -120, 785, 864, -303, -372, -627, -14, 672, 666, 232, -386, -684]
5418f84L22P70P15q33n33p63O94N93M85j53p87p34L04Q63N12j57l00q87Q6K63
5438b24Q66J47o98o42q5N51P80K97o86p82l28N40P29J62l74o53n34M42Q01M21
5458G30j93o81p15R9R88R22o31m31q81J76Q26K59o1m48r18J91N84P15K95p90l84
5479c48m43K74Q39K20k45p90k76K88M80P01k46n28q64K32R99N13j15o24j019K16
5499g36R27M59p2p51o91K83O17O64q3m38o95k96Q64P33L2k46p64m13K46O58O89
5520I87o39q04o9J25Q51R3p9p88p80L95J175M14j37o74r10OO07Q03L52q62o39
5541e73o9N05N90K46m68p79k78N57P33M93n78q52q4l0R65L19j25q17l71m42J000
5562e8Q53l84m56n48n6M00P85K2j87r09j47P82N02k5m41m24n34N34O87M02n84
$$ y = [-684, -362, 408, 1123, 290, -243, -1006, -312, 281, 766, 613, -174, -908, -604, 259, 771, 614, 314, -573, -487, -224, 642, 789, 91, -551, -636, -85, 695, 992, 306, -476, -804, -264, 465, 627, 253, -400, -934, -492, 309, 730, 537, -144, -859, -760, 228, 1150, 519, 88, -793, -617, 209, 468, 407, -41, -959, -768, -184, 531, 826, 36, -348, -791, -517, 322, 542, 297, -493, -769, -481, -1, 700, 454, -74, -938, -706, 293, 806, 691, 67, -952, -736, 191, 650, 578, -173, -864, -581, 36, 700, 617, 179, -516, -812, 52, 785, 817, 571, -193, -606, -360, 298, 987, 348, -456, -525, -400, 451, 544, 465, -323, -1103, -708, 467, 881, 744, 70, -840, -834, -227, 576, 928, 66, -573, -642, -137, 453, 699, 231, -548, -826, -269, 464, 957, 379, -473, -557, -587, 378, 697, 572, -245, -616, -1058, -58, 795, 411, -45, -593, -649, -249, 536, 558, 371, -538, -685, 97, 599, 574, 133, -291, -825, -291, 396, 798, 214]
5583B14o92n71P18Q89P11r21n39n04L04O76J30l5n40m56K7P40L39L96j122k45
5603d81k78O34Q40o1n61p07k01N87R13Km85q82n9J80P35N95n75o00k78q0J078
5624C16N23j41p33p21J92O65N41ko28o02k08M50J037K25p53j056j8Q11M59K02
5644E59k86r05k2M19O12N48m76r36n50N71Q68L44k53n79o99M71P09O68n94p90
5664c21m75L61L50P60k42p36l05k38P26O42K89n54r92p7O29O30L64n21o86m20
5684h16L14J153j29j96m95p16L75J138J57j19o08q77L33O45N81K35q42q65P1P95
5704A34M41J51m04p55l18O81N88P7l60p43l05O53O05K61k09p23p34M02P46O55
5724H43l41p34o63K51N80Q43j66p43n66k03P48J011l50j50o36l39N42N96J74m13
$$ y = [214, -478, -1049, -331, 558, 1269, 348, -191, -695, -391, 285, 415, 380, -160, -616, -589, 151, 490, 886, -236, -481, -759, -125, 715, 654, 93, -614, -815, -228, 685, 687, 202, -680, -739, -559, 176, 771, 196, -404, -682, -762, 316, 839, 698, -35, -756, -564, 101, 642, 640, 12, -590, -798, -348, 689, 914, 161, -895, -913, -102, 357, 559, 273, -632, -654, -235, 377, 925, 449, -487, -1037, -466, 402, 746, 493, -86, -785, -314, 395, 1063, 469, -321, -796, -435, -85, 675, 433, -303, -608, -846, -120, 522, 811, 257, -735, -812, -183, 447, 811, 290, -396, -816, -502, 651, 522, 326, -169, -885, -510, 628, 785, 666, 58, -819, -486, 159, 740, 975, 133, -732, -661, 134, 575, 726, 322, -433, -751, -70, 518, 595, 235, -508, -813, -160, 445, 706, 497, -226, -960, -558, 188, 843, 502, -232, -895, -644, -64, 779, 613, -130, -696, -899, -151, 860, 510, 360, -276, -615, -73, 523, 697, 284]
5744B84q46j31L84Q18L33l61p10p95O56J028q5J39q04m27L3P10N14j12q53n80
5764h05M43M49Q44l73m58j082K36N74Q65Lp32n31k41M19P35L25l60j047m0L19
5784d57R99M32m23q20m96M32R12j11K98r76p18M24Q03M97l61k05j012J81R24L56
5804F79k5m51j247K17O54O52K51k98q31k83N60N57L30k88m37q04K65P56M60j19
5824E98o87n97J85N71P08j80m98o83k08O89P66J96o01o59m50R40L59L11n36p64
5844e40m17P51O90J06L4j096k83M45Q67O1j51o83n39K63P03L70L6q33m45j3J050
5865C76J80J03n34p79J76M94O10k75m42l33k64N97L06N84p44o88J83Q6O00N51
5885G87n38n27n07K75Q76O10m72j080J36j1K98Q76m73l14o99j58P60R48L7o95
$$ y = [284, -562, -693, -309, 509, 842, 481, -229, -1024, -368, 660, 575, 714, -90, -517, -484, 226, 740, 628, -225, -805, -362, 87, 931, 558, 100, -982, -746, -172, 693, 696, -36, -567, -808, -389, 346, 671, 311, -736, -776, -457, 542, 974, 551, -269, -765, -333, 579, 468, 766, -210, -928, -504, 299, 796, 435, 230, -782, -601, 323, 679, 654, 203, -1044, -827, -173, 479, 730, 432, -399, -682, -122, 435, 765, 477, 40, -764, -499, 257, 717, 598, -89, -686, -501, 70, 778, 598, 100, -583, -791, -102, 664, 860, 259, -400, -850, 90, 449, 760, 224, -540, -957, -206, 484, 590, 624, -472, -755, -310, 557, 618, 467, -216, -755, -492, 211, 581, 617, -216, -661, -674, 376, 556, 659, 125, -654, -478, 16, 626, 351, -91, -424, -688, -91, 215, 799, 55, -633, -450, -364, 236, 787, 249, -278, -785, -510, 366, 976, 504, -576, -440, -451, -153, 723, 250, -64, -763, -921, -161, 787, 824, 129]
5905A29o41k08Q25L79K21m57q23k3J68J239L4n65p31m77N56M88O69k31p30l22
5925e00m9O02O39K1p86q29K54N62M26J98o07l94l02P72O54Q9p99l86k71M63L93
5946A50N50m12p32m55L04J133J21l92o36j83L28L03M21r0l93n12j51Q69M48J87
5966H58r67n87j46R62O76j44p54m92m12P70O06L28l82o63m08M03P17M61l96p01
5986b71m66Q4J015M94j13p59o99J14J085L70m21n55o81K31P72N16k17m74o53J85
6006d43J88R40J27o43p45j00L34N21M83n53m86n76N74N32O63o58j89o25M05N68
6026C17J00K76q12n59q9Q76N40Q7q42l73k89Q02L24K21p31j17n72N48Q98K11m39
6047C77o92m94Q0J025N50l10q68k70K94M40O50n5j117m22K24P99M04j41m44n25
$$ y = [129, -512, -720, 105, 484, 705, 248, -575, -598, -430, 809, 843, 278, -453, -930, -374, 114, 783, 552, -178, -500, -549, 53, 692, 713, -73, -902, -648, -86, 340, 538, -69, -463, -765, 7, 661, 750, -49, -435, -706, -243, 150, 700, 288, -444, -899, -595, 538, 659, 267, -369, -552, -224, 79, 500, 410, 17, -495, -646, 223, 671, 858, -109, -696, -842, 120, 796, 652, -102, -594, -1006, -236, 370, 698, 316, -347, -755, -352, 365, 826, 430, -271, -737, -653, 362, 856, 743, -16, -715, -601, 484, 854, 433, -122, -803, -572, 200, 716, 499, 25, -628, -443, -255, 685, 812, 169, -576, -676, -342, 179, 662, 109, -377, -953, -379, 153, 816, 158, -31, -656, -251, 317, 417, 693, -119, -678, -767, 109, 649, 736, -106, -479, -768, 34, 358, 579, -152, -269, -841, -293, 605, 816, 377, -315, -809, -729, 296, 846, 536, -332, -602, -308, 132, 782, 727, -390, -812, -588, 211, 615, 474, 30, -495]
6067d95k01N71M80R6Q1j197j51O60R08J3n71n63l39L64O18O97n42o33p12N58P35
6088C77M23k30p72p85O07N26M20J48o45p04j19P95O39j21n27n63O4L55P02K53
6108H43m69p65l49N76O57N1m10n36o15Q29M66L63l26p37m74M56R97N10n56p89
6128b78m91K45L77Q78o1q68o42K32N15Q13N6o67m91l53O61L38N74o98o67k79L59
6149d47R29L44k40j034m64K59J116O03n66p10n74K17Q05N47j2r69m26J26P18L64
6169E86J68n21r72q3N54O44M76m97r49k46O00N36M84m91p07p29O85Q22M73m55
6189C78o45n67J71J034L21L4p99p94K86L30Q28J4p03l58m47J038P51k39n12p59
6209f38J1K81Q98M01n18p67m12M16Q89j39o5q32k74L37P31M81j72o56o29J30P01
$$ y = [-495, -696, -125, 355, 451, 532, -665, -816, -156, 752, 765, 194, -369, -708, -344, 274, 971, 429, -204, -916, -358, 377, 800, 570, -202, -987, -380, 146, 566, 714, 69, -635, -754, 41, 680, 559, 32, -531, -467, -112, 590, 843, 374, -391, -740, -164, 493, 544, 134, -402, -1017, -188, 278, 641, 315, -422, -896, -440, 557, 1067, 511, -278, -769, -524, -147, 731, 670, -198, -840, -608, -93, 720, 776, 109, -382, -735, -74, 264, 838, 140, -527, -806, -447, 482, 826, 586, -448, -912, -653, 463, 1066, 500, -210, -784, -567, 238, 785, 773, -196, -622, -496, 222, 586, 754, 233, -739, -822, -268, 376, 852, 355, -594, -840, -240, 296, 780, 289, -418, -1147, -462, 360, 833, 378, -267, -834, -663, 371, 692, 726, -73, -867, -581, -251, 577, 591, -112, -470, -917, 121, 872, 633, 121, -638, -627, -346, 552, 953, 435, -332, -744, -328, 561, 422, 357, -475, -749, -412, 319, 800, 628, -28, -657, -527, 174]
6230A74O02l67m99n57j01N81O82J69m52q47k98Q01P88K42m76j319j52O82O36M09
6250F98k15j082k72N42N27N18J71j040m67K5L80J230n00o70p20J77N78Q82m2o53
6270F7l90n81P53P11K07n30p39j24L72P18P0m3q12j59K10N73M98o4j167l48K65
6291e13O35P20p7j275r6K78R6J038j04q55l35R0L88Q51k68j32p93m47N96P52J50
6312F99l63p78l11N60L76L61k05m36q94M07O32P97k69o29o98J47N25N25J52n55
6332D3l67k48O25O73R8m52o08n93P16M77N42n22q49l26M21R10J52l11l94o99L16
6353c96P68M01j69p19p37M81L76M74P7p13o03J51L80Q65j69m86n75j87P11O72
6373F02Jk22n94o18M26Q69K80k32n31n61J90N26M56l98n23m69q0J184O66j95p80
$$ y = [174, 776, 409, -90, -647, -748, -167, 515, 684, 232, -615, -913, -112, 676, 918, 442, -877, -1029, -347, 289, 698, 483, -599, -871, -329, 198, 716, 887, -153, -620, -595, -215, 1015, 515, -155, -875, -698, -120, 762, 720, 67, -323, -904, -151, 560, 767, 237, -502, -626, -254, 464, 534, 491, -321, -480, -270, 303, 801, 737, -430, -778, -513, 122, 842, 765, -510, -606, -328, -232, 806, 702, -153, -488, -398, -10, 841, 573, 441, -352, -799, -203, 549, 699, 336, -442, -753, -193, 183, 544, 339, -97, -991, -584, 48, 845, 576, -53, -751, -604, -79, 446, 598, 43, -324, -572, 53, 726, 824, 372, -236, -829, -113, 364, 906, 384, -465, -791, -370, 540, 692, 381, -13, -712, -396, 372, 773, 604, -115, -852, -371, 5, 479, 556, -157, -760, -609, -229, 636, 467, -19, -594, -781, -70, 602, 603, 381, -213, -831, -405, 464, 744, 512, -19, -580, -390, 136, 592, 194, -329, -798, -878, 306, 972, 777, -3]
6394co97j01J110J81Q6m02o47j99O74P19j42o66n72j63M80O92N31p23p36k7K60
6415c45L31J043m82p15n73J02N44P31J18r84l49j66P99M46J38o73n65J16O76M64
6435F56J22m19r96k51P77N18K99n67p57j07L34J033N4k09r52l36J60P57N97j8
6455F95j033o91M67R51J98j38o63l16j95P67P19n7n42q39P4M08Q30Q2o37o64J76
6476d08O5R66J31l55p11m35Q21L14J08j19o22l44j77Q99P96m98o03n41K29N93
6496A09P79o4q36o11j32Q25P40j87l47p81l8L75O68K70m76n48p45N65P64O11q18
6517A23k92n71L91O99K17J1o27o93L90L49N62n1m23p31j15O04J046k6p25o77l30
6538h69N57R25J16n23o07m95M84Q02M54m92o26n11N01O09K86o5p41n08K82P89
$$ y = [-3, -700, -801, 309, 490, 576, 174, -473, -672, 2, 721, 579, -87, -659, -822, -342, 350, 881, 158, -578, -605, -345, -14, 1029, 547, -168, -741, -639, -95, 636, 754, -230, -579, -745, 54, 500, 638, -35, -600, -484, 192, 656, 778, 359, -637, -888, -111, 407, 706, 139, -618, -725, -391, 642, 696, 487, -465, -801, -641, 116, 713, 695, -338, -1029, -562, 389, 587, 449, -214, -530, -725, 42, 761, 704, 162, -677, -603, -195, 635, 717, 80, -584, -408, -343, 623, 754, 399, -312, -747, 74, 388, 496, 377, -245, -589, -766, 133, 929, 431, -172, -713, -484, 109, 888, 824, -12, -623, -755, 70, 810, 623, 276, -505, -543, -168, 500, 770, 294, -254, -999, -434, 330, 941, 123, -169, -740, -349, 350, 567, 578, -49, -742, -352, -3, 559, 508, 85, -646, -761, -157, 889, 863, 138, -539, -869, -312, 613, 729, 206, -401, -896, -412, 390, 844, 352, -274, -785, -284, 325, 611, 546, -195, -703, -421, 368]
6558C68J92J50o41p61l7Q45K92L15p44l86j84L18J015j69n11o91Q2K11Q01K98
6578G63n26o51l10K50J040N5k94o67l88L30L74P61k31l69j020L37M43M97M66r10
6598e0o84L7P66M02L38o56p54l43O63O72J84o11k82m52M02R25N5k83p22n81M67
6619e07M99P13j15r26l61K82M92O62Mp89n16J13M70O99p1o00q50J45M95P42J83
6640G64m78o88k27P14M93J19m92n17m32K09Q59M70l79q21l57J99P88N03l50o31
6660b54m1k11P73N17m9m89r49L5M34P52K22o74l57l01N04R14j2m06o77k34J64
6681c39N78L85r4p47k49N0O29O12l90m11q98M17P06Q8J56o34m96O1P02M77K42
6702H45o75o77k01P26O61L09p91p78j31M72N05M57l79p19m47L72P38M14j94n61
$$ y = [368, 560, 710, 69, -692, -729, 116, 408, 723, -21, -407, -591, -273, 742, 573, 62, -629, -547, -336, 465, 763, 237, -414, -724, -474, 566, 621, 327, -340, -728, -398, -24, 737, 506, 137, -883, -546, -103, 394, 860, -50, -734, -697, 69, 471, 809, 153, -601, -944, -281, 391, 575, -36, -318, -770, -368, 557, 612, 329, -393, -974, -507, -8, 705, 590, -336, -697, -415, 77, 739, 743, -46, -562, -449, 21, 720, 649, 49, -801, -656, -161, 581, 764, 286, -402, -629, 85, 578, 697, 205, -312, -744, -535, 324, 794, 415, -406, -763, -564, 224, 727, 377, -254, -295, -506, 267, 784, 735, 246, -703, -668, -234, 518, 740, 66, -291, -592, -88, 826, 814, 408, -269, -503, -339, 239, 624, 530, -217, -466, -416, 213, 825, 435, 24, -874, -457, 249, 337, 493, -141, -637, -576, 126, 603, 845, 170, -507, -708, 18, 679, 988, 197, -581, -712, -240, 265, 722, 343, -376, -823, -451, 287, 701, 507, -54]
6722e4p74J09R62J96J74q00m03J67M37P50k80n88m94j24N45Q38j16l10n98o61
6742a024R13M89J41R3j083k12M57M15N25j7r35n86O82M65M22l95m27o31L18L14
6762g6N78K27n67p98n1N59O97K49q06n30k64Q74L86L73l67j070m53Q64M81M83
6782G89k65o99j71r5O25J74L66r27m68P9P62M04M8q27m93K48N17O16K82r00n27
6803d62j39M54N17N30q35m23l36K90P29K57l20n02k77M10O22J69l93p40k88J68
6823e69P50L24Q9o17p52L24O02N77O2q16n45m6K74R00K57p37n45o2K30N88N46
6844H34n15q60j45N39N76N36n88p35j4k63J065O43n81m97r02L01N74P84K6q06
6864b8o51lM50P92J38p43m75j51M59R08j28q4o67n63N79M94J60k89o41j79K61
$$ y = [-54, -828, -719, 243, 439, 613, -187, -590, -423, 14, 764, 484, -104, -598, -722, -177, 661, 545, 235, -363, -1024, -111, 378, 519, 612, -471, -683, -226, 189, 714, 697, -238, -824, -142, 323, 745, 350, -77, -708, -390, -76, 502, 729, 162, -636, -687, -128, 569, 818, 12, -518, -782, 92, 478, 851, 484, -586, -1039, -175, 306, 789, 524, -175, -346, -441, 184, 358, 724, -203, -671, -592, 170, 574, 622, -205, -698, -450, 67, 683, 965, 65, -462, -601, -147, 370, 900, 65, -358, -694, -404, 325, 582, 262, -240, -517, -107, 515, 684, 291, -449, -737, -569, 181, 505, 594, -23, -775, -451, 151, 728, 790, -26, -571, -617, -343, 557, 814, 77, -468, -530, -300, 288, 834, 319, -541, -686, -147, 429, 965, 377, -358, -372, -635, 430, 1073, 492, -5, -907, -606, -32, 752, 778, -28, -679, -682, -232, 560, 698, -45, -520, -671, -212, 696, 568, 484, -183, -746, -167, 327, 487, 198, -443, -622, -361]
6885c61R03K33q7r55l81r4O38P80p5m45r64J07O92Q65p3j100k33j4N80M34M42
6906H92o60q08j08N56O25J62n00j52o05M01P84K34o13n87l94N23N26O47j95p88
6926f0m65p0N04P95o8n62o87m5O21M95M34p56o55k05N26P76Kl47j003K68L26O63
6948D87L63n00n64p78N95N71N86k95o15k90k65Q36N94Q9m70j004J77K93J013l40
6968D83l84o41QL56M77O3k12p31n7M23O98O7l64m64l45L08O14N48n03p58k46O1
6990e99N90Q06k54p17m95K09M42N17K00n67o42J8M78M68J27l16n11n50O53P06
7010E63K19m35o26l63L06Q90Q6n8j070l07P6J031K28j53o60n04K07N39N58k04
7030C23o84k63K1N83O21K51n16r77K0L83P38L04m32q80k28M18N65M84m27n61k09
$$ y = [-361, 542, 775, 688, -267, -648, -742, -104, 676, 601, 156, -808, -701, -9, 856, 783, -317, -550, -564, 16, 450, 892, 232, -576, -684, -128, 497, 659, 159, 7, -598, -197, 587, 821, 208, -379, -773, -250, 276, 923, 728, -60, -525, -595, -91, 704, 636, 74, -613, -658, -37, 458, 892, 136, -519, -724, -198, 578, 580, 233, -770, -502, -176, 487, 850, 350, -214, -992, -397, 174, 760, 465, -150, -440, -705, 131, 725, 814, 344, -660, -483, -190, 823, 483, 99, -542, -534, -178, 299, 362, 150, -581, -638, -215, 483, 550, 186, -278, -623, -315, 299, 847, 344, -414, -660, -599, -9, 797, 543, -174, -669, -460, -18, 499, 699, 132, -510, -492, -14, 454, 581, 265, -246, -796, -143, 563, 782, 347, -279, -642, -336, 554, 640, 582, -488, -795, -719, 312, 540, 387, -273, -777, -570, -31, 527, 323, -361, -624, -603, -20, 601, 852, 336, -641, -621, -238, 500, 804, 372, -508, -736, -318, 247, 731, 304, -257, -466]
7051d66k74J092M55l48m25p23J34Q26M46j69n02q18K78J11Q79J54o97o95kM31
7071c13O24K87k64o98l89N86O14L42k99o85n37k8J220L66l55q42p9k25M74Q15
7091F14K32r18p38K60P44K96J62m11n37n63O00Q40R0n07q01o5N85O47K22k63p68
7112b79n53L21R88O90q39n63r6q3R20J49N5o73o57J29N19N80K83r46o54K64J97
7133b48Q41J44q62m17mN21L75K45l81o07m28N63Q58R7k25o98m54O10L9O33k55
7154C47p70l4k34J075K16P4m95q91K94M19M78j29l52q66R0L64J018J67o00r68
7174g97j93O33P84J01m0q77k65J23P63J88N6o81l51K85O25K12n1r43l13M4O11
7195h6Q81k35l07n80j90L18N60K67m02n30k11K03R62J37o54o55k23M39M49M91
$$ y = [-466, -740, 352, 807, 459, 34, -689, -555, 271, 717, 548, 46, -772, -494, -383, 496, 650, -47, -742, -744, -313, 311, 598, 334, -364, -753, -167, 447, 789, 490, -195, -732, -760, 460, 826, 471, -371, -450, -675, -201, 614, 846, -72, -810, -550, 194, 490, 652, 241, -296, -859, -259, 581, 671, 164, -637, -702, -117, 530, 752, 489, -279, -832, -511, 477, 1167, 328, -235, -331, -414, 506, 655, 710, 37, -620, -491, 28, 608, 891, -55, -709, -445, -248, 593, 737, -125, -542, -546, -25, 350, 595, 214, -393, -821, -258, 600, 697, 472, -226, -680, -70, -31, 602, 347, -423, -457, -691, 384, 600, 674, 179, -712, -418, 1, 479, 350, -2, -868, -778, -414, 604, 771, 171, -797, -990, -357, 427, 528, 488, -389, -654, -531, 232, 420, 476, -205, -556, -271, 354, 566, 515, -428, -741, -697, -86, 795, 560, 253, -327, -517, -199, 361, 628, 226, -304, -515, -312, 650, 787, 133, -522, -745, -306, 143, 634]
7215F34j92o90n63Q64K33L47j42n18n86rQ73M59l17m07o01j4P45L79L35j059k25
7236d54k35N11Q27L10p10p36l26P56O57J21j44q09n06N68K15M87l46l73m34P4
7256e47N72N34j92n05j59k24O84N19l3n60m94j10O10L72K62l90o92j66Q1O82K25
7277D69k07l55l76J76O37j38J25o40m59L18O31P10p45l22n46J51O11N41J24p25
7297b0m20j56L06J012k23j71j012m6M52N52K95n54o84Q5M20M50L21K00r99p79
7317i71K51Q64Q84l29j121n34L73N23N02K70p61q06J59M13R39j40p9o77o37R09
7337C2O27l2k92q70k30O10N01N01n57p09k45N38K01P38l86p15m65J1P71Q51n42
7358C38l76p49J33P28P53l34m46p21O6N73N38K73m77p63j63L26Q43M0l06o00k96
$$ y = [634, 442, -248, -811, 53, 286, 633, 491, -27, -613, -622, 251, 710, 393, -14, -615, -629, 116, 495, 830, -229, -454, -689, -178, 649, 959, 249, -487, -813, -57, 600, 721, 577, -232, -738, -170, 45, 532, 186, -187, -621, -547, 25, 559, 367, -138, -297, -521, 163, 682, 649, 89, -405, -515, 95, 467, 729, 339, -353, -519, -438, 244, 469, 262, -93, -469, -293, 344, 206, 331, -309, -768, -450, 181, 891, 146, -176, -722, -571, 40, 581, 705, -20, -440, -596, -290, 722, 499, 328, -684, -730, -278, 274, 569, 15, -669, -584, -164, 286, 607, 807, -192, -971, -720, 144, 1028, 699, -422, -956, -583, -60, 442, 712, -49, -855, -696, -283, 656, 516, 437, -240, -877, 32, 659, 627, 335, -535, -765, -155, 346, 847, 290, -419, -664, -126, 75, 813, 427, -288, -753, -742, 29, 880, 338, -38, -787, -654, 74, 827, 493, 47, -674, -608, -35, 503, 776, 299, -464, -627, -301, 542, 582, 276, -324, -620]
7379f20J29N51N32m3q32n21N28N04M92j77o37n11M3O06N06m1k70r36K03P33K95
7400E34J48p24o28J83L41N67J40k66n59o61N41N65O16n79l47n15K14P94M1L34
7420G39r41j37M3L89L90J6n38o25j13Q69N25j52m75p49Q0Q40N98l18m73n08j6
7441e56J58O36K81p3r48k50L78Q17L60k55r41l81K95Q16R8n7o36l74L59M44K15
7462C86J13o08o02M5Q57J95J97k39q07k58M16Q11K08m98m46p41O02Q57L0l5o61
7483a78k48j40P35L43R9o86o50K08N85L62K25r11k42P6L34O03j41k49p50J13K87
7504b25N39O04o88q96k03R23M84K6j18p59l61L34M74L40J5o88m42K91M78L25N5
7525E08n30n65J64O52K02Rk83p38NO68L31J32m19n64j38M28M78M18o11m57l23
$$ y = [-620, -491, 60, 592, 549, -283, -804, -276, 228, 720, 543, -94, -605, -562, 44, 550, 509, 239, -697, -494, 239, 534, 682, -42, -670, -487, -146, 421, 561, 295, -264, -925, -384, 181, 797, 218, -129, -644, -430, 364, 405, 739, -202, -339, -296, 93, 483, 499, -39, -664, -777, 92, 617, 465, -10, -759, -679, 161, 759, 441, -32, -540, -556, -398, 238, 519, 446, -502, -752, -374, 443, 803, 548, -393, -774, -479, 337, 435, 378, -258, -632, -273, 171, 386, 499, -109, -711, -666, 191, 386, 583, 344, -463, -721, -305, 506, 714, 216, -230, -971, -369, 488, 518, 483, -178, -426, -566, 169, 512, 611, -75, -725, -517, 68, 430, 655, -256, -498, -422, -88, 515, 374, 125, -625, -512, -225, 314, 918, 230, -666, -869, 54, 538, 564, 446, -313, -674, -340, 134, 474, 489, -199, -641, -350, 128, 453, 508, -22, -587, -423, 229, 431, 440, 157, -581, -576, 92, 423, 555, 136, -428, -566, -138, 340, 758, 147, -310, -633]
7546f33M92K81O37l34o91m05O6N16O31K05q87m62K37J39O71j72l25n24n8N02J061
7567I47p74n8n77l8L84M35L16o67l96j48K58O24N20n95m83l82M93M45K69j74o53
7588b54m59L82M76L66R8p14m73j2M30O49k17m58l61R5L23O53K00k99p37l49L53
7609c08P78K14m77p75k03O93M60L28m12p00l33J53P32N18m83k59l95j62R14O17
7629I00kq31o19L0M92N22k63k00o20m65J020M23K39k30j179J18O38M05K45k52
7649C71o79l18M08M72L00j69l27q25k13Q33R06k11p87k60j96O52M18K75n71m56
7669c77j58K88P09Ro3p18r9J37P68J08m64o40j93J96O83L32j96m79n26L07O27
7690B51L06p7k80o29L4K99N69k36n83k99k34Q59L67J26l67l32j22K41N48L20l04
$$ y = [-633, -141, 140, 777, 443, -248, -653, -587, -71, 560, 765, -122, -584, -347, -208, 463, 291, -34, -558, -616, -114, 947, 173, 115, -462, -500, -116, 319, 635, -32, -428, -576, -318, 306, 826, 231, -252, -634, -141, 304, 573, 399, -254, -713, -331, 145, 511, 609, -105, -578, -590, -160, 489, 272, -186, -547, -452, -129, 524, 724, 425, -312, -661, -308, 470, 684, 207, -568, -771, -78, 382, 710, 298, -402, -735, -582, 150, 668, 185, -74, -469, -631, 283, 900, 898, 67, -552, -522, -30, 492, 229, 29, -591, -1056, -36, 387, 626, 396, -783, -665, -27, 378, 623, 371, -308, -626, -218, 254, 554, 385, 58, -767, -980, -147, 759, 548, -239, -499, -695, -43, 375, 650, 79, -377, -535, -247, 462, 471, 408, -310, -409, -272, 496, 604, 140, -500, -693, -497, 186, 518, 322, -157, -683, -376, 251, 557, 480, 200, -429, -395, -96, 473, 237, -346, -645, -879, -20, 347, 473, 106, -226, -348, -107, 441, 761, 457]
7711D57p49j77J44M07N39m50m56r6m6O24O15k70p84m28P4O79O35pm75p36K2K20
7733b58O56L08r06l28m18M27P61M96m77m95j93L97L13L33m97l58m58m1J252L08
7753H22m86o39k51L25J6P39K16o04q65K94L75N67J8l71l14l72M61N60j03j42p21
7774d75o5M03K70K42N0o34m37J73Q43J05m19n13J78q2M65M14k63k93n96K05M87
7795E8K30N81p81p23N7N84L26K44l14q30n7M11M09M16l25r06k95O08M93O00m92
7816B94r11J77RK18O79j61o81k84K11O53K43K89o11l01n34P53M02J94n89q57K04
7837f03K59Q51M69l85p18m70P82K73j6p5p35j50J14N44N41j99q15j6j4M18M68
7858E23k3o71m96K66M01O36N9r32k71q9M48N57P4n87m51j16L71O61J20l32n76
$$ y = [457, -292, -469, -325, 82, 621, 171, -285, -381, -427, 197, 812, 542, -242, -670, -596, 83, 718, 711, 236, -500, -478, -258, 398, 706, -200, -528, -946, -519, 242, 738, 261, -234, -427, -30, 283, 616, 119, -239, -697, -738, 514, 822, 336, -303, -554, -229, -213, 526, 742, 138, -727, -433, -58, 509, 527, 156, -158, -530, -69, 491, 388, 246, -475, -540, -137, 133, 375, 425, -209, -646, -473, 370, 475, 56, -457, -279, -361, 104, 518, 255, -38, -634, -429, 58, 288, 869, 88, -635, -578, 6, 332, 576, 262, -568, -625, -214, 195, 611, 286, -620, -915, -307, 186, 786, 294, -617, -440, -431, -213, 466, 305, -376, -660, -449, 204, 447, 736, 125, -176, -710, 43, 445, 639, 50, -807, -603, -344, 507, 976, 591, -127, -597, 185, 458, 442, 367, -368, -518, -404, 140, 681, 482, -333, -349, -363, 55, 523, 500, -171, -667, -401, 0, 636, 695, -237, -508, -597, -149, 408, 482, -105, -556, -672, -301, 360, 480, 148, -428]
7879d28L1j62R81k5m9o96j78J95K80M48o9o45j16J7O27N4K34m97k74m16P74O15
7901G01l94k30m71j67N33O02J18m22m87q3j1P34J26j84o80n04L42M59P69m32k97
7922B2q98L67P22M24R7n35o68l0M45P50j49n62m90j02M26P77p9o43l51R7J92M50
7944B62N71n74o02k13K95J31Q43k80o79j30RK56P46j21q37k03OK69R67l06l18
7965I2p20j49Q31L81k4r9o85j50L36O52M13q64m44k57M39N18J14o7m38p54L39
7986e36O87L57l60m63l18J03N58K99L24o72o68m0N89P64o5k22q00j53O27M11q7
8007C35j68n43k90L10Q32J85n17l09l25P9M61L09K29n63o03K34M30O95k8o64q69
8028g80M31K95M89J12m36n78qN24L51L3j18p35n58O06O52L63m37m71k20J81L23
$$ y = [-428, -397, -559, 422, 397, 348, -348, -526, -331, -51, 397, 328, -317, -433, -416, 211, 265, 499, 2, -272, -688, 86, 701, 307, 77, -394, -561, -28, 574, 692, 270, -217, -300, -311, 423, 549, 365, -315, -819, -477, -18, 751, 319, 22, -876, -509, 213, 637, 734, 199, -469, -499, -54, 696, 547, -15, -505, -607, -181, 596, 517, -126, -477, -380, -188, 262, 833, 259, -343, -556, -261, -130, 713, 433, -246, -376, -367, -111, 635, 514, -323, -526, -520, -251, 716, 410, 92, -628, -777, 54, 435, 411, 312, -373, -523, -187, 465, 878, 14, -430, -687, -248, 270, 384, 317, -121, -875, -536, 151, 508, 148, -315, -633, -530, 28, 327, 651, -21, -689, -729, -140, 624, 559, 337, -463, -616, 11, 422, 335, 167, -376, -666, -356, 476, 661, 144, -165, -490, -411, 50, 359, 588, 25, -578, -344, 86, 781, 753, 89, -780, -349, -54, 435, 547, 111, -467, -475, 49, 400, 433, 315, -420, -978, -372, 280, 643, 206, -265, -485, -304, 19]
8049A9M33j06o05o0k34M38O01J43o05o33J44O47J91P0o98l17j38M98M21M92o57
8070D4l75j42L36O53J72n32p64k24M84N89L41j53m55n29o8O77M74k28m37m90K44
8091c83O26K80p6m01n67k86P63K74P67p74n45q7L23O28J08m7j196p3L41N05K72
8112D52k38m03k95K96K67N45j32o38n80M00K15P68n61j49m25J09M37Q54l20p60
8132a58k20r0L36O83J41m28m01k89K16M81M42m56n46k10L29N54J42m76j26p69
8152h45N36N16J67r8j30r05Q3Q55N53k36m90m16p1K07Q53j0l67n56M7L05N19J65
8174F82m80n19l57M00P45K87n74l24o73L41N95N65l06o23n56K85P29
$$ y = [19, 452, 346, -259, -319, -553, -115, 486, 629, 24, -609, -465, 182, 373, 443, -255, -572, -710, -212, 209, 701, 44, -331, -473, -137, 516, 688, 156, -608, -832, -348, 241, 582, 429, -26, -555, -623, 54, 528, 300, -137, -627, -383, 243, 523, 447, 46, -521, -807, -44, 230, 997, 223, -322, -409, -86, 542, 650, 603, -593, -666, -325, 180, 452, 214, -189, -484, -188, 79, 624, 492, -146, -726, -326, -111, 657, 96, -53, -478, -369, 68, 922, 602, -158, -378, -468, -132, 551, 692, 264, -137, -426, -210, 271, 713, 257, -289, -499, -170, 384, 526, 50, -76, -845, -309, 207, 374, 276, 146, -759, -676, 179, 732, 496, 6, -410, -481, -274, 579, 569, 202, -354, -307, -2, 517, 682, 202, -317, -674, -274, 471, 758, 184, -140, -813, -472, 123, 688, 382, -241, -797, -512, 217]
8191B17
$$ Imaginary data points
##PAGE= N=2
##DATA TABLE= (X++(I..I)), XYDATA
0@%%%%%%Qj6J6j6K4l2M0n1N9p2Q8j04J24j48J75k06K40k76L17l64M15m71N34o03
30c19O81p68Q62r66J078j202J338j485J648j827K024k242K482k748L045l377L750
47A974m174M659n220N881o668P627q828J0381j2478J5482k0178K8616m8467J77376
61A45983J46628k97902k2725J40519K3336j50579J2993R4904m0419j26100N2558
72b0804J24783j344q5234J2678L7941k5817k1232N8996K1166o8482n5885K9907
84F673L0534j5259j8446j762k4261k4540J8868L8444M105j4563k805j954n524
97a0490K5659M0242j6858o8610k6142L9723K1994l0716k3754M035j1958j9705
109g6580K9132M9245j0370m8858N99M4776J7791p975R158N062k7834j8434K6658
$$ y = [0, 0, 0, 0, 0, 0, 0, 8, -8, 8, -8, 16, -16, 24, -27, 32, -40, 48, -56, 68, -80, 95, -111, 129, -147, 170, -194, 221, -250, 284, -319, 362, -406, 456, -510, 568, -634, 704, -781, 867, -960, 1064, -1178, 1304, -1444, 1601, -1776, 1974, -2200, 2459, -2761, 3120, -3548, 4079, -4749, 5632, -6846, 8636, -11542, 17074, -31393, 145983, 292611, -5291, -28016, 112503, 135839, -14740, -1747, 93157, 52738, -73362, -20804, 103979, 102635, 17401, 30079, 68020, 42203, 20971, 79967, 101133, 32651, -23234, 6673, 37207, 21948, 3502, 1740, -22521, -47061, -28193, 10251, 14356, -207, -3012, -4966, -10490, 15169, 55411, 38553, -30057, -56199, -16476, 5518, -25198, -48952, -44917, -56875, -76580, -47448, 1797, -8573, -57431, -56832, -12056, 5735, -2240, 6918, 11980, -15854, -34288, -7630]
122g630K6327j7515l2882j7704n841J2498L4444J6412k5923j9198K3549L3236
134A9773J0204P589P081k0664k7384J3014L3746m92k7290j4829o030r711R135
147e858K8491M114l1474j8880J7377K8015J9127R962r227k6940q342K6488K1890
160E4743j5282l2389k0823r990m02J5081J2433j4235k8655p098K2968K7300J0181
173A3832q991j9101j0952J1752K1732M005k1633k2980o848k50l384J217M194r479
187d6886k3003p621K3627K8740P106j0245q782j61J3123K2757R780k1819l1543
200d4927n740J6338J0146k636q131j3420j2075R200K9794J8704p976j5517P15
213b5525J6289K3538J7151m373k2333j3097Q599J3591M74r857j3696j4425l522
$$ y = [-7630, 18697, 1182, -31700, -49404, -55245, -42747, -8303, 8109, -17814, -37012, -13463, 19773, 29977, 37566, 44647, 23983, -3401, 9613, 43359, 42867, 15577, 748, -5282, -14993, -5858, 22633, 26747, -4727, -23607, -6230, 21785, 40912, 50874, 41647, 14707, 6365, 32853, 54743, 39461, 7072, -13751, -23741, -24143, -9062, 3371, -10864, -39519, -46617, -23649, 3651, 13832, 4841, -14260, -25212, -13460, 8272, 12277, -9356, -32336, -39184, -39434, -42818, -41601, -37407, -46886, -69889, -77510, -53883, -25143, -18037, -28282, -37064, -37225, -24102, -1345, 8435, -13384, -44927, -50667, -34329, -24183, -26819, -34950, -48370, -60445, -51245, -21451, -2747, -10723, -26240, -25525, -9236, 14302, 31453, 27080, 4747, -8350, 249, 13840, 14314, 4457, -9239, -23664, -27186]
226b7186J5176K1950P744r125r380L929J8071K0602P508j1748j8524j0225M496
239A3288J3110O784j3733k7640j5867R141J7094N447n771j0495j0191K375K2826
252F368K4195m35k0736j4449K122R123P246k337k0911k9861q838J7964J6792m540
266a8297j3016p146k01R898K1169J5296q350j9473l084J4344J1572J650n854j5195
280a6687j8968k724J6709J0594r754j4107k163O658J3599K1838J4957r248j6139
293e435N279K0948J0317l691o826j4928j6825N532K6293P869k3039j8690O780
306f416J4884J0049J2701O217j4129j3401J7723K8634L773j5343r251p679j0411
319A7351M315J6807m924l0510j5038J4392J4236L585O778L044j5257j0082K0101
$$ y = [-27186, -12010, 9940, 17684, 8559, -821, 3108, 21179, 41781, 49289, 37541, 19017, 8792, 13288, 26398, 33182, 19449, -8191, -24058, -14917, 2177, 7624, 1853, -8642, -18833, -16458, 6368, 30563, 30128, 9392, -5057, -2935, 6188, 13434, 11097, -9814, -39675, -48513, -30549, -13757, -18297, -31313, -38459, -38660, -28762, -7593, 7703, -647, -20120, -23204, -8860, 2712, 4362, -1492, -16687, -35655, -38379, -21670, -11076, -20830, -34937, -37100, -30442, -16843, 4995, 19952, 10704, -5435, -156, 20792, 31109, 27418, 20592, 5664, -11161, -5629, 20664, 28533, 5494, -13196, -6416, 8468, 18517, 31218, 37435, 23306, 9905, 27628, 56262, 60035, 44692, 35441, 27762, 17351, 21666, 38473, 33549, 3039, -11999, 2393, 16629, 20214, 26992, 30036, 14779, 4697, 24798]
332B4798K4204o131k0185o500k907r327N924J6622q896l6541j5983J9384J5861
345C23m583l332J550r743m722K3965K6699p154k5125p670O074Q70M250N596j5388
360h390l0204k852K6699J3736j1652o218L813l251J180K5253K0738j4595k2240
373g983P457J8542J37l705M779j0412k5857l452K5913J1553j5882j0285P027M675
387B507N970K1940J5750j5335k1189P639J9788L082n822m367j5184j9083Q351
400D047K6547O72k7292j2737J0375P213M152J4491O658j8507j4488J6872K2138
413D0141l752j5629p437j0802j3476N304J6729n334k5762j0169J1619R556M278
426d734Q463p42j8242p163J9391J8280p132j3308n521p457p305J1367J5046j5338
$$ y = [24798, 49002, 42871, 22686, 16186, 13279, 3952, 9876, 26498, 17602, -18939, -34922, -15538, 323, -4260, -7592, -6042, -15785, -20507, 3458, 30157, 23003, -2122, -9792, -3718, -2848, 1402, 6998, -8390, -38594, -41446, -14747, -1011, -12663, -18881, -15068, -18319, -17139, 8114, 28852, 14257, -7983, -526, 18016, 18153, 14448, 19227, 8815, -17042, -20494, 5419, 16972, 1090, -9195, -2168, 2507, 8477, 30417, 46167, 30832, 9643, 17282, 37070, 40152, 34330, 29963, 14779, -4304, 4047, 30594, 31266, 3974, -8763, 1612, 8825, 12977, 27468, 34126, 15619, 1131, 18003, 40141, 36389, 20760, 13323, 2521, -10955, -5651, 11078, 5744, -20018, -30187, -18568, -9012, -4734, 3729, 2987, -15255, -22418, -3027, 15253, 8121, -5187, -10708, -18165, -25470, -14103, 943, -14395]
440a4395l0777l720K0397R462k410M555L553j1827k350K4790K0404j0290j9357
453a1965l513K773M00Q174P421j5196k4013K354K3244R390n525j931r37o226O851
468h699K6487J3484j6300j6171N501J0242k04J827J871j7657k1471M500K2528
481E938O521j1713o190J417J666Q018J7807O935j5619j4938L105J0330M855j74
495A7958q727j9856j2591J0827J6452l083j5990q297P34N106J2573J4250k832
508F524j7028o628J2562J1324j959q185r939j4324n410J1057J1531o738j4669
521c1882n138N233Q037J1336Q489n674j4148n88J6160J2730j030p853j0079r648
535b4055J123J4680P735j3450j8198q1J3063J1128P064M582m986q707M332J8756
$$ y = [-14395, -45172, -48892, -28495, -19033, -21443, -16888, -13335, -25162, -27512, -2722, 17682, 7392, -11965, -15478, -12705, -12305, -4131, 3290, -11906, -35919, -33565, -10321, -931, -6456, -8387, -9324, -15550, -8699, 17788, 31272, 14972, -1199, 4302, 14544, 14340, 16167, 18038, 381, -21090, -16590, 5938, 12459, 746, -5444, -4027, -2361, 5657, 23464, 30399, 14780, -158, 2947, 13277, 18132, 17958, 9231, -10625, -23216, -12389, 4063, 980, -15010, -23307, -22573, -17467, -4894, 9356, 6524, -10504, -17132, -4570, 6754, 4795, -3390, -13329, -27653, -33063, -22006, -10475, -17213, -31882, -37020, -31787, -23750, -12414, -3925, -9599, -23747, -24335, -8175, 4555, 3525, -4328, -14407, -24055, -22932, -8252, -517, -13967, -32165, -32246, -19183, -8055, -991, 3591, -1395, -10102, -5770, 12986]
549A2986J3181o504j4849q313J899P775P245j693j1124j0732o35R138J1242N806
563A5422m038j0660k477J2872J6693N410q863j1808o452K871R262L752r736j7007
577d759q937N352J0996O431j935q198o880L589J2675J0719m5j0434j0866k725
591e017P982R804j183j4870j5413l168P094Q169K236n860r887l912R609J7177
605B761Q261n859r941m662M240R142O153n469j4768j1250J939J1039P761j594
619b247r441p876L370J4136J1985J111n272m110k72N607J1955O715r451j7370
633a160n493R321Q294k84n118p317p166N425J8190J1783o867j0404N95P102N879
648B2780O321J164j1956j5526O92J2725M987q465q670n732m550N291J5885O002
$$ y = [12986, 26167, 19663, 4814, -3499, -1600, 6175, 13420, 11727, 603, -10129, -10764, -1626, 9616, 15422, 11384, 724, -1753, 11119, 27812, 33222, 24359, 12551, 6099, 8970, 18232, 21984, 12248, -4759, -13696, -8344, 2652, 9083, 7148, -1050, -7930, -4341, 8334, 19053, 19008, 8574, -2292, -5017, 2965, 12769, 11586, -3284, -18697, -21865, -14771, -6602, -4366, -10226, -20113, -24025, -14416, 2761, 11022, 5163, -4778, -9440, -5200, 3942, 10095, 4626, -10142, -21392, -19453, -8414, -653, -2247, -11688, -19564, -16194, -2058, 9927, 11038, 5766, 1656, 1384, 6991, 18946, 25661, 16210, -1160, -6653, 2668, 10962, 10678, 5560, -1757, -8923, -3498, 14692, 26475, 19608, 9204, 9799, 16901, 22780, 29101, 30265, 18309, 2783, 3475, 16200, 21187, 12722, 4052, -1680, -6230, -939, 14946, 20948]
662B0948j2416j1111N614J1841N468J532k832j2536j2423M616J2714j55j3191
675a931j0954l108O70P546J2383R21j4669r869R909J6026M224l810n906q925m472
690a1965Q954J1186l889j5266r252K34L451P541Q804k983j3844l313J6096J4641
704A0395R73m080m489o837q67J2908R798j0391j7470k373P033L419L606N334n299
719A660j4243J071K0472J2413o033p738O19n19R76J0579O316j2864j8305p49J0255
734C910L482k147j301o537q375N788J7588P281r787q265Q17K240L912Q871N95
749A8072j6715j5338N454J2609O1q344n684n249n182P220J6409M061j3095q930
763a4651N668R268M858K997m322j4678j0565Q089J3166j733j0884p616k685R17
$$ y = [20948, 8532, -2579, 3035, 14876, 20344, 21876, 19044, 6508, -5915, -1299, 11415, 11260, -1931, -12885, -15993, -15323, -7777, 4606, 5527, -9142, -19011, -9102, 6924, 11148, 7338, 1432, -7493, -11965, -3011, 8175, 4286, -10980, -20232, -19998, -16547, -9006, -202, -3185, -17029, -20342, -4246, 10395, 11368, 7288, 2799, -4038, -4905, 8003, 17801, 7410, -10060, -12433, -5400, -1981, 1625, 6959, 1660, -12583, -11512, 8960, 21373, 15340, 7602, 8221, 7702, 8678, 19257, 25573, 12709, -5596, -6345, 3910, 7392, 5245, 3944, -2593, -10968, -5180, 12408, 19689, 9902, 1637, 2454, 4694, 8606, 17477, 18072, 1357, -13981, -8527, 4082, 4143, -4201, -9885, -15134, -20316, -13096, 3313, 7374, -5721, -14651, -8983, 285, 5143, 8140, 3818, -10860, -21425, -13336, -170, -1903, -12787, -20403, -23088, -22171]
777b2171J0489J2737k212j4139l593J0858R698L080J699l798j3215m606J2246
790b927J1828o990j3972m262J599K218Q445J0385m189j3508j43J4230J0686N6
804A3456k246n445q615J53J2684P394r973j3752l159L878N048O276K961r161j1336
819a1837N176J6455P914m564o124l560k720L521R569J713j3338j3365j423P928
833d655N326J099l768q965n188Q085J3986L685o889o628j577O81O509P993k524
848G170j4758j0758L994R032K689k676n419q217k392J1521J4454Q63j0455n785
862a0737L334O415O608M134o133j3423n886P810R278O88o100p154n307L244J3399
877A70R787m284j0128j736P206Q148N459J222q152j1373j010R613P068m111q681
$$ y = [-22171, -11682, 1055, -1157, -15296, -18889, -8031, 1667, 4747, 6446, 2648, -10567, -15173, -2927, 8901, 1911, -12061, -16323, -14724, -12506, -4061, 6324, 2135, -11373, -11516, 2714, 13400, 13456, 11210, 5765, -2850, -2697, 9987, 17381, 7408, -6344, -9503, -5625, -577, 5699, 8660, -501, -11837, -6661, 9794, 17708, 13144, 7020, 3460, 740, 4261, 13830, 15543, 2205, -11160, -12583, -4655, 671, 1770, -1998, -10963, -16151, -8066, 5920, 9605, 2716, -3912, -5489, -4808, 1701, 9694, 7170, -7588, -18346, -14352, -5320, -2631, -5307, -10726, -18943, -21335, -9814, 4640, 5503, -4952, -10737, -7403, -988, 5620, 9754, 3621, -9802, -15688, -7878, 1400, 2088, -4012, -11166, -16473, -13229, 170, 9957, 5673, -4455, -6191, 1015, 9163, 14622, 15844, 7692, -3681, -4691, 4922, 11990, 7879, -802]
892h02o445r94N809J0204N385n682r408r42R237J0420L020o184r703n019L835
907B731Q159K099o232r478o746J189Q641Q184j951r570n920M738J0792O521j125
922A2032o870p916j448O607O944k040r636q995j819M607P258L004n126q252j884
937a3534P170J0351M537k987p800n276L244R279M476n721r499o228N13O651O902
952B078M70q523q267K446J1648R272J193o052p004j030P845R482N60q632r361
967c875k556L525P348M449m750j0758l456P171J0321M140j754n235m434J649R099
982A0884P094l736r700n988L52L788M546J366p041j0465j195R153R149M17m563
997D061m971k280M709R399M244p466j0437k772L648M702K080k903q946q131L277
$$ y = [-802, -7247, -8241, -2432, 7772, 13157, 7475, -1933, -2875, 6362, 16782, 19802, 13618, 3915, -1104, 2731, 10890, 12989, 6757, -2721, -9467, -8278, 363, 8547, 6596, -2974, -8894, -4156, 6636, 13157, 12032, 5162, -2754, -4202, 2405, 9349, 7309, -2327, -11322, -13141, -8534, -1276, 1728, -3398, -11650, -13534, -6364, 3987, 8524, 5537, -2263, -7539, -4295, 4984, 9460, 3739, -5760, -11988, -11475, -4824, 2078, 2548, -5975, -14242, -11796, -148, 9124, 10317, 4265, -2739, -3769, 4076, 13558, 14118, 5486, -3875, -6431, -2906, 4442, 8891, 4141, -6617, -10073, -2902, 7419, 11559, 9805, 4570, 136, 1785, 10884, 17978, 14242, 4542, -1446, -1094, 2694, 7240, 8606, 1565, -8900, -10095, -942, 8207, 8624, 4061, -910, -3190, 1519, 10918, 15162, 7696, -2741, -5513, -1865, 2837, 4917, 2014, -6932, -15063, -11786]
1012a1786J0847N711m527o696k400K834O760P820R37r242q428J256P030L832j694
1027B254n641p769m305O095J0737J617p042n678J577M353O982O525j233j0111
1041a639n712O038Q847L25m606n242n995k506P168J0122j210j0570m287N182P086
1056C001N129L618l417r252k665Q355Q797k938p858n143l004R20P168N413n394
1071B730j0128j677P685O867K250m63m150o113P93R094N536m921q935l951o29
1086f012K659N476J745p207r554J086R127O333j3k979m707l381M629J0141K829
1101A0172q711q757p12K989L946L173k354r185o645N865J0398K834l970l093j891
1116e941l55O486R263l37r714o918L214N412J660k3l174q068m276P580R538N30
$$ y = [-11786, -939, 4772, 245, -6451, -8851, -6017, 743, 8563, 9500, 258, -8170, -6914, 116, 3948, 2254, -3387, -11156, -15461, -9366, 1371, 2988, -4054, -9732, -8155, -3802, 3180, 9705, 8472, -1639, -7351, -1313, 7534, 7859, 3253, -1989, -7984, -10490, -3322, 6800, 5590, -4980, -9267, -4085, 3001, 8130, 11748, 8331, -921, -3586, 4769, 13566, 10628, 2770, -2373, -5377, -4457, 2711, 8124, 2730, -7398, -9075, -1390, 5477, 7727, 7264, 3114, -2999, -2206, 6888, 12424, 7503, -1432, -5383, -6012, -3353, 2123, 3868, -3339, -12893, -11807, -2680, 3653, 3640, 661, -4046, -7427, -2798, 7343, 10172, 1461, -7296, -8008, -5019, -1073, 2100, -254, -9439, -16084, -10219, 179, 3013, -957, -4050, -5941, -6296, 190, 9453, 9116, -598, -7516, -4302, 1110, 2770, 2747, -427, -8495, -12771, -5191, 4347, 4877]
1132D877o122k767M26K327O514P149k720j0461m638N922O732M19l693n036o422
1147g493n47P856P530k654p535k906K765M942O669L074o216q891m66P889N153
1162I170k727n878n129l372J514Q116L846n997p731l62N790N647L516o06n998
1177b01o085K921Q079L182m827o449l505j226L588O170J169p788o938K144P386
1192b380N365J485j917o465l158N661R249Q68p849o096j138J909M038M030j612
1207A990q538m846N354Q609L348k363m025l333Q85O701O818j808p754n007J265
1222b704L604L597L89m248p513j354O076P415J067l531m800j563L551P765L929
1237A1680m658q154l215L722M713K446k303o995n704J696O684N405j546n243m579
$$ y = [4877, -1245, -4012, -3586, -1259, 5255, 12404, 9684, -777, -5415, 507, 7239, 7658, 3965, -1071, -7493, -8040, -184, 7346, 4692, -2843, -5749, -2984, 1958, 8627, 11701, 5485, -3406, -3872, 4017, 9170, 6443, 565, -4564, -7936, -6422, 1694, 5540, -457, -8188, -8550, -2760, 2887, 6403, 5797, -201, -6286, -3365, 4714, 7896, 3069, -3380, -6885, -8111, -4523, 1647, 2816, -4972, -11910, -9766, -2380, 2985, 4470, 2553, -3912, -7070, -1409, 7840, 8708, 859, -5237, -6375, -4466, -428, 3602, 1990, -6548, -11394, -6040, 2569, 5917, 3554, -471, -3804, -2919, 3782, 10600, 8792, 1038, -3969, -2704, 900, 4497, 4886, 638, -6875, -8229, -2153, 5262, 6329, 2798, -2002, -3565, -14, 7751, 11680, 7022, -1132, -4347, -625, 4088, 6534, 4231, -2764, -8468, -6772, -88, 5317, 3771, -1472, -6051]
1252f051J063O850P005K56p140o360R70M926L120k9m030o713l236L668P331K620
1268D250m917n688r63M155O028M392k328o454l643K752O038K721k672n470m983
1283f782o71M741O104n88n592m615L99O147O742K272n185o245m27N411N645J84
1299G540m261o338l103K698O436K925m176o456k061K972O384M910j449n937l850
1314c766L093N962L564j714n213n820j121N086N285p13o050m709J95M039N573
1329C691K786k834o320k399M534P128J908m275n565l462J967M886L486l243o959
1344d671l902K507N289M233R7m460n223J416P151N177j210o075l889o66L215M662
1360C651J212n222o721q51M994M921J327k592m702k438L543P356L079l683n040
$$ y = [-6051, -4988, 1862, 8867, 9123, 1983, -4377, -3407, 1519, 4639, 4610, 580, -6133, -9369, -5701, 1630, 4250, -667, -6355, -7318, -3163, 2865, 7257, 4929, -1525, -5168, -2416, 3622, 6343, 3671, -1799, -6782, -7453, -2712, 3392, 2804, -2788, -7403, -7004, -857, 5885, 8157, 2972, -3273, -3700, 1711, 7356, 7540, 3279, -3059, -6162, -3464, 2972, 5897, 1721, -4735, -6796, -3824, 2560, 7470, 6021, 84, -3766, -673, 5289, 8853, 7139, 1926, -3894, -5015, 71, 5356, 4643, -1407, -6116, -5921, -1882, 3691, 6477, 3643, -2677, -5076, -542, 6586, 8494, 4219, -1346, -4808, -2841, 2045, 5531, 2288, -4671, -8573, -6066, -777, 3456, 3553, -907, -6130, -4714, 2437, 7614, 6404, 329, -3560, -4226, -1011, 3651, 4863, -359, -7080, -7931, -2937, 1984, 3311, 719, -3983, -6421, -2878, 4478, 7557, 3874, -1166]
1375a166j784J411L537L959p93p191o093K191O100L301p55l576m053j183O097
1390BP957p1o551m657Q58L589L901J619k938p146l986M509O622O51l786m756j811
1407e994J710O200N242k080o554k770L063N011K223j255m039n821j384N136N218
1422C906j021m932l800j66L050N795L398m007o729q71N352N157N50k742m830l993
1438e883J268O374L104m170o425j476K214M041M441Q94m953n449K118P419L327
1453F844k841l736l326j855L053O048J281o802n654J070M208K984J979j351n020
1468c118l313M542P311J720m401l748j821N31L862L910j453p108m522K848N191
1483D31K638n69l093m108m65N869O246q16n702l634j66L041M298K149m020p312
$$ y = [-1166, -2950, -1539, 1998, 5957, 5164, -2027, -8120, -5929, 171, 3472, 2717, -859, -4912, -6095, 2, 7959, 7888, 1337, -3320, -2462, 1127, 5028, 6647, 3709, -3437, -7423, -2914, 3708, 4359, 573, -4183, -5994, -4284, 1916, 7158, 5078, -1476, -4246, -1183, 3828, 6051, 4796, 757, -5064, -6448, -1312, 3906, 2885, -2047, -5847, -6013, -2963, 2832, 6230, 2223, -4506, -5377, -25, 5132, 5682, 2940, -1890, -5883, -4615, 1759, 4863, 693, -5732, -7208, -4994, -953, 3488, 4382, -571, -6020, -3902, 3517, 6844, 4003, 267, -3059, -4914, -1861, 4187, 5468, -1334, -6988, -5918, -1710, 1274, 3253, 1902, -3118, -6431, -1889, 5422, 7142, 2741, -1007, -2828, -2297, 1565, 5475, 4022, -3086, -7608, -4760, 431, 3069, 2500, -593, -4701, -5166, 703, 6949, 6133, 431, -3203, -3369, -328, 3970, 6119, 2099, -5213]
1499e213k058M821N133N59l507l678k078K070O571M177k820n793k345K663L847
1514B349K476p65m820n379k5O033L869j344m227k899p66L087O058K309m882n054
1530c980O75M060L664J210j945n852m011K504O237J920m133m647j112J319M522
1545D31M466r2n514m242K685N582K723j810l668l909o63L907M559k16m898m410
1561e069q8L579M075J919k579n082j396M431N332J374l160m056l292J593N083
1576B664K763l002n635l314K488M450L378Q5m169m544R71N869M282p97m785l503
1592b799l26L410M260J241m767n692j297M059M491J066k288m040k878L375O226
1607D041L049k994n005k354J650M033K849j113n313m323J595M702K691n43l567
$$ y = [-5213, -7271, -2450, 2683, 3242, -265, -3943, -6021, -3951, 2620, 6797, 3977, -1816, -4161, -1498, 2349, 4825, 4060, -760, -6139, -6164, -131, 3738, 2394, -1833, -4732, -5498, -2411, 3647, 5956, 1074, -3980, -3305, 755, 4419, 5629, 3684, -2168, -6179, -3675, 2562, 4482, 349, -4298, -5410, -4091, 431, 4897, 4805, -709, -4951, -2266, 3316, 6039, 4229, 561, -3348, -4011, -104, 4455, 4239, -659, -5069, -5157, -1578, 2497, 4416, 1837, -3245, -4641, -210, 5122, 6496, 3336, -720, -4012, -2419, 2664, 5427, 2425, -3210, -6524, -4036, 414, 3792, 3877, -292, -4836, -3865, 2004, 6286, 5489, 704, -2799, -3125, 285, 4545, 5786, 1019, -4673, -5970, -1911, 2580, 3646, 1358, -2682, -5560, -2185, 4041, 7090, 4096, -909, -3263, -1613, 2420, 5269, 4156, -1157, -5480, -3885, 817, 3508, 2965, -602]
1622f02l786o23M906M551Q48l618m120o39L365M204J656l740n649j886K860M335
1638B062J564k484m255k532K049N888L012j801m600k938J754M222L345q79m688
1653b81m108J80M360L722n27m199m042q28L965N176J329l527m602m14L483M305
1669C992J670k338n456k761K176N045K219k708m589k683J380M564L911m71n254
1684a303l467J288N102L444l92l600m126o75L818M091j79l846m148j445K397M813
1700A772K545k959m772j212L402M460J435j257m314l617J282N066L096k324m802
1715b199k481O70L319L721J32m476m275P81M827L865k48k741l521j568L141M989
1731C936J026m915m779k47K623L190K241j611m381l003K735N386K486k251l823
$$ y = [-602, -4388, -5011, -105, 4446, 5294, 1676, -2444, -3083, 282, 4486, 6142, 2402, -3247, -5133, -2273, 2062, 3626, 1142, -3113, -5645, -3596, 2292, 5304, 3503, -1097, -4035, -2281, 1941, 5286, 4407, -281, -4389, -4209, 151, 3873, 3346, -853, -4895, -5723, -1758, 3418, 4747, 1220, -3382, -3796, -313, 3992, 5662, 3324, -2132, -4893, -2717, 2328, 4547, 1839, -2750, -5433, -4053, 511, 4422, 3951, -1303, -4770, -3482, 1620, 5064, 4672, 1072, -3054, -3729, 89, 4180, 4001, 155, -3993, -5438, -3041, 1772, 4317, 1358, -3414, -4626, -1224, 3236, 4671, 3414, -900, -4517, -3235, 1831, 4927, 2603, -2199, -4680, -4010, -691, 3030, 3162, -1314, -5589, -4808, 19, 3884, 3636, 895, -2626, -4194, -1053, 3936, 4962, 47, -4732, -4979, -2356, 834, 3075, 1464, -2917, -5920, -3185, 2201, 4687, 2436, -1387]
1746a387k587Q57M440L490q13n174l457J085L590K662k87k795m338r72M396M998
1762C708O81l729l037r46K498M014K302k855n087k478L129L801J338j200l976
1777a837l034P82M947L989j932m460k145J037L322L474P37l933n161M43M229L007
1793C465o11l307l229j419K342N217K153l598m172o34K639L534J749j206m263
1808a340l666K207M988K445k684m034k120O20L205L570J4m402l581J150M156L282
1824C810L28k504l748j951L567M444M40m254l504n35J834L528K322j767m440k164
1840d594K552M533J676j423l298k411M28M480L522j613m780k768J122L006K322
1855B754P67l035m629K7M382M170K55l266k940j310J927M445J596k831n055j380
$$ y = [-1387, -3974, -3117, 1323, 4813, 4000, -1174, -4631, -3546, 44, 2706, 2419, -376, -4714, -5686, -1290, 3708, 4389, 660, -2377, -3323, -825, 3189, 5491, 2636, -2451, -4929, -1800, 2001, 3339, 2139, -1837, -4871, -4089, 858, 4847, 2915, -1545, -3690, -2653, 669, 4143, 4880, 947, -4214, -3771, 458, 3465, 2854, -453, -3682, -5101, -2759, 2458, 4611, 1013, -3159, -3793, -1154, 2380, 4129, 2923, -1340, -5006, -2799, 2189, 4634, 1950, -2084, -4204, -3584, -379, 3191, 3205, -1197, -4778, -3628, 528, 3810, 4138, 1634, -2114, -4065, -498, 3946, 4386, 132, -3372, -3907, -2073, 1455, 3777, 2010, -2430, -4594, -2042, 2491, 4167, 2744, -554, -2965, -2537, 1943, 5465, 3852, -928, -3696, -2574, 432, 2754, 3521, 486, -4143, -4116, 266, 4436, 4691, 1425, -1515, -2825, -898, 3547, 5143, 2312, -2743, -4123]
1871d123K857L455J549j210l801l087Q43N469K694k375l468j627M78L379L341
1886D374j3l795m299K88L446K787L30k862l616r45K719M664J070l068l627r05
1902c452K203L667K073j480m374k765J991M095J917j820l166l007M68M127L232
1917C709o75l922k517R48L296L311L83l171m314o00L497L652q5l334k419j255
1933c496K005L771J971j912m981j313K622L585K119j429l490k858J296M568K335
1948D793j929l637k418j06K988L109M53l559l331J2L557L548K8k583l479r20K163
1965a311M143J170l005l596j200J757L615J562j783l442k491J886L369K522q78
1980B318l289k769P91M000K847j165l442l015J73K694L218N64l117l804l22L373
$$ y = [-4123, -1266, 2189, 3738, 2528, -1273, -4360, -3517, 1952, 4646, 2271, -1197, -2824, -2346, 1033, 4374, 4361, 566, -3733, -3445, 1, 2788, 3118, 256, -3360, -4305, -1586, 3078, 4148, 1080, -2547, -3452, -1249, 2418, 4491, 3011, -1363, -4128, -2137, 1958, 3875, 2055, -1111, -4118, -3650, 477, 3709, 3034, -888, -3405, -2457, 839, 4150, 4533, 1362, -2952, -3552, -55, 3597, 3512, 178, -2241, -3496, -1491, 2280, 4251, 2339, -2642, -3955, -1333, 2252, 4371, 2942, -548, -3406, -2110, 2458, 4793, 2864, -773, -3191, -3297, -309, 2800, 3253, -306, -3637, -3625, -68, 3480, 3508, 925, -2554, -3474, -1311, 2832, 4002, 997, -2599, -3799, -2042, 1573, 3135, 1352, -2090, -4581, -2695, 674, 3196, 2318, -971, -3740, -2949, 1051, 3898, 2733, -709, -3724, -3551, -857, 2361, 2925, -192, -3996, -4318, -945]
1996i45L634N99k886k896j192K134L518K063k117m104j714K270L056K123j723
2011A820l809k525J442L432K576m20l174k382L43K946L245J25l402l285m04L099
2027c73K952P58k790l389j280K449L766J157k352l033j568J762L314K605j462
2042B516l994k267J949K684K149r24l033l040m54L837L495m15l291k875O19K566
2058d78L332P16l281l446o6K572K854J061k379k663k161J324M130J858k348l612
2074b587j520J879L398K161p85l034k884P93L670K321q70l186k339k41K446L984
2090C206M04l408l428J61K608L026O66j919l274j428K614L656R26k133l076j408
2106b807Q27L073K797j404m261k311J942L222K178n95k369k712n25L909K993q51
$$ y = [-945, 2689, 3288, 402, -2494, -3686, -1552, 1966, 4029, 1912, -2192, -3906, -1636, 1420, 3543, 1820, -1989, -4514, -3072, 360, 2936, 2516, -658, -3040, -2697, 249, 3494, 3619, 217, -3068, -3472, -373, 2579, 3337, 547, -2842, -4122, -1673, 2093, 3250, 898, -2135, -3703, -1941, 1373, 3978, 2516, -1478, -3745, -1796, 888, 3037, 2113, -920, -3960, -4414, -577, 2918, 2503, -788, -3663, -3044, -478, 2854, 3570, 289, -3157, -3223, -651, 2203, 3264, 885, -1778, -3939, -2615, 1515, 3373, 1025, -2587, -4107, -2228, 1170, 3331, 2546, -488, -3372, -2579, 1091, 3412, 2542, -644, -2983, -3224, -778, 3206, 3610, 202, -3226, -3065, -457, 2569, 3235, 1316, -1958, -3386, -772, 2884, 3810, 1677, -1399, -2807, -1980, 1093, 3890, 2486, -1775, -4086, -2144, 1078, 3256, 2661, 292, -2420, -2945, 964, 3957, 3106]
2122C106l103k961M43K137K909Q78k429m072p98K987L007Q13j891k581j867J657
2138a765L719K414j982l992j370J353K703J844n7l405l267Q42L477L005j116k847
2154d44k080r2K305L381M60k812l407n1K591K727O79j552l346j677J873L522J404
2171C481k144l308p06J065L009K292p26l272k606J057L343J779n28k524l299P0
2187c017L183L275k64l275k664K81K347K159J397j979l455j111K617L174Q98j985
2203A581l157j481Q95L566K118j665l573j456J693K571J836o02k424k979Q8L484
2219D95K909n04l061k051p91K380K918J031l028l228m19K207K820R64j456k844
2235a658j422J782L242J724j657l494j364R11K880J878n56l179k705J188L261
$$ y = [3106, 3, -2958, -2515, -378, 2531, 3409, 980, -3092, -3890, -903, 2104, 2917, 1026, -1555, -3422, -1765, 1954, 4368, 2386, -1606, -2976, -1623, 1080, 2924, 2867, -538, -3805, -2963, 514, 3519, 2403, -444, -2524, -2616, -311, 3070, 3530, 718, -2689, -2740, -149, 2578, 3257, 1705, -1641, -3318, -1445, 2077, 3481, 1337, -1971, -2677, -1612, 1397, 3689, 2963, -309, -2915, -1858, 1485, 3264, 2736, 212, -3087, -3017, 166, 3441, 3177, -98, -2762, -2481, -134, 2025, 3422, 1443, -2012, -3123, -506, 2668, 3566, 1581, -1576, -3057, -2162, 1404, 3522, 1857, -1716, -3172, -1479, 1092, 2928, 2326, -98, -3077, -2989, 495, 3404, 2900, -161, -2212, -3003, -623, 2295, 3326, 298, -2930, -3349, -1142, 1678, 2642, 1186, -1658, -3080, -1298, 1944, 3668, 2011, -1483, -2847, -1936, 944, 2822, 2266, -913, -3618, -2430, 831]
2250H31J928l73k618k339m40K782K986K34k773k765J7K027K760O25j494l743j195
2267c550J782L586J151j991k495j086Q67K951K242j243l463k006R57L054J972
2282B728o05k575k744K43L313K440m80k720k207k74K238K957N10k325k682o94
2298b877K052L064R09k001k952j761J662L239J366j263l277j696J348K834K267
2313B914p35l243k024O56K581K222J3k904k300k53K787K641J94k479k787l86K095
2330a008L010P62j598k992j486K201L263Q38j901k667j554Q89K911K228o21l316
2346a041j955J066K538K250n82k206k856Q0K883K568k20k527k153j6J670K715
2362B214O97k294k852p63J940K689J170j248k986j595J513L193J412j292k971
$$ y = [831, 2759, 2386, -232, -2571, -3011, -229, 2757, 2991, 218, -2547, -2530, -503, 2257, 2882, 1388, -2355, -3550, -1768, 1818, 2969, 978, -1517, -2603, -1736, 1215, 3457, 2214, -1249, -3255, -2298, 756, 2728, 2123, -452, -3196, -2953, 360, 2800, 2320, -400, -2607, -2881, -643, 2314, 2824, 499, -2183, -2877, -825, 2239, 3148, 1147, -1805, -3566, -1904, 1335, 2701, 1438, -1839, -3535, -2187, 647, 2914, 2179, -1064, -3088, -2432, 149, 2371, 2384, -520, -2820, -3073, -286, 2355, 2549, 70, -2717, -3103, -1008, 2002, 2764, 1166, -1826, -3312, -1111, 2152, 2990, 1089, -1578, -3132, -2243, 668, 2896, 2275, -1041, -2996, -1930, 608, 2858, 2276, 70, -2786, -2706, 177, 2745, 2525, -2, -2155, -2171, -501, 2214, 2911, 617, -2235, -2998, -1058, 1631, 2801, 1553, -1433, -3028, -1515, 1678, 3090, 1798, -1173]
2377a173j980J072K980J955l93k885k481O78K592J936j59k036k593l16K508K921
2393B626Q7k474k367m19J825K465J235j886k905j269J837K828J053j124k624j597
2409b709Q12L055J735q18l004j973R27K487K574o03k432k472k5K730K380q8k255
2426C21k466n62J975L068Q48k197k808q60J949K579R42j346k570j786J311L001
2442A399J675q60k817j763N60K413K308n30l002k109P66K490J870O9j881k584
2458a996q84K341K616O38k356k249p95J773K668J183j445l161j572J790L228O82
2474B461q01k432j647O03K656K029o39k764k244O25K426J925K06k418k508J15
2490b407K081K956k41j920k272r59K067K848R04k485k320q57J707K503J163j519
$$ y = [-1173, -3153, -2081, 899, 2854, 2461, -424, -2905, -2227, 365, 2301, 2142, 106, -2487, -2803, -295, 2626, 2713, 239, -2128, -2547, -722, 1743, 2978, 1092, -1813, -3082, -1245, 1583, 2636, 1512, -1112, -2709, -1897, 1158, 2893, 2075, -929, -2902, -1975, 512, 3086, 2483, 51, -2421, -2446, 284, 2664, 2576, 321, -2145, -2707, -732, 2336, 3184, 987, -1821, -2681, -732, 1847, 2789, 1443, -1127, -2913, -1602, 1399, 3074, 2214, -603, -2366, -1806, 607, 2915, 2385, -617, -2726, -1960, 530, 2400, 2469, 588, -1996, -2880, -539, 2077, 2715, 359, -1890, -2685, -912, 1756, 2939, 1494, -1667, -3239, -1449, 1779, 2461, 1660, -772, -2419, -1816, 840, 2869, 2230, -534, -2778, -2153, 273, 2198, 2404, -14, -2522, -2407, -326, 2630, 2389, 469, -1803, -2762, -695, 2153, 3057, 572, -1748, -2605, -898, 1605, 2768, 1249]
2506A249k357j681J219K956J213q81k432j667L97K238K477n25k467k407L62K410
2522A04J834K15j966k057q32K088K729Q35k294k476q79J596K198J529j155k762
2538a293j624J519K777J127r45k374j744M67K343K578q03k719j902N25K488J556
2554A976K01k154j922o81K249K561P3k019k077q46J834K553O91j506k468j018
2570b553J264K258J172o07k414j673L69K991J877r09k470j907N12K083K336j46
2586B183k581k210L11J832K132O74j873k135p22J086L052R11j755k608o11J270
2602a044K502R56j025k777j427J119K810J369j143j997j425j48K513K101l8k765
2618d19j792Q3K280J690M78k114k044n63J569L066L86j924k406p56J543K201J238
$$ y = [1249, -1108, -2789, -1570, 1386, 2599, 1718, -714, -2381, -1984, 254, 2731, 2206, -261, -2668, -2306, 104, 1938, 2153, 187, -1870, -2702, -614, 2115, 2950, 656, -1820, -2699, -1103, 1095, 2624, 1469, -1293, -2917, -1398, 1379, 2506, 1561, -813, -2557, -2090, 253, 2831, 2028, -691, -2593, -2068, 420, 1976, 2177, 23, -1899, -2580, -331, 2230, 2303, 284, -1793, -2639, -805, 1748, 2439, 933, -1535, -2553, -1289, 969, 2141, 1534, -880, -2553, -2184, 807, 2684, 1775, -695, -2602, -2090, -7, 2329, 2183, -398, -2608, -2297, -465, 1667, 2341, 468, -1667, -2389, -1303, 1749, 2660, 905, -1703, -2314, -1044, 1458, 2414, 1389, -1388, -2815, -1696, 1114, 2483, 1340, -657, -2082, -2230, 283, 2384, 2346, -419, -2211, -2128, 152, 1842, 2320, 206, -1838, -2401, -832, 2234, 2620, 696, -1710, -2466, -923, 1278, 2516]
2635B516j253k688r33J292K075J439q73k368j763P57K736J619q73k125j631J82
2651a891K144J487O18k344k215Q3J991J939M44j489k399p76J636K528P31j599
2667H88k286j159J401K386J042q33k288j744J121K418J602r44j977j890L83K152
2683B72K252k94k361j884o0J914J921L79j632k002n85J732K060P17j416k299r05
2700b191J071K858N78j188j928j564R04K238J461o94k023j747M06K387J863n55
2716A876j939j551m41J942K274%j689k346k11J641K117L38j458j888j043J505
2732h73K560O57j119k300r90N50K438J488p76k738j395R06K186J695p72j934j789
2749b206M65J645K390j35k064j994k52J600K464J65j677k223k36J581K068M38
$$ y = [2516, 1263, -1425, -2358, -1066, 1009, 2448, 1575, -793, -2556, -1799, 937, 2556, 1683, -442, -2073, -1891, 253, 1740, 2358, 14, -2201, -2118, -127, 1812, 2256, 767, -1632, -2408, -772, 1756, 2487, 888, -1398, -2557, -1156, 1230, 2272, 1439, -849, -2593, -1472, 946, 2548, 1604, -373, -2263, -1880, 272, 2524, 2230, -131, -2015, -2075, -161, 1760, 2139, 507, -1495, -2080, -348, 1712, 2429, 1013, -1286, -2191, -1120, 1738, 2316, 1128, -800, -2364, -1460, 778, 2239, 1545, -478, -2225, -1819, 568, 2431, 1876, -63, -1614, -2055, -113, 2161, 2161, 472, -1874, -2085, -444, 1673, 2011, 553, -1335, -2378, -873, 1687, 2344, 1225, -1075, -2065, -1515, 923, 2411, 1635, -1103, -2498, -1592, 594, 2289, 1517, -417, -2206, -1741, -96, 2294, 2159, 95, -1899, -2151, -551, 1913, 2078, 401, -1822, -2058, -477, 1591, 2029]
2765B029j432j749r33Q65K263J525j194k194j448Q75K088J566l99k608j490N48
2781a688K277J612l99j881j995J93J494J958L75j560k028o08K008J784O72j293
2797I21k088j046J508K316Q40j487k051j140O31K219J638p78k257j609J090K079
2813G86J235m17j917j334l23K019K237k39j657k292j06J719J979P04j650k452
2829a708n39J474J895Q27j064j902j007P06K123J770j169k172j371R45J691J201
2845A700j96j946j570L73J873J714M7j863j954k8J435K018N99j626k130m25J438
2862e41J891L43r13j805j396J278K037J330j167k265p59Q09J837J505j93k575
2878e84j189L99J815J306l12j573j794k5J593K409l55j478j824l04J345K036N74
$$ y = [2029, 597, -1152, -2085, -1220, 1043, 2568, 1374, -820, -2268, -1393, 695, 2261, 1862, -746, -2236, -1688, 589, 2201, 1802, -79, -2074, -1881, -387, 1571, 1946, 386, -1642, -2250, -242, 1542, 2214, 921, -1167, -2213, -705, 1611, 2451, 964, -1087, -2227, -1596, 623, 2261, 1483, -774, -2383, -1293, 786, 2021, 1604, -313, -1647, -1970, 49, 2286, 2047, 390, -1902, -2008, -289, 1690, 2394, 744, -1708, -2247, -773, 1122, 1949, 885, -1017, -2024, -1318, 805, 2575, 1406, -766, -2137, -1192, 499, 1700, 1504, -442, -2012, -1639, 234, 1948, 1995, 132, -1822, -1850, -415, 1603, 2202, 576, -1554, -1979, -541, 1350, 1693, 780, -1025, -2421, -1143, 894, 2224, 1057, -1208, -1967, -1158, 679, 2184, 1991, -584, -1773, -1374, 441, 1747, 1435, -138, -1932, -1957, -364, 2045, 1690, 212, -1612, -1916, -571, 1465, 2039]
2895B039j233k049o53J053K241N66q90k027j219Q43J797J797p67k327j504P23
2911a610K069J701o82j666j728J88J901J492J27j886j487mJ033J867P85j597k093
2928a590j69J509J823L40p97k035r05Q93J990J403j298j876j390N77J592J654
2944A721r1j777j751L4K174J706k75j602j558k23J485J957J51j574j820n13J255
2961g01J958N91j231j686r15J087K071O85q54j750j100N02J724J570n57k251j110
2978a967P45J490J667m15j929j208j97J878J255L98j440j767l23J501J637O07
2994A932j502j674o13J461J737Q22r55k322p50M62K343J145r64j586j431O80J584
3011C69J407j08j703j506J17J466J577pj597j459o41J524J956O16j689j865NQ89
$$ y = [2039, 806, -1243, -1896, -843, 1398, 1964, 1074, -953, -2172, -1329, 468, 2265, 1498, -829, -2333, -1610, 459, 2160, 1478, -188, -1916, -1728, 173, 1665, 1792, -94, -1581, -1585, -552, 1315, 2100, 503, -1590, -1759, -250, 1573, 1913, 1116, -919, -1824, -931, 1059, 2462, 1164, -712, -2102, -1525, 67, 1721, 1630, -147, -1898, -1864, 310, 2016, 1741, 139, -1419, -1642, -157, 1800, 1951, 377, -1443, -1956, -701, 1257, 1848, 617, -1069, -1984, -897, 1174, 1859, 1005, -745, -1845, -1343, 381, 1951, 1394, -857, -1967, -1222, 268, 1935, 1520, -409, -1617, -1814, 64, 1319, 1717, 277, -1490, -1813, -312, 1325, 1932, 430, -1244, -1857, -396, 1341, 2163, 1208, -1114, -1864, -1402, 941, 2086, 1122, -464, -1895, -1215, 369, 1776, 1668, -35, -1541, -1424, 42, 1619, 1612, 15, -1444, -2085, -561, 1395, 2011, 322, -1543, -1538, -649]
3029f49J897O95j059k021p40J217K014Q43j027j765j446J143J172J704m13k019
3045d54j510N19J463J532Oj397j847p3J739J514J30j423j495l71J217J740M05
3062A695p60j875j083J104J632J044p11j984q72R34J538J291o61j911j209N82
3078a246J679J036l5j539j536K7J929J237k41j333j467j59J258J640N01j432j468
3095a149n70J167J481P68q84j988r09J076J482J025m66j641j050N79J420J567
3111A908m70j364j434j75J740J317J56j640j667k97J715J643n7j444q32p08O33
3128i76J642Q76q79j451j142J234J549Q88q33j705q41O22J418J371p39j511j025
3145a502J23J630J298J16j661j613l5J720J203K81j820j132j81J138J527M10o81
$$ y = [-649, 1248, 1943, 884, -1137, -1877, -660, 1354, 2197, 1170, -595, -2041, -898, 274, 1978, 1565, -454, -1964, -1445, 18, 1550, 1556, 159, -1688, -1761, -22, 1492, 1622, 199, -1296, -1667, -450, 1290, 1695, 935, -940, -2023, -919, 713, 1757, 1046, -938, -1810, -876, 662, 1953, 1292, -619, -1828, -1246, 433, 1469, 1434, -105, -1641, -1614, 315, 1552, 1311, -22, -1489, -1648, -390, 1250, 1751, 319, -1149, -1719, -552, 929, 1697, 813, -1175, -2084, -1008, 474, 1499, 1033, -608, -1658, -1079, 341, 1908, 1438, 74, -1360, -1535, 205, 1522, 1678, 38, -1629, -1926, -211, 1432, 1375, -69, -901, -1609, -976, 666, 1542, 663, -788, -1930, -696, 853, 1741, 908, -797, -1638, -1016, 402, 1773, 1034, -477, -1502, -1379, 251, 1549, 1665, 4, -1609, -1644, 76, 1279, 1560, -260, -1392, -1573, -435, 1092, 1502, 821]
3162H21j850q05R15J883P26n76j785j018N92J744R96m24j858r08J68J531J226
3179A378n0j344j585l4J672J553Jj084j986j26J542J660K20j621r59o79P90J566
3197I14Q50j068j830p92Q78J757Q77n48j303j408M39J705J263l86j544j360K60
3214a296J197J559j86j093j606k38J423J193L70j178j388k35J269J130Q77j177
3230F21j437q88P51J720Q47n98j627p45K00J377J138k89j468j296K23J528J609
3247A666j25j644j354J27J302J365J43j165j559m77J382J320N81r28j513n50N38
3264h91J756Q82r68j920o54J308J214Q13o52j513r04K36J938R23j18j859j172
3281a581J08J463J327J32j503j346J1J328J335K74j173j288m41O20J547M19m30
$$ y = [821, -1029, -1834, -919, 964, 1690, 1114, -671, -1689, -1097, 647, 1643, 1219, -639, -1547, -1379, 152, 1378, 1328, -16, -1601, -1635, 37, 1590, 1591, 507, -1479, -1605, -63, 1597, 1817, 196, -763, -1442, -652, 914, 1764, 696, -1134, -1926, -1048, 709, 1586, 1038, -265, -1673, -1234, 471, 1734, 1348, -196, -1556, -1296, -99, 1460, 1274, 181, -1425, -1663, -240, 953, 1323, 145, -1243, -1478, -209, 921, 1798, 621, -816, -1704, -953, 767, 1614, 1016, -611, -1356, -1156, 221, 1359, 1070, -398, -1694, -1471, 57, 1666, 1541, -103, -1457, -1330, -28, 1337, 1480, 315, -1244, -1721, -339, 981, 1562, 634, -879, -1429, -891, 865, 1747, 779, -1141, -1795, -487, 727, 1540, 888, -625, -1529, -1293, 645, 1568, 1450, -409, -1581, -1473, -10, 1317, 1449, -54, -1400, -1389, -61, 1274, 1548, 375, -913, -1354, -734, 813, 1232, 802]
3298H02j930n33P96J369Q27l40j426j260O16J373J224l79j334j417K48J156J372
3315A164M6j075j501o7J417J159J77q73j606n81J131J713O65q40k011p25P22K037
3333I52N68r05j606l31M94J234Q28Oj573j114M15J091J509n8j444j586J98J236
3351h6J120K70r52j128q25J003J718L14q34j367o04P66J628K83m20j765m58N93
3369g44J328P48j57j549r85K12J298J367l51j386j052RJ398J098K98j239j172
3386h79m60J317J362q1m92j851m39R47J483N61q65j408n48N82J398R63o20j587
3404f17j057Q14J413R50r7j301j328J06J415J002m0j140j336L3R99J477K70j209
3422C54j372k17R14J571M76j195r33q37K40J691J058p86j580n37K55J511O96k32
$$ y = [802, -1128, -1661, -865, 504, 1331, 991, -435, -1695, -1079, 294, 1518, 1139, -195, -1612, -1364, -208, 1164, 1210, 135, -1366, -1433, -16, 1143, 1320, 447, -1159, -1740, -609, 1104, 1769, 929, -1082, -1807, -1085, 952, 1520, 615, -991, -1322, -828, 406, 1234, 1240, -333, -1447, -1032, 59, 1568, 1510, 66, -1520, -1322, -86, 1034, 1304, 352, -776, -1601, -598, 1120, 1434, 600, -767, -1371, -605, 1023, 1306, 886, -879, -1337, -744, 584, 1332, 1175, -374, -1359, -1147, 151, 1518, 1167, -219, -1271, -1262, 136, 1234, 1532, 293, -879, -1339, -22, 1340, 1259, 767, -1084, -1523, -576, 907, 1468, 603, -805, -1353, -771, 627, 1590, 970, -617, -1674, -860, 553, 1503, 1406, 105, -1223, -1117, 298, 1300, 1260, 120, -1216, -1183, -184, 1293, 1563, 354, -1018, -1235, -321, 1250, 1726, 531, -402, -1239, -999, 692, 1750, 964, -616, -1153, -898, 613, 1309, 1077]
3440A077j145j296O17J373J256p49q16j601K26R01J753k47j197r57n76J005J474
3457A098J83p20j433m33O15J791K05q32j113o82O85R78J068k84j532j091N66R50
3475A9Q60K26j263p13n58J331J765m19j111j531K98P60J242M88r94j261o31Q93
3493e99J152R63p88j268q37M93J337Q42m06j374q22M58J073Q69k5j244j011R1
3511a096J150J206Qj250j146j6Q00J241L51q13j364k15N74J254O16n72j612m72
3529a356Q54J070P14p25j185q42M42J615N97l07j126q81K70J017J207m95r25r43
3547i99j95O47J483K77j454q85j25P69J228K74r84j099n51Q78J430O57o31j418
3565f98p88Q40Q84R36n02j239r95N05J277Q56l48j033q71j00J116J185K3p63j334
$$ y = [1077, -68, -1364, -747, 626, 1882, 1133, 317, -1284, -1058, -157, 1596, 1349, 152, -805, -1381, -376, 1098, 1281, 561, -872, -1305, -690, 1101, 1306, 474, -639, -1321, -636, 342, 1410, 1126, -406, -1497, -931, 19, 879, 1105, -158, -871, -1429, -98, 1667, 1248, 137, -1394, -1096, -336, 906, 1394, 400, -861, -1492, -599, 553, 1516, 728, -540, -1377, -884, 453, 1295, 889, -485, -1307, -849, 224, 1093, 1068, -176, -1187, -1096, 54, 1260, 1268, 18, -1128, -1144, -344, 897, 1248, 435, -929, -1144, -570, 684, 1300, 728, -884, -1356, -502, 568, 1282, 557, -628, -1470, -1028, 587, 1184, 877, -249, -1130, -860, 157, 1364, 869, -56, -999, -1194, -547, 936, 1213, -241, -1126, -1251, -482, 746, 1020, 36, -1063, -1614, -736, 694, 1351, 720, -698, -1486, -646, 238, 1174, 672, -567, -1562, -1057, 220, 1076, 728, -305, -1176, -1276, -160, 1025, 1048, 285, -1049]
3584a049l20J129J139L03j108j398l31J255J355K55q28j241k87M24J508M84o94
3601E96r20j156O01J313Q33l56j039j082L19J009P71L62j368q52r7Q11J407J60
3619A312j052j028k90Q61J157O36j031j109p84O14J470N54p39j093r31O32J289
3636D68O58k55j142q79M07J019R16k13j103r15j27Q85J008K35o77j041l18O48
3654d26J323K55p75j155m62J000Q97P10q82p37n16KJ213P05m76q76r07K17Q34
3673e6J265j2j211j258K55J091J158k63n92j207l80J069J191M83j073r47o63P57
3691c93P39R12l62j320n47K56J574M82k23j250q16m8J318Q19k4j258j206M40R94
3710H7J077J38j066r88M2N75J318J60o47j382p36J171J096N56p66j300k83M50
$$ y = [-1049, -1369, -240, 899, 1202, 94, -1304, -1635, -380, 975, 1230, 402, -839, -1126, -702, 806, 1290, 596, -324, -1480, -879, 434, 1267, 911, -128, -1210, -891, 118, 889, 1251, -117, -969, -1066, -255, 1152, 1312, 260, -768, -1058, -197, 960, 1596, 565, -544, -1328, -714, 756, 1310, 571, -522, -1453, -821, 468, 1126, 871, -271, -1150, -743, 276, 1192, 979, -124, -1039, -1166, -281, 727, 962, 285, -756, -1074, -426, 897, 1152, 377, -778, -1240, -240, 657, 1367, 485, -252, -768, -766, 447, 1152, 676, -200, -1107, -890, -56, 1209, 1197, -14, -1272, -1017, 74, 1232, 969, 377, -830, -1210, -141, 1050, 1533, 460, -487, -1150, -393, 346, 1258, 896, -424, -971, -715, 859, 1341, 1118, -132, -948, -996, 322, 1141, 1117, -141, -1347, -907, 87, 1164, 1302, 236, -752, -710, -135, 1183, 1343, 696, -686, -1422, -251, 845, 1401, 635, -665, -948, -498]
3728d98J256N56q12r78n63M04J269P96n28j139o97q3J102J027k69j030q99N6Q62
3747a68J000J58r36p26m20P82J082K54l02j707j61P75R71M00l78q01j029O00J161
3766E55N63m00j083o53m2J368P47J06j012j176j00J276Q62M1p34j005m94Q95Q86
3785F00N14j054p08o15J019R58K95l58j259k74M9J563J63j74j227q36M71J322
3803D49P47m72r81r25K71R47Q64K3r66p34k71P83Q91K72o15r23n50N90J405J79
3823I84p85j034o59Q23J111N11n71p63j114N72J315J008o78j247m79j66J222R81
3841A031m3j281o01j18Q89P82L02n10j002p50Q52R93N86o79p81n30L91J189N25
3860A245m89j218m27J31J166O79l49j053p60j20J200J039j42r03q77M8O64J114
$$ y = [-498, 758, 1314, 502, -476, -1039, -635, 634, 1430, 902, -237, -934, -1017, 85, 1112, 843, -187, -1086, -1030, -168, 832, 990, 54, -672, -1092, -310, 772, 1026, 724, -983, -1144, -369, 602, 1002, 624, -177, -1206, -606, 555, 1118, 718, -365, -1018, -1060, 308, 1055, 1161, 149, -1027, -1127, 149, 1011, 1052, 318, -687, -1181, -286, 600, 1114, 60, -648, -1263, -244, 714, 1009, 651, -608, -882, -833, 730, 893, 719, -508, -1344, -873, 449, 1196, 724, -257, -1182, -911, 36, 900, 923, -43, -777, -1048, -265, 626, 898, 283, -640, -1190, -600, 805, 984, 199, -835, -1494, -671, 440, 951, 380, -383, -1497, -925, 390, 1398, 720, -527, -1006, -1172, 50, 1031, 988, -293, -894, -1012, -123, 659, 961, 451, -551, -1301, -449, 544, 1130, 451, -330, -860, -469, 720, 1245, 756, -462, -889, -758, 408, 1087, 738, -315, -1075, -1195, 5, 1044, 902, -1, -878, -830, -166, 948]
3878I48j35o28r30l68Q26P43L66m21j249m51Q44R69O94q01j089l87L96R76N45
3897H48Q6j122j005J51J179Q20J32j512p77N43N40R36j0p80p34k91R97Q93J90
3916A084p77r85k41N53J033L41o17q07q64N38Q70J019m71j214o23P63M76P32M6
3935H56j232m42l59J289Q91R1p85q85j48O43J174P5q78q17n74Q06R42M29p08j002
3955f34m18N42J019O33l82j164n16K16R90P41M4j526n28K89R05R44j38r52j151
3974a086M68M23J233n8q81j008o4O60J107K15l87j112n44L40J083N49o84q43o25
3993a214M28J485K07k68o59r72M45Q23O25O3r85q46jQ95J019k56m42p64n37R19
4013c5R69K05o94j074j83O95P96M22o50r02m21L81R75N05j77j210l54J30R26J063
$$ y = [948, 813, 185, -745, -1113, -287, 456, 822, 401, -848, -1299, -455, 514, 1208, 407, -682, -1069, -673, 303, 848, 934, -188, -1193, -1042, 137, 957, 1089, -423, -1200, -657, -117, 819, 809, 29, -705, -996, 1, 894, 1084, 307, -678, -919, -366, 667, 1008, 391, -416, -1280, -742, 128, 1147, 676, -538, -1161, -398, 78, 810, 856, -376, -818, -1177, 112, 1003, 1094, 309, -576, -724, -81, 1093, 1168, 290, -527, -1101, -295, 647, 1076, 368, -634, -1052, -510, 509, 1142, 760, -404, -920, -704, 286, 1027, 1071, -455, -983, -694, 211, 1155, 1017, 65, -1086, -618, -195, 1038, 980, 99, -909, -973, -313, 794, 1009, 622, -490, -1034, -694, 389, 938, 254, -589, -1214, -786, 699, 906, 638, -21, -993, -548, 275, 900, 963, -22, -868, -869, 26, 1045, 789, 347, -417, -954, -35, 934, 1139, 445, -629, -812, -117, 679, 1101, 451, -451, -872, -491, 484, 989, 812, -398, -752, -622, 304, 1367]
4033A367l33j283l66k93J026P60q2p24o72j17N62Q09M03p66r57l7L53J025L79
4052A054l40j496l14O94Q51M20l31j130m23M04J036N73j81q66j008J63J083P43
4070I32j66r41o41p4P21J330m22k85j340m1K82J318q7j94j322L7O87Q11K85m30
4090D60o97m42K94O39P30k90q49r72L38J196R06p19p51o81n3P33R98kp22q01l90
4111a075R54P92L94q14p25o34M18J416J73m20j241k3K13R56M48m28q94n60L26
4130g24R58M36K30j180q88K45R48N78L1q70q30R6R11N94K73m77j058m16Q71Q87
4150F15J95m19j048m34N16R07P41q15r07n95L03J021R59m64q57n49j43J109Q92
4169A027k82q33p44q8P94J119k47o27r25j5L73J057K97m98q41o39M21R00P24m13
$$ y = [1367, 1034, -249, -615, -908, 118, 878, 796, 72, -600, -717, -155, 654, 1057, 291, -666, -703, -350, 675, 1054, 714, -782, -1096, -402, 449, 869, 538, -592, -1015, -611, 425, 998, 817, -49, -1057, -894, 189, 932, 766, -175, -816, -890, -169, 1161, 739, 454, -886, -927, -645, 673, 586, 392, -930, -893, -206, 605, 890, 460, -237, -679, -385, 254, 984, 694, -155, -1127, -789, 407, 1313, 594, -157, -838, -891, -158, 840, 838, 116, -685, -1075, -121, 671, 1065, 251, -474, -1108, -690, 726, 899, 479, -762, -785, -572, 384, 832, 404, -490, -1050, -724, 234, 670, 900, -280, -1168, -923, 25, 603, 634, -236, -1066, -970, -59, 535, 808, 331, -727, -1143, -272, 615, 810, 391, -657, -1091, -575, 332, 1073, 258, -649, -1244, -941, 80, 1039, 575, -282, -831, -974, 135, 1027, 745, -88, -832, -920, -126, 993, 746, 119, -806, -821, -448, 609, 906, 408, -433, -1072, -651, 249, 973, 560]
4189E60r01o00L58N95Q60k08o23q97J09Q82R14m21n51p93l0P75M99P7j89r68k18
4210g70O78O75J52o68n52m26O77N19M36k87r35l98N31P28O19n84n10p95J15N13
4230b82J176j5q19r37l9Q99N93J00o96r20m0N90R30K30m22j158j62L89J257L57
4250A031o45p69n71P38N64N89m02q70n47M0J026O19k46o53o35O2O52J125n90o66
4270a48p97K06O31P35K90o57q97l6L63J063J79m03r32m30R5J155Q58p01p93q27
4290a046N50J052N11l42p72o19K8Q31N88K10j117m08j77Q05O76K6l69j279PP48
4310i7O97K42n21q71n72Q43N94O20o21o47l24K37P46M41Qr86n49Q3P15Q64kr95
4332i5p60J84P28N33M89q27o98n32P64R54L9l83j121l7J40J045M21k93r65o24
$$ y = [560, -341, -941, -583, 12, 872, 664, 41, -856, -747, 135, 1049, 628, 77, -716, -746, 29, 528, 605, 416, -552, -770, -92, 583, 735, 67, -485, -911, -234, 285, 721, 434, -501, -899, -368, 360, 979, 395, -115, -910, -795, -282, 894, 879, 60, -877, -916, -17, 576, 676, -20, -940, -980, -390, 540, 770, 348, -810, -972, -583, 674, 1031, 386, -383, -954, -216, 348, 937, 535, -335, -882, -842, 184, 803, 557, -96, -731, -669, -17, 1108, 518, -148, -945, -739, -108, 627, 917, 260, -637, -673, -310, 753, 932, 529, -403, -833, -738, 417, 1275, 574, -219, -1046, -496, 556, 1067, 725, -47, -666, -638, 193, 781, 991, -126, -534, -711, 94, 770, 796, 427, -852, -845, -97, 600, 842, 321, -550, -1122, -279, 315, 935, 314, -333, -657, -420, 326, 767, 775, -211, -760, -677, 38, 902, 900, -95, -855, -671, 57, 590, 1079, 252, -446, -978, -214, 740, 779, 396, -725, -762, -622, 423, 844, 551, -414, -1038]
4352a038O82N10R10m08q91l70J20N69O92j00r34n63K57O82N10J37n58p81k05O45
4372a34R04O7p36r12l34R45N18P05n34r30j81K52N66P27j77j074m62j8R28P40
4392H60k54r68k74p9O13R87k22o05q00j10Q30P78L61p33j016k48P88O23M27o12
4412C46q11l35M18R04J94n58n30o54M29Q46O20k72r71p36K89J061O46R4j200n48
4432g68k82J201M37O9q25l92m04O57R61K17o35m59m84M19P20N29p41r46l35O65
4452c96P21N85l36o87p89K94R14O08J35j080n40l10R28O92J09q26p92L15K67N30
4472C42O21n85j123m94Q28P35N47k76j229l32M60P72N66m93r16k44K14R55L03
4491F51N7p78q09M9N58J048J68j277l54J13N61P00J23p97n79l85Q29P41K69o47
$$ y = [-1038, -356, 154, 1064, 656, -235, -605, -485, 84, 776, 676, -258, -821, -564, 118, 628, 765, 207, -574, -779, -134, 770, 837, 101, -811, -1145, -200, 318, 1023, 489, -441, -622, -370, 196, 923, 746, -328, -790, -808, 120, 860, 606, -362, -636, -715, -102, 885, 663, 58, -742, -852, -22, 756, 1117, 384, -632, -880, -92, 531, 958, 346, -465, -800, -382, 522, 716, 158, -372, -1026, -597, 249, 869, 597, -374, -1110, -821, 240, 886, 980, -220, -768, -1050, 151, 588, 657, -168, -560, -964, -307, 654, 871, 236, -223, -707, -288, 432, 961, 220, -726, -1061, -396, 325, 910, 574, -113, -902, -608, 306, 914, 1049, -31, -571, -881, 47, 739, 848, 22, -770, -455, -188, 342, 963, 378, -745, -1239, -411, 324, 871, 595, -634, -966, -506, 266, 832, 339, -577, -821, -607, 348, 651, 708, -70, -879, -830, -272, 776, 944, -333, -687, -574, -13, 687, 810, 13, -566, -951, -122, 619, 888, 241]
4511B41m56o08M74O07L07Q0r88o26K74J032N16l51n70q40P4Q59Q60R5j375m62
4531h57j76Q55Q34j88j43j293J60O56N79L79m94q38l81M47P27Q17o08p19k68N3
4551d58J070M59o39o17n47L47N48Q84m72p14n50MO68R06O1q06o74k33O76P75K35
4572I23o39n67l85L29R66L13j81j355l35L61Q33M44j4q00n45k01J338P33o95p22
4592a99n11MM19J154j61o37p08o2P34O83J3o47p37k68M55R35L53l20r54m44O32
4613b66P54L21j97j089k66j4J124O87k37r48n29M2P50P00J53r68p64J58M21P96
4633F28J84m78o29m76N42J032J43n18r86l35L65Q96O62m83r15p14M27Q97Q93o54
4653D81n23n60J9P24Q49l48q45o27J66P85P17l3o27j020P9O91O24N07q89o17p98
$$ y = [241, -215, -823, -349, 258, 565, 645, -343, -969, -695, 337, 853, 502, -68, -908, -834, 25, 885, 980, -395, -857, -1033, -178, 656, 468, 325, -968, -808, -152, 427, 806, 312, -526, -907, -460, 267, 1084, 476, -243, -511, -458, 612, 1071, 432, -185, -732, -385, 163, 1047, 575, -139, -689, -685, -17, 889, 950, 144, -530, -763, -87, 688, 923, 284, -283, -668, -339, 627, 940, 759, -596, -931, -570, 263, 707, 693, -107, -652, -853, 485, 1218, 523, -199, -710, -706, -287, 867, 706, 69, -639, -701, 33, 716, 729, 82, -655, -923, -468, 467, 820, 500, -454, -898, -266, 488, 809, 612, -477, -743, -757, 367, 1054, 817, -131, -660, -618, 132, 832, 985, 17, -747, -589, -168, 628, 812, 334, -295, -771, -229, 803, 946, 428, -558, -893, -528, 368, 1030, 547, -368, -1082, -655, 242, 1135, 481, -42, -602, -583, 141, 990, 642, -203, -830, -664, 121, 838, 805, 178, -842, -763, -72, 552, 1059, 170, -447, -1245]
4674a245N84J297K74l95r70m24K72R93M23j92p10n43OQ82Q61l67p72q03O4J023
4694B58K59K77p76r25L46L33R30N5n64j061J91K25R29M26n05j013l25N93O79M15
4714G47l12o54k90P8P92M81k21p37m42j19P05Q27k1q92n38j58P68Q43m4p15p44
$$ y = [-1245, -661, 636, 910, 515, -455, -879, -607, 386, 809, 617, -93, -636, -630, 252, 1113, 746, -26, -829, -765, 258, 517, 794, 18, -907, -561, -228, 702, 757, 193, -868, -677, -452, 477, 903, 398, -615, -940, -347, 332, 747, 435, -219, -509, -431, 361, 842, 621, -116, -558, -677, 28, 855, 834, -58, -596, -754, 14, 857, 813, 98, -646]
$$ [...]
8191G03
##END NTUPLES=NMR FID
##END=
