##TITLE=1H_SAV-41-N2
 CDCl3, 8 sc, 
 25.10.2019
##JCAMPDX= 6.0         $$ Bruker NMR JCAMP-DX V2.0
##DATA TYPE= NMR FID
##DATA CLASS= NTUPLES
##ORIGIN= UXNMR, Bruker Analytische Messtechnik GmbH
##OWNER= root
$$ XWIN-NMR		Version 3.5
$$ Fri Oct 25 13:55:13 2019 Russian Standard Time (UT+4h)  she@DPX200
##.OBSERVE FREQUENCY= 200.1315
##.OBSERVE NUCLEUS= ^1H
##.DELAY= (6, 6)
##.ACQUISITION MODE= SIMULTANEOUS
##.ACQUISITION SCHEME= undefined
##.AVERAGES= 8
##.DIGITISER RES= 18
##SPECTROMETER/DATA SYSTEM= spect
##.PULSE SEQUENCE= zg30
##.SOLVENT NAME= CDCl3
##.SHIFT REFERENCE= (INTERNAL, CDCl3, 0, 15.7039)
##AUDIT TRAIL= $$ (NUMBER, WHEN, WHO, WHERE, WHAT)
$$ ##TITLE= Audit trail, XWIN-NMR		Version 3.5
$$ ##JCAMPDX= 5.01
$$ ##ORIGIN= Bruker BioSpin GmbH
$$ ##OWNER= she
$$ F:/spectra/data/she/nmr/H-F/1/audita.txt
$$ ##AUDIT TRAIL=  $$ (NUMBER, WHEN, WHO, WHERE, WHAT)
(   1,<2019-10-25 13:54:15.93 +0400>,<she>,<DPX200>,
      <created by zg, POWCHK disabled, PULCHK disabled
       configuration hash MD5:
       00 E9 B6 7A A2 85 ED C7 34 08 36 98 17 FE 4E 26
       data hash MD5: 16K
       A0 2A 36 59 FB EE 06 0C 96 5B 61 65 E2 8F A0 D3>)
$$ ##END=
$$ 
$$ hash MD5
$$ C0 3E F9 1C EF B1 41 1D CB 66 DB 87 39 75 06 84
##$RELAX= 
##$RELAX= 
##$RELAX= 
##$RELAX= 
##$RELAX= 
##$RELAX= 
$$ Bruker specific parameters
$$ --------------------------
##$DU= <F:/spectra>
##$EXPNO= 1
##$NAME= <H-F>
##$PROCNO= 1
##$TYPE= <nmr>
##$USER= <she>
##$AMP= (0..31)
100 100 100 100 100 100 100 100 100 100 100 100 100 100 100 100 100 100 
100 100 100 100 100 100 100 100 100 100 100 100 100 100 
##$AQSEQ= 0
##$AQ_mod= 1
##$AUNM= <au_zg>
##$AUTOPOS= <>
##$BF1= 200.13
##$BF2= 200.13
##$BF3= 200.13
##$BF4= 200.13
##$BF5= 200.13
##$BF6= 200.13
##$BF7= 200.13
##$BF8= 200.13
##$BYTORDA= 1
##$CFDGTYP= 0
##$CFRGTYP= 5
##$CHEMSTR= <none>
##$CNST= (0..31)
1 1 145 1 1 1 1 1 1 1 1 1 1 1 1 1 1 1 1 1 1 1 1 1 1 1 1 1 1 1 1 1 
##$CPDPRG= <>
##$CPDPRG1= <>
##$CPDPRG2= <>
##$CPDPRG3= <>
##$CPDPRG4= <mlev>
##$CPDPRG5= <mlev>
##$CPDPRG6= <mlev>
##$CPDPRG7= <mlev>
##$CPDPRG8= <mlev>
##$CPDPRGB= <>
##$CPDPRGT= <>
##$D= (0..31)
0 1.2 0 0 0 0 0 0 0 0.06 0 0.03 0 0 0 0 0.0002 0 0 0 0 0 0 0 0 0 0 0 0 
0 0 0 
##$DATE= 1571997255
##$DBL= (0..7)
120 120 120 120 120 120 120 120 
##$DBP= (0..7)
150 150 150 150 150 150 150 150 
##$DBP07= 0
##$DBPNAM0= <>
##$DBPNAM1= <>
##$DBPNAM2= <>
##$DBPNAM3= <>
##$DBPNAM4= <>
##$DBPNAM5= <>
##$DBPNAM6= <>
##$DBPNAM7= <>
##$DBPOAL= (0..7)
0.5 0.5 0.5 0.5 0.5 0.5 0.5 0.5 
##$DBPOFFS= (0..7)
0 0 0 0 0 0 0 0 
##$DE= 6
##$DECBNUC= <off>
##$DECIM= 24
##$DECNUC= <off>
##$DECSTAT= 4
##$DIGMOD= 1
##$DIGTYP= 9
##$DL= (0..7)
0 120 120 120 120 120 120 120 
##$DP= (0..7)
150 150 150 150 150 150 150 150 
##$DP07= 0
##$DPNAME0= <>
##$DPNAME1= <>
##$DPNAME2= <>
##$DPNAME3= <>
##$DPNAME4= <>
##$DPNAME5= <>
##$DPNAME6= <>
##$DPNAME7= <>
##$DPOAL= (0..7)
0.5 0.5 0.5 0.5 0.5 0.5 0.5 0.5 
##$DPOFFS= (0..7)
0 0 0 0 0 0 0 0 
##$DQDMODE= 0
##$DR= 18
##$DS= 0
##$DSLIST= <SSSSSSSSSSSSSSS>
$$ [...]
##$SUBNAM2= <"">
##$SUBNAM3= <"">
##$SUBNAM4= <"">
##$SUBNAM5= <"">
##$SUBNAM6= <"">
##$SUBNAM7= <"">
##$SUBNAM8= <"">
##$SUBNAM9= <"">
##$SW= 24.0689530833862
##$SWIBOX= (0..15)
0 0 2 0 0 0 0 0 0 0 0 0 0 0 0 0 
##$SW_h= 4816.95568400771
##$TD= 16384
##$TD0= 1
##$TE= 0
##$TE2= 300
##$TE3= 300
##$TEG= 300
##$TL= (0..7)
0 120 120 120 120 120 120 120 
##$TP= (0..7)
150 150 150 150 150 150 150 150 
##$TP07= 0
##$TPNAME0= <>
##$TPNAME1= <>
##$TPNAME2= <>
##$TPNAME3= <>
##$TPNAME4= <>
##$TPNAME5= <>
##$TPNAME6= <>
##$TPNAME7= <>
##$TPOAL= (0..7)
0.5 0.5 0.5 0.5 0.5 0.5 0.5 0.5 
##$TPOFFS= (0..7)
0 0 0 0 0 0 0 0 
##$TUNHIN= 0
##$TUNHOUT= 0
##$TUNXOUT= 0
##$USERA1= <user>
##$USERA2= <user>
##$USERA3= <user>
##$USERA4= <user>
##$USERA5= <user>
##$V9= 5
##$VALIST= <valist>
##$VCLIST= <CCCCCCCCCCCCCCC>
##$VD= 0
##$VDLIST= <DDDDDDDDDDDDDDD>
##$VPLIST= <PPPPPPPPPPPPPPP>
##$VTLIST= <TTTTTTTTTTTTTTT>
##$WBST= 1024
##$WBSW= 4
##$XGAIN= (0..3)
0 0 0 0 
##$XL= 0
##$YL= 0
##$YMAX_a= 361660
##$YMIN_a= -516227
##$ZGOPTNS= <>
##$ZL1= 120
##$ZL2= 120
##$ZL3= 120
##$ZL4= 120
##$ABSF1= 10
##$ABSF2= 0
##$ABSG= 5
##$ABSL= 3
##$ALPHA= 0
##$AQORDER= 0
##$ASSFAC= 0
##$ASSFACI= 0
##$ASSFACX= 0
##$ASSWID= 0
##$AUNMP= <proc_1d>
##$AZFE= 0.1
##$AZFW= 0.1
##$BCFW= 1
##$BC_mod= 2
##$BYTORDP= 1
##$COROFFS= 0
##$CY= 11.3945322036743
##$DATMOD= 1
##$DC= 2
##$DFILT= <>
##$DTYPP= 0
##$F1P= 20.1720416913024
##$F2P= 0.152960286110954
##$FCOR= 0.5
##$FTSIZE= 0
##$FT_mod= 4
##$GAMMA= 1
##$GB= 0.15
##$INTBC= 1
##$INTSCL= 1
##$ISEN= 128
##$LB= 0.24
##$LEV0= 0
##$LPBIN= 0
##$MAXI= 10000
##$MC2= 0
##$MEAN= 0
##$ME_mod= 0
##$MI= 1.114404
##$NCOEF= 0
##$NC_proc= 0
##$NLEV= 6
##$NOISF1= 3.799351
##$NOISF2= 2.8
##$NSP= 1
##$NTH_PI= 0
##$NZP= 0
##$OFFSET= 15.70392
##$PC= 1
##$PHC0= -9578.806
##$PHC1= 25.20084
##$PH_mod= 1
##$PKNL= yes
##$PPARMOD= 0
##$PSCAL= 0
##$PSIGN= 0
##$REVERSE= no
##$SF= 200.130013532006
##$SI= 16384
##$SIGF1= 3
##$SIGF2= 2
##$SINO= 400
##$SIOLD= 16384
##$SREGLST= <1H.CDCl3>
##$SSB= 0
##$STSI= 0
##$STSR= 0
##$SW_p= 3612.71676300578
##$SYMM= 0
##$S_DEV= 0
##$TDeff= 0
##$TDoff= 0
##$TI= <>
##$TILT= no
##$TM1= 0
##$TM2= 0
##$TOPLEV= 0
##$USERP1= <user>
##$USERP2= <user>
##$USERP3= <user>
##$USERP4= <user>
##$USERP5= <user>
##$WDW= 1
##$XDIM= 8192
##$YMAX_p= 0
##$YMIN_p= 0
$$ End of Bruker specific parameters
$$ ---------------------------------
##NTUPLES= NMR FID
##VAR_NAME=  TIME,          FID/REAL,        FID/IMAG
##SYMBOL=    X,             R,               I
##VAR_TYPE=  INDEPENDENT,   DEPENDENT,       DEPENDENT
##VAR_FORM=  AFFN,          ASDF,            ASDF
##VAR_DIM=   8192,          8192,            8192
##UNITS=     SECONDS,       ARBITRARY UNITS, ARBITRARY UNITS
##FACTOR=    0.0002076,     1,               1
##FIRST=     0,             0,               0
##LAST=      1.7004516,     0,               0
##MIN=       0,             -516227,         0
##MAX=       1.7004516,     361660,          0
$$ Real data points
##PAGE= N=1
##DATA TABLE= (X++(R..R)), XYDATA
$$ [...]
2197A56j953K317J939k367j032K514M64k904n60L274J250l206j475J967J295j422
$$ 156 -1797 520 2459 92 -940 1574 2038 -866 -1426 1848 3098 -108 -1583 384 1679 257
2213B57m88J502q74j438K45K155k48j230n5J46q90N8K529l71k739p15K736R74
$$ 257 -231 1271 397 -1041 -796 1359 1111 -119 -174 -28 -918 -860 1669 1298 -1441 -2156 580 1554
2231A554k170n66K258p83k339M39L007j56k962l46K357Q2j494k4J119n04p22P00
$$ 1554 -616 -1182 1076 293 -2046 -1607 1400 1244 -1718 -2064 293 375 -1119 -1143 -24 -528 -1250 -550
2249e50Q79p42m67O28n03m83J058Q43j516j865J978K007r21k287N68J999r17j273
$$ -550 329 -413 -880 -252 -755 -1238 -180 663 -853 -2718 -740 1267 346 -1941 -1373 626 -291 -1564
2267a564Q52J820j105j723L36J708Q33j213j032L8R32N57k13q77N01Q41r89j330
$$ -1564 -712 1108 3 -1720 -1384 324 1157 -56 -1088 -1050 -118 439 226 -651 -150 691 -298 -1628
2285a628J372J891n25k180k84J873J126j266j243O89J364n73j144J19J458L88
$$ -1628 -256 1635 1110 -1070 -1354 519 1645 379 -864 -175 1189 616 -528 -409 1049 1437
2301A437j664q61J909J082r94k439Q93K511l94j554j34J058M34r24l55N72N83
$$ 1437 -227 -1088 821 1903 909 -1530 -637 1874 1480 -74 -208 850 1284 360 5 577 1160
2318A160J47j405l84J344J187p85k485P31K717m88k396K99K272j22k489l95K455
$$ 1160 1307 -98 -482 862 2049 1264 -1221 -490 2227 1739 -657 -358 1914 1792 -697 -1092 1363
2335A363O36j744j482J183J188l11o64o90M70R18j86j362l34J589M32j418j620
$$ 1363 1999 255 -1227 -44 1144 833 169 -521 -51 867 681 -681 -1015 574 1006 -412 -2032
2352b032K301J793k142k369K152J894j223j987K21K430k02k001m49J775J19p89
$$ -2032 269 2062 -80 -2449 -297 1597 374 -1613 -1392 1038 836 -1165 -1614 161 280 -509
2368e09j120N65J234J3r49j062J215J183l32k000M25J542K87j391j224J900J612
$$ -509 -1629 -1064 170 183 -766 -1828 -613 570 238 -1762 -1337 205 492 -899 -2123 -223 1389
2385A389j776j895R74K140k49k060K40J922Q6j743n00J401Q57j059q74N17M71
$$ 1389 -387 -2282 -1308 832 583 -1477 -1237 685 771 -972 -1472 -71 786 -273 -1147 -630 -159
2402a59O99o70q99Q83Q07j1j669J3J635Q53k161j098K184J097j413j464J386J436
$$ -159 540 -130 -1029 -146 661 650 -1019 -1006 629 1482 -679 -1777 407 1504 91 -1373 13 1449
2420A449j095j234P10J087j91p86n08Q24L64k6k97p64R85P92p07j537J382J400
$$ 1449 354 -880 -170 917 726 -60 -568 256 620 594 297 -467 518 1310 603 -934 448 1848
2438A848j033j457L57J863j10j959J87J584O3j469k26R75N28p10l93K15P3Q12
$$ 1848 815 -642 -285 1578 1468 -491 -304 1280 1343 -126 -352 623 1151 441 48 263 336 1148
2456A148l39p87o7J177K27j652r16K061M35j517o52J071J083r59r17M23P00k82
$$ 1148 809 22 -45 1132 1359 -293 -1209 852 1287 -230 -882 189 1272 313 -604 -181 519 237
2474B37o17L79J2j23j34K01m06N78J7Kr79M01J226j037r46M03J121l87j332P96
$$ 237 -380 -1 11 -112 -246 -45 -451 127 144 146 -833 -432 794 -243 -1189 -786 335 -52 -1384 -588
2494e88O35m82m42J33N89m53k26M73J22n42Q1L56m0l86M57j00k61J0L73J01n02
$$ -588 47 -435 -877 -744 -155 -608 -834 -361 -239 -781 -700 -344 -384 -770 -313 -413 -674 -664 -291 -190 -692
2515f92Q4Q04o56j54R1N14l61j81J41K61o3j46J3R2K29o5j36l47Q17k61m13k0
$$ -692 -608 196 -460 -614 -523 -9 -370 -551 -410 -149 -212 -358 -345 -253 -24 -89 -225 -572 245 -16 -429 -449
2537d49P61J60r33J93K89P01k65o59J76L42K7j93n5L41K68j93p20M84P08m7r08
$$ -449 312 472 -461 -268 21 722 457 -202 -26 316 343 150 95 436 704 511 -209 275 983 936 28
2558B8l50J062K15q53o4K85O23k45o9k54M42mj72n95K81Q14o0q63k62J070N7p80
$$ 28 -322 740 955 102 38 323 946 701 632 378 820 816 644 49 330 1144 1084 221 -41 1029 1086 306
2580C06m60R30Qn62m56O19M81m58o37k8O30J22j94p83MQ10N12j274l59J348Q2
$$ 306 -154 776 784 222 -234 385 866 408 -229 -257 373 495 301 -482 -478 332 844 -430 -789 559 641
2601F41j258o03J683N40j296o34N92O28n84j72J57P9l73L71k4m82L34M12m50r49
$$ 641 -617 -1220 463 1003 -293 -927 -335 293 -291 -463 -306 -227 -600 -229 -253 -735 -401 11 -439 -1388
2621a388Q57J246q76j571P68J769m82j671L39J020q3j455P93J089k86j453K73
$$ -1388 -531 715 -161 -1732 -964 805 323 -1348 -1009 11 -72 -1527 -734 355 69 -1384 -1111
2638a111Q66J22j22o0l67n65N41J255k47j512P28Q69n62j163J469R27j599j834
$$ -1111 -245 -123 -245 -305 -672 -1237 -696 559 312 -1200 -472 397 -165 -1328 141 1068 -531 -2365
2656b365J966J665p68j900J148J069j236p22J367R53j491o92J347N90j607N61
$$ -2365 -399 1266 498 -1402 -254 815 -421 -1143 224 1177 -314 -1006 341 931 -676 -115
2672a15O73o51r87J609J355j646j255J375J070j484m45J576N11k207m52K403P46
$$ -115 558 -93 -1080 529 1884 238 -1017 358 1428 -56 -501 1075 1586 -621 -1073 1330 2076
2689B076j644j167J626L17j180J58J403o00j714M42J285l00m58L61o2o71l55J840
$$ 2076 432 -735 891 1208 28 186 1589 989 -725 -283 1002 702 244 605 543 -128 -483 1357
2707A357J62k040k47J460J62q76l95J662p41j578L89K368m17k145O8J102J11q57
$$ 1357 1519 -521 -768 692 854 -22 -417 1245 504 -1074 -685 1683 1266 -879 -811 291 402 -455
2725d55O08Q50q81j529J248J522j081j174K70O67j059L52J555n03j794j11K269
$$ -455 153 1003 122 -1407 -159 1363 282 -892 -622 45 -1014 -662 893 390 -1404 -1515 754
2742G54n16j083L19J107j294j388K064J444j290k407J034J880p79j010J182O58
$$ 754 238 -845 -526 581 -713 -2101 -37 1407 117 -2290 -1256 624 -155 -1165 17 675
2758F75j821n19J926P85j286j095Q19J47l07O61O29p76j543J410J368r77j417
$$ 675 -1146 -1665 261 1046 -240 -1335 -516 -369 -676 -15 614 -162 -1705 -295 1073 96 -1321
2775a321J121N87j253p88K518Q48k135j407J470J929j397j154P86O64r78l6J241
$$ -1321 -200 387 -866 -1654 864 1712 -423 -1830 -360 1569 172 -982 -196 468 -510 -546 695
2792F95j10j235l27R39M61j45P24l81j399k34J915J400j948j328R89J082j195
$$ 695 585 -650 -977 -38 423 278 1002 621 -778 -1012 903 2303 355 -973 16 1098 -97
2809i7j54J767L22k547p55K160J410j225j407M86P06k58r9N69k32n91K22K23k43
$$ -97 -251 1516 1838 -709 -1464 696 2106 881 -526 -40 666 408 309 878 646 55 277 500 257
2828B57O47n9m24j468M95K225K44k376q77J724J432j904m88J235M41j807j091
$$ 257 904 845 421 -1047 -552 1673 1917 -459 -1336 388 1820 -84 -572 663 1104 -703 -1794
2845a794K374J679k098j643M00J639J50p95K64p00j57O69M14o04j60L52J66j676
$$ -1794 580 2259 161 -1482 -1082 557 707 -88 176 -524 -681 -12 402 -202 -362 -10 156 -1520
2863a520O28K282j05k693p67K424J174k413p22J984O17k207LK172m7j983j51Q10
$$ -1520 -892 1390 1285 -1408 -2175 249 1423 -990 -1712 272 889 -1318 -1315 857 810 -1173 -1324 -514
2881e14O01l39K39n20r30K44J763k26j809L13J807o38j806R65K076n76k813M77
$$ -514 87 -252 -13 -533 -1463 -1219 544 318 -1491 -1178 629 -9 -1815 -850 1226 650 -2163 -1686
2899a686K709R8k005m76J672k6o78R3O83l18n43M0N11nJ76J9n39q89R67J791j250
$$ -1686 1023 1121 -884 -1360 312 286 -392 -299 384 66 -477 -437 74 69 245 264 -275 -1164 -197 1594 344
2920C44j419M86J469k88j447P52J866q60k070O41K453m92k042r7J548j13m28J48
$$ 344 -1075 -589 880 592 -855 -103 1763 903 -1167 -526 1927 1435 -607 -704 844 731 303 451
2938D51K37k98n35N91J87j64l06M62r9r19Q38J330r94j899Q75J847p61j588R61
$$ 451 688 390 -145 446 633 469 163 625 526 -393 445 1775 781 -1118 -243 1604 843 -745 216
2957B16J224j102r88P42J477j193j189R08N71n55j23L50j95n45M77O81n92p30
$$ 216 1440 338 -650 92 1569 376 -813 95 666 111 -12 338 143 -402 75 756 164 -566
2975e66P12N92r49n21J116M39j310q47J229Q88q62p73J013J53r37k21J051J74
$$ -566 146 738 -211 -732 384 823 -487 -1334 -105 783 -79 -852 161 314 -623 -844 207 381
2993C81r68j95O49J23l63J39k62m30K28P94qq75K75L67jp16N01O95m61q57K65
$$ 381 -587 -782 -133 -10 -373 -234 -496 -926 -698 96 88 -787 -512 -145 -146 -862 -361 334 -127 -984 -719
3014g19O04M2n06J18M72j74m82J14L27M4l32K02O0K5mk64L12P6M0k36J74P5p7
$$ -719 -115 -73 -579 -461 11 -163 -645 -531 -204 -160 -492 -290 -230 -205 -209 -473 -161 -85 -45 -281 -107 -32 -109
3037a09P5j02R0p0N61l80j97J45K79M07r45J58K53M93m34n16O59Op13L74M94j52
$$ -109 -34 -136 -46 -116 445 65 -132 13 292 699 -246 -88 165 658 224 -292 367 373 -340 34 528 376
3059C76j22j12K22J87l97M47k56q6L36j10j24l62M17M2j97k18L17N13o08l80N70
$$ 376 254 142 364 551 154 601 345 259 595 485 361 -1 416 458 261 43 360 873 265 -115 455
3080D55K53k11k60j19K96P1n83N78j79R0l44k59L26L19j13j83n59O79K24m02l01
$$ 455 708 497 237 118 414 485 -98 480 301 391 47 -212 114 433 320 137 -422 257 481 79 -222
3101b22K85M06l81m40l0L20J67l51J85j95K1J78j82j32K22O04r85m89P39M99l43
$$ -222 63 469 88 -352 -382 -62 105 -246 -61 -256 -235 -57 -239 -371 -149 455 -530 -1019 -280 219 -124
3122a24q38K00O68j81o63L45K72j8Mm62K88M93m12o8p0J58L92k27o21J01J121
$$ -124 -962 -762 -94 -275 -938 -593 -321 -339 -335 -797 -509 -16 -428 -496 -566 -408 -16 -243 -864 -763 358
3143C58k88n61m95O83M25q32J81L89M66o53k29L53K65O8J26m82k93L85N27l96
$$ 358 70 -491 -986 -303 122 -710 -529 -140 326 -327 -556 -203 62 130 256 -226 -519 -134 393 -3
3163cl52L86N79p48m72R62K92n73l83O39r7j09n75Q83M7o6j96J0j24J52P56p34
$$ -3 -355 31 610 -138 -610 352 644 71 -312 327 230 121 -454 429 476 410 214 224 100 252 1008 274
3185B74m90M21N28m36j52K76K88l29j55l52O25J3m61OM54l7o2k86K8K39k03L00
$$ 274 -216 205 733 297 145 421 709 380 225 -127 498 511 50 56 510 473 411 125 153 392 189 489
3207D89k23m1mK1p3j42K22J17l01J56k36M53k34k14L8N15m32j73J62K25k06p9
$$ 489 266 225 221 242 169 27 249 366 65 221 -15 438 204 -10 28 543 111 -62 100 325 119 40
3229D0j94K92l40J06j81M85m8p02N81j40J05p72P85M9j32n58K12M63n48r7K29
$$ 40 -154 138 -202 -96 -277 208 160 -542 39 -101 4 -768 17 66 -66 -624 -412 51 -497 -594 -365
3250c65R7k35l26N67J3k37M17K48q29j97O31K36o51j23M20M84o84l21J207j34
$$ -365 -268 -503 -829 -262 -249 -486 -69 179 -650 -847 -216 20 -631 -754 -334 150 -534 -855 352 218
3270B18m49l67M57L08n58j95K08J64QL59k63m26J41R10n83m81L68N17j29j149
$$ 218 -231 -598 -141 167 -391 -586 -378 -214 -206 153 -110 -536 -395 515 -68 -549 -181 336 207 -942
3290i42P40J086n28r19J47J046l92o01J97L66j9l41J9P99k76k53k14Q1K24L78
$$ -942 -202 884 356 -563 -416 630 238 -363 -166 200 181 -160 -141 658 382 129 -85 -4 220 598
3310E98K6n34n79O71Q68p28j82L90J52l10m37N88O66r50n64r2J185L47j061l04
$$ 598 624 90 -489 182 1050 322 140 530 682 372 -65 523 1189 239 -325 -417 768 1115 54 -250
3330b50O50J17l71k34M72j27k89j02O09j34k25K64k46m46L00J244p34j296M94
$$ -250 400 517 146 -88 384 257 -32 -134 475 341 116 380 134 -312 -12 1232 498 -798 -304
3349c04J065j98j208M62J109j078p82N18J260m19p50n49P91jj70J51M7k67k45
$$ -304 761 563 -645 -183 926 -152 -934 -416 844 425 -325 -874 -83 -84 -254 -103 -56 -323 -568
3368e68K69K30j43P1L1n07m89J328O22j047j364M27K015j109n91K57Q01n09p03
$$ -568 -299 -69 -212 -141 -110 -617 -1106 222 844 -203 -1567 -1140 875 -234 -825 -568 233 -276 -979
3387i79N30J401j049o42m18J088L72p37J31K04n66N25K45j50q76O42O96o98l54
$$ -979 -449 952 -97 -739 -1157 -69 303 -434 -303 -99 -665 -140 105 -45 -921 -279 417 -281 -635
3406f35R27R29j357j063Q99J474m91j654M30J109n16m88Q22N73q26o64L80N50
$$ -635 292 1221 -136 -1199 -300 1174 683 -971 -541 568 52 -436 386 959 133 -531 -151 399
3424C99l7J49j65o57k73J330N61j134o07O48N54o20m94J277Q9j318o95J736J106
$$ 399 362 511 346 -311 -584 746 1307 173 -434 214 768 148 -346 931 1020 -298 -993 743 1849
3443A849j391j040O09R89q17J60L94Q0j259L50O06P9m39N8J19n44k0J060N55j663
$$ 1849 458 -582 27 1016 199 359 753 833 -426 -76 530 609 170 228 347 -197 -217 843 1398 -265
3463b65m52J182M80j089k19R79K1j490J78J478L68j868j10R61N39p87J69N23n13
$$ -265 -717 465 945 -144 -363 616 637 -853 -675 803 1171 -697 -807 154 693 -94 75 598 85
3482H5j171O49J022o98m27K63N64j120L4J406j08j442k87J789O9j026m51R59p8
$$ 85 -1086 -437 585 -113 -540 -277 287 -833 -799 607 499 -943 -1230 559 628 -398 -849 110 32
3501C2j171P44J147p50j365M05J167j56q49O66l3m38l50J218K98q28n61M59K58
$$ 32 -1139 -395 752 2 -1363 -958 209 53 -796 -130 -163 -601 -951 267 565 -263 -824 -365 -107
3520a07m9mO65q93p05L12J381J01j356L22M21k64m89N56R14q53r13P56J070l60
$$ -107 -156 -160 505 -388 -1093 -781 600 701 -655 -333 88 -176 -665 -109 805 -48 -961 -205 865 505
3540E05j050O48Q6m06m6N82K03n73k07N09K08l47K81L32n38r32J063P30p50o70
$$ 505 -545 103 189 -217 -263 319 522 -51 -258 251 459 112 393 725 187 -745 318 1048 298 -372
3560c72L56Q45p23l23P02K51q46l29N54J106q60p07L74N67l68O1K52j0q62J52
$$ -372 -16 829 106 -217 485 736 -110 -439 115 1221 361 -346 28 595 227 288 540 530 -332 -180
3580a80P62j14n34N98J20r80k70J187N58j297o23P79P95o99k12M96J40r94n3R17
$$ -180 582 468 -66 532 652 -328 -598 589 1147 -150 -773 6 801 102 -110 386 526 -468 -521 396
3600C96J13m57p23L40L96k46L85j62m23O5L29M87o94m24O44J08p07j1J017R8j308
$$ 396 509 52 -671 -331 65 -181 204 42 -381 -316 13 500 -194 -618 26 134 -573 -584 433 531 -777
3621g77m26J400J04o62k05O44k38m49K2O78k48k48o57J162j53l71K01P1l03j64
$$ -777 -1203 197 301 -361 -566 78 -160 -609 -587 91 -157 -405 -1062 100 -53 -424 -223 -152 -455 -619
3641f19R23L4q34r3M95J26m31p5N37M5q10K14Q26Rl02o43M53J98j00l98O74k31
$$ -619 304 338 -496 -589 -94 32 -399 -474 63 108 -702 -488 338 347 45 -598 -145 53 -47 -445 229 -2
3663bO3j28K03k7K3q4j26J60k04K95K28o22K79L00J58n47j38O86j99m93N2O77
$$ -2 61 -67 136 109 132 48 -78 82 -122 173 401 -221 58 358 516 -31 -169 517 318 -175 -123 554
3685E54K16r44L3N19P2m85K69J90k07l61M74K57p63L54P5K53o14K45P61m88r40
$$ 554 770 -174 -141 378 450 -35 234 424 217 -144 330 587 -176 178 253 506 -108 137 898 410 -530
3706e30O95O80k24r78L89P20n02m92K37O10n23k75P5M81k45j9j1J94k68k9K67
$$ -530 165 845 621 -357 32 752 250 -242 -5 605 82 -193 -118 363 118 99 88 282 14 -15 252
3727B52k98J30J43P7m41n9K86Q7m41j52N67J4l27k78L46J74k55j97L33n77M53
$$ 252 -46 84 227 304 -137 -196 90 177 -264 -416 151 165 -162 -440 -94 80 -175 -372 -39 -616 -163
3748a63m9k10K25P8J32j46j35K72j31q9k6rk93O51j91l0j44j0M8k4r3J77j15R
$$ -163 -212 -422 -197 -119 13 -133 -268 4 -127 -216 -242 -251 -544 107 -84 -114 -258 -268 -220 -244 -337 -160 -275 -266
3772b66m1K80l35R9K44Q9l75K28J54n5p93N05M88l51l07L66J92O7m27R9K46l6
$$ -266 -307 -27 -362 -263 -19 70 -305 -77 77 22 -771 -266 222 -129 -436 -70 122 189 -238 -139 107 71
3794G1O8k63Q5J77J12J48n15Q7K34O9j40j12m1M60j94m02O06K44k63k26o6J26
$$ 71 139 -124 -39 138 250 398 -117 -30 204 273 133 21 -20 440 246 -156 450 694 431 205 139 265
3816B65J65n58M20l72N31L04l77l26K95R9j66j19J55J9M9j30k21K58j80O2J49
$$ 265 430 -128 292 -80 451 755 378 52 347 446 280 161 316 335 384 254 33 291 111 173 322
3837C22j03r3L87j52m83K12L79m06j72J47J47J15m13m2N88r8n36jK86N1k11k15
$$ 322 219 126 513 361 -122 90 469 63 -109 38 185 300 -113 -155 433 335 -201 -202 84 135 -76 -291
3859b91K29J22j88Q1l15P7M65n90L76m46N38k8m75NK56M60m40l85O92K2l89l74
$$ -291 -62 60 -128 -47 -362 -285 180 -410 -34 -480 58 30 -445 -440 -184 276 -164 -549 143 165 -224 -598
3881e98L74L55j64m2k21L3K92O2m41j12k1N32l61l57P36L21l71m91L04J17k1n70
$$ -598 -224 131 -33 -75 -296 -263 29 91 -350 -462 -483 49 -312 -669 67 388 17 -474 -170 -53 -74 -644
3903f44L62L55j08m0k33K75j77K62l83L61r8L74j65m65L2O34j78n63L7R12j44
$$ -644 -282 73 -35 -75 -308 -33 -210 52 -331 30 -68 306 141 -324 -292 342 164 -399 -362 550 406
3924D06p82R8K85M58n25J04L0L5M9o1R9K00K08k68o3k24K27J91j74k51J71q5K55
$$ 406 -376 -278 7 465 -60 44 74 109 158 97 196 396 604 336 273 49 276 467 293 42 213 128 383
3947C83l65K64Q1K05n77J13L22K3k48j47J92p0o0J8j33M95n20lJ41J79k27J37
$$ 383 18 282 363 568 -9 104 426 449 201 54 246 176 116 134 1 496 -24 -27 114 293 66 203
3969B03j3j26l2M68l98l49J52O8L38j95m42N76l45k44L39L94J06j132Q4R43p09
$$ 203 190 64 32 500 102 -247 -95 -27 311 116 -326 250 -95 -339 0 394 500 -632 -548 395 -314
3990c14K91k96L38l45k01K73M10p13L83K33j49o77K91R12q99k34K02O71j17r11
$$ -314 -23 -319 19 -326 -527 -254 156 -557 -174 59 -90 -767 -476 436 -463 -697 -495 176 59 -852
4010h52M75L55n03JN52J51m17l68N75L14q38L94J18j12k16J19K77J34p56L13L30
$$ -852 -377 -22 -525 -524 28 179 -238 -606 -31 283 -555 -161 -43 -155 -371 -252 25 159 -597 -284 46
4031D6m53J83M06J3n22L5J02M26k97nN9M5k06j94P31N4p59q6O31K84o09k69Q61
$$ 46 -407 -224 182 195 -327 -292 -190 236 -61 -66 -7 38 -168 -362 369 423 -336 -422 209 493 -116 -385 476
4054D76j7m25J09L77k48n08J60N00J62o97N87k94l33l74J198J45p26l93P58J47
$$ 476 459 34 143 520 272 -236 -76 424 586 -111 476 182 -151 -525 673 818 92 -301 457 604
4074F04m62m68J231k60j182K91J007J64p90m26N27M0n04J68N93l58m58M43K48
$$ 604 142 -326 905 645 -537 -246 761 925 135 -291 236 276 -228 -60 533 175 -283 160 408
4093D08j07j1k00n0l65K4P29J00j128J25Q33rn40k29P96n69k21J14R72n72p54
$$ 408 301 290 90 40 -325 -301 428 528 -600 -475 358 349 -191 -420 376 -193 -414 -300 672 100 -654
4114f54J41P22j85kN8N6r09K60M46K20m83j68M86k16n29O38L27k97j009N62O19
$$ -654 -513 209 24 22 80 136 -773 -513 -67 153 -330 -498 -12 -228 -757 -119 208 -89 -1098 -536 83
4135H3K07o15k43O90l02n56M91O19m80n80j8P06l6M5k58k8n01N77O14j12p53J2
$$ 83 290 -325 -568 122 -180 -736 -245 374 -106 -686 -704 2 -34 11 -247 -275 -776 -199 415 303 -450 -438
4157d38M01q8k49L32P72p56p30L67J022l29n93o7N15j28k21N28J3n35k33O13K53
$$ -438 -37 -125 -374 -42 730 -26 -756 -389 633 304 -289 -356 159 31 -190 338 351 -184 -417 196 449
4178D49l22l16L67j88k29O18N05m87p34N23L54p7n71N79R0n94l68O84M85p20l87
$$ 449 127 -189 178 -10 -239 379 884 397 -337 186 540 463 -108 471 561 -33 -401 283 768 48 -339
4199c39M31K05Q6k46K70m6p02K50O35K4n20L7Q5j36k82Q13N38j189m02O77M32
$$ -339 92 297 383 137 407 361 -341 -91 544 568 48 85 170 34 -248 565 1103 -86 -488 189 621
4220F21j93o89L31J54l11k06O91R9q71o4L63J70l04K19K98o32l01N43K24j03o53
$$ 621 428 -261 70 224 -87 -293 398 497 -374 -438 -75 95 -209 10 308 -324 -625 -82 142 39 -614
4241f14K53N02k71J64L76m47o52q3Q72K18n26m80O59j29k83J71P17m58n52K85
$$ -614 -361 141 -130 34 410 -37 -689 -772 100 318 -208 -688 -29 -158 -441 -270 447 -11 -563 -278
4261b78J33Q0j89M19l04k13j89O26K16n92k70J2M74j44j26M41o7l24m2N37J38
$$ -278 -145 -65 -254 165 -139 -352 -541 85 301 -291 -561 -549 -75 -219 -345 96 29 -295 -337 200 338
4282C38p28J89K50j84M7o5N35n52k13K46L11M7m81J7L26k48J03K55J38n66j06
$$ 338 -390 -201 49 -135 -88 -153 382 -170 -383 -137 174 221 -260 -243 83 -165 -62 193 331 -235 -341
4303c41N38L39l61k8J18j09j61J8N31k71l03L71J64o15N5P10j19p72J59M68M64
$$ -341 197 536 175 147 265 156 -5 13 544 273 -30 341 505 -110 -55 655 536 -236 -77 391 855
4324H55p38m60P62k98k03n0Q61o06m90N58L05Rn76l3L00m10K25L54R7m16p5K82
$$ 855 117 -343 419 121 -82 -132 729 123 -367 191 496 505 -71 -104 196 -214 11 365 462 46 -29 253
4346B53j20J8j34K09l3p44M60L70L7j37k89J9L28k25l72K03K59j53j18K71k01
$$ 253 133 151 17 226 193 -551 -91 279 316 179 -110 -91 237 12 -360 -157 102 -51 -169 102 -99
4367i9q9M71j37n47L99L04m25l89K50N73j34p86K93L29k19j82R2K54l14k0j9K42
$$ -99 -188 283 146 -401 -2 302 -123 -512 -262 311 177 -609 -316 13 -206 -388 -296 -42 -356 -376 -395 -153
4389a53j22K4k65K29L60q6j87j23K96J02N6j29l22O2J56R9m52K63K50J88n25l26
$$ -153 -275 -251 -516 -287 73 -13 -200 -323 -27 75 131 2 -320 -258 -102 -3 -455 -192 58 246 -279 -605
4411f05N71J66o8l51K66K26j85k87K47L14k99r0J59m2L0J37J4n0m3M15l01l11
$$ -605 -34 132 64 -287 -21 205 20 -267 -20 294 -5 -95 64 22 52 189 203 153 110 525 224 -87
4433h7J15L74j47q9l0K24J18m14Q8J90J2j90K38l46mK27p1J85k65J11R6j28L1
$$ -87 28 402 255 166 136 360 478 64 152 342 354 164 402 56 52 279 208 393 128 239 335 207 238
4456B38k77M18l11L3K06o0k28l4K64jJ44n49N3J61K02J0l17kJ43k2j27K21N5K25
$$ 238 -39 379 68 101 307 247 19 -15 249 248 392 -157 -104 57 259 269 -48 -50 93 71 -56 165 220 445
4480D45j24l10k29R4j02J83o6J6K0J58k13OmK81l63J7N29n26j33P2K49k10K23
$$ 445 321 11 -218 -124 -226 -43 -109 -93 -73 85 -128 -122 -126 155 -208 -191 338 -188 -321 -249 0 -210 13
4503A3k01J25N1k52Q2M5M5m5J63k14R5J17k11j08l5J50K69m48j20K92Rl4N5m3
$$ 13 -188 -63 -12 -264 -182 -137 -92 -137 26 -188 -93 24 -187 -295 -330 -180 89 -359 -479 -187 -178 -212 -157 -200
4527b00K29o42N31Q5j57k18K71M2M6j22K75j81J99l06L65j70K77k9j42j48k8M47
$$ -200 29 -613 -82 3 -154 -372 -101 -59 -13 -135 140 -41 158 -148 217 47 324 295 153 5 -23 424
4549D24o67K98J71l14J61l30L25J73p1Mj26j4L67k29k74K71k37K4L79j17k23M60
$$ 424 -243 55 226 -88 73 -257 68 241 170 174 48 34 401 172 -102 169 -68 -44 335 218 -5 455
4571D55k22Nk89Q4J95J0k31kN0L11k02k14L91p1j22k48J73M40l27J80n06M28k3
$$ 455 233 238 -51 33 228 238 7 5 55 366 164 -50 341 270 148 -100 73 513 186 366 -140 288 265
4594B65j51qj38L94n57J64L19j49k10J12M1Lr7q5J%J9r6j8J82j5J3J25r8k61K31
$$ 265 114 106 -32 362 -195 -31 288 139 -71 41 82 85 -12 -97 -96 -96 -77 -173 -191 -9 -24 -11 114 16 -245 -14
4620a4j53k27L04J39J49m06P5M32n52P9j3M7k00L2J34N9j75M13o14K31J3M70J16
$$ -14 -167 -394 -90 49 198 -208 -133 299 -253 -174 -187 -140 -340 -308 -174 -115 -290 123 -491 -260 -247 223 339
4643C39p30j17L01M30l53k82M59j41l33J36K41K41k33j89r1O41k53n8m1r9M7J37
$$ 339 -391 -508 -207 223 -130 -412 47 -94 -427 -291 -50 191 -42 -231 -322 319 66 8 -33 -132 -85 52
4665E2l5O3j84K48j44r4k5L17J73m75k13O62J86m61k27N04j15J9j58k9R7P2j98
$$ 52 17 80 -104 144 0 -94 -119 198 371 -104 -317 345 531 70 -157 347 232 251 93 64 161 233 35
4688C5O7K89l6k21M9K12j31j63L06l08k83K43J60j17j89K64K40n25QM37R0k32
$$ 35 102 391 355 134 183 395 264 101 407 99 -184 59 219 102 -87 177 417 -108 -100 337 427 195
4710A95l78N09L6m41J97N19l24l56j5L68k60O5n7m8l34J73K96K19m65l08O61J18
$$ 195 -183 326 362 -79 118 637 313 -43 -58 310 50 115 58 10 -324 -151 145 364 -101 -409 252 370
4732C70n44j03L16j51j45j9O47k31n44J99L00K1j79K75l15j57m09R98j08l52m39
$$ 370 -174 -277 39 -112 -257 -276 371 140 -404 -205 95 116 -63 212 -103 -260 -669 329 221 -131 -570
4753e70M35Q2l85K90M33k69m76N8J98L53k69L7K79k73j94k01P55l63k84L60K80
$$ -570 -135 -53 -438 -148 285 16 -460 -402 -204 149 -120 -83 196 -77 -271 -472 283 -80 -364 -4 276
4774B76m1p27K16L49n04k0N46o5l91O5M27J49k24P6r0n1j42L78K23m1m62J03J14
$$ 276 235 -492 -276 73 -431 -451 95 30 -361 -296 131 280 56 132 42 -9 -151 227 450 409 -53 50 164
4797A64j73n79J354o15n92q1O44K39l39j21L66n1q57O76O86j95p10l2P16o70J91
$$ 164 -9 -588 766 151 -441 -522 122 361 22 -99 267 216 -641 35 721 526 -184 -216 500 -170 21
4818B1J32N6l54J0L27N58o85l13K37J78J7j80M95j55n91J03P34j2q93J19M06l0
$$ 21 153 209 -145 -135 192 750 65 -248 -11 167 184 4 499 344 -247 -144 590 578 -315 -196 210 180
4840A80k61J78M81m31m08K98M11Mn44qP0m1J82M76l66m75L3M76q6m01J60K31l21
$$ 180 -81 97 578 147 -261 37 448 452 -92 -100 -30 -71 111 587 221 -254 -221 255 169 -232 -72 159 -162
4863a62m08M45Q49o64n12J4M52l22r0O52k98m11n6M48L13l53j92L87l7k10M9L43
$$ -162 -570 -125 724 60 -452 -438 14 -308 -398 254 -44 -455 -511 -63 250 -103 -295 92 55 -155 -106 237
4885B37l74m47J51O15l44l12J49J78k83R8J94K99j23m46M41J49j68j29K46j65
$$ 237 -137 -584 -433 182 -162 -474 -325 -147 -430 -332 -138 161 38 -408 33 182 14 -115 131 -34
4905c4m03P2N32J95l27n1O7o9l53N48r4j26n51Q58K14p83J32L32N8l93L66J65
$$ -34 -437 -365 167 362 35 -16 51 -18 -371 177 83 -43 -594 264 478 -305 -173 159 217 -176 190 355
4927C55l17j02l68M63K88j82l15L24q4l14O27L69m50m39J58O33p75K68K93k69
$$ 355 38 -64 -432 31 319 137 -178 146 62 -252 375 744 294 -145 13 646 -129 139 432 163
4947A63k79O0L97M86o92k32%O06k81l2k7J78n12L18L02m1l26J19K5k97R4J71M00
$$ 163 -116 -56 341 827 135 -97 -97 509 228 196 169 347 -165 153 455 414 88 207 232 -65 29 200 600
4970F00p44j50M29J86n80K24K78j9n03J0K28J69j25j67R2J56j07k18Q7K1j57L84
$$ 600 -144 -294 135 321 -259 -35 243 224 -279 -269 -41 128 3 -164 -72 84 -23 -241 -154 -133 -290 94
4992I4K8q0l08N4P6j80P3J81P9l64J04L36K2k63o7m6K03j51L6K77j62m34M6N29
$$ 94 122 42 -266 -212 -136 -316 -243 -62 17 -347 -243 93 115 -148 -215 -261 -58 -209 -173 104 -58 -492 -446 83
5016H3j34l23J77J41k24m2L49J58l27q7L32pk28Q2k66K04K61k98N09m60n5j49
$$ 83 -51 -374 -197 -56 -280 -322 27 185 -142 -229 103 96 -132 -50 -316 -112 149 -149 360 -100 -155 -304
5038c04K29l1o7J96J27k37J45P6r6N4j84K8M25n24j74O03q8k26j60K72n8l2j63
$$ -304 -75 -106 -173 23 150 -87 58 134 38 92 -92 -64 361 -163 -337 266 178 -48 -208 64 6 -26 -189
5061a89L98n1l29K12M59k81k50K19J14k56J64p1K54k15k02L82k38m6J5q0P4L31
$$ -189 209 158 -171 41 500 219 -31 188 302 46 210 139 393 178 -24 358 120 74 89 9 83 414
5083D14o41L47L48k90J94m65L78k46k33L84J53n60M71J71p07L92J0mj03J17j03
$$ 414 -227 120 468 178 372 -93 285 39 -194 190 343 -217 254 425 -282 110 120 116 13 130 27
5104B7J30r5j30J01k6j3k43J21N34k61n4n61M89q3rN7l30K36K65m4K17k65m28
$$ 27 157 62 -68 33 7 -6 -249 -128 406 145 91 -470 19 -64 -73 -16 -346 -110 155 111 328 63 -365
5127c65K58j18J53j55J32k72K78j84K0J47pJ29k97J7k03K55L49k26j97Q1O5j60
$$ -365 -107 -225 -72 -227 -95 -367 -89 -273 -253 -106 -113 16 -281 -264 -467 -212 137 -89 -286 -205 -140 -300
5149c00K83j17Lk1k09L77j56j72L12J20m72N49J57j92l82q6M43O5j88k44K04p8
$$ -300 -17 -134 -131 -152 -361 16 -140 -312 0 120 -352 197 354 162 -220 -306 137 202 14 -230 -26 -104
5171a04k5K16j46J11J43p9j18K68Q1j4l64p4J72K90l47k4J64Kj38n1R3J47p2k
$$ -104 -129 87 -59 52 195 116 -2 266 347 333 -31 -105 67 357 10 -14 150 152 14 -37 56 203 131 129
5195A29n%L66m39qK00k26k22Q1J09L10o6j77j01L8L2J51O7k99K7L22j15l73L79
$$ 129 124 124 490 51 43 243 17 -205 -124 -15 295 229 52 -49 -11 21 172 239 -60 -33 289 174 -199 180
5219A80P8k50J35N5Kj43j8M7o0K53p4k63r8m5k28L44N2K3j95L22k98J45N3Q9p7
$$ 180 258 8 143 198 200 57 39 86 26 279 205 -58 -156 -201 -429 -85 -33 -10 -205 117 -181 -36 17 106 29
5244B9o1n5j28k5o0L24oj06l93P79k21K03n89K51r0j18J56k12K53j47P5P2N3l2
$$ 29 -32 -87 -215 -240 -300 24 18 -88 -481 298 77 280 -309 -58 -148 -266 -110 -322 -69 -216 -141 -69 -16 -48
5268d8J11k05P1j39J06K02j63l31L88K24j48l28J68k6L31o33M93L1j59M0K98l06
$$ -48 63 -142 -71 -210 -104 98 -65 -396 -8 216 68 -260 -92 -118 213 -420 73 104 -55 -15 283 -23
5290b3J29m6J3l37l8N41k00j26J93j91L96m2m87M11q0j69K17k35K94p5%pj52L5
$$ -23 106 60 73 -264 -302 239 39 -87 106 -85 311 269 -218 193 113 -56 161 -74 220 145 145 138 -14 21
5314B1J6J90j26J50NJ55k2l45q5J27l5j42K75K15m37J96l37L68j00q2J08l31N06
$$ 21 37 227 101 251 256 411 389 44 -41 86 51 -91 184 399 -38 158 -179 189 89 7 115 -216 290
5337B90l44M22j08O3j41j19j33J4m2L10j73k25J73L3K08n74O12J39l20k80J94
$$ 290 -54 368 260 323 182 63 -70 -56 -98 212 39 -186 -13 20 228 -346 266 405 85 -195 -1
5358aJ75k18l33K88j2j08M03k38j35r0P43k92j43j63L15Po36L61R3J18j84j52
$$ -1 174 -44 -377 -89 -101 -209 194 -44 -179 -269 474 182 39 -124 191 198 -438 -77 16 134 -50 -202
5380b02J90R9N3k93k06L32m13K12J99O3o2n8p6o2J45q8L9K6l09M90Mj85j16k8
$$ -202 -12 87 140 -153 -359 -27 -440 -228 -29 34 -28 -86 -162 -224 -79 -167 -128 -102 -411 79 83 -102 -218 -246
5404b46Q7L6R5L79qn65n3pN84m31P7J65r1m6K53N4j64m2KJ63l63j43N28J35k14
$$ -246 -159 -123 -28 351 343 -222 -275 -282 302 -129 -52 113 22 -24 229 283 119 77 79 242 -121 -264 264 399 185
5429A85k68k4M72q1m08J49K57k42K3L48m17j9l44M87K24o19M72Q4k32N5J10N7
$$ 185 -83 -107 365 284 -124 25 282 40 63 411 -6 -25 -369 118 342 -277 195 279 47 102 212 269
5451B69j03k57L78J02l53K10j2k55O4k58M88K32o29Q3K05k71j54N87j65l56J14
$$ 269 166 -91 287 389 36 246 234 -21 43 -215 273 505 -124 -41 164 -107 -261 326 161 -195 -81
5472h1N19j70l79J15L02n0o06K91L29jk07k13J63K13k47j11L17l73qJ71M11n88
$$ -81 438 268 -111 4 306 256 -350 -59 270 269 62 -151 12 225 -22 -133 184 -189 -197 -26 385 -203
5494b03k04K80J57J63j51j07K58k80k00K33K19l97p9K36r2j9K41K60j46m55o3
$$ -203 -407 -127 30 193 42 -65 193 -87 -287 -54 165 -232 -311 -75 -167 -186 55 315 169 -286 -349
5515c49M44n9l12L43n2kn91L42N01l49l75L18M03l48k3k9J97k60o8L30J47m70
$$ -349 95 36 -276 67 15 13 -578 -236 265 -84 -459 -141 262 -86 -109 -138 59 -201 -269 61 208 -262
5537b62r9L14J47k65M5M40l40m18L86J63o7o31O37K70j14k14K43L1j95k4k92O95
$$ -262 -361 -47 100 -165 -120 320 -20 -438 -52 111 44 -587 50 320 206 -8 235 266 71 47 -245 450
5559D50l95j11J83l19J47J23J87K21n99k0P10k96j92J40J7k4n82N11L18m18k10
$$ 450 55 -56 127 -192 -45 78 265 486 -113 -133 577 281 89 229 246 222 -360 151 469 51 -159
5580a59K89K39k05k0K59k6j53j24j69M24k59k58K31k32L31J14J3j48l40J20K02
$$ -159 130 369 164 144 403 377 224 100 -69 355 96 -162 69 -163 168 282 295 147 -193 -73 129
5601A29j7n79M12K43k97K43K66k08J54o27L99k17j4J74J1k95k05K58O83l65k50
$$ 129 112 -467 -55 188 -109 134 400 192 346 -281 118 -99 -113 61 72 -223 -428 -170 513 148 -102
5622a02Pn2J55j97j59L85M6m90J62J90L70n98K90j55k69K63J68k01k61K12L94
$$ -102 -95 -147 8 -189 -348 37 83 -407 -245 -55 315 -283 7 -148 -417 -154 14 -187 -448 -236 158
5643A58l53n2O8K02l78J56J95K29l92k70M75l76K61L2K36k86K74m51K21J08r2
$$ 158 -195 -247 -179 23 -355 -199 -4 225 -167 -437 38 -338 -77 -45 191 -95 179 -272 -51 57 -35
5664c5J2J3J24l10M23l4j94P1L4k23J60j18J01j7j06J23J64Ml35J65J42j23J61
$$ -35 -23 -10 114 -196 227 193 -1 70 104 -119 41 -77 24 7 -99 24 188 192 -143 22 164 41 202
5687B02n07K81L03k43j46L80j23j70L13O5m49l6L18k39R9%j76N74l74k78j4N25
$$ 202 -305 -24 279 36 -110 270 147 -23 290 355 -94 -130 188 -51 48 48 -128 446 72 -206 -220 305
5709C05m0k30J07k96L26l49K85M35l98r9%j42L15j56j8j3K2Q9J25m07n2M94j5
$$ 305 265 35 142 -154 172 -177 108 543 145 46 46 -96 219 63 45 32 54 143 268 -139 -191 303 288
5732B88l54O6R9L7k81L02k08q9K89k74l3K6J11l31M00k8j88m6J10J05k7Qrj4j99
$$ 288 -66 0 99 136 -145 157 -51 -140 149 -125 -158 -132 -21 -352 48 20 -168 -214 -104 1 -26 -18 -27 -41 -240
5757b40J80K4m3j7L1l7q8M56l74J57k33LL95j12j32m4J39j36K4J6J50p7k72J32
$$ -240 -60 -36 -79 -96 -65 -102 -190 266 -108 49 -184 -181 214 102 -30 -74 65 -71 -47 -31 119 42 -230 -98
5781i8n2j67lN3K41Q5j50L16k83j3j84M56k9k44k3K1K05k56K20l5K31j66N5j71
$$ -98 -150 -317 -320 -267 -26 59 -91 225 -58 -71 -255 201 172 -72 -95 -74 131 -125 95 60 291 125 180 9
5805IP5J0K21m40J92J20J01N3n94l7L54J24J48j98m8P8r5J19J1n6j62K42k39l8
$$ 9 84 94 315 -125 67 187 288 341 -253 -290 64 188 336 138 90 168 73 192 203 147 -15 227 -12 -50
5829e0L36M8l5k63r4p2o0L29k59L27j86j36N14l74M75o80J22j61J76J12q2J14
$$ -50 286 334 299 36 -58 -130 -190 139 -120 207 21 -115 399 25 500 -180 -58 -219 -43 69 -13 101
5851A01Rlm1L5j91K15k22J28R7j16l8J81j73j40k9N39m35k44J74K05k59Q6j59
$$ 101 110 107 66 101 -90 125 -97 31 128 12 -26 155 -18 -158 -187 352 -83 -327 -153 52 -207 -121 -280
5874b80J78p5J0k4L88l12J32r0k03K23k0k4q9J30oK7k08J13L88J75n84K5M16m27
$$ -280 -102 -177 -167 -191 197 -115 17 -73 -276 -53 -73 -97 -186 -56 -62 -35 -243 -130 258 433 -151 -126 290 -137
5898a37o8L7K01k03l0L35l03j83J00m9K09m30O96j88l16M05K8k58K12k05j52M16
$$ -137 -205 -168 33 -170 -200 135 -168 -351 -251 -300 -91 -521 175 -13 -329 76 104 -154 58 -147 -299 117
5920A17m8K1k31K60J68p0l49J82L37k27k54J50K9j6j95O6M01l72K98m89L45K49
$$ 117 69 90 -141 119 287 217 -132 50 387 160 -94 56 85 69 -126 -60 341 -31 267 -222 123 372
5942C72m03M08l71J21J2lP8l7J66k46J34j94K56j11O6o3o4K7J9j45K60j79M8j98
$$ 372 -31 377 6 127 139 136 214 177 343 97 231 37 293 182 248 185 121 148 167 22 282 103 151 -47
5966d7L19n21J73L36j70j78p1M82l18J75r7J14j4j59j08j68K73j42LK18j42J7
$$ -47 272 -249 -76 260 90 -88 -159 323 5 180 83 197 183 24 -84 -252 21 -121 -118 100 -42 -25
5988b5k04k1J64j52M61l27l82M98K21j05k52m7K39Lp1Qp6j28J34j55K9M8j84J79
$$ -25 -229 -250 -86 -238 223 -104 -486 12 233 128 -124 -171 68 71 0 8 -68 -196 -62 -217 -188 -140 -324 -145
6012a45O3P7o2J67m03K48qj42j52M3J98J84R6j26l46L47l03k04N08j20jK39j26
$$ -145 -82 -5 -67 100 -303 -55 -63 -205 -357 -314 -116 68 164 38 -308 39 -264 -468 40 -80 -81 158 32
6035C2J68o41O07k71j66L75J5J16m2k85k62N05J43o27N24j68n3O0J82k66J28J46
$$ 32 200 -441 166 -105 -271 104 119 235 193 -92 -354 151 294 -333 191 23 -30 30 212 -54 74 220
6057B20m5k7j65L38j87l5j51J99k14K80j84k41L57K21l62j02K62k39PL44k12J31
$$ 220 175 148 -17 321 134 99 -52 147 -67 213 29 -212 145 366 4 -98 164 -75 -68 276 64 195
6079A95m95P53k14rp1j91K2Ll76N68l8j31q0n3J47m19N60m2k3q5N4K0j43o5R9
$$ 195 -300 453 239 230 159 -32 -10 -7 -383 185 147 16 -64 -117 30 -389 171 129 106 21 75 95 -48 -113 -14
6104a4J62k19m36L77L69k60l7J42L4j99J73k19J71k62K00n7M63o57J13J49o9k16
$$ -14 148 -71 -507 -130 239 -21 -58 84 118 -81 92 -127 44 -218 -18 -75 388 -269 -156 -7 -76 -292
6126b92J45K21r6m2J01J79m76K07j52O7Q6J15j03k3l81J72L75O7n02J24j2K30
$$ -292 -147 74 -22 -64 37 216 -260 -53 -205 -138 -52 63 -40 -63 -444 -272 103 170 -332 -208 -220 10
6148A0m5K39k04M0N3j76K03Q5l65j21N16n54J43J86M09q46R4J21K90j07L6LL3
$$ 10 -35 204 0 40 93 -83 120 205 -160 -281 235 -319 -176 10 419 -427 -333 -212 78 -29 7 10 43
6171D3k31L42P7k45j22k26O88k54j93J36N49m40q0K85r2j60j04J28j84j17L31
$$ 43 -188 154 231 -14 -136 -362 326 72 -121 15 564 124 44 329 237 77 -27 101 -83 -200 131
6192A31K06J2o28J05J25K55l69K93j72O5o7r0M49l22k50J91M74l22m7q9L9k36
$$ 131 337 349 -279 -174 -49 206 -163 130 -42 23 -44 -134 315 -7 -257 -66 408 86 39 -50 -11 -247
6214b47J40M31k05J21j22j2m3J28j64K3P9m16J88J48Q8j38j31j14L24J39j07l88
$$ -247 -107 324 119 240 118 106 63 191 27 50 129 -287 -99 49 137 -1 -132 -246 78 217 110 -278
6236b78O6n5L56m44M58o8O2R2k64p2J98j92k76Q4M48l5j26j61M99l13ooJ31k25
$$ -278 -212 -267 89 -355 103 35 97 189 -75 -147 51 -141 -417 -333 115 80 -46 -207 292 -21 -27 -33 98 -127
6260a27j91K34j0m60M42N6j60K34k4J98j71N5j83n5J22j64J07K43l12J81k75J41
$$ -127 -318 -84 -94 -554 -112 -56 -216 18 -6 192 21 76 -107 -162 -40 -204 -97 146 -166 15 -260 -119
6282a19N9n1M6L52n17j55L67K46m65J60K3N4K52l61K04k53j03K49L28l11j96K23
$$ -119 -60 -111 -65 287 -230 -385 -18 228 -237 -77 -54 0 252 -109 95 -158 -261 -12 316 5 -191 32
6304C2n9j53J50J82O7l99r7L65Mk08R5R8j12K37j58K60j05j28O5q6j26m1J56J5
$$ 32 -27 -180 -30 152 219 -180 -277 88 92 -116 -21 77 -35 202 44 304 199 71 136 50 -76 -117 39 54
6328E4j54k36O55P7k87l12J64K67j59l95N64K50m03J02k43K72p2q7ml1j36J48
$$ 54 -100 -336 319 396 109 -203 -39 228 69 -326 238 488 85 187 -56 216 144 57 53 22 -114 34
6350C4N7j63n0K74j61j7J47J3k67J10r0J85j58JJ60m1J8j25J42k6r2J96k79J12
$$ 34 91 -72 -122 152 -9 -26 121 134 -133 -23 -113 72 -86 -85 75 34 52 -73 69 43 -49 147 -132 -20
6374b0n1J31j51J52j13l07K45J92j6j50j62M48k57j69M4J90J89k92J16k6j11J31
$$ -20 -71 60 -91 61 -52 -359 -114 78 62 -88 -250 198 -59 -228 -184 6 195 -97 19 -7 -118 13
6396A3k78J46P0Pk17N23n21J50K82j56j95k97L15Oj95L8L35k16o1K10n5j8L5K43
$$ 13 -265 -119 -49 -42 -259 264 -257 -107 175 19 -176 -473 -158 -152 -347 -309 26 -190 -251 -41 -96 -114 -79 164
6420A64j64k29L68j38j96J3M43l6J3l13J53k06j53M50j38j11K51l99K27N8K28
$$ 164 0 -229 139 1 -195 -182 261 225 238 -75 78 -128 -281 169 31 -80 171 -228 -1 57 285
6441B85k29J80l01P1OJ23m2R2j87O4Q6j69M8J2R0k71J76kJ79l89L54l44J06j54
$$ 285 56 236 -65 6 12 135 93 185 -2 62 148 -21 27 39 129 -142 34 32 211 -178 176 -168 -62 -216
6465b16M06J76k01r0k94J97m4R5Rk20m1J17lK89Rl63K96O5j50L0n2L6j46K43p0
$$ -216 190 366 165 75 -219 -22 -66 29 38 -182 -223 -106 -109 180 189 -174 122 187 37 67 15 51 -95 148 78
6490G8m52K16L54j92p7k44L94j04j2R3Q9m67J28K9J9L42l71L43j61Q8j94J87l9
$$ 78 -374 -158 196 4 -73 -317 77 -27 -39 54 143 -324 -196 -167 -148 194 -177 166 5 93 -101 86 47
6513D7j82j31K72K11k99j05K20k33J17J04L1r1l2o5L6J00j27L3q2K4J84l32L16
$$ 47 -135 -266 6 217 -82 -187 33 -200 -83 21 52 -39 -71 -136 -100 0 -127 -94 -176 -152 32 -300 16
6536A6j2OQ1j96m6M47j62j97p7J07K27k41j9j65L01j8J20J33j97m28M70k97K71
$$ 16 4 10 91 -105 -151 296 134 -63 -140 -33 194 -47 -66 -231 70 52 172 305 108 -320 150 -147 124
6559A24j41J72k56j05J01M43m56L23m46K20n8J94J76m87K73p3J36n5K8J5r2l5
$$ 124 -17 155 -101 -206 -105 338 -118 205 -241 -21 -79 115 291 -196 77 4 140 85 113 128 36 1
6581AP4n8p3j29J78J30k01J41N7k39J48K8L00k77l37K48J92m12K42M27n47K34
$$ 1 75 17 -56 -185 -7 123 -78 63 120 -119 29 57 357 80 -257 -9 183 -229 13 440 -107 127
6603A27p7L9J02j41J50j44Lj80L61j43j67%L2J8o0p9J03j59K82Q4k08m8N7r8P5
$$ 127 50 89 191 50 200 56 59 -121 240 97 -70 -70 -38 -20 -80 -159 -56 -215 67 151 -57 -105 -48 -146 -71
6628g1K57p9j55K04k03PJ9r4n8k0J71n3K04o2q7l8j29K01j75J10J72J57n16N7
$$ -71 186 107 -48 156 -47 -40 -21 -115 -173 -193 -22 -75 129 67 -20 -58 -187 14 -161 -51 121 278 -238 -181
6652a81K46p7L05l50O0l14M73O5j82j73J53o3k03N26n89J21K54k93K82K01l64
$$ -181 65 -12 293 -57 3 -311 162 227 45 -128 25 -38 -241 285 -304 -183 71 -222 60 261 -103
6673a03K25q8L67k69k37L12m31K79R1k83K71j29J63l4m18O98m66J53j96K51J80
$$ -103 122 34 401 132 -105 207 -224 55 146 -137 134 5 168 134 -284 414 -52 101 -95 156 336
6694C36j86k36M38k18J36l04mQ0J55k83M08l18j03M10k48mj22P8m80O90j04O6
$$ 336 150 -86 352 134 270 -34 -38 42 197 -86 322 4 -99 311 63 59 -63 15 -465 225 121 187
6716A87l86P3M7O6K36j98K01j26l28J36J15J08o7j03n4k42K88N9j50l5p9K96M0
$$ 187 -199 -126 -79 -13 223 25 226 100 -228 -92 23 131 64 -39 -93 -335 -47 12 -138 -173 -252 44 84
6739H4j1J11o13Q84o59OL4J86J14j60M6Q5Nl99J54Q0J8j41K29nL7j96n0K09m55
$$ 84 73 184 -429 455 -204 -198 -164 22 136 -24 22 107 112 -287 -133 -53 -35 -176 53 48 85 -111 -161 48 -407
6764d07N05j17m2k08J35K04p5mj77N9K28k7J40l88m1JK90k6L82n94o8K9J27j92
$$ -407 98 -19 -61 -269 -134 70 -5 -9 -186 -127 101 74 214 -174 -215 -214 76 50 432 -162 -230 -201 -74 -266
6788b66J95J8J91m23L12M9r0k49L81l4n3o1K56k28j18J17m3P0j58M40m0k89j25
$$ -266 -71 -53 138 -285 27 76 -14 -263 118 84 31 -30 226 -2 -120 -3 -46 24 -134 306 266 -23 -148
6811a48M44l12J28l89M59j50K83m55J78M00l91k78M10j78J23J49j0r4l51K63m3
$$ -148 296 -16 112 -277 182 32 315 -140 38 438 47 -231 179 1 124 273 263 169 -182 81 38
6832C8J68j51J14m4k00K23l19K09J37l13L85q1k33J65j81K15r3m7rl9J70J74j63
$$ 38 206 55 169 125 -75 148 -171 38 175 -138 247 166 -67 98 -83 132 39 -8 -17 -56 114 288 125
6855A25k7k79O6J94K1Lq1K59l63J61K20k80j7nr9J15j59K29P7K30p56O4L65k5
$$ 125 98 -181 -115 79 100 103 22 281 -82 79 299 19 2 -3 -102 13 -146 83 160 390 -366 -302 63 38
6879C8k50L65k43j76j89N10J26k49LoK60m24q9J61O5j4j03M8J35Kj42K32J7j06
$$ 38 -212 153 -90 -266 -455 55 181 -68 -65 -71 189 -235 -324 -163 -98 -112 -215 -167 -32 -30 -172 60 77 -29
6903b9K58j64q7n17N28K40l31k10K93m9J51q2K03o0j26p0j08J35K37l68K78p4
$$ -29 229 65 -22 -539 -11 229 -102 -312 -19 -68 83 1 204 144 18 -52 -160 -25 212 -156 122 48
6925D8k51K76m0n6rL34n06J82P6K72l71l84J30M26k17j71K40L24Q6n48K61Nj16
$$ 48 -203 73 33 -23 -32 302 -204 -22 54 326 -45 -429 -299 127 -90 -261 -21 303 389 -159 102 107 -9
6948ij28J73r0N4J53J09j08j85m1K56J51l34j85L31J32k44k03J58K16k08j17L82
$$ -9 -137 36 -54 0 153 262 154 -31 -72 184 335 1 -184 147 279 35 -168 -10 206 -2 -119 263
6970B63k55k33K33q2K17P0l58J82K72o12K78L4K0J7l72L28J87o7N0j15k22j69
$$ 263 8 -225 8 -74 143 213 -145 37 309 -303 -25 9 29 46 -326 2 189 122 172 57 -165 -334
6992c34K99rm8p0M21q0m57L72j44k38J64Q3Q8j05J25j27M2J94m64N18j5k43k03
$$ -334 -35 -44 -92 -162 259 179 -278 94 -50 -288 -124 -41 47 -58 67 -60 -18 176 -288 230 215 -28 -231
7015b31J23O0lk52M52l74O3j93J21j5L15k92M11j59r8L8J32K8m32N05J20l29o1
$$ -231 -108 -48 -51 -303 149 -225 -162 -355 -234 -249 66 -226 185 26 -72 -34 98 126 -306 199 319 -10 -71
7038g1j54KK42Jk3P3j2l84N33m17L36j99K12k69q6L90k78J45j65K59k46p4L8K66
$$ -71 -225 -223 19 20 -3 70 58 -326 207 -210 126 -73 139 -130 -216 174 -104 41 -124 135 -111 -185 -147 119
7062A19o0L3j1j37L62j40l49K85l4j2K46m04P3L0k65O27k98J10J34j00m44M30
$$ 119 59 92 81 -56 306 166 -183 102 68 56 302 -102 -29 1 -264 363 65 175 309 209 -235 195
7084A95k61o9K32r3R9R6k85J20Q1O0l35J94j06M7M7j55J5Q6N7j43L01k27K1k94
$$ 195 -66 -135 97 4 103 199 -86 34 115 175 -160 34 -72 -25 22 -133 -118 -32 25 -118 183 -44 -23 -317
7108c17N14l86J49m8J42N0j21M0r2J43n1o5J8M8r7J36M4l27K76k92L51k88K79
$$ -317 197 -189 -40 -88 54 104 -17 23 -69 74 23 -42 -24 24 -73 63 107 -220 56 -236 115 -173 106
7131A06K0k88o7O4J05k30N3J89k95L37j67m1K00j6l3O5o8Nk39J61K8k15L1K39
$$ 106 126 -162 -229 -165 -60 -290 -237 -48 -343 -6 -173 -214 -14 -30 -63 2 -66 -61 -300 -139 -111 -326 -295 -56
7155e6m8L30l10J99J61l95M9N2J75j91J40k02K07j59J73k83K57k91L17Q9m28K56
$$ -56 -104 226 -84 115 276 -119 -70 -18 157 -34 106 -96 111 -48 125 -158 99 -192 125 214 -214 42
7177D2o0L15k03k5P7lR5k19j50M03j53K5K66m32o9L87j33k08O0j02L01k66L95
$$ 42 -18 297 94 69 146 143 238 19 -131 272 119 144 410 -22 -91 296 163 -45 15 -87 214 -52 343
7200C43j43M6j47k19o0K47p0N9K88m75O2K59J33k34j23L2j11P7r5q6K80k47M57
$$ 343 200 246 99 -120 -180 67 -3 56 344 -131 -69 190 323 89 -34 -2 -113 -36 -131 -217 63 -184 273
7223B73k15L9j84J90K44m82K99N5l06m1K16l0N3k2M3j70l7p4J10K42k92l4j87
$$ 273 58 97 -87 103 347 -135 164 219 -87 -128 88 58 111 89 132 -38 -75 -149 -39 203 -89 -123 -310
7246c10L94Jl57K33J91p0k08J78j30mJ3J72k98L07j37k91L66j35O1J5k08K2J19
$$ -310 84 85 -272 -39 152 82 -126 52 -78 -82 -69 103 -195 112 -25 -316 50 -85 -24 -9 -217 -195 -76
7269g6N9J35p2M8k74K4j2J35K58l07Q8n2n6k4J08K17L8l53Kj16j27K59K62k61
$$ -76 -17 118 46 94 -180 -156 -168 -33 225 -82 6 -46 -102 -126 -18 199 237 -116 -114 -230 -357 -98 164 -97
7293i7mJ73l8j9j89J69Q7J09j53O7l49L06P7J10j19j2M5J75l66K51L7j72M3K84
$$ -97 -101 72 34 15 -174 -5 82 191 38 105 -244 62 139 249 130 118 163 338 -28 223 260 88 131 415
7317D15m38R2l3m2m3J12q3K86k26J20j27J32m23J96J09k76L56o9j88L59j73J1
$$ 415 -23 69 36 -6 -49 63 -20 266 40 160 33 165 -258 -62 47 -229 127 58 -130 229 56 67
7339F7J04J54k08k65K80J84k34J87j65k21K08L2Q5l84L22r3k8k8p8K98l88K30
$$ 67 171 325 117 -148 132 316 82 269 104 -117 91 123 208 -176 146 53 25 -3 -81 217 -171 59
7361E9K6n0J08m88N04j54k37K18j88J25J68l61K22O4j41N4j51J92%n7pM5P8j76
$$ 59 85 35 143 -345 159 5 -232 -14 -202 -77 91 -270 -48 16 -125 -71 -222 -30 -30 -87 -94 -49 29 -147
7385a47K95j40k35J74P8k64J65k0n3j23Q4r6J20M12l72O4q5qM6J72J05p2r2KK34
$$ -147 148 8 -227 -53 25 -239 -74 -94 -147 -270 -186 -282 -162 250 -122 -58 -143 -151 -105 67 172 100 8 10 244
7410B44m13J8n3J40J69j21j64J57j62J14k99M02p5J40q1rK56l3n03J47K31Q5j70
$$ 244 -169 -151 -204 -64 105 -16 -180 -23 -185 -71 -370 32 -43 97 16 7 263 230 -273 -126 105 190 20
7433B0m3J86j61K65k66l01L30N5l76M86m90M37R8k18N1q7l9J70N0p5j17j10P6
$$ 20 -23 163 2 267 1 -300 30 85 -291 195 -295 142 240 22 73 -14 -53 117 167 92 -25 -135 -59
7456e9j57J41J37qj9P0j07K53l93N25l53N4k05R4Q9Q2k75k2p9J67l4j01J62J02
$$ -59 -216 -75 62 54 35 105 -2 251 -142 383 30 84 -121 -27 62 144 -131 -153 -232 -65 -99 -200 -38 64
7480F4m8K3l8p7K90o6q1R8j37M2o5j31l0N08m89k80K70R3q0r4J61j3O3r7L7j03
$$ 64 16 39 1 -76 214 148 67 165 28 70 5 -126 -156 352 -137 -417 -147 -54 -134 -228 -67 -80 -17 -114 -77 -180
7506a80P4L18k90k0j51K69k30J20n8R7K85k82p7k23N30l07K07p7Q3k17k17L86
$$ -180 -106 212 -78 -98 -249 20 -210 -90 -148 -51 234 -48 -125 -348 182 -125 82 5 88 -129 -346 40
7528D0j59O6j71J98J45l79M34k67M3j76J9L73j77l4J29L15l57j35K83k54J04J83
$$ 40 -119 -53 -224 -26 119 -260 174 -93 -50 -226 -207 166 -11 -45 84 399 42 -93 190 -64 40 223
7550B23k75J19r1j20N8J39l91K51M22l55k72L64j40K93l33J55J92p44L88K49j74
$$ 223 -52 67 -24 -144 -86 53 -338 -87 335 -20 -292 72 -68 225 -108 47 239 -505 -117 132 -42
7571d2K03M1l56N08l69k13M08j5j78L9P6k44J20J27L33n98o8K1J69P7j59J57j4
$$ -42 161 202 -154 354 -15 -228 180 165 -13 26 102 -142 -22 105 438 -160 -228 -207 -38 39 -120 37 23
7594B3Pj08K40j19J16k90J66K35j17j06J00j53n8J71k25K90j91k61J34L02j35
$$ 23 30 -78 162 43 159 -131 35 270 153 47 147 -6 -64 107 -118 172 -19 -280 -146 156 21
7615B1L6L11m22J48j0Q9j75k3j32Q0j01kJ63k1O8n2j62K20j34J24o2L9J11p3n6
$$ 21 57 368 -54 94 84 173 -2 -25 -157 -77 -178 -180 -17 -38 30 -22 -184 36 -98 26 -36 3 114 41 -15
7640a5K9n1J23l1r7k01K64Q7l29L6K85j69j72K47j0o8Q5m4Q0j63M03l86p1J71
$$ -15 14 -37 86 55 -42 -243 21 108 -221 -185 100 -69 -241 6 -4 -72 13 -31 49 -114 289 -97 -168 3
7664CN2N2j70k17K84J00m31K72K58m42L86l23M19k60l1K82k24j80o1L94m15M47
$$ 3 55 107 -63 -280 4 104 -327 -55 203 -239 147 -176 243 -17 -48 234 10 -170 -231 163 -252 195
7686A95J9k29L25J4l77j27j12K14M22k46M9K8o9j47l2J99l05K75m8j0J16k83K06
$$ 195 214 -15 310 324 -53 -180 -292 -78 344 98 147 175 106 -41 -73 126 -179 96 48 38 154 -129 77
7709G7l6N2k92J32K57l32j24M45n1j69K63J29k94k15K06MJK66m48K9J78j37J69
$$ 77 41 93 -199 -67 190 -142 -266 179 128 -41 222 351 57 -158 48 52 53 319 -129 -100 78 -59 110
7732A10l73J79O1L39k65j8K0J28k1o6%J91k63l12K25l5L7J3J58J19m13k6K90j92
$$ 110 -263 -84 -23 316 51 33 53 181 160 94 94 285 22 -290 -65 -100 -63 -50 108 227 -186 -212 78 -114
7756a14J31p4K1J16J18r4l0j3J00J80n42L29l23J29K36l58K84j87J03j35J2K45
$$ -114 17 -57 -36 80 198 104 74 61 161 341 -201 128 -195 -66 170 -188 96 -91 12 -123 -111 134
7778A34j52k68J21J47O0q7j45M40m62L54l53L84L0m23M6J99j55L51l94J25j52
$$ 134 -18 -286 -165 -18 42 -45 -190 250 -212 142 -211 173 203 -220 -174 25 -130 221 -173 -48 -200
7799b00J36M0K49k81k07L18j40j86L00r4l7J23l7K75k02p6N2J46l15k07L16K13
$$ -200 -64 -24 225 -56 -263 55 -85 -271 29 -65 -102 21 -16 259 57 -19 33 179 -136 -343 -27 186
7821A86j59Ok1j36o6J16J03l4J67J09k4o0j15k88J31r8O9L1K80P5n7m9l78K69
$$ 186 27 33 12 -124 -190 -74 29 -5 162 271 247 187 72 -216 -85 -183 -114 -83 197 272 215 166 -212 57
7845E7P2l97K11J41j72J20J13p6K74j73j64K27l28J88Op3o9M0J69Pk92P5K39j20
$$ 57 129 -268 -57 84 -88 32 145 69 343 170 6 233 -95 93 99 26 -43 -3 166 173 -119 -44 195 75
7869G5j69K30k53J60J83k12M7j75j22J62R7K46l45J54p9K81j01%m47J92R2j91
$$ 75 -94 136 -117 43 226 14 61 -114 -236 -74 23 269 -76 78 -1 280 179 179 -268 -76 16 -175
7891a75pJ33K00j37ok63l0P7J7O6K44p5m10K02K12J88k90r9L76r7j41j30J34M
$$ -175 -182 -49 151 14 8 -255 -285 -208 -191 -125 119 44 -366 -164 48 236 -54 -153 223 126 -15 -145 -11 -7
7915gj10Q9J23k52J21o4R5j09L1K59k28p3Q6l50J08J43J56no5J44L4O9k4j27Q5
$$ -7 -117 -28 95 -157 -36 -100 -5 -114 -83 176 -52 -125 -39 -389 -281 -138 18 13 -52 92 126 195 171 44 129
7940A29j59J25O2l20R1L50j47J27k51k80P75m55K5J1r8L11n0j01k14j65K57j25
$$ 129 -30 95 157 -163 -72 278 131 258 7 -273 502 47 72 83 -15 296 246 145 -69 -234 23 -102
7962a02K23n0j84L08l07K68j64J04L46l69l02M54R8k30j74N0lM1J8l3J59J82n30
$$ -102 121 71 -113 195 -112 156 -8 96 442 73 -229 225 323 93 -81 -31 -34 7 25 -8 151 333 -197
7985a97M82j44l61L47P9p5j00j1l24K71K51j58m0O0r3M3j22oR2N3k31L39j84l44
$$ -197 285 141 -220 127 206 131 31 20 -304 -33 218 60 20 80 -13 30 -92 -98 -6 47 -184 155 -29 -373
8009c73M46MK72m40J05l40N09k64m1k23L31j41O0J40j07J34k59o5K14J09j22j39
$$ -373 73 77 349 -91 14 -326 183 -81 -122 -345 -14 -155 -95 45 -62 72 -187 -252 -38 71 -51 -190
8031a90P1O41o97j61M67j91J28m3j63K00j03K0j39j0K28j74K39J7k57K53l06L06
$$ -190 -119 522 -175 -336 131 -60 68 25 -138 62 -41 -21 -160 -170 58 -116 123 140 -117 136 -170 136
8053A36p3j85J05J27R9Q4j03j45J48J63o85M80r9N6r8P7J27j03J1q5rJ0j42RK39
$$ 136 63 -122 -17 110 209 293 190 45 193 356 -329 151 52 108 10 87 214 111 122 37 28 38 -104 -95 144
8078A44l32K17K3M2k24J94J4m5Q2j94J22j6k10j62M56k15K15j19J77j74P4ol89
$$ 144 -188 29 52 94 -130 64 78 33 115 -79 43 27 -183 -345 111 -104 111 -8 169 -5 69 63 -326
8101c26K03K65j58J51l03L10P7j99k54J60j18M8K5LK03k95J68k20J58J0R6j83
$$ -326 -123 142 -16 135 -168 142 219 20 -234 -74 -192 -144 -119 -116 87 -208 -40 -260 -102 -92 4 -179
8123a79J67l9n7m4K93J06j89k77J28l1R0k3k03J70J47j95J03J0J22P6k7o29O58
$$ -179 -12 -51 -108 -152 141 247 58 -219 -91 -122 -32 -55 -258 -88 59 -136 -33 -23 99 175 148 -481 177
8146A77m9k8k68N7J60L2j76Q6n4l1K37k0l58J46K51l17R4L58o85M05p8j00L14
$$ 177 128 100 -168 -111 49 81 -95 -9 -63 -94 143 123 -235 -89 162 -155 -61 297 -388 17 -61 -161 153
8169A53j72K1k23J09K99j01j04J24j40k12J66%M6K24k66j09J38J80j47K19l76
$$ 153 -19 2 -221 -112 187 86 -18 106 -34 -246 -80 -80 -34 190 -76 -185 -47 133 -14 205 -171
8190a71L33
$$ -171 162
8191A62
$$ Imaginary data points
##PAGE= N=2
##DATA TABLE= (X++(I..I)), XYDATA
0@%%%%%%%Qj6J6j6K4l2L2m0N3o1P1q6J02j18J34j53J77k06K35k64L01l44L87m32
$$ 0 0 0 0 0 0 0 0 8 -8 8 -8 16 -16 16 -24 29 -32 39 -47 55 -63 71 -82 95 -111 124 -140 161 -183 204 -228
31b28M87n48O11o79P54q40R34j034J146j269J402j550J717j906K117k354K624
$$ -228 259 -289 322 -357 397 -443 491 -543 603 -666 736 -814 903 -1003 1114 -1240 1384
48A384k938L305l738M265m921N756o861Q401j0693J4454k1665M0158j66327l76807
$$ 1384 -1554 1751 -1987 2278 -2643 3113 -3748 4653 -6040 8414 -13251 26907 -139420 -516227
62e16227M97764L80123l48803l20005L07376K37519k76870k03521K53786J64647
$$ -516227 -18463 361660 12857 -307148 228 237747 -39123 -242644 11142 175789
72A75789j96456j23261J45105N1321j05765K3559J18152o3676j29776O1711J15119
$$ 175789 -20667 -143928 1177 52498 -53267 -29708 88444 24768 -105008 -43297 71822
83G1822p0316r1977R3170J03245q6780j02870O8206R0878o2915q5525N2347Q4554
$$ 71822 1506 -90471 2699 105944 19164 -83706 -15500 75378 12463 -73062 -20715 63839
95F3839l6469p3610K3665O0754j7630m3439K5589L7937l6506m8337L0771N5765
$$ 63839 27370 -46240 -22575 38179 20549 -22890 2699 40636 4130 -44207 -13436 42329
107D2329r184l9981k903J2329l687N675J0918j7672j5692K8862J4804m4678j2779
$$ 42329 33145 -6836 -9739 2590 -1097 4578 15496 -2176 -17868 10994 25798 -18880 -31659
120c1659P2792K6052r8336o1592R3376Q7296p6478j08255M5341J18447j846r8354
$$ -31659 41133 67185 -31151 -92743 633 87929 11451 -96804 -51463 66984 65138 -33216
132c3216k8672O4622L0263n0442k8240N2257M5085m2394n7834K8205O3113j1728
$$ -33216 -61888 2734 32997 -17445 -45685 6572 51657 9263 -48571 -20366 42747 31019
144C1019o0000o729L9491J3313o861P093j312j6328Q920J6730l2237k9918N2067
$$ 31019 -28981 -35710 3781 17094 10233 17326 16014 -314 8606 25336 -6901 -36819 15248
157A5248N4207n4773o9309N2027P7144m4931p5523L2486N4189l7576l5996N5818
$$ 15248 69455 14682 -54627 -2600 74544 29613 -45910 -13424 40765 3189 -32807 23011
169B3011L6793o1218m2294N0276L2993m1566k2949L0679M140k7091J2866L1485
$$ 23011 59804 -1414 -43708 6568 39561 -2005 -24954 5725 9865 -17226 -4360 27125
181B7125j8509l1447J7384J7386k9822j1433M2529J2924n0958j7005N4337K2216
$$ 27125 8616 -22831 -5447 11939 -17883 -29316 13213 26137 -24821 -41826 12511 34727
193C4727n3970k9677M5756K9832l8192k9403L3050L0248k1477k2416J7143J3905
$$ 34727 -19243 -48920 -3164 26668 -11524 -40927 -7877 22371 894 -21522 -4379 9526
205I526k0974j7225J7629K2059l481j5381m260R062J2276K801j4942j5924R633
$$ 9526 -11448 -28673 -11044 11015 7534 -7847 -12107 -3045 9231 12032 -2910 -18834 -9201
218i201K3244k106k0763M106K5684m27k9247j1326J7070J2592n114l398M523o20
$$ -9201 14043 11937 -8826 -4720 20964 20537 -8710 -20036 -2966 9626 4512 1114 5637 5017
232E017o385j055P409O659n546k1931j0083K5793K9797j5903l4551P319K9136
$$ 5017 -1368 -2423 4986 11645 6099 -15832 -25915 -122 29675 13772 -20779 -13460 15676
245A5676j2459l2018J5473L5364j3257l4462J4255L2688j3853k8524J3532K2002
$$ 15676 3217 -28801 -13328 22036 8779 -25683 -11428 21260 7407 -21117 -7585 14417
257A4417j6360j8370J5742J3886q758J141J3050j2967k0857J5448K3581j7943
$$ 14417 -1943 -20313 -4571 9315 557 1698 14748 1781 -19076 -3628 19953 2010
269B010j9848K7394K1077l2655k4423L7578K9305l6951l2787L0795L1837k4767
$$ 2010 -17838 9556 30633 -2022 -26445 11133 40438 3487 -29300 1495 33332 8565
281H565k4557K2919K2346j6786j7542Q506M096r693N432J2564q958j2826J1901
$$ 8565 -15992 6927 29273 12487 -5055 3451 7547 -2146 3286 15850 6892 -5934 5967
294E967J0905j6190q770J9043L140k9317m564L7016J0480l7954j6116L3812J6488
$$ 5967 16872 682 -8088 10955 14095 -15222 -19786 17230 27710 -10244 -26360 7452 23940
307B3940l2447k0026K2373J5056j4710n953J4951J849j4651j514Q362k478n153
$$ 23940 -8507 -28533 -6160 8896 -5814 -11767 3184 5033 -9618 -11132 -2770 -5248 -10401
320a0401M693O94m509Q524J0644j4392j7632J6448K2806j7955k7716J6464L1394
$$ -10401 -5708 -5014 -9523 -999 9645 -4747 -22379 -5931 16875 -1080 -28796 -12332 19062
333A9062q083k4866Q092K0029j0745k0362O831J7661P43q649k362J664N010O599
$$ 19062 10979 -13887 -5795 14234 3489 -16873 -10042 7619 8362 -287 -2649 -985 4025 10624
347A0624q018j7537N923K3834l710k8222K195L3292K834l2714p010K5978K765
$$ 10624 2606 -14931 -9008 14826 11116 -17106 -14911 18381 21215 -11499 -18509 7469 10234
360A0234k4893o23K5622L819j9225n106J0300K198l624m16n687n304J2986J3331
$$ 10234 -14659 -15282 10340 14159 -5066 -10172 128 2326 -1298 -1714 -7401 -12705 281 13612
374A3612j4772j7083J6175J9442j7344k1879J6797J9780j7343j4529K2948J7371
$$ 13612 -1160 -18243 -2068 17374 30 -21849 -5052 14728 -2615 -17144 5804 23175
386B3175k3398k0215J9388J6849j5621j2080J4620R578j0330k459R220k056o674
$$ 23175 -223 -20438 -1050 15799 178 -11902 2718 12296 1966 -493 8727 6671 -3
399cO979N431j2855o529J5804P803j2694j232J3322o943k2604O995K9076l060
$$ -3 6976 12407 -448 -6977 8827 16630 3936 2704 16026 9083 -13521 -6526 22550 19490
413A9490k9591j229K5765K007k1113J107J7725n907k1807J802J8254K150q762
$$ 19490 -10101 -11330 14435 16442 -4671 -3564 14161 8254 -13553 -11751 6503 8653 -109
426a09J00J899o790j041O407j654o050N965O244j2486j0052J8155J7373j6408
$$ -109 -9 1890 -4900 -5941 466 -1188 -7238 -1273 4971 -7515 -17567 588 17961 1553
440A553k2265P984J7228p819r124J5140J2447j7688j8033J2087J8673m892j4328
$$ 1553 -20712 -12728 4500 -3319 -12443 2697 15144 -2544 -20577 -8490 10183 5291 -9037
453i037m52P054K547r03M67J232K589q6q991q291R826J7021m500j5134K567J2791
$$ -9037 -9489 -2435 112 -791 -324 908 3497 3411 -5580 -13871 -4045 12976 8476 -6658 -4091 8700
469H700n915j4123O389J7313n415j9397l9J6580O881o703o292k253N10K691K2
$$ 8700 2785 -11338 -4949 12364 6949 -12448 -12487 4093 10974 4271 -2021 -4274 -3764 -1073 -1051
484a051m236K575R452k916j4970K05J7866J287k0258m578K0457O500j8989n786
$$ -1051 -5287 -2712 6740 3824 -11146 -10941 6925 8212 -12046 -16624 3833 10333 -8656 -14442
498a4442J9435Q132j5608j0098Q080O943j798j405j22j249M025O932o301j0430
$$ -14442 4993 13125 -2483 -12581 -4501 2442 644 -761 -883 -2132 1893 8825 2524 -7906
512g906P490J3060r171j5871J2608K2454j2685k6534J0779K9552n816l0992n78
$$ -7906 -416 12644 3473 -12398 210 22664 9979 -16555 -5776 23776 17960 -13032 -13610
525a3610K7072N132j9535m102J5137M469j2631o587M181P117L382n041j1082k4
$$ -13610 13462 18594 -941 -5043 10094 14563 1932 -4655 -474 6643 10025 4984 -6098 -6122
539f122J7752N440k0609j1747K1337J3959k3326j8967K3461K4119j9983k6737
$$ -6122 11630 17070 -3539 -15286 6051 20010 -3316 -22283 1178 25297 5314 -21423
551b1423J2951K3756j0083k0350O563J5596l921j0969J350O696J915P11n621j0124
$$ -21423 -8472 15284 5201 -15149 -8586 7010 3089 -7880 -6530 166 2081 2792 -2829 -12953
565a2953L650J7286p73k0425N97K4645j04k8914l113L1540O838k9563q746K5685
$$ -12953 -9303 7983 7210 -13215 -12618 12027 11923 -16991 -20104 11436 18274 -11289 -20035 5650
579E650Q686k0563m873J9246M001j8094q203R635R179M560j509j3775j0042J5152
$$ 5650 14336 -6227 -11100 8146 12147 -5947 -14150 -4515 4664 9224 7715 -6060 -16102 -950
593i50J8061j4295k1034J4736K1355j9430k5302K2513L3311j8403l7507R380L2994
$$ -950 17111 2816 -18218 -3482 17873 -1557 -26859 -4346 28965 10562 -26945 -17565 15429
606A5429n552k6182N161K2669l024j8917j511J1745M817k623n263p199J897J5257
$$ 15429 9877 -16305 -11144 11525 8501 -10416 -11927 -182 4635 2012 -3251 -10450 -8553 6704
620F704K528j8782n258K3482Q957k6409j4039K5304J8332k1500j7165K1120J6659
$$ 6704 9232 -9550 -14808 8674 17631 -8778 -22817 2487 20819 -681 -17846 3274 19933
633A9933k0535j8320J6826J9708r181j6009K927J0698K37k235R50k125j244K836
$$ 19933 -602 -18922 -2096 17612 8431 -7578 -4651 6047 6284 4049 4999 2874 1630 4466
647D466j696n821N426J2924n194j9519J702K2348K785k3071p248J9518J0240j5581
$$ 4466 2770 -3051 2375 15299 10105 -9414 -7712 14636 17421 -5650 -12898 6620 16860 1279
661A279r701J1996P944j0310r041P525R272m303j0710j344Q350P975l058j0408
$$ 1279 -8422 3574 11518 1208 -7833 -308 8964 4661 -6049 -7393 957 8932 5874 -4534
675d534l062P223L944n774l444Q346M678j1142r327R374J5133m121j6300l753
$$ -4534 -7596 -373 3571 -2203 -5647 2699 7377 -3765 -13092 -3718 11415 7294 -9006 -12759
689a2759J2744P229p149n440N631L679o990n826P391R106m700j1572L50J2074
$$ -12759 -15 7214 65 -5375 256 3935 -3055 -8881 -1490 7616 2916 -8656 -8306 3768
703C768M723p953p817L546O584q39n232N74O019p4q004k180Q888O430p706j1534
$$ 3768 8491 538 -7279 -3733 2851 2012 -3220 -2646 3373 3299 -4705 -6885 2003 8433 727 -10807
719a0807J943J2115M265q201o092M268M007l111l110L871L806n035p075L902J0213
$$ -10807 -8864 3251 7516 -685 -6777 -2509 1498 -1613 -4723 -852 2954 -2081 -9156 -5254 4959
734D959j1j0116l569P000L824m240k585M404J477l882j165L372K767n65l014m662
$$ 4959 4948 -5168 -8737 -1737 2087 -2153 -4738 -334 1143 -2739 -3904 -532 2235 1670 -1344 -6006
750f006N69J0020N181j0938q464R784J0260q448q787J0363P024j4095p689J7237
$$ -6006 -5437 4583 9764 -1174 -9638 146 10406 1958 -6829 3534 10558 -3537 -11226 6011
764F011J2646j4414j4442Q205J0158l311k907L024k420n039N748M686o952k510
$$ 6011 18657 4243 -10199 -1994 8164 4853 1946 4970 2550 -2489 3259 7945 993 -1517
778a517J0086j382j6659J815K1322J012k1606k979J9029J878j7298k85J5586k517
$$ -1517 8569 7187 -9472 -7657 13665 14677 -6929 -9908 9121 10999 -6299 -6584 9002 6485
792F485j4261L811J2742m179j1522L359P759l218l043M243l208p319O054J2369
$$ 6485 -7776 -3965 8777 4598 -6924 -3565 4194 976 -2067 2176 -1032 -8351 -2297 10072
806A0072n106j3600L021J0480n324q529J0139J1040j1717j5841Q251J7566l647
$$ 10072 4966 -8634 -5613 4867 -457 -8986 1153 12193 476 -15365 -7114 10452 6805
819F805j2690J373P442m532o373P603R407m931j0109l2M595K304K048L09o542
$$ 6805 -5885 -4512 2930 -1602 -7975 -372 9035 4104 -6005 -6037 -1442 862 2910 3219 -3323
834c323n137Q351Q762q647r727Q708R359j0754j0987J2595J2155j2154j2931J0987
$$ -3323 -8460 -109 8653 6 -9721 -1013 8346 -2408 -13395 -800 11355 -799 -13730 -2743
848b743J2414r169j0736O598P046o412k695O933L20o759J868M518m548k536Q980
$$ -2743 9671 502 -10234 -3636 3410 -3002 -5697 1236 1556 -5203 -3335 1183 -3365 -5901 3079
863C079J144j3220r73J6863K754j7105l721J6464L702j4980j736J3518K46j1822
$$ 3079 4223 -8997 -9970 6893 9647 -7458 -11179 5285 8987 -5993 -7729 5789 6035 -5787
877e787J759J1166k002r081J575N324j977j133N848j224p713J348R000j885q122
$$ -5787 -4028 7138 5136 -3945 -2370 2954 977 -156 5692 4468 -3245 -1897 7103 5218 -2904
892b904L842P326o298q700P840J0451o065j0648L533Q688l532n992L870M553m522
$$ -2904 938 8264 1966 -6734 1106 11557 5492 -5156 -1623 7065 3533 -2459 1411 5964 1442
907A442l639M538K558l608k334K337R1k030K493J975m722l218N608L829n273l623
$$ 1442 -2197 2341 4899 1291 -1043 1294 1385 -645 1848 3823 -899 -4117 1491 5320 47 -3576
923c576M645J848o467r47Q369K710q230m507N381L994l339j139L063j166l627
$$ -3576 1069 2917 -3550 -4497 3872 6582 -1648 -6155 -774 3220 -119 -1258 1805 639 -2988
938b988Q50L794L94j857j82q32j874P34L210k80j958J642P96m268j246N018K940
$$ -2988 -2138 1656 2050 193 11 -821 -2695 -1961 1249 969 -989 653 1449 -2819 -4065 953 3893
955C893m799k399L791j52m188P72N670k48n530j398L299O01j443J378J104j304
$$ 3893 -906 -3305 486 334 -3854 -3082 2588 2340 -3190 -4588 -1289 -688 -2131 -753 351 -953
971i53k009k38k74J398M100k31o253l074N891M730m316l436L843K924n534l388
$$ -953 -2962 -3200 -3474 -2076 2024 1793 -4460 -7534 -1643 3087 -1229 -4665 -822 2102 -3432 -6820
987f820N949N302l066n890Q62L461J220j724k36N55J166m83j984n4L229L220l300
$$ -6820 -871 4431 1365 -4525 -3663 -202 1018 -706 -942 -387 779 296 -1688 -1742 1487 4707 1407
1004A407n181J677O780j94o728k90P315J939q367k983P789M978n927n917L788
$$ 1407 -3774 -2097 4683 4489 -2239 -2529 4786 6725 -1642 -4625 3164 8142 2215 -3702 86
1019H6N597k049m147J64L187J280k678k735O47M302J552n118l972N981N522o028
$$ 86 5683 3634 -513 -349 2838 4118 1440 -1295 -648 3654 5206 88 -3884 2097 7619 1591
1035A591q055N656R713m197j1200K658J0504j485r286p3P702J358n863k343K478
$$ 1591 -6464 -808 8905 4708 -6492 -3834 6670 5185 -4101 -4174 3528 4886 -977 -3320 -842
1050h42K786J331k351l758Q24O059k5q548m67J0320K196j2613m369J2572O402
$$ -842 1944 3275 924 -2834 -2010 4049 4024 -4524 -4991 5329 7525 -5088 -9457 3115 9517
1065I517j1131o659Q664O247o818o108N412N518l048n145k26K440L385N67m425
$$ 9517 -1614 -8273 391 6638 -180 -6288 -876 4642 1594 -3551 -3777 -1337 2048 2615 -1810
1080a810l790M794N668n072p726N185R725n410j1012K816J1941p94j1075l15Q934
$$ -1810 -5600 -806 4862 -210 -7936 -2751 6974 1564 -9448 -6632 5309 4515 -6560 -6875 2059
1095B059J348q120j826O958L189m982m244J489M977J871l636m604J251O756K87
$$ 2059 3407 -4713 -6539 419 3608 -1374 -5618 -4129 848 2719 -917 -5521 -4270 2486 2773
1110B773o821j544P979L045q258m610P795O232o211o925M459P542l239o406J704
$$ 2773 -4048 -5592 2387 5432 -2826 -7436 359 6591 380 -6545 -2086 5456 2217 -4189 -2485
1125b485N629R76m669l260L038M735K23m673k880M283N039l777n935L174P481
$$ -2485 3144 4120 -549 -3809 -771 3964 4187 -486 -3366 917 5956 2179 -3756 -582 6899
1140F899k497q576J346Q828M85q833j457P761K008o088l064M498L363k230k968
$$ 6899 4402 -4174 -2828 6000 6485 -2348 -3805 3956 5964 -124 -3188 1310 4673 2443 -525
1155e25n34K126K329o01l836r24M877K226o466l407P298M988p409o634O679P520
$$ -525 -1059 1067 3396 2795 -1041 -1965 2912 5138 -1328 -4735 2563 7551 142 -6492 187 7707
1171G707n780p488M313P489l363o832J905N350k49l891p00J279J452L17j001k269
$$ 7707 1927 -5561 -1248 6241 2878 -3954 -2049 3301 3052 -839 -1539 -260 1192 1509 508 -1761
1187a761P69L686j605m531J123O241l82p693j044P750K802p074l690N331L517
$$ -1761 -992 2694 1089 -3442 -2319 3922 3540 -4153 -5197 2553 5355 -1719 -5409 -78 3439
1202C439m229l563L302L545k545l602Q83K795Q40k114j482O15K606k32k721j143
$$ 3439 -790 -4353 -1051 2494 -51 -3653 -2770 25 865 -1249 -2731 -2116 490 258 -2463 -3606
1218c606L334K060l908k691K762M105k602l861J637M393j070m684N98M450N98
$$ -3606 -272 1788 -2120 -4811 -2049 2056 -546 -4407 -2770 1623 553 -4131 -3533 917 1515
1233A515l569j667K659K705j479k635M65L077J432m173k514L606M774k647n647
$$ 1515 -2054 -3721 -1062 1643 164 -2471 -2006 1071 2503 -1670 -4184 -578 4196 1549 -4098
1248d098J048N945J26m808l06M710Pm329p37M359K369k918l084K88K947K013j437
$$ -4098 -3050 2895 3021 -1787 -2093 2617 2624 -1705 -2442 1917 4286 1368 -1716 -1428 1519 3532 2095
1265B095l395J66M269l6m348j94N205O48o590j365P070K590o447l901N243L929
$$ 2095 -1300 -1134 3135 3099 -1249 -1443 3762 4410 -2180 -3545 3525 6115 -332 -4233 1010 4939
1281D939l424l154K115K247k324j187J666O95K19n92k018j390L886M065m563n812
$$ 4939 1515 -1639 476 2723 399 -788 878 1573 1792 1200 -818 -2208 1678 5743 1180 -4632
1297d632L972O083l595n755M443N639m922o991L923P772j632p824J10N185J76
$$ -4632 -660 5423 1828 -3927 516 6155 1233 -5758 -1835 5937 4305 -3519 -3409 1776 1952
1312A952k429L77J48j145J143J224k314j168M093J206o744j642Q168L351r561
$$ 1952 -477 -100 48 -1097 46 1270 -1044 -2212 1881 3087 -3657 -5299 2869 6220 -3341
1327c341n749J0010O522q206o820N878O042n317m452N349L838n793l471L667L141
$$ -3341 -9090 920 7442 -764 -7584 -1706 4336 -981 -5433 -84 3754 -2039 -5510 -1843 1298
1342A298j129j38n46m280M5P398J930p963k594O946J617q126N00J0210K87j2076
$$ 1298 169 31 -515 -4795 -4750 2648 4578 -3385 -5979 967 2584 -5542 -5042 5168 5455 -6621
1358f621k277J1113M201q110k721N532L69n512J305O090j272n229J572K600j961
$$ -6621 -8898 2215 6416 -1694 -4415 1117 1486 -4026 -2721 3369 2097 -3132 -1560 1040 -921
1373i21MM251j515o101J276Q389j023q750Q39Q177q78p240K024P030k790q075
$$ -921 -917 3334 1819 -4282 -3006 5383 4360 -4390 -3551 4626 3748 -3492 -1468 5562 2772 -5303
1389e303L281Q294j216q015j27N334n7j993K037M84l748p85M001J010l431R29
$$ -5303 -2022 6272 5056 -2959 -3086 2248 2191 198 2235 2719 -1029 -1814 2187 3197 -234 695
1405F95K996l296m108M632O577m786q028L948P163k959o101L893M630m855m716
$$ 695 3691 395 -3713 919 7496 2710 -5318 -1370 5793 2834 -3267 626 5256 401 -4315
1420d315N225M638m239m515K678K644j982P87K919l845m412L695N424k647m704
$$ -4315 910 5548 1309 -3206 -528 2116 134 921 3840 -5 -4417 -722 4702 2055 -2649
1435b649K821J981m552q59O664J371p446k628N466K851l415q55K372j701l980
$$ -2649 172 2153 -2399 -3258 3406 4777 -2669 -5297 169 3020 -395 -1250 1122 -579 -4559
1450d559K926N489k226n339P82L029p50j68J917l14m313m09M355J617k730j009
$$ -4559 -1633 3856 1630 -3709 -2927 102 -648 -816 1101 787 -3526 -3935 420 2037 -693 -1702
1466a702Q90p91j078K252J969j819l196K29K925R02j253k02K63r44p59J007K248
$$ -1702 -812 -1603 -2681 -429 1540 -279 -3475 -3246 -321 581 -672 -874 -611 -1555 -2314 -1307 941
1483I41k22k614m47J678J740j677m72M48L02q03P82J941p22k753j06K621J073
$$ 941 719 -1895 -2342 -664 1076 -601 -1073 -625 -323 -1126 -344 1597 875 -1878 -1984 637 1710
1500A710r86r94n76o10J781K247l61l423l42K583M8j899J828K675k878m685K165
$$ 1710 724 -270 -846 -1456 325 2572 2211 -1212 -1554 1029 1077 -822 1006 3681 803 -3882 -1717
1517a717N825Q52n492j546K629J617j613o4J236P8j867l76P43J560R02j880j999
$$ -1717 4108 4960 -532 -2078 551 2168 555 491 1727 1805 -62 -438 305 1865 2767 887 -1112
1534a112K4L121J187k488k226J523K697q31k723Q67K566j114l299M31M845M20
$$ -1112 -1088 2033 3220 732 -1494 29 2726 1895 -828 39 2605 1491 -1808 -1377 3468 3888
1550C888m853j892L806K887k845k315J670J183j649j052J890J069r16j862j048
$$ 3888 -965 -2857 949 3836 991 -1324 346 1529 -120 -1172 718 1787 871 -991 -2039
1565b039J051K502J511l047l803K259M725j177n261Q10M922j378n178J447N985
$$ -2039 -988 1514 3025 -22 -3825 -1566 3159 1982 -3279 -2469 2453 1075 -4103 -2656 3329
1580C329j303o086n2M984J211l361j492J727P46j22k3j106n66J943J190l474j298
$$ 3329 2026 -4060 -4112 872 2083 -1278 -2770 -1043 -297 -419 -442 -1548 -2114 -171 1019 -2455 -3753
1597c753M530K252n545l275N408M850m616n340M129M902l785l841K956L936k240
$$ -3753 777 3029 -2516 -5791 -383 4467 -149 -5489 -1360 3542 -243 -4084 -1128 2808 568
1612E68l357R79K254q9m07l93j454N31L172q8m199J18M682Q2m957r3N672O41o178
$$ 568 -2789 -1810 444 355 -52 -445 -1899 -1368 1804 1716 -2483 -2365 2317 2399 -2558 -2651 3021 3662 -2516
1631b516j236O403J763n688k028M469K319l173j571J809R36q63l20O90r26R22
$$ -2516 -3752 2651 4414 -1274 -3302 1167 3486 313 -1258 551 1487 624 304 994 68 990
1647I90J201j796k024K239L107k248l807K421L775j773m322J778M243j120m330
$$ 990 2191 395 -1629 610 3717 1469 -2338 83 3858 2085 -2237 -459 3784 2664 -1666
1662a666M72M190n20k667p46K290Q37j726p59J66J289L42p27j318K73K107o22
$$ -1666 -1194 2996 2476 -191 -937 1353 2190 464 -295 -129 1160 1502 775 -543 -270 1837 1215
1679A215k556M47L032J37k970j691L029J765k360j803J803J823j707k446J751
$$ 1215 -1341 -894 2138 2275 -695 -2386 643 2408 48 -1755 48 1871 164 -2282 -531
1694e31J802p43j840o97J955O30o35j084j92J298L22j308j350J790J785j066k834
$$ -531 1271 528 -1312 -2009 -54 576 -59 -1143 -1335 -37 285 -1023 -2373 -583 1202 136 -2698
1711b698N99L214o69l041M05K966j18l564L28K689J039k569p93J471M19l86k10
$$ -2698 -2099 1115 446 -2595 -2190 776 658 -2906 -2578 111 1150 -1419 -2212 -741 -322 -708 -918
1728i18k4K06R54k50k119l94L094J199l297j537L289J565l245j654L563K164l231
$$ -918 -942 -736 218 -32 -2151 -2545 549 1748 -1549 -3086 203 1768 -1477 -3131 432 2596 -635
1745f35k767L284K349j712k167R90J609o54m24J06K63N37K76j343j547K102K442
$$ -635 -3402 -118 2231 519 -1648 -658 951 297 -127 -21 242 779 1055 -288 -1835 267 2709
1762B709j772l107J968L268j540l737J858L594r20l749O92K602L15j825p41J177
$$ 2709 937 -2170 -202 3066 1526 -2211 -353 3241 2321 -1428 -736 1866 2181 356 -385 792
1778G92P76l61q17q53J657J706j801k624J132L583l35m177k05M191N29l898j136
$$ 792 1568 1207 390 -463 1194 2900 1099 -1525 -393 3190 2855 -1322 -1527 2664 3193 -705 -1841
1795a841L152J386k323k013J981J724j060j353n4J317O34j016j746J96K400N26
$$ -1841 1311 2697 374 -1639 342 2066 1006 -347 -401 916 1550 534 -1212 -1016 1384 1910
1811A910k652j341K854J978l086k600K625L139j910l456J106L280o50k792m71
$$ 1910 -742 -2083 771 2749 -337 -2937 -312 2827 917 -2539 -1433 1847 1197 -1595 -2066
1826b066K579P71k281j352J751J751o13j626j140J439K012q10k983O85L088k78
$$ -2066 513 1284 -997 -2349 -598 1153 540 -1086 -2226 -787 1225 415 -2568 -1883 1205 927
1842I27l522l77M015J334l789k392K855K714k134k756J812K382o08k762J37K105
$$ 927 -2595 -2972 1043 2377 -1412 -3804 -949 1765 -369 -3125 -1313 1069 461 -2301 -2164 -59
1858e9J163j228j798l15K194J721k090k106J982K836k164l536J741M577r72m827
$$ -59 1104 -124 -1922 -2237 -43 1678 -412 -2518 -536 2300 136 -3400 -1659 2918 1946 -2881
1874b881L64M044M70l360l90L004L47k029j051J345J250J24m79j702k4K386R48
$$ -2881 -2517 1527 1997 -1363 -1753 1251 1598 -431 -1482 -137 1113 1237 758 -944 -968 1418 2366
1891B366k754j393L295J648l495j903L504K799l560l339L008L399j755l205J253
$$ 2366 -388 -1781 1514 3162 -333 -2236 1268 4067 507 -2832 176 3575 1820 -1385 -132
1906a32K428q96j482O56N06q5k33J44p98M7J573j78k390k51L157N92l774q79L419
$$ -132 2296 1400 -82 574 1080 995 762 906 108 155 1728 1550 -840 -1091 2066 2658 -1116 -1995 1424
1925A424J468l205j615L382R54l043j385K973J247j991j699J336R44j042L61N20
$$ 1424 2892 -313 -1928 1454 2408 -635 -2020 953 2200 209 -1490 -154 790 -252 109 629
1941F29p31q35J103O90j902K47J593m62k299N04L050l37l100k32K782M63k355
$$ 629 -102 -937 166 856 -1046 -799 794 332 -1967 -1463 1587 1250 -1850 -2082 700 1163 -1192
1958a192N0J817r71j505R42J292n63j413J89J010Lj22P49r36j059lK123o6j712
$$ -1192 -1142 675 -296 -1801 -859 433 -130 -1543 -1354 -344 -341 -463 286 -650 -1709 -1712 411 345 -1367
1977a367J21Q65m05p08J195R22j183j404P89J233J4r73N67l6p64NJ292R91j654
$$ -1367 -1246 -381 -786 -1494 -299 623 -560 -1964 -1175 58 72 -901 -334 -370 -1134 -1129 163 1154 -500
1996e00j312R47J547p9q46j01K60k63n6R03M57o18p85J58P78J49M34Kj729j05
$$ -500 -1812 -865 682 603 -243 -344 -84 -347 -403 500 957 339 -446 -288 490 639 1073 1075 -654 -759
2016g59J502J206j072j072L53Q07n90m74J594M61j708j916K240K020j202j687
$$ -759 743 1949 877 -195 158 965 375 -99 1495 1956 248 -1668 572 2592 1390 -297
2032b97L29Q40K3k01P84l07j130o33J156J229o27l44m85j001k2K276R93j546k708
$$ -297 32 872 895 694 1478 1171 41 -592 564 1793 1166 822 337 -664 -686 1590 2583 1037 -1671
2051a671J774J743j190j213J748M86k702j331L132K390k565k346J037J594p19
$$ -1671 103 1846 656 -557 1191 1677 -1025 -2356 776 3166 601 -1745 -708 886 167
2066A67m08O70J05j570J18J434O43j612K18n1j064O1K697P94m183j319L276J977
$$ 167 -241 429 534 -1036 -918 516 1159 -453 -235 -286 -1350 -1289 1408 2202 -1981 -3300 -24 1953
2084A953k693j689K661Q06l250o93L950J237m067j720K232K444j292j083P81m47
$$ 1953 -740 -2429 232 1038 -2212 -2905 1045 2282 -1785 -3505 -1273 1171 -121 -1204 -423 -870
2100h70r65J384J240n91k064J102L46j635J035K789q17m149l79M798J549l741
$$ -870 -1835 -451 789 198 -1866 -764 -418 -2053 -1018 1771 954 -3195 -3574 1224 2773 -968
2116i68k333L598R42l276N32L261J33l939o06L535R33j839k49O15j414K4K618
$$ -968 -3301 297 1239 -2037 -1505 1756 1889 -2050 -2656 879 1812 -27 -276 339 -1075 -1051 1567
2133A567O64l267q58L151L73k923J080L688k004m769K022N296j436m820N66M108
$$ 1567 2231 -1036 -1894 1257 1630 -1293 -213 3475 1471 -3298 -1276 4020 2584 -2236 -1670 2438
2149B438q51k862K054J731k197j891K043K104j985p19J366o95j827K025L027k975
$$ 2438 1587 -1275 779 2510 313 -1578 465 2569 584 -135 1231 536 -1291 734 3761 786
2165G86l405K154L395j868k440K135K016l317k180M021K623l397k939K261J937
$$ 786 -2619 -465 2930 1062 -1378 757 2773 -544 -2724 1297 3920 523 -2416 -155 1782
2180A782j083j131J679l06k280K73K410j94j522L09N59j200n38K659J090l655
$$ 1782 699 -432 1247 941 -1339 -1066 1344 1150 -372 -63 496 -704 -1242 1417 2507 -1148
2196a148j521K828K050k484j633K243R34k811m04L085J059l212j885K125J732
$$ -1148 -2669 159 2209 -275 -1908 335 1269 -1542 -1946 1139 2198 -1014 -2899 -774 958
2211I58j445m47R77n55j198N93K075q25j545J06O43k68L00J222K24k844o62K969
$$ 958 -487 -934 43 -512 -1710 -1117 958 133 -1412 -1306 -663 -931 -631 591 815 -2029 -2691 278
2229B78P16k251l92J974j00k481O80L130n74k786k85K886M16k231r7J670j53j282
$$ 278 994 -1257 -1649 325 225 -2256 -1576 1554 980 -1806 -2091 795 1211 -1020 -1117 553 400 -882
2247h82N90Q53p08l86M15J4n49J179O68j573j195J753K043j422k417J322J924
$$ -882 -292 561 -147 -533 -118 -104 -653 526 1194 -379 -1574 179 2222 800 -1617 -295 1629
2264A629q48j622J371J344j194j830Q10J909L57j656o46L73P86M83o68n84K33
$$ 1629 781 -841 530 1874 680 -1150 -340 1569 1926 270 -376 -3 783 1266 598 14 247
2281B47R50p04j052J173J490p79j952j9K148N09j943p09J009J440q62j244J16
$$ 247 1197 493 -559 614 2104 1325 -627 -646 1502 2011 68 -641 368 1808 946 -298 -182
2298a82J629j08j691o55J865J067j708j671J153K304q66j763j71J604k8p37p19
$$ -182 1447 1339 -352 -1007 858 1925 217 -1454 -301 2003 1137 -626 -797 807 779 42 -677
2315f77Q11P30l34j165k37J058J156j345j970P68K852o14k553K86K051J24k452
$$ -677 134 864 530 -635 -872 186 1342 -3 -1973 -1205 1647 1033 -1520 -1234 817 941 -1511
2332a511k04K357M70k322r42J719J306j133j067j06J072N73k80j232k56J515O95
$$ -1511 -1715 642 1112 -1210 -2152 -433 873 -260 -1327 -1433 -361 212 -68 -1300 -1556 -41 654
2349F54k155o91J784J997k413j880J921K392j524k252R39K066k84j714l82J756
$$ 654 -1501 -2192 -408 1589 -824 -2704 -783 1609 85 -2167 -1228 838 554 -1160 -1542 214
2365B14N82j308n18P01J011k50j428l28J409P20j94j821K28J902J74j735o51J658
$$ 214 796 -512 -1030 -329 682 432 -996 -1324 85 805 611 -1210 -982 920 1094 -641 -1292 366
2383C66J291j778j663J758J674o14k013J44K121o7j631j54J024Q72j129p86Q20
$$ 366 1657 -121 -1784 -26 1648 1034 -979 -835 1286 1219 -412 -566 458 1330 201 -585 235
2400B35Q62K3q51n47M88J029k67j240K41J538J55j983o51K027Q47j633j211J304
$$ 235 1097 1120 269 -278 210 1239 972 -268 -27 1511 1666 -317 -968 1059 1906 273 -938 366
2418C66J393j116j506J047J366o43j076K95P70N7r4q68l59R32O63q64r62P80J405
$$ 366 1759 643 -863 184 1550 907 -169 126 896 953 859 -9 -368 564 1227 363 -599 181 1586
2437A586r96j810P16J820p97j423j65J965O3j861J33J177J07m90p40J11L75K81
$$ 1586 590 -1220 -504 1316 519 -904 -1069 896 959 -902 -769 408 515 25 -715 -604 -229 52
2455E2k73m06l75J146J28j218n19J404P30j477j103J658P57j350r68J417O64r56
$$ 52 -221 -627 -1002 144 272 -946 -1465 -61 669 -808 -1911 -253 504 -846 -1814 -397 267 -689
2473f89n45M10L11Jj30k0l3K4M59l88m16K16J313n56j155N59R16o2j087J88J145
$$ -689 -1234 -824 -513 -512 -642 -662 -695 -671 -212 -600 -1016 -800 513 -43 -1198 -639 277 215 -872 -684 461
2494D61l79r71N23N73j31k81P0R3k27J15R6k7Q3K68K4k07K07nq4m87O03L24j42
$$ 461 82 -889 -366 207 76 -205 -135 -42 -269 -154 -58 -85 -2 266 290 83 290 285 201 -286 317 641 499
2517D99m93K06K66J90o74J70M38n05Q9j8L08J49J90m68j51L46J51l73k35N88K34
$$ 499 6 212 478 668 -6 164 602 97 186 168 476 625 815 347 196 542 693 320 85 673 907
2538I07n39j05L80M31n22o19L52M74m6n38p5L05K52m25n70O09P50m02q09q3Q28
$$ 907 368 263 643 1074 552 -67 285 759 713 175 100 405 657 232 -338 271 1021 619 -190 -273 555
2559E55J02n19m04N62L22l34o19N13q9J05o05m25R57K80m09r75M32O44J38p67
$$ 555 657 138 -266 296 618 284 -335 178 89 194 -411 -836 121 401 -8 -983 -551 93 231 -536
2579e36n24J047J22q22k94N82P39o29p24m6P87N48l83p99m11J276N12j527NJ251
$$ -536 -1060 -13 109 -713 -1007 -425 314 -315 -1039 -1085 -298 250 -133 -932 -1343 -67 445 -1082 -1077 174
2599A74Q6j096n58J489L69j076j109J233N71k71n54J65K01k4J03Q8j93rJ92L16
$$ 174 260 -836 -1394 95 464 -612 -1721 -488 83 -188 -742 -577 -376 -400 -297 -209 -402 -411 -219 97
2619I7j002K74J576q71j241N22J725n82j596L29J338l3j435Q48J115o91j021J32
$$ 97 -905 -631 945 74 -1167 -645 1080 498 -1098 -769 569 536 -899 -51 1064 373 -648 -516
2637e16J157k3m44mk79j54M88R27l87j207L69J204m75q02P17J156j699j308J604
$$ -516 641 618 174 170 -109 -263 225 1152 765 -442 -73 1131 656 -146 571 1727 28 -1280 324
2656C24J682r36k008R70J381r94o13J007P88j532n76J466J60o92m02N82j35j144
$$ 324 2006 1070 -938 32 1413 419 -194 813 1601 69 -507 959 1119 427 25 607 472 -672
2674f72J532J047j447j543J452J156j238j037J546P13k330j69J953Q43k387p15
$$ -672 860 1907 460 -1083 369 1525 287 -750 796 1509 -821 -990 963 1806 -581 -1296
2690a296J708P61j587K59R48o91j444R76J466p14o67k54N28p40J12J338L14k118
$$ -1296 412 1173 -414 -155 793 102 -1342 -366 1100 386 -281 -535 -7 -747 -635 703 1017 -1101
2708a101m10J704L13j282M5R15j92j543P19J564k02k190K75J487Qp59K50M37o18
$$ -1101 -1511 193 506 -776 -731 184 -8 -1551 -832 732 530 -1660 -1385 102 110 -649 -399 38 -580
2727e80j029J216J332j010j465P79R82o52l2J085m28j896N76K275l82j798O62
$$ -580 -1609 -393 939 -71 -1536 -757 225 -427 -459 626 198 -1698 -1122 1153 771 -1027 -365
2744c65Q15r05p39J648J244j983j900J493K011r66j169Q10O19j206m80J846R56
$$ -365 450 -455 -1194 454 1698 -285 -2185 -692 1319 353 -816 -6 613 -593 -1073 773 1729
2761A729j955r92J637J70l44P4O33j180j262J831J388j200j223N81J230j093n46
$$ 1729 -226 -1218 419 589 245 319 952 -228 -1490 341 1729 529 -694 -113 1117 24 -522
2778e22J835O32k259j057K057J476j210j633P99P50n92j83R95K66j643k99J354
$$ -522 1313 1945 -314 -1371 686 2162 952 -681 118 868 276 93 1088 1354 -289 -588 766
2795G66L97o34nk6j098j46K087P87k389j163J567J247j280o20J477M03k312q70
$$ 766 1163 529 524 498 -600 -746 1341 2128 -261 -1424 143 1390 110 -510 967 1370 -942 -1812
2813a812K718R43j810j629R35J289l84j01k8R5j013L2J130k57l16O9l69o63O05
$$ -1812 906 1849 39 -1590 -655 634 250 149 121 216 -797 -765 365 108 -208 -139 -508 -1171 -566
2832e66J596J5k660p64K511R62j401j155J347O96j792o85K361R30k242j582J777
$$ -566 1030 1045 -1615 -2379 132 1094 -307 -1462 -115 581 -1211 -1896 465 1395 -847 -2429 -652
2849f52J208l06n42m97j01K09M76M99m91m81P55k46j170O70K429r61k648j65K654
$$ -652 556 250 -292 -789 -890 -681 -205 294 -197 -678 77 -169 -1339 -669 1760 799 -1849 -2014 640
2868F40J176k847n47K013O31k079j77K189j48j991l35J659O26q50P8k86p68R68
$$ 640 1816 -1031 -1578 435 1066 -1013 -1190 999 851 -1140 -1475 184 810 -40 38 -248 -1016 -48
2886d8J263n77j556l19K209j40j687O08K349j303k651J252K666n6k744j87J601
$$ -48 1215 638 -918 -1237 972 832 -855 -247 2102 799 -1852 -600 2066 2010 -734 -921 680
2903F80N89j302L73L62j39o44J93P55o6l99O8p43NJ081O87q68j527O64K051q02
$$ 680 1269 -33 340 702 563 -81 112 867 801 402 470 -273 -268 813 1500 632 -895 -231 1820 1018
2923A018j546L63J568r29j396P00J796k01k371L89J237M53j289K64N80n62k44
$$ 1018 -528 -165 1403 474 -922 -222 1574 1373 -998 -609 628 1081 -208 56 636 74 -170
2940a70K92K97k98n40Q61m01m63N36R78j214j147Q40J605o14j670N68J437j089
$$ -170 122 419 121 -419 442 41 -422 114 1092 -122 -1269 -429 1176 562 -1108 -540 897 -192
2958a92j382J352J027j124j543J072J113o55k88M05L6o01J70Q16n54r41P42Q46
$$ -192 -1574 -222 805 -319 -1862 -790 323 -332 -620 -215 -179 -780 -610 206 -348 -1289 -547 299
2976B99r40m92J268J61j213n68J284R50j281p05J187K35j034j62J268P1r65j62
$$ 299 -641 -1133 135 296 -917 -1485 -201 749 -532 -1237 -50 185 -849 -1011 257 328 -637 -799
2994g99O94K65o95L95J88o44L42M22Qq72N33O59k26n97K79N98n46n72L42Q78r7
$$ -799 -105 160 -535 -140 48 -596 -254 168 176 -696 -163 496 270 -327 -48 550 4 -568 -226 652 555
3015E55p48l6O45j08m18J96K72j33k36R7K24J98j67j75K29J63R0m25q9j9K71J49
$$ 555 -193 -229 416 308 -110 86 358 225 -11 86 310 508 341 166 395 558 648 223 134 115 386 535
3037E35l15K89j17j31j93j14K74M73l24k84k37O68J03l24k90K62K93o13j16P85
$$ 535 220 509 392 261 68 -46 228 701 377 93 -144 524 627 303 13 275 568 -45 -161 624
3057F24lp96M7L15j14L4j37J33R4K96l88q4R1J28j54k01j29L00O3o6n78J17O89
$$ 624 621 -175 -128 187 73 107 -30 103 197 493 105 21 112 240 86 -115 -244 56 119 53 -525 -408 281
3080B81m19l96j6P03j86j61r7q3K36r4j65J61j25J16m32J00N48J66n55l32O39
$$ 281 -138 -534 -550 153 -33 -194 -291 -374 -138 -232 -397 -236 -361 -245 -677 -577 -29 137 -418 -750 -111
3101a11J77l48n46k30J039j92j31l3k49M62J52n17K59J14K31n33l37N53L18m17
$$ -111 66 -282 -828 -1058 -19 -211 -342 -375 -624 -162 -10 -527 -268 -154 77 -456 -793 -240 78 -339
3121c39n11N31M52j34o25K09M90K1j33m11M05L43l76J62o84N78L19j36l54kJ083
$$ -339 -850 -319 133 -1 -626 -417 73 94 -39 -450 -45 298 -78 84 -600 -22 297 161 -193 -195 888
3142H88k04j183J98Q73L08r38m1M36K39k51j94K70K3o7j66j82K67M55rn88j40
$$ 888 684 -499 -301 572 880 -58 -99 337 576 325 131 401 424 357 191 9 276 731 722 134 -6
3163fM99M04o90n63Q81L41l86n19L51O40o41n35N55M5M2l28M4NL43j47k61k7J67
$$ -6 493 897 207 -356 525 866 480 -39 312 952 311 -224 331 376 418 90 134 139 482 335 74 47 214
3186B14J2Lk91OL63Q1n91k04P73k79k18j59M92j9n24r7L80r5J23o4k08jj39j5
$$ 214 226 229 -62 -56 307 388 -203 -407 366 87 -131 -290 202 183 -341 -438 -58 -153 -30 -94 -302 -303 -442 -457
3210d57M12n03L29p8r0j36O06l36o0j74K62J98l93n5J86O5R1j24l21M02Ro24L81
$$ -457 -45 -548 -219 -297 -387 -523 83 -253 -313 -487 -225 -27 -420 -475 -289 -224 -133 -257 -578 -176 -167 -791 -410
3233d10M37K3m56K44j19k33l52N70P41n38p60O17L45k09j82PM83j63P6q9l26j16
$$ -410 27 50 -406 -162 -281 -514 -866 -296 445 -93 -853 -236 109 -100 -282 -275 208 45 121 32 -294 -410
3255d10M77J40l87j42N56L82q94K0N89J41n76j3M74O0p04K6O16J65o15KL51K35
$$ -410 67 207 -180 -322 234 616 -278 -258 331 472 -104 -117 357 417 -287 -261 355 520 -95 -93 258 493
3277D93m56M85l23l70O23J35N8n63k7P13k37o03K65J114p32j158N58P42K24r15
$$ 493 37 522 199 -171 452 587 645 82 55 768 531 -72 193 1307 575 -583 -25 717 941 26
3297B6k04O31j97j71K9K39j11R4j84pk01M75l4o88L55M26K03m00p76M69O97n97
$$ 26 -178 453 256 85 114 353 242 336 152 145 -56 419 385 -303 52 478 681 281 -495 -26 671 74
3319G4m52K34P05o03l19k72J363j34j034PM64J29l07m82N34Rk36j58M37R7m79
$$ 74 -378 -144 561 -42 -361 -633 730 596 -438 -431 33 162 -145 -627 -93 -84 -320 -478 -41 56 -423
3340d23J58k2l09K63M95m14r61L83J193l63p57N52O12o00r27N29J168m32r78J28
$$ -423 -265 -287 -596 -333 162 -252 -1213 -830 363 0 -757 -205 407 -193 -1120 -591 577 145 -833 -705
3360g05R72j3m84k41M11n40l2M75L07n51J06K46m61j69Q70O22j081q07R83R96
$$ -705 267 254 -230 -471 -60 -600 -632 -157 150 -401 -295 -49 -510 -679 191 813 -268 -1075 -92 904
3380I04m67j327O20N29L0j164Q33J010q26q68K82J042L80r59o7j0j94M13P13l16
$$ 904 437 -890 -270 259 289 -875 -42 968 142 -726 -444 598 978 19 -48 -58 -252 161 874 558
3400E58p78K19R27p19n30R16Q15j593q99J518J291r84j421N78J105o69p00P84
$$ 558 -220 -1 926 207 -323 593 1408 -185 -1084 434 1725 741 -680 -102 1003 334 -366 418
3418D18L89n52j399J329O87l46m05o5N8l83N63J014j136p76R01P49j039l77R57
$$ 418 807 255 -1144 185 872 526 121 56 114 -269 294 1308 172 -604 297 1046 7 -370 587
3437E87M94j570n33J702Q24j394j409J276N29k18m74M49K64j260M89P19J21j178
$$ 587 1081 -489 -1022 680 1504 110 -1299 -23 506 288 -186 263 527 -733 -244 475 596 -582
3455e82K16K21k50k04Q08N41j461r60J739R12j201o97Q85L85j064m85J431O82
$$ -582 -366 -145 -395 -599 209 750 -711 -1671 68 980 -221 -918 -33 352 -712 -1197 234 916
3473I16j855m56J593L29r55N2O62p17o28P62Q59o01j270J042K88l08n11J155K66
$$ 916 -939 -1395 198 527 -428 -376 286 -431 -1059 -297 562 -39 -1309 -267 21 -287 -798 357 623
3492F23j719j19J582L84j308m17R27L56j248R27Q85n81j551M45J522l11j017M98
$$ 623 -1096 -1215 367 751 -557 -974 -47 309 -939 -12 873 292 -1259 -814 708 397 -620 -122
3510a22O94q36j66R84M15j001p51J058L00m30N1L93k62q38O15Q61m24j115J65
$$ -122 572 -264 -430 554 969 -32 -783 275 575 145 196 589 327 -511 104 965 541 -574 -409
3529d09J006L2p43P12O31j193p14P90J008o65p94L81M57n61J01R05j71j094O8
$$ -409 597 629 -114 598 1229 36 -678 112 1120 455 -339 42 499 -62 39 944 773 -321 -253
3548b53O30J69l48N69m75k99l55J052M25r34p38M53J185q89n80O52J37n26m81
$$ -253 377 546 198 767 292 -7 -362 690 1115 181 -557 -104 1081 192 -388 264 401 -125 -606
3567f06R99M27m24j338R67K73mp5J35l48q83O86N35k59j40m6J09o26j11J112L24
$$ -606 393 820 396 -942 25 298 294 219 354 6 -877 -191 344 85 -55 -101 8 -618 -729 383 707
3588G07j174q03R98O07m90r13P60M24o90k9P81l1o62j28J57N34k39P5N0l53l43
$$ 707 -467 -1270 -272 335 -155 -1068 -308 116 -574 -603 178 147 -515 -643 -486 48 -191 -116 -66 -419 -762
3609g62Q39K54n50k27L44J50o98K69O42Q4q92k00P70P75j240k37O54K60q19N15
$$ -762 77 331 -219 -446 -102 48 -650 -381 261 345 -547 -747 23 798 -442 -679 -25 235 -584 -69
3629f9N51l26k75m72O59L3m4l3J07l24J46O86r1o00l60P18K17o48m3N24k7n46
$$ -69 482 156 -119 -591 68 101 57 24 131 -193 -47 639 548 -52 -412 306 523 -125 -168 356 329 -217
3651b17n7Q49M4o99O3L67K91m85k41L26K24l04Q5K83N3n40M4O7q8K93L98k80p42
$$ -217 -274 575 619 -80 -17 350 641 156 -85 241 465 161 246 529 582 42 86 153 65 358 756 476 -266
3674b66K04P91j13p39o1N75J23o03J00O19L00j262K85M53R2m96q9M03r5j92j28
$$ -266 -62 729 616 -123 -184 391 514 -89 11 630 930 -332 -47 406 498 2 -87 316 221 29 -99
3695i9N14o35L83O3L7k76j97N90Mr97O67N6j47m19M21L38m04l81K19O40n47l38
$$ -99 415 -220 163 226 263 -13 -210 380 384 -613 54 110 -37 -456 -35 303 -101 -482 -263 377 -170 -508
3717e08L41L40o06J85J81j08j3j06N1J1JJ05L32o60j54M09L81l24n20L92L50m09
$$ -508 -167 173 -433 -248 -67 -175 -188 -294 -243 -232 -231 -126 206 -454 -608 -199 182 -142 -662 -270 80 -329
3739c29k8J21q1K8K04l33L06j00k8j2j44l9M26r7k56M10%k49K25J70l53N1L00
$$ -329 -357 -236 -317 -289 -85 -418 -112 -212 -240 -252 -396 -435 -9 -106 -362 48 48 -201 24 194 -159 -108 192
3762A92j61r3R1K2R4p3M3K50l63J30M82n24Q9N0J28k38o5N26l28k28L84K48l37
$$ 192 31 -62 29 51 145 72 115 365 2 132 614 90 179 229 357 119 54 580 252 24 408 656 319
3785C19k23r0M41O6o49J41N59l7k21j07J60j63J63m7j41j87L65L62o55k48R5N93
$$ 319 96 6 447 513 -136 5 564 527 306 199 359 196 359 312 171 -16 349 711 56 -192 -97 496
3807D96l9o71L8N60k75l09P7L31J66l75j57j18L91o3J3L1n4M07p49lm6N10k4n55
$$ 496 457 -214 -176 384 109 -200 -123 208 374 -1 -158 -276 115 52 65 96 42 449 -300 -303 -349 161 137 -418
3831d18J12L82j80o4r3J67k4M4Ol92K89K06l30k91K84K37k58p8J47R1J88k02m18
$$ -418 -306 76 -104 -168 -261 -94 -118 -74 -68 -460 -171 35 -295 -586 -302 -65 -323 -401 -254 -163 25 -177 -595
3854e95M13L64o62j02L97K72j10n62mJ71L81L9n17L38J63k4l81j78O96J85o10
$$ -595 -182 182 -480 -582 -185 87 -23 -585 -589 -418 -37 2 -515 -177 -14 -38 -419 -597 99 284 -326
3875c26j5L37J74m09k25K15N39k86j40o2J81L83j46n76K35K38k7J74m73J87L91
$$ -326 -341 -4 170 -239 -464 -249 290 4 -136 -198 -17 366 220 -356 -121 117 90 264 -209 -22 369
3896C69k10l75O01K59l83n58J6N95j2k66O1N2M07m9m99K50k26K32J94k44p0K33
$$ 369 159 -216 385 644 261 -297 -281 314 302 36 97 149 556 507 8 258 32 264 458 214 144 377
3918C77K90n23j78L43L60q47m4O81k61K39m19M44k34l47j7N51p9mj53J82k83Q1
$$ 377 667 144 -34 309 669 -178 -222 459 198 437 18 462 228 -119 -136 415 336 332 179 361 78 159
3940A59L5l93K15L59n7k76J32r4L70m02l65J43M57P8o43j58O84j34m52n7L29N56
$$ 159 194 -199 16 375 318 42 174 80 450 48 -317 -174 283 361 -282 -440 244 110 -342 -399 -70 486
3962D86o99j65K35M8j95j53N46l04Q7k1J86o92N36k46N33p16J14N47j75m22L12
$$ 486 -213 -378 -143 -95 -290 -443 103 -201 -114 -135 51 -641 -105 -351 182 -534 -420 127 -48 -470 -158
3983a58M51l25o91J29M56M83q11RK77j91K28K25M7k13j24J46k6l87L81J25ro33
$$ -158 293 -32 -723 -594 -138 345 -466 -457 -180 -371 -143 82 129 -84 -208 -62 -88 -475 -94 31 22 -611
4005f11M61L45l43J28J49K65m99k80Q53k2m33m10M26K17j26K26J4J10o24J0P56
$$ -611 -150 195 -148 -20 129 394 -105 -385 468 446 13 -397 29 246 120 346 360 470 -154 -144 612
4026F12k57m74j42O48O6j08J24j10l87k63L42M71l03m17N88o5k08l28O88k56j56
$$ 612 355 -119 -261 387 453 345 469 359 -28 -291 51 522 219 -198 390 325 117 -211 477 221 65
4047F5j52P41K38r93k43O27K33o54K0M05n9l77nL73K64q10M90O9m61j05O12J51
$$ 65 -87 654 892 -101 -344 283 516 -138 -118 287 228 -149 -154 219 483 -327 163 232 -229 -334 278 429
4069D29n49l91L07O60o55n0N21k88n37K66R28k43o74j88O38N0m73J2L57l81l80
$$ 429 -120 -511 -204 456 -199 -249 272 -16 -553 -287 641 398 -276 -464 174 224 -249 -237 120 -261 -641
4090f41N53J91j91J02o0k5m76K27Q96p00l60j33O99m4n07K01O85o89l61K40J029
$$ -641 -88 103 -88 14 -46 -71 -547 -320 576 -124 -484 -617 82 38 -469 -268 417 -272 -633 -393 636
4111F36n70p15K56J34P6MJ8k01k68M00M09j9k85j37K55L8m70M82O35p14j011R31
$$ 636 66 -649 -393 -259 -183 -179 -161 -362 -630 -230 179 160 -125 -262 -7 31 -439 43 678 -36 -1047 -116
4133a16Q33j42r49o5R04l3o30L60O24n32o72P1J049k9m32j85L7n47R67k7m8q10
$$ -116 717 575 -374 -439 465 432 -198 162 786 254 -418 -347 702 673 241 56 93 -454 513 486 438 -372
4155c72J23P29l41J0J6O54r20k94N07R86m70j058K40N16j84j56K86K86m88n29
$$ -372 -249 480 139 149 165 819 -101 -395 112 1098 628 -430 -190 326 142 -14 272 558 70 -459
4175d59O63K67k99k10K94j76j32K66N26l70o31J28P73l19o93L05M73o73m24R70
$$ -459 204 471 172 -38 256 80 -52 214 740 370 -261 -133 640 321 -372 -67 406 -267 -691 279
4195B79K98l08r26L80O45l93k22O11m31l11k15Q63Nn24K24k9j47l81P87K06o50
$$ 279 577 269 -657 -277 368 -25 -247 364 -67 -378 -593 270 275 -249 -25 -54 -201 -582 205 411 -239
4216b39q73J253J40j32p80Q25k04o55j7Q89K39o30m87O85J84l60j03K11j86k93
$$ -239 -1112 141 281 149 -631 194 -10 -665 -682 207 446 -184 -671 14 198 -162 -265 -54 -240 -533
4236e33N99L94m65m78J05N35m88j27N35K48p92j56P52K47m59m1J66r0m05M01J83
$$ -533 66 460 -5 -483 -378 157 -331 -458 77 325 -467 -623 129 376 -83 -124 42 -48 -453 -52 131
4257A31j17m77J26P14k87k78K93Nm02jP05K31o74m15L73M53m00q3L87p4m41L27
$$ 131 14 -463 -337 377 90 -188 105 110 -292 -293 412 643 -31 -446 -73 380 -20 -103 284 210 -231 96
4279I6L86l29k14K44L15k48p9r7K16l90Q5J33M98k99k90j24L52m7m1J71K25n67
$$ 96 482 153 -61 183 498 250 171 74 290 -100 -15 118 616 317 27 -97 255 208 167 338 563 -4
4301dk55O42q4m49ON85l08j29P2J75j48m04O68M1l70L3kL05q46P3O61J89l43n10
$$ -4 -259 383 299 -150 -144 441 133 4 76 251 103 -301 367 408 38 71 69 374 -472 -399 262 451 108 -402
4325d02L01K33l06q2L22n8l28K42J43j24K7j36r8PR7K17M2m94J01K28J97m80L2
$$ -402 -101 132 -174 -256 66 8 -320 -78 65 -59 -32 -168 -266 -259 -162 55 97 -397 -296 -68 129 -351 -319
4348c19N63l93m13K48K50J73o10M3L11LJ22j76m0J47Lo3j38K90k97nL95m77K97
$$ -319 244 -149 -562 -314 -64 109 -501 -458 -147 -144 -22 -198 -238 -91 -88 -151 -289 1 -296 -301 94 -383 -86
4371h6K64r8l86J94N2K02n02L28J80j79k01L02J03k98j55q3L19K17N5p4N2k62
$$ -86 178 80 -306 -112 -60 142 -360 -32 148 -31 -232 70 173 -125 -280 -363 -44 173 228 154 206 -56
4393e6M73k94k11J71J47j21j0k1P1ON1k77M09R4j42j86l8j32N33j05k35O5j13
$$ -56 417 123 -88 83 230 109 99 78 149 155 206 -71 338 432 290 104 66 -66 467 362 127 192 79
4416G9j61K20qj63K23k35m8N58k38J43k91k06K10K09n0l02J60L37o5o01L87R2
$$ 79 -82 138 130 -33 190 -45 -93 465 227 370 79 -127 83 292 242 -60 100 437 372 -229 158 250
4438B50J22k26k09J35o9r4j66K76r8L11j78j71JJ90P1k33J64j26J35L7o49L98
$$ 250 372 146 -63 72 3 -91 -257 19 -79 232 54 -117 -116 74 145 -88 76 -50 85 122 -527 -129
4460a29K5j40j59L08J57k80O2LJ08k94L75k66j30L17j13m19K33M80n84M4K3J63
$$ -129 -104 -244 -403 -95 62 -218 -156 -153 -45 -339 36 -230 -360 -43 -156 -575 -342 138 -446 -402 -379 -216
4482b16K18o6l0j74r3K79ll23R4K57q3l8q1J10R5j40K09k27L96n66K26R9J9k95
$$ -216 2 -64 -94 -268 -361 -82 -85 -408 -314 -57 -140 -178 -259 -149 -54 -194 15 -212 184 -382 -156 -57 -38 -333
4506c33M13M7j52j30K29J32l61m2L17k72l7L07M3j99P4K4K42K8o45O22j51j03
$$ -333 80 127 -25 -155 74 206 -155 -197 120 -152 -189 118 161 -38 36 60 302 330 -315 307 156 53
4528E3J94q0n1l87N25l97L72q9j26L41p3k03k56L87J50k02j5K9rL8K47n54J48
$$ 53 247 167 116 -271 254 -143 229 140 14 355 282 79 -177 210 360 158 143 172 163 201 448 -106 42
4551D2L10K4l51r8L1N6j29K08m3j0k05J80R3L7j49M32n75j39L29J1j15j0j22J60
$$ 42 352 376 25 -73 -42 14 -115 93 50 40 -165 15 108 145 -4 428 -147 -286 43 54 -61 -71 -193 -33
4575c3l60K51J73L2o7L4Ql69M51k68l0L7L17l26j48K37lj20j5m4L18j33k95M11
$$ -33 -393 -142 31 63 -4 30 38 -331 120 -148 -178 -141 176 -150 -298 -61 -64 -184 -199 -243 75 -58 -353 58
4599E8j54o2m34M24q6J41j36jM5K2J80m9l21N48m09m6J72k33K2J47j07j15K16
$$ 58 -96 -158 -592 -168 -254 -113 -249 -250 -205 -183 -3 -52 -373 175 -234 -280 -108 -341 -319 -172 -279 -394 -178
4622a78J69L18o35R2J55j16Q5J5K12l51j10K48M2k36J15J92q8J53J32o1L9m35
$$ -178 -9 309 -326 -234 -79 -195 -110 -95 117 -234 -344 -96 -54 -290 -175 17 -71 82 214 153 192 -243
4644b43L73J4M9n05O13j70kj45J93J05k00j51K17J08j27k77J11J06o8K16k5j74
$$ -243 130 144 193 -312 301 131 129 -16 177 282 82 -69 148 256 129 -148 -37 69 1 217 192 18
4666A8L22R4k35k73l8M81n9m42L25J47r0k99L61r2K5l81J27q4L9K52k49NL78k60
$$ 18 340 434 199 -74 -112 369 310 -132 193 340 250 -49 312 220 245 -136 -9 -93 -54 198 -51 -46 332 72
4690G2p9q2R4J5o4N77l84J19k99K77j83p5j6R5l38J24M43M5o53j83M29L97n87
$$ 72 -7 -89 5 20 -44 533 149 268 -31 246 63 -12 -28 67 -271 -147 296 341 -312 -495 -66 331 -256
4713b56K65Q2n6j43K1M23n05k15n0M28l45J26K73L50p47k92N72j0k82j50O27l48
$$ -256 9 91 35 -108 -87 336 -169 -384 -434 -6 -351 -225 48 398 -349 -641 -69 -79 -361 -511 116 -232
4735b32k18J20L88j16l88j27L17K14l68L85J4j12m04N94M67p63J44J45j68j06
$$ -232 -450 -330 58 -58 -446 -573 -256 -42 -410 -25 -11 -123 -527 67 534 -229 -85 60 -108 -214
4755b14K51P4j04n60L89M94l8m24JL07l60K11J43j64K22m35K27L49k76k33Q8L35
$$ -214 37 111 7 -553 -164 330 292 -132 -131 176 -184 27 170 6 228 -207 20 369 93 -140 -52 283
4777B83n07L12K91J24m80j58Q55k81l31M04l71K4m19K09N00j19l94J74O65n58
$$ 283 -224 88 379 503 23 -135 720 439 108 512 141 165 -254 -45 455 336 -58 116 781 223
4797B23N6j74L07n13k44P05L24q07j12P97K11q95L4O63l38m44K01K94P3k33p9
$$ 223 279 105 412 -101 -345 360 684 -123 -235 562 773 -122 -88 575 237 -207 -6 288 361 128 49
4818D9J30k19l91P42r4j92m02L56R6l05o5N88N68r70k29P08l49k89P4L55m0m32
$$ 49 179 -40 -431 311 217 25 -377 -21 75 -230 -295 293 861 -109 -338 370 21 -268 -194 161 121 -311
4840c11N79N5m65l78K89M33l47k3k8m8J05oK42K29o56j95K95pj13n2O67k94n00
$$ -311 268 323 -142 -520 -231 202 -145 -168 -196 -244 -139 -145 97 326 -330 -525 -230 -237 -350 -402 265 -29 -529
4863e29R5O82k60n10J15N45j22k25J88J53k64j11L95K34l47k63J54J33l89J40
$$ -529 -434 248 -12 -522 -407 138 16 -209 -21 132 -132 -243 152 386 39 -224 -70 63 -326 -186
4883a86N90k17n06J59M75k72k46K43J27k62j09N12m9j97k68J52P35l25j41j55
$$ -186 404 187 -319 -160 315 43 -203 40 167 -95 -204 308 259 62 -206 -54 681 356 215 60
4903F0N0j98J9K54L66n46l12K33K69o7J76K9l08j25J84M47j52q09K77O86k71k03
$$ 60 110 -88 -69 185 551 5 -307 -74 195 128 304 333 25 -100 84 531 379 -430 -153 533 262 59
4925E9R8L69n60k83J44K51K41n87K30m8R3J51J50m9n21J12L09O7m83L15L25o50
$$ 59 157 526 -34 -317 -173 78 319 -268 -38 -86 7 158 308 259 -262 -150 159 226 -257 58 383 -267
4947b67k97M93O64m89m71J63L25k5k42K92k95k02K68L49r9j65j12L53n30n4N93
$$ -267 -564 -71 593 104 -367 -204 121 96 -146 146 -149 -351 -83 266 167 2 -110 243 -287 -341 252
4968B52k06l91k64O43N3k02l25J22J60k72P4L92K55m28k98M80J22n21J30J57K6
$$ 252 46 -345 -609 34 87 -115 -440 -318 -158 -430 -356 36 291 -137 -435 45 167 -354 -224 -67 -41
4989d1j39j74N05r0l48J62J81j44l11L33N1j45m8M89p9n47L78r2J16k06K38L96
$$ -41 -180 -354 151 61 -287 -125 56 -88 -399 -66 -15 -160 -208 281 202 -345 33 -59 57 -149 89 485
5011D85m66k86M4M98j05l08J25K32Nj70L1K53l36j36L50j1k07l86N91K8m47L50
$$ 485 19 -267 -223 275 170 -138 -13 219 224 54 85 338 2 -134 216 205 -2 -388 203 231 -216 134
5033A34J74L0o34J81L47J69l32J80j85j37L13j36K97m43l05P5P74j78l90L43j11
$$ 134 308 338 -296 -115 232 401 69 249 64 -73 240 104 401 -42 -347 -272 502 324 -66 277 166
5054A66k37j59N99P7j18o11Q5L51j97j34M42l43K8J86k61K31j59K61j12k76q1
$$ 166 -71 -230 369 446 328 -283 -198 153 -44 -178 264 -79 -51 135 -126 105 -54 207 95 -181 -262
5075b62J20K52l0l32K05J77k20n8J19K97k46J29j59j65K29l5O2l75L37Q1j59k67
$$ -262 -142 110 80 -252 -47 130 -90 -148 -29 268 22 151 -8 -173 56 21 83 -292 45 126 -33 -300
5097c00R0J53J51k09j34K50l93J12L7L34l8k50lL23k70J46j63j70J69j92k9M33
$$ -300 -210 -57 94 -115 -249 1 -392 -280 -243 91 53 -197 -200 123 -147 -1 -164 -334 -165 -357 -386 47
5119D7l89L13l38J81J64l2k02L80k07l52L28k03L32j20q3J43j32j53M34Q3O1r7
$$ 47 -342 -29 -367 -186 -22 -54 -256 124 -83 -435 -107 -310 22 -98 -181 -38 -170 -323 111 194 255 158
$$ [...]
8191h2
##END NTUPLES=NMR FID
##END=
