##TITLE=1H_SAV-41-N1
 CDCl3, 8 sc, 
 25.10.2019
##JCAMPDX= 6.0         $$ Bruker NMR JCAMP-DX V2.0
##DATA TYPE= NMR FID
##DATA CLASS= NTUPLES
##ORIGIN= UXNMR, Bruker Analytische Messtechnik GmbH
##OWNER= root
$$ XWIN-NMR		Version 3.5
$$ Fri Oct 25 14:17:56 2019 Russian Standard Time (UT+4h)  she@DPX200
##.OBSERVE FREQUENCY= 200.1315
##.OBSERVE NUCLEUS= ^1H
##.DELAY= (6, 6)
##.ACQUISITION MODE= SIMULTANEOUS
##.ACQUISITION SCHEME= undefined
##.AVERAGES= 8
##.DIGITISER RES= 18
##SPECTROMETER/DATA SYSTEM= spect
##.PULSE SEQUENCE= zg30
##.SOLVENT NAME= CDCl3
##.SHIFT REFERENCE= (INTERNAL, CDCl3, 0, 15.7039)
##AUDIT TRAIL= $$ (NUMBER, WHEN, WHO, WHERE, WHAT)
$$ ##TITLE= Audit trail, XWIN-NMR		Version 3.5
$$ ##JCAMPDX= 5.01
$$ ##ORIGIN= Bruker BioSpin GmbH
$$ ##OWNER= she
$$ F:/spectra/data/she/nmr/H-F/1/audita.txt
$$ ##AUDIT TRAIL=  $$ (NUMBER, WHEN, WHO, WHERE, WHAT)
(   1,<2019-10-25 14:16:52.54 +0400>,<she>,<DPX200>,
      <created by zg, POWCHK disabled, PULCHK disabled
       configuration hash MD5:
       00 E9 B6 7A A2 85 ED C7 34 08 36 98 17 FE 4E 26
       data hash MD5: 16K
       EC 45 C2 29 47 84 88 10 B7 21 FC D6 4A 55 2C 94>)
$$ ##END=
$$ 
$$ hash MD5
$$ 03 5C A1 26 FF 17 B8 AA 37 44 01 8C BA B2 40 08
##$RELAX= 
##$RELAX= 
##$RELAX= 
##$RELAX= 
##$RELAX= 
##$RELAX= 
$$ Bruker specific parameters
$$ --------------------------
##$DU= <F:/spectra>
##$EXPNO= 1
##$NAME= <H-F>
##$PROCNO= 1
##$TYPE= <nmr>
##$USER= <she>
##$AMP= (0..31)
100 100 100 100 100 100 100 100 100 100 100 100 100 100 100 100 100 100 
100 100 100 100 100 100 100 100 100 100 100 100 100 100 
##$AQSEQ= 0
##$AQ_mod= 1
##$AUNM= <au_zg>
##$AUTOPOS= <>
##$BF1= 200.13
##$BF2= 200.13
##$BF3= 200.13
##$BF4= 200.13
##$BF5= 200.13
##$BF6= 200.13
##$BF7= 200.13
##$BF8= 200.13
##$BYTORDA= 1
##$CFDGTYP= 0
##$CFRGTYP= 5
##$CHEMSTR= <none>
##$CNST= (0..31)
1 1 145 1 1 1 1 1 1 1 1 1 1 1 1 1 1 1 1 1 1 1 1 1 1 1 1 1 1 1 1 1 
##$CPDPRG= <>
##$CPDPRG1= <>
##$CPDPRG2= <>
##$CPDPRG3= <>
##$CPDPRG4= <mlev>
##$CPDPRG5= <mlev>
##$CPDPRG6= <mlev>
##$CPDPRG7= <mlev>
##$CPDPRG8= <mlev>
##$CPDPRGB= <>
##$CPDPRGT= <>
##$D= (0..31)
0 1.2 0 0 0 0 0 0 0 0.06 0 0.03 0 0 0 0 0.0002 0 0 0 0 0 0 0 0 0 0 0 0 
0 0 0 
##$DATE= 1571998611
##$DBL= (0..7)
120 120 120 120 120 120 120 120 
##$DBP= (0..7)
150 150 150 150 150 150 150 150 
##$DBP07= 0
##$DBPNAM0= <>
##$DBPNAM1= <>
##$DBPNAM2= <>
##$DBPNAM3= <>
##$DBPNAM4= <>
##$DBPNAM5= <>
##$DBPNAM6= <>
##$DBPNAM7= <>
##$DBPOAL= (0..7)
0.5 0.5 0.5 0.5 0.5 0.5 0.5 0.5 
##$DBPOFFS= (0..7)
0 0 0 0 0 0 0 0 
##$DE= 6
##$DECBNUC= <off>
##$DECIM= 24
##$DECNUC= <off>
##$DECSTAT= 4
##$DIGMOD= 1
##$DIGTYP= 9
##$DL= (0..7)
0 120 120 120 120 120 120 120 
##$DP= (0..7)
150 150 150 150 150 150 150 150 
##$DP07= 0
##$DPNAME0= <>
##$DPNAME1= <>
##$DPNAME2= <>
##$DPNAME3= <>
##$DPNAME4= <>
##$DPNAME5= <>
##$DPNAME6= <>
##$DPNAME7= <>
##$DPOAL= (0..7)
0.5 0.5 0.5 0.5 0.5 0.5 0.5 0.5 
##$DPOFFS= (0..7)
0 0 0 0 0 0 0 0 
##$DQDMODE= 0
##$DR= 18
##$DS= 0
##$DSLIST= <SSSSSSSSSSSSSSS>
$$ [...]
##$SUBNAM2= <"">
##$SUBNAM3= <"">
##$SUBNAM4= <"">
##$SUBNAM5= <"">
##$SUBNAM6= <"">
##$SUBNAM7= <"">
##$SUBNAM8= <"">
##$SUBNAM9= <"">
##$SW= 24.0689530833862
##$SWIBOX= (0..15)
0 0 2 0 0 0 0 0 0 0 0 0 0 0 0 0 
##$SW_h= 4816.95568400771
##$TD= 16384
##$TD0= 1
##$TE= 0
##$TE2= 300
##$TE3= 300
##$TEG= 300
##$TL= (0..7)
0 120 120 120 120 120 120 120 
##$TP= (0..7)
150 150 150 150 150 150 150 150 
##$TP07= 0
##$TPNAME0= <>
##$TPNAME1= <>
##$TPNAME2= <>
##$TPNAME3= <>
##$TPNAME4= <>
##$TPNAME5= <>
##$TPNAME6= <>
##$TPNAME7= <>
##$TPOAL= (0..7)
0.5 0.5 0.5 0.5 0.5 0.5 0.5 0.5 
##$TPOFFS= (0..7)
0 0 0 0 0 0 0 0 
##$TUNHIN= 0
##$TUNHOUT= 0
##$TUNXOUT= 0
##$USERA1= <user>
##$USERA2= <user>
##$USERA3= <user>
##$USERA4= <user>
##$USERA5= <user>
##$V9= 5
##$VALIST= <valist>
##$VCLIST= <CCCCCCCCCCCCCCC>
##$VD= 0
##$VDLIST= <DDDDDDDDDDDDDDD>
##$VPLIST= <PPPPPPPPPPPPPPP>
##$VTLIST= <TTTTTTTTTTTTTTT>
##$WBST= 1024
##$WBSW= 4
##$XGAIN= (0..3)
0 0 0 0 
##$XL= 0
##$YL= 0
##$YMAX_a= 277185
##$YMIN_a= -449729
##$ZGOPTNS= <>
##$ZL1= 120
##$ZL2= 120
##$ZL3= 120
##$ZL4= 120
##$ABSF1= 10
##$ABSF2= 0
##$ABSG= 5
##$ABSL= 3
##$ALPHA= 0
##$AQORDER= 0
##$ASSFAC= 0
##$ASSFACI= 0
##$ASSFACX= 0
##$ASSWID= 0
##$AUNMP= <proc_1d>
##$AZFE= 0.1
##$AZFW= 0.1
##$BCFW= 1
##$BC_mod= 2
##$BYTORDP= 1
##$COROFFS= 0
##$CY= 11.3945322036743
##$DATMOD= 1
##$DC= 2
##$DFILT= <>
##$DTYPP= 0
##$F1P= 19.5091578491511
##$F2P= -0.509923556040331
##$FCOR= 0.5
##$FTSIZE= 0
##$FT_mod= 4
##$GAMMA= 1
##$GB= 0.15
##$INTBC= 1
##$INTSCL= 1
##$ISEN= 128
##$LB= 0.24
##$LEV0= 0
##$LPBIN= 0
##$MAXI= 10000
##$MC2= 0
##$MEAN= 0
##$ME_mod= 0
##$MI= 1.114404
##$NCOEF= 0
##$NC_proc= 0
##$NLEV= 6
##$NOISF1= 3.799351
##$NOISF2= 2.8
##$NSP= 1
##$NTH_PI= 0
##$NZP= 0
##$OFFSET= 15.70392
##$PC= 1
##$PHC0= -9577.645
##$PHC1= 22.80083
##$PH_mod= 1
##$PKNL= yes
##$PPARMOD= 0
##$PSCAL= 0
##$PSIGN= 0
##$REVERSE= no
##$SF= 200.130013532006
##$SI= 16384
##$SIGF1= 3
##$SIGF2= 2
##$SINO= 400
##$SIOLD= 16384
##$SREGLST= <1H.CDCl3>
##$SSB= 0
##$STSI= 0
##$STSR= 0
##$SW_p= 3612.71676300578
##$SYMM= 0
##$S_DEV= 0
##$TDeff= 0
##$TDoff= 0
##$TI= <>
##$TILT= no
##$TM1= 0
##$TM2= 0
##$TOPLEV= 0
##$USERP1= <user>
##$USERP2= <user>
##$USERP3= <user>
##$USERP4= <user>
##$USERP5= <user>
##$WDW= 1
##$XDIM= 8192
##$YMAX_p= 0
##$YMIN_p= 0
$$ End of Bruker specific parameters
$$ ---------------------------------
##NTUPLES= NMR FID
##VAR_NAME=  TIME,          FID/REAL,        FID/IMAG
##SYMBOL=    X,             R,               I
##VAR_TYPE=  INDEPENDENT,   DEPENDENT,       DEPENDENT
##VAR_FORM=  AFFN,          ASDF,            ASDF
##VAR_DIM=   8192,          8192,            8192
##UNITS=     SECONDS,       ARBITRARY UNITS, ARBITRARY UNITS
##FACTOR=    0.0002076,     1,               1
##FIRST=     0,             0,               0
##LAST=      1.7004516,     0,               0
##MIN=       0,             -449729,         0
##MAX=       1.7004516,     277185,          0
$$ Real data points
##PAGE= N=1
##DATA TABLE= (X++(R..R)), XYDATA
$$ plain form
0 0 0 0 0 0 8 -8 8 -8 16 -16 24 -32 35 -41 56 -64 79 -91 109 -128 152 -176 202 -233 269 -308 352 -398
28 -398 453 -511 575 -648 728 -815 909 -1012 1125 -1251 1388 -1538 1704 -1887 2088 -2311
44 -2311 2561 -2841 3155 -3514 3925 -4403 4963 -5636 6458 -7494 8839 -10669 13315 -17503
58 -17503 25155 -43691 181900 48733 -383695 -46196 237201 58985 -214802 -39712 154049
69 154049 57539 -112053 -52390 16844 8716 22998 65808 -23760 -98305 -4064 109877 40290
81 40290 -23648 60543 99924 -53200 -146136 -29170 73300 -3680 -60510 18752 55710 -40104
93 -40104 -79438 6317 48782 -5717 -11247 35136 2272 -58538 9095 112655 60971 -54470
105 -54470 -36246 25082 -43803 -115439 -14366 95638 17137 -84622 -11679 70614 -18546
$$ packed form
0@%%%%Qj6J6j6K4l2M0n6O7p6R7j20J43j70K00k37K80l28L78m35N02n77O60p50
28c98Q51r64J086j223J376j543J724j921K137k376K639k926L242l591L975m399
44b311M872n402N996o669P439q328R366j0599J2094j3952J6333j9508K3984l0818
58a7503M2658o8846K25591j33167m32428L37499K83397j78216k73787J75090J93761
69A54049r6510j69592N9663O9234q128J4282M2810q9568p4545R4241J13941o9587
81D0290o3938Q4191L9381j53124r2936J16966J02470p6980n6830P9262L6958r5814
93d0104l9334Q5755M2465n4499n530M6383l2864o0810O7633J03560n1684j15441
105e4470J8224O1328o8885p1636J01073J10004p8501j01759P2943Q2293q9160
$$ plain form
116 -18546 -98194 5159 107068 28190 -67574 -17412 54269 32265 9245 27430 -7896 -72755
128 -72755 -49174 6894 -25954 -64525 10611 83125 19451 -65045 -37919 14766 4816 6538
140 6538 42497 15333 -45993 -6016 77902 38355 -66991 -49311 36966 6021 -90458 -66442
152 -66442 37320 49315 -9705 -7648 30014 5584 -33447 -5676 37592 22579 -2334 13724
164 13724 25835 6267 2719 13021 -14337 -50422 -22956 19476 -13015 -58787 -5847 75677
176 75677 47487 -35682 -27027 38845 29495 -26579 -12290 40737 31823 -6214 3281 17862 -13711
189 -13711 -33318 -8301 -10320 -47321 -28883 33011 25680 -29568 -5264 64686 37502 -48352
201 -48352 -36422 41810 38010 -23564 -16069 32074 18871 -18543 -7093 -3592 -47414 -50392 15581
$$ packed form
116a8546p9648J03353J01909p8878r5764N0162P1681k2004k3020J8185l5326o4859
128g2755K3581N6068l2848l8571P5136P2514o3674q4496K7126N2685r950J722
140F538L5959k7164o1326L9977Q3918l9547j05346J7680Q6277l0945r6479K4016
152f6442J03762J1995n9020K057L7662k4430l9031K7771M3268j5013k4913J6058
164A3724J2111j9568l548J0302k7358l6085K7466M2432l2491m5772N2940Q1524
176G5677k8190q3169Q655O5872r350n6074J4289N3027q914l8037R495J4581l1573
189a3711j9607K5017k019l7001J8438O1894p331n5248K4304O9950k7184q5854
201d8352J1930P8232l800o1574P495M8143j3203l7414J1450L501m3822k978O5973
$$ plain form
214 15581 29091 -34693 -38399 45115 68756 -4129 -35572 14529 31784 -9896 -13559 19340
226 19340 6669 -21956 9157 37935 -16933 -70129 -25430 28796 -9783 -53461 -5603 49259
238 49259 21553 -11100 18759 32640 -13546 -27010 20871 24875 -30845 -31919 30924 34353 -30806
251 -30806 -43015 4682 2903 -43477 -32822 17919 15399 -11039 15873 46641 11376 -21022
263 -21022 12844 30828 -20019 -40457 17502 41318 -18334 -41912 16543 34981 -28832 -54897
275 -54897 -3042 20885 -10110 -6957 33235 29047 390 20128 43946 291 -41934 -917
287 -917 41095 -1362 -43172 -1117 39399 2034 -34136 -7178 8245 -22930 -20845 26969 28881
300 28881 -12505 3187 58912 43092 -24419 -25596 23239 15697 -29608 -20107 16107 4486 -17375
$$ packed form
214A5581J3510o3784l706Q3514K3641p2885l1443N0101J7255m1680l663L2899
226A9340j2671k8625L1113K8778n4868n3196M4699N4226l8579m3678M7858N4862
238D9259k7706l2653K9859J3881m6186j3464M7881M004n5720j074O2843L429o5159
251c0806j2209M7697j779m6380J0655N0741k520k6438K6912L0768l5265l2398
263b1022L3866J7984n0847k0438N7959K3816n9652k3578N8455J8438o3813k6065
275e4897N1855K3927l0995L153M0192m188k8657J9738K3818m3655m2225M1017
287i17M2012m2457m1810M2055M0516l7365l6170K6958J5423l1175K085M7814J912
300B8881m1386J5692N5725j5820o7511j177M8835p542m5305R501L6214j1621k1861
$$ plain form
313 -17375 5706 16942 -24838 -38789 11972 31236 -16491 -27511 33571 57208 8486 -13404
325 -13404 19358 19407 -24903 -27393 7270 1752 -24713 -3032 26587 -3650 -37062 -5619 24713
338 24713 -9200 -33682 9701 39143 4555 -12091 29948 41713 -8149 -29867 313 -530
350 -530 -37527 -26408 20988 14812 -27228 -19642 15930 628 -32438 -12265 21567 6353 -11537
363 -11537 13332 26485 -2934 -6298 27942 15585 -47009 -52766 5156 16772 -30449 -29017 26647
376 26647 29598 -25980 -39950 536 14819 -2176 3299 19103 4412 -7091 15577 23500 -8741
389 -8741 -20506 4602 -2256 -46681 -41721 16999 31843 -9181 -13371 21202 9018 -38771 -24725
402 -24725 35989 39593 -7013 -10779 24758 20408 -14262 -12812 10521 2557 -19402 -20650 -20157 -24192
$$ packed form
313a7375K3081J1236m1780j3951N0761J9264m7727j1020O1082K3637m8722k1890
325a3404L2762M9m4310k490L4663n518k6465K1681K9619l0237l3412L1443L0332
338B4713l3913k4482M3383K9442l4588j6646M2039J1765m9862k1718L0180q43
350e30l6997J1119M7396o176m2040P586L5572j5302l3066K0173L3832j5214j7890
363a1537K4869J3153k9419l364L4240j2357o2594n757N7922J1616m7221J432N5664
376B6647K951n5578j3970M0486J4283j6995N475J5804j4691j1503K2668P923l2241
389h741j1765K5108o858m4425M960N8720J4844m1024m190L4573j2184m7789J4046
402b4725O0714L604m6606l766L5537m350l4670J450K3333p964k1959j248M93m035
$$ plain form
416 -24192 3564 43648 27014 -25064 -21988 22335 13306 -30995 -9792 54871 49810 -16523 -32545
429 -32545 8115 16863 -10785 -12195 3109 -11911 -30549 -10345 13862 8176 10003 31609 20581
442 20581 -25304 -31235 11389 27863 9288 15206 33585 3128 -39337 -19264 23533 4760
454 4760 -34574 -13994 23019 -3401 -40209 -3272 53661 39015 -12252 -17721 2789 -1429 -6662
467 -6662 14691 27192 11638 1726 1386 -22065 -42361 -11008 29256 7726 -36428 -20435 22683
480 22683 15222 -12403 6722 36378 12839 -24771 -15243 5968 -2692 0 31853 27753 -25491
493 -25491 -45943 -7854 8990 -19616 -21334 16590 21675 -12965 -15714 16466 20886 2187 10278
506 10278 19841 -12204 -37566 -1078 37307 13056 -20101 -1522 14900 -21716 -48241 -12667
$$ packed form
416b4192K7756M0084j6634n2078L076M4323r029m4301K1203O4663n061o6333j6022
429c2545M0660Q748k7648j410J5304j5020j8638K0204K4207n686J827K1606j1028
442B0581m5885n931M2624J6474j8575N918J8379l0457m2465K0073M2797j8773
454D760l9334K0580L7013k6420l6808L6937N6933j4646n1267n469K0510m218n233
467f662K1353J2501j5554r912l40k3451k0296L1353M0264k1530m4154J5993M3118
480B2683p461k7625J9125K9656k3539l7610R528K1211q660K692L1853m100n3244
493b5491k0452L8089J6844k8606j718L7924N085l4640k749L2180M420j8699Q091
506A0278R563l2045k5362L6488L8385k4251l3157J8579J6422l6616k6525L5574
$$ plain form
518 -12667 24712 11197 -6970 6092 12648 -2595 785 22283 14565 -10345 -4902 10401 -8157
531 -8157 -23423 8484 35232 1708 -36067 -16824 8763 -12939 -26899 10176 36925 8220
543 8220 -13375 11469 24269 -3309 -10971 17465 17277 -19937 -23176 12763 18828 -10567 -12752
556 -12752 9522 1204 -25567 -16828 10353 8614 -997 16782 27679 3848 -9755 10320 16092
569 16092 -10301 -15604 10286 10121 -19391 -15027 18061 11263 -25110 -20060 13140 5903 -24524
582 -24524 -9655 27932 21646 -5596 3652 22052 1282 -22040 -3788 12987 -9070 -23085
594 -23085 1573 14544 -10211 -21477 1255 6462 -16450 -15316 9993 8234 -10442 4023 30525
607 30525 12999 -19206 -7273 17670 -1993 -30756 -13320 12698 -391 -17854 -2936 7598
$$ packed form
518a2667L7379j3515j8167J3062O556j5243L380K1498p718k4910N443J5303j8558
531h157j5266L1907K6748l3524l7775J9243K5587k1702j3960L7075K6749k8705
543H220k1595K4844J2800k7578p662K8436j88l7214l239L5939O065k9395k185
556a2752K2274q318k6771Q739K7181j739r611J7779J0897k3831j3603K0075N772
569A6092k6393n303K5890j65k9512M364L3088o798l6373N050L3200p237l0427
582b4524J4869L7587o286k7242R248J8400k0770k3322J8252J6775k2057j4015
594b3085K4658J2971k4755j1266K2732N207k2912J134K5309j759j8676J4465K6502
607C0525j7526l2205J1933K4943j9663k8763J7436K6018j3089j7463J4918J0534
$$ plain form
619 7598 -11141 -15785 6016 5435 -17704 -5855 29140 19396 -16955 -6589 29964 13741 -31090
632 -31090 -24253 13894 5993 -27317 -16650 15756 9052 -15118 -7257 6231 -6163 -11573 10297
645 10297 16153 -5554 -4047 24241 20001 -14820 -16752 12270 7869 -23886 -20892 8223 6355
658 6355 -12428 -904 16514 -1415 -18683 3643 21440 -1707 -15269 15548 33010 2165
670 2165 -16540 9226 20764 -10710 -24593 682 8774 -13978 -12575 16042 15304 -10916 -6676
683 -6676 17873 9142 -14370 -759 24653 12058 -8340 7649 23153 -182 -19474 78
695 78 10714 -15217 -23440 7161 17626 -8672 -12545 17330 19573 -10818 -12727 15364 14797 -8448
709 -8448 -1507 21263 11378 -10896 -2204 10743 -8681 -23599 -2604 11221 -10119 -17309 11307
$$ packed form
619G598j8739m644K1801n81k3139J1849L4995r744l6351J0366L6553j6223m4831
632c1090O837L8147p901l3310J0667L2406o704k4170P861J3488j2394n410K1870
645A0297N856k1707J507K8288m240l4821j932K9022m401l1755K994K9115j868
658F355j8783J1524J7418j7929j7268K2326J7797k3147j3562L0817J7462l0845
670B165j8705K5766J1538l1474j3883K5275Q092k2752J403K8617p38k6220M240
683f676K4549q731k3512J3611K5412j2595k0398J5989J5504k3335j9292J9552
695G8J0636k5931q223L0601J0465k6298l873K9875K243l0391j909K8091n67k3245
709h448O941K2770r885k2274Q692J2947j9424j4918K0995J3825k1340p190K8616
$$ plain form
722 11307 21191 -5118 -11470 13745 16222 -11471 -11712 15200 15638 -7282 -3536 16095 2708 -22788
736 -22788 -12713 8230 -4404 -22483 -3727 17044 1861 -13309 5746 19860 518 -12361
748 -12361 4042 10247 -7020 -7926 13098 12037 -11034 -11254 6266 -4105 -26725 -13839 13044
761 13044 4984 -15504 -1041 19633 4333 -14652 3327 20533 -276 -18086 -31 13804
773 13804 -3627 -10863 8717 10765 -14403 -20912 -1912 -1266 -14716 -1296 22209 10428 -13679
786 -13679 -1936 19439 6135 -12516 3474 19019 -2113 -20956 -1074 16790 22 -11761
798 -11761 2661 5044 -18819 -22953 4668 16725 3091 2045 15133 7455 -11987 -3957 16119
811 16119 8554 -9305 -1029 9388 -6939 -19477 2306 20187 196 -19988 -7907 3174
$$ packed form
722A1307R884k6309o352K5215K477k7693k41K6912M38k2920L746J9631j3387k5496
736b2788J0075K0943j2634j8079J8756K0771j5183j5170J9055J4114j9342j2879
748a2361J6403O205j7267r06K1024j061k3071k20J7520j0371k2620J2886K6883
761A3044q060k0488J4463K0674j5300j8985J7979J7206k0809j7810J8055J3835
773A3804j7431p236J9580K048k5168o509J9000O46j3450J3420K3505j1781k4107
786a3679J1743K1375j3304j8651J5990J5545k1132j8843J9882J7864j6768j1783
798a1761J4422K383k3863m134K7621J2057j3634j046J3088p678j9442Q030K0076
811A6119p565j7859Q276J0417j6327j2538K1783J7881j9991k0184J2081J1081
$$ plain form
823 3174 -9424 -10902 15830 26920 4422 -9746 2726 6055 -8482 -5721 13173 9582 -10827
836 -10827 -11707 1172 -3408 -10219 4549 13831 -7436 -24718 -5265 14097 4091 -2170 17569
849 17569 22364 -6564 -23168 -2712 10859 -2799 -7299 7639 5304 -17627 -19329 1816 8475
862 8475 -2807 -3421 1386 -7842 -13469 4332 19242 9079 -810 7361 4240 -18698 -22148 5743
876 5743 17838 -2632 -13751 -756 694 -15695 -11828 11763 13798 -7630 -11922 4146 5781
889 5781 -2194 6968 19890 8059 -11864 -10121 -2183 -8118 -7575 9838 13718 -6883 -16869 -1358
903 -1358 5976 -4920 -2747 14232 10919 -9346 -6791 13539 13577 -1904 1984 14612 471 -21759
917 -21759 -13737 8940 8406 -2630 1261 5970 -4892 -9756 3693 9458 225 1796 15376 9376
$$ packed form
823C174j2598j478K6732J1090k2498j4168J2472L329j4537K761J8894l591k0409
836a0827q80J2879m580o811J4768R282k1267j7282J9453J9362j0006o261J9739
849A7569M795k8928j6604K0456J3571j3658m500J4938k335k2931j702K1145O659
862H475j1282o14M807r228n627J7801J4910j0163r889Q171l121k2938l450K7891
876E743J2095k0470j1119J2995J450j6389L867K3591K035k1428m292J6068J635
889E781p975R162J2922j1831j9923J743P938n935N43J7413L880k0601r986J5511
903a358P334j0896K173J6979l313k0265K555K0330L8j5481L888J2628j4141k2230
917b1759Q022K2677n34j1036L891M709j0862m864J3449N765r233J571J3580o000
$$ plain form
931 9376 -10185 -4489 19165 15337 -9100 -10715 5942 1247 -16090 -7091 14975 11560 -6216
944 -6216 -4852 5734 547 -5944 5525 13903 3713 -1621 8634 8565 -6426 -5558 11060 7194
958 7194 -14472 -13962 4193 4304 -9148 -1658 14754 5867 -11615 -4066 12115 2920 -9097 3647
972 3647 17820 4545 -10989 -2871 6115 -3064 -9017 -1202 -1772 -11873 -6453 8526 3504 -11170
986 -11170 -1627 15678 4689 -16788 -7663 14605 8925 -9138 -3633 10004 1759 -12875 -7031
999 -7031 1919 -5927 -11358 -953 3041 -6415 -5858 7291 7091 -6493 -4265 8559 4005 -10025
1013 -10025 -3391 10958 4653 -8912 -3300 5942 -5135 -15542 -4451 5555 -5162 -11023 4315
1026 4315 11994 -3054 -9196 5723 11568 -2852 -7646 4639 6166 -5136 -3773 7126 2196
$$ packed form
931I376j9561N696K3654l828k4437j615J6657m695j7337Q999K2066l415j7776
944f216J364J0586n187o491J1469Q378j0190n334J0255o9j4991Q68J6618l866
958G194k1666N10J8155J11j3452P490J6412q887j7482P549J6181r195j2017J2744
972C647J4173j3275j5534Q118Q986r179n953P815n70j0101N420J4979n022j4674
986a1170R543J7305j0989k1477R125K2268n680j8063N505J3637q245j4634N844
999g031Q950p846n431J0405L994r456N57J3149k00j3584K228J2824m554j4030
1013a0025O634J4349o305j3565N612R242j1077j0407J1091J0006j0717n861J5338
1026D315P679j5048o142J4919N845j4420m794J2285J527j1302J363J0899m930
$$ plain form
1039 2196 -10695 -5137 4336 -4508 -14466 -1388 12186 3287 -6345 2245 9837 891 -4706 4786
1053 4786 6998 -3060 -3969 5249 4050 -6030 -2161 6420 -1344 -12375 -3735 7435 -579 -8278
1067 -8278 5232 15474 2000 -9341 4027 14056 -271 -10182 2183 10714 -1529 -9216 1724
1080 1724 6708 -4275 -8700 611 2023 -6520 -4373 6731 6185 -1248 1876 8206 1873 -4943 696
1095 696 5266 -2669 -5802 3334 4466 -7435 -8388 4693 4089 -9914 -9547 5605 5856 -6645 -3207
1110 -3207 11331 8989 -5106 -3388 6199 985 -9015 -1636 7445 -2146 -10658 -419 7441 -4541
1124 -4541 -12075 604 8632 -2927 -9907 2110 10638 2525 -2267 4073 4295 -3626 -3820 2221 -829
1139 -829 -6067 -6 5754 -2426 -9945 -1235 6615 -1173 -7617 1874 8390 -196 -4364 5886 10252
$$ packed form
1039B196j2891N558R473q844r958J3078J3574q899r632Q590P592q946n597R492
1053D786K212j0058r09R218j199j0080L869Q581p764j1031Q640J1170q014p699
1067h278J3510J0242j3474j1341J3368J0029j4327r911J2365Q531j2243p687J0940
1080A724M984j0983m425R311J412q543K147J1104n46p433L124O330o333o816N639
1095F96M570p935l133R136J132j1901r53J3081o04j4003L67J5152K51j2501L438
1110c207J4538k342j4095J718R587n214j0000P379R081r591q512J0239P860j1982
1124d541p534J2679Q028j1559o980J2017Q528q113m792O340K22p921j94O041l050
1139h29n238O061N760q180p519Q710P850p788o444R491O516q586m168J0250M366
$$ plain form
1154 10252 521 -2756 4131 2513 -8090 -5864 7121 5126 -6458 -3553 6846 2235 -9171
1167 -9171 -3136 10034 5980 -4412 1038 9379 2602 -4013 5027 11218 366 -8904 -1829 4174
1181 4174 -2472 -4515 4261 6122 -2164 -3053 2098 -566 -4369 5149 13324 2706 -8296 1133 11540
1196 11540 2970 -6918 1145 8846 -2014 -11986 -4156 5107 1625 -906 4399 2278 -7092 -4712
1210 -4712 5547 4608 -2049 3359 10556 564 -11863 -2593 11033 3440 -9606 -4433 4191 -3359
1224 -3359 -12701 -2963 9518 5092 -4558 -2685 -44 -4754 -3298 6230 7069 -1084 -1998 2519 -3703
1239 -3703 -10577 -1497 8729 179 -12465 -5938 3923 -3728 -10527 3103 14146 1373 -13225
1252 -13225 -6377 4673 1341 -1804 4893 5333 -5280 -7872 -766 -1998 -7897 -185 9376 -681
$$ packed form
1154A0252r731l277O887j618j0603K226J2985j995j1584K905J0399m611j1406
1167i171O035J3170m054j0392N450Q341o777o615R040O191j0852r270P075O003
1181D174o646k043Q776J861q286q89N151k664l803R518Q175j0618j1002R429J0407
1196A1540q570r888Q063P701j0860r972P830R263l482k531N305k121r370K380
1210d712J0259r39o657N408P197r992j2427R270J3626p593j3046N173Q624p550
1224c359r342R738J2481m426r650J873K641m710J456R528Q39q153r14M517o222
1239c703o874R080J0226q550j2644O527R861p651o799J3630J1043j2773j4598
1252a3225O848J1050l332l145O697M40j0613k592P106j232n899P712R561j0057
$$ plain form
1266 -681 -15259 -7860 7745 5194 -3347 1843 7532 -3777 -11236 -118 9538 1577 -3298 4328
1280 4328 3993 -10218 -12403 2125 7533 -1392 -3605 2999 -603 -7585 -969 10348 6474 -3525
1294 -3525 -484 4582 -2607 -6808 3862 11562 1295 -6629 -380 1920 -7220 -7465 7044 10791
1308 10791 -1903 -6976 2191 5489 -1234 256 9145 5447 -4325 -2821 3964 471 -3387 4236
1322 4236 9449 -1508 -10494 -2403 4206 -1116 -2967 8023 8815 -4807 -7822 5768 9779 -1420
1336 -1420 -4139 6000 6192 -4694 -6678 1598 3888 502 2123 997 -7996 -8144 3952 9052 -2369
1351 -2369 -5806 6488 9018 -4758 -8692 4647 9418 -1714 -5644 2287 2457 -5671 -4546 4525
1365 4525 2972 -5308 -3764 1836 -999 -4261 1996 6694 -90 -3880 3390 5374 -4461 -7132 3504
$$ packed form
1266f81j4578P399J5605k551q541N190N689j1309p459J1118R656p961m875P626
1280D328l35j4211k185J4528N408q925k213O604l602o982O616J1317l874r999
1294c525L041N066p189m201J0670P700j0267p924O249K300r140k45J4509L747
1308A0791j2694n073R167L298o723J490Q889l698r772J504O785l493l858P623
1322D236N213j0957q986Q091O609n322j851J0990P92j3622l015J3590M011j1199
1336a420k719J0139J92j0886j984Q276K290l386J621j126q993j48J2096N100j1421
1351b369l437J2294K530j3776l934J3339M771j1132l930P931J70q128J125R071
1365D525j553q280J544N600k835l262O257M698o784l790P270J984r835k671J0636
$$ plain form
1380 3504 7193 -3207 -7520 990 3429 -4200 -4978 3258 2656 -4715 -3317 4062 2027 -3743 1369
1395 1369 7280 1974 -5112 -87 4453 -3148 -5714 4149 7165 -4408 -9365 1819 7452 -2644
1409 -2644 -7164 2207 6868 -439 -3760 2477 3368 -740 2045 5491 -682 -6870 -397 6524 333
1424 333 -6004 569 5910 -875 -6066 1118 4522 -1543 -2221 5614 5376 -3978 -3930 6811 6477 -3464
1440 -3464 -3836 4071 2576 -5389 -2785 5340 2465 -5026 -1213 4952 -59 -6111 -15 6894 1822
1455 1822 -3687 649 4188 -1015 -2899 2817 3483 -4391 -5119 2224 2260 -4293 -3531 3167 1966 -3943
1471 -3943 -2317 2644 -772 -4084 1917 6073 -1818 -6894 759 5202 -2921 -6625 1488 3911 -5381
1486 -5381 -7803 1986 4258 -4447 -5194 3423 4035 -5461 -5868 2595 4170 -1505 -1908 797 -1647 -3936
$$ packed form
1380C504L689j0400m313Q510K439p629p78Q236o02p371J398P379k035n770N112
1395A369N911n306p086N025M540p601k566R863L016j1573m957J1184N633j0096
1409b644m520R371M661p307l321O237Q91m108K785L446o173o188O473O921o191
1424C33o337O573N341o785n191P184L404o065o78P835k38r354M8J0741l34r941
1440c464l72P907j495p965K604Q125k875p491L813O165n011o052O096O909n072
1455A822n509M336L539n203j884N716O66p874p28P343L6o553P62O698j201n909
1471c943J626M961l416l312O001M156p891n076P653M443q123l704Q113K423r292
1486e381k422R789K272q705p47Q617O12r496m07Q463J575n675m03K705k444k289
$$ plain form
1502 -3936 918 2036 -4716 -5855 2231 4018 -5617 -7177 2975 6142 -2619 -5758 1530 3310 -3105
1517 -3105 -2728 3765 3358 -4201 -2924 2524 69 -4469 -914 3618 -934 -4407 1254 3449 -3136
1532 -3136 -3624 5253 6441 -4101 -6241 4651 7452 -2110 -4331 3914 5833 -2952 -4616 2358 3383
1547 3383 -1914 -653 3602 955 -3061 1015 4328 51 -1212 4813 4738 -3770 -4066 5662 7182 -3251
1563 -3251 -4323 4778 5836 -4235 -5323 4203 5663 -927 -1162 2870 1004 -2923 1452 6194 1835
1578 1835 -2886 1323 4650 -1439 -3933 2586 5394 -870 -3130 1984 1653 -4232 -1964 6354 4728
1593 4728 -4199 -3853 4233 3081 -3428 -876 6032 2801 -4941 -2882 2384 273 -2886 1473 4437
1608 4437 -2043 -5666 -502 2324 -1482 -1010 4232 1991 -5274 -4183 3215 2581 -3042 -824 4451
$$ packed form
1502c936M854J118o752j139Q086J787r635j560J0152L167q761l139P288J780o415
1517c105L77O493m07p559J277N448k455m538L555M532m552l473N661K195o585
1532c136m88Q877J188j0542k140J0892K801r562k221Q245J919q785j664O974J025
1547C383n297J261M255k647m016M076L313m277j263O025p5q508k96R728J520j0433
1563c251j072R101J058j0071j088R526J460o590k35M032j866l927M375M742m359
1578A835m721M209L327o089k494O519K808o264k260N114l31n885K268Q318j626
1593D728q927L46Q086j152o509K552O908l231p742K059N266k111l159M359K964
1608D437o480l623N164K826l806M72N242k241p265J091P398o34n623K218N275
$$ plain form
1623 4451 116 -7441 -4056 4067 2102 -2733 -612 1592 -3002 -5620 -21 4371 136 -1688 1340
1638 1340 -96 -4970 -2873 4075 3457 -3097 -1995 2520 -1792 -7250 -1766 6876 3356 -4782 -3889
1653 -3889 967 -190 -3180 1405 4550 761 -2818 -701 -70 -2867 -136 5322 3580 -4260 -4260 1348
1669 1348 1229 -2529 620 5921 1420 -5555 -3307 2444 1743 -786 2430 3766 -1737 -5151 -237
1684 -237 2471 -140 -71 3879 1637 -5718 -4789 3712 4476 -1684 -925 3952 1238 -5507 -3410 4254
1700 4254 4625 -764 -1413 944 -1675 -3231 676 3232 313 -422 1536 -711 -5120 -1692 5506 4414
1716 4414 -3296 -3446 2532 1042 -4542 -2618 5202 4800 -2793 -4379 -602 183 -723 882 2130 -759
1732 -759 -2646 -265 -210 -3219 -806 4685 2983 -5401 -5206 2415 2500 -3530 -2581 4140 2888 -4692 -5153
$$ packed form
1623D451m335p557L385Q123j965m835K121K204m594k618N599M392m235j824L028
1638A340j436m874K097O948o18o554J102M515m312n458N484Q642l520q138Q93
1653c889M856j157k990M585L145l789l579K117O31k797K731N458j742p840%N608
1669A348j19l758L149N301m501o975K248N751p01k529L216J336n503l414M914
1684b37K708k611O9L950k242p355R29Q501P64o160P59M877k714o745K097P664
1700D254L71n389o49K357k619j556L907K556k919p35J958k247m409L428P198j092
1716D414p710j50N978j490n584J924P820m02p593j586L777P85r06J605J248k889
1732g59j887K381N5l009K413N491j702q384J95P621Q5o030R49O721j252p580m61
$$ plain form
1749 -5153 1216 2733 -997 -1498 1023 246 -2870 -1177 316 -814 -285 2291 673 -4287 -3129 3242
1765 3242 2410 -2847 -1702 3890 1842 -4697 -3750 3377 3935 -1250 -1576 1879 441 -2498 -502 2498
1781 2498 1044 -800 1469 1525 -2331 -2124 3014 4122 -368 -1640 2067 1770 -2113 -990 3413 2815
1797 2815 -869 -568 2170 245 -1815 1207 4289 745 -2462 1010 3414 -280 -1877 2878 4884
1812 4884 -183 -2620 1422 3088 -97 -923 2919 2729 -1042 -887 1741 1083 -689 1745 3594 304
1828 304 -2229 1260 4049 290 -2298 2417 4169 -998 -3293 1112 3061 -605 -1844 2012 1861
1843 1861 -1927 -1951 1815 837 -1455 382 2957 -565 -3698 138 3760 48 -3745 100 2942 -1755
1859 -1755 -4675 -84 3186 2 -3082 -712 627 -1873 -1836 1393 683 -2118 -888 1765 -513 -3693
$$ packed form
1749e153O369J517l730n01K521p77l116J693J493j130N29K576j618m960J158O371
1765C242q32n257J145N592k048o539R47P127N58n185l26L455j438k939J996L000
1781B498j454j844K269N6l856K07N138J108m490j272L707k97l883J123M403n98
1797B815l684L01K738j925k060L022L082l544l207L472K404l694j597M755K006
1812D884n067k437M042J666l185q26L842j90l771J55K628o58j772K434J849l290
1828C04k533L489K789l759k588M715J752n167k295M405J949l666j239L856j51
1843A861l788k4L766r78k292J837K575l522l133L836L622l712l793L845K842m697
1859a755k920M591L270l184l084K370J339k500L7L229p10k801J230K653k278l180
$$ plain form
1875 -3693 -714 2820 -527 -4745 -1509 1824 -1188 -3749 -124 3190 -1281 -4196 -723 1672 -1326
1890 -1326 -2170 1315 1436 -2310 -2254 1375 125 -3281 -1684 2410 -7 -4452 -1972 2995 875 -3359
1906 -3359 -1081 1982 -340 -3291 -15 2233 128 -1471 1167 872 -2346 -1495 2236 1132 -3032
1921 -3032 -1166 2763 24 -4004 -202 4392 1486 -3282 -1141 3234 1053 -2426 499 3724 878
1936 878 -2008 -200 1243 -668 -862 1778 1495 -1704 -1167 2078 1242 -1576 769 3359 1033 -2440
1952 -2440 20 3228 705 -1849 1482 3207 -749 -3953 -561 2652 -327 -1856 1145 1989 -1508
1967 -1508 -1928 1570 2355 -716 -328 1787 481 -2517 -543 2584 737 -2152 -116 1748 -2228 -4135
1983 -4135 297 3258 -437 -2417 628 1971 -1519 -2353 1393 2782 -801 -1223 864 -275 -2419
$$ packed form
1875c693K979L534l347m218L236L333l012k561L625L314m471k915L473K395k998
1890a326q44L485J21l746N6L629j250l406J597M094k417m445K480M967k120m234
1906c359K278L063k322k951L276K248k105j599K638k95l218Q51L731j104m164
1921c032J866L929k739m028L802M594k906m768K141M375k181l479K925L225k846
1936H78k886J808J443j911j94K640k83l199N37L245q36k818K345K590k326l473
1952b440K460L208k523k554L331J725l956l204L392L213k979j529L001Q44l497
1967a508m20L498P85l071L88K115j306k998J974L127j847k889K036J864l976j907
1983d135M432K961l695j980L045J343l490q34L746J389l583m22K087j139k144
$$ plain form
1998 -2419 87 3052 -224 -3240 -907 1316 -1988 -3558 1424 4470 9 -3677 30 2395 -856
2013 -856 -2173 1787 3306 -684 -2930 -421 675 -503 -113 1574 -73 -3013 -1447 1284 91
2028 91 -594 2352 3862 -595 -3739 17 3176 908 -1172 1477 1649 -1893 -3006 666 1841 99
2044 99 -120 1441 -44 -3065 -516 4034 2887 -408 878 2935 -77 -3358 238 4656 2170 -1407
2060 -1407 -962 1423 -363 -2166 1007 3166 790 -768 133 -155 -825 1451 3983 2370 -1146 -772
2076 -772 1348 -281 -2258 1383 3976 586 -3350 -1951 803 -149 -1092 1740 2673 -198 -2157 -179
2092 -179 1387 397 892 2636 793 -3382 -2515 969 450 -1522 -276 1896 -783 -4068 -2714 1583
2108 1583 1206 -534 -47 698 -1336 -2399 602 2095 -415 -1012 376 -626 -3789 -3161 954 1573
$$ packed form
1998b419K506K965l276l016K333K223l304j570M982L046m461l686L707K365l251
2013h56j317L960J519l990k246K509J096j178L90J687j647k940J566K731j193
2028I1o85K946J510m457l144L756L159k268k080K649J72l542j113L672J175j742
2044I9k19J561j485l021K549M550j147l295J286K057l012l281L596M418k486l577
2060a407M45K385j786j803L173K159k376j558R01k88o70K276K532j613l516L74
2076g72K120j629j977L641K593l390l936J399K754r52r43K832R33k871j959J978
2092a79J566r90M95J744j843m175Q67L484n19j972J246K172k679l285J354M297
2108A583l77j740M87P45k034j063L001J493k510n97J388j002l163O28M115O19
$$ plain form
2124 1573 -1739 -2178 -123 -1116 -3155 -1270 2002 1736 -1221 -741 25 -1388 -2315 712 1884 -1281
2140 -1281 -3256 -697 -511 -3354 -2399 1728 2209 -2575 -3748 -165 1110 -1487 -949 2167 2355 -705
2156 -705 -1737 -126 -641 -817 1210 830 -1835 -2835 138 1120 -1657 -1275 2843 2566 -1922 -2585 1920
2173 1920 3499 520 -395 2363 2414 -1360 -1924 868 1235 -418 -58 487 -981 -1837 916 2612 164
2190 164 -591 2455 2969 -941 -1481 2351 3640 439 -829 1551 1316 -2056 -1841 1617 1620 -1442 -740
2207 -740 1159 92 -1586 798 2968 1153 -563 1291 2500 -364 -1211 1902 2825 -295 -1996 147
2223 147 811 -1744 -1368 1616 926 -1605 -600 1935 432 -1419 912 3473 989 -2335 -446 1945
2239 1945 75 -1688 307 1163 -1182 -2905 -915 293 -1076 -680 1296 157 -1769 -81 2112
$$ packed form
2124A573l312m39K055r93k039J885L272k66k957M80P66j413r27L027J172l165
2140a281j975K559J86k843R55M127M81m784j173L583J275k597N38L116J88l060
2156g05j032J611n15j76K027l80k665j000K973R82k777L82M118k77m488o63M505
2173A920J579k979r15K758N1l774n64K792L67j653L60N45j468q56K753J696k448
2190A64p55L046N14l910n40L832J289l201j268K380k35l372K15L458Ll062P02
2207g40J899j067j678K384K170j815j716J854J209k864q47L113R23l120j701K143
2223A47O64k555L76K984o90k531J005K535j503j851K331K561k484l324J889K391
2239A945j870j763J995Q56k345j723J990J208j369L96J976j139j926J688K193
$$ plain form
2254 2112 529 -1344 649 2285 -356 -3236 -347 2204 -213 -2990 -1092 887 -1235 -2811 -384
2269 -384 1332 433 -124 743 148 -746 -29 2128 962 -1257 370 1399 -535 -2508 83 1887 -747
2286 -747 -2907 -987 1456 -268 -1612 881 2470 695 -855 605 1657 -72 222 1742 985 -1207
2302 -1207 -742 1052 -90 -1799 -486 1224 -425 -1530 -100 1743 618 194 1664 2111 -256 -931
2318 -931 1075 1796 -635 -852 1297 559 -2020 -1903 659 838 -1380 -881 1033 815 -868 229 2134
2335 2134 1316 259 540 622 -444 -842 1008 774 -1453 -1346 157 -296 -2341 -1903 735 1054 -1579
2352 -1579 -1624 791 1191 -122 188 1036 687 -1414 -1273 -254 -883 -1092 -342 -238 -2033 -2410 -1087 -340
2370 -340 -1829 -1250 1385 1258 -1317 -1506 1079 1742 -339 -895 265 -54 -1777 -2114 -578 -265 -1209
$$ packed form
2254B112j583j873J993J636k641k880K889K551k417k777J898J979k122j576K427
2269c84J716q99n57Q67n95q94P17K157j166k219J627J029j934j973K591J804k634
2286g47k160J920K443j724j344K493J589j775j550J460J052j729K94J520p57k192
2302a207M65J794j142j709J313J710j649j105J430J843j125m24J470M47k367o75
2318i31K006P21k431k17K149p38k579J17K562J79k218M99J914k18j683J097J905
2335B134q18j057K81Q2j066l98J850k34k227J07J503m53k045M38K638L19k633
2352a579m5K415M00j313L10Q48l49k101J41J019o29k09P50J04j795l77J323P47
2370c40j489N79K635j27k575j89K585O63k081n56J160l19j723l37J536L13r44
$$ plain form
2387 -1209 -712 -598 -1357 -1934 -334 807 324 -201 943 901 -336 -742 1022 1213 -204 -833 -249 -962
2405 -962 -2109 -740 693 221 -1335 -73 347 -599 -742 1481 3012 1337 -590 548 1434 386
2421 386 -517 374 1161 108 -1545 -1215 -148 368 950 910 179 -226 879 1589 548 799 2691 3414
2439 3414 433 -1811 198 2048 526 -946 575 1450 -383 -2226 -606 1826 1824 1040 758 852 107
2456 107 1086 2205 1674 1072 1500 1697 -904 -2095 -362 2061 514 -1706 -952 604 -770 -1340 366
2473 366 2313 1417 232 388 -44 67 1333 1760 531 -577 -178 121 -2070 -2572 69 1788 -287
2490 -287 -2674 -1047 757 -356 -1165 1146 2659 640 -1106 -613 685 6 -240 456 154 -2050 -2386
2507 -2386 -974 -1049 -1327 -304 745 -342 -1634 -516 686 409 315 1341 793 -295 -1158 -579 138
$$ packed form
2387a209M97J14p59n77J600J141m83n25J144m2j237m06J764J91j417o29N84p13
2405i62j147J369J433m72j556J262M20r46j43K223J531j675j927J138Q86j048
2421C86r03Q91P87j053j653L30J067N16N82m0p31m05J105P10j041K51J892P23
2439C414k981k244K009J850j522j472J521Q75j833j843J620K432kp84k82R4p45
2456A07R79J119n31o02M28J97k601j191J733K423j547k220P54J556j374n70J706
2473C66J947q96j185J56m32J11J266M27j229j108L99K99k191n02K641J719k075
2490b87k387J627J804j113q09K311J513k019j746M93J298o79k46O96l02k204l36
2507b386J412p5k78J023J049j087j292J118J202k77r4J026n48j088q63N79P17
$$ plain form
2524 138 -718 -397 142 -1236 -2975 -1699 183 249 -854 241 1395 52 -1634 -248 2285 1528 -322
2541 -322 18 707 -555 -1520 -286 536 -440 -983 -300 -1004 -1334 -235 1635 1552 -145 221 1414 359
2559 359 -36 1099 2374 1039 -689 -677 95 -711 -1156 280 632 -616 -1103 -3 353 -313 668 2150
2577 2150 1258 136 467 1075 388 -392 714 1440 -345 -1957 -1358 303 -655 -1173 3 637 -556
2594 -556 -1004 18 1305 785 480 1382 1091 -532 -880 284 16 -470 -573 -95 -1158 -2038 -1169 -128
2612 -128 -413 -699 523 548 -478 -738 960 1800 620 -305 317 369 -1414 -1272 -73 -264 -1404 -1482 -469
2631 -469 -1066 -1566 -567 829 348 -464 388 999 295 -39 688 1126 204 -840 -369 -257 -1568 -1266 103
2650 103 29 -846 -1002 318 402 -248 229 1822 1233 51 504 816 674 401 457 585 -478 -881 -487 -186
$$ packed form
2524A38q56L21N39j378j739J276J882O6j103J095J154j343j686J386K533p57j850
2541c22L40O89j262r65J234Q22r76n43O83p04l30J099J870q3j697L66J193j055
2559C59l95J135J275j335j728J2P72q06m45J436L52j248m87J100L56o66R81J482
2577B150q92j122L31O08o87p80J106P26j785j612N99J661r58n18J176O34j193
2594e56m48J022J287n20l05R02k91j623l48J164k68m86j03M78j063q80Q69J041
2612a28k85k86J222K5j026k60J698Q40j180r25O22N2j783J42J199j91j140p8J013
2631d69n97n00R99J396m81q12Q52O11p04l34P27M38r22j044M71J12j311L02J369
2650A03p4q75j56J320Q4o50M77J593n89j182M53L12j42k73N6J28j063m03L94L01
$$ plain form
2670 -186 -456 -341 549 575 -510 103 1497 1622 852 674 2254 1787 33 76 1137 1069 84 -410 79
2689 79 -1 -605 -396 97 64 544 986 761 258 644 2134 1981 417 361 1079 885 -765 -409 892 429
2709 429 -825 -1240 -159 82 -208 -112 466 622 392 904 924 310 984 1492 616 -663 -856 471 -56
2728 -56 -1419 -1339 -49 -361 -1477 -1359 230 763 113 -96 517 266 -29 832 826 -172 -131 90 -236 -1883
2748 -1883 -1975 -154 -646 -1689 -1627 -566 -386 -1067 -857 934 949 193 -264 5 79 46 82 -72 -883 -1334
2768 -1334 -1012 -810 -2122 -1571 105 28 -1432 -1118 295 902 -222 -173 1408 1719 -274 -997 255 540
2786 540 -298 -588 -625 -1115 -1489 -1056 -625 -794 -425 518 340 -593 -513 1162 1786 532 77 1377 1032 -748
2806 -748 -967 -68 750 -421 -746 -631 -444 -1193 -176 499 806 296 626 918 47 480 1606 1446 326
$$ packed form
2670a86k70J15Q90K6j085O13J394J25p70j78J580m67j754M3J061o8r85m94M89
2689G9q0o04K09M93l3M80M42k25n03L86J490j53j564n6P18j94j650L56J301m63
2709D29j254m15J081K41k90R6N78J56k30N12K0o14O74N08q76j279j93J327n27
2728e6j363Q0J290l12j116J18J589N33o50k09O13k51k95Q61or98M1K21l26j647
2748a883r2J821m92j043O2J061J80o81K10J791J5p56m57K69P4l3L6j54q11m51
2768a334L22K02j312N51J676p7j460L14J413O07j124M9J581L11j993p23J252K85
2786E40q38k90l7m90l74M33M31j69L69R43j78r33Q0J675O24j254m55J300l45j780
2806g48k19Q99Q18j171l25J15J87p49J017O75L07n10L30K92q71M33J126j60j120
$$ plain form
2825 326 -117 786 424 -881 -1081 285 526 -804 -1555 -343 290 -8 360 1170 1039 708 382 328 590
2844 590 1031 1380 843 -563 -801 -397 -893 -1395 -485 714 138 -1193 -1146 697 1226 169 654 1453 1121
2863 1121 -295 -485 486 592 64 -349 -363 -1203 -1237 -919 -589 -328 -279 455 -320 -1004 218 1186 1453 632
2883 632 277 951 414 -710 -497 632 173 -830 -1102 -1033 -1323 -907 133 451 100 -15 787 584 -92
2902 -92 536 1748 1595 184 -310 -72 -248 -1059 -509 420 -293 -1185 -1019 -96 -240 136 1279 1554 668
2921 668 243 798 1165 691 626 1070 690 -413 -774 -311 -244 -340 -369 -23 -84 -540 -19 813 1007 999 1542 1661
2943 1661 376 -5 670 996 693 188 347 -47 -979 -1287 -279 368 228 -378 263 183 -195 610 1330
2962 1330 1242 784 462 775 -40 -729 154 520 -201 -768 -1265 -826 -1208 -982 -206 477 172 -51 -39 267
$$ packed form
2825C26m43R03l62j305k00J366K41j330p51J212O33k98L68Q10j31l31l26n4K62
2844E90M41L49n37j406k38M04m96n02R10J199n76j331M7J843N29j057M85P99l32
2863A121j416j90R71J06n28m13j4q40l4L18L30K61M9P34p75o84J222R68K67q21
2883F32l55O74n37j124K13J129m59j003k72O9k90M16J040L18l51j15Q02k03o76
2902i2O28J212j53j411m94K38j76q11N50R29p13q92J66R23j44L76J143K75q86
2921F68m25N55L67m74o5M44l80j103l61M63O7r6k9L46o1m56N21Q32J94qN43J19
2943A661j285l81O75L26l03n05J59l94r32l08J008O47j40o06O41q0l78Q05P20
2962A330q8m58l22L13q15o89Q83L66p21n67m97M39l82K26P76O83l05k23J2L06
$$ plain form
2982 267 240 394 904 196 -255 -327 -82 -938 -1092 -431 -297 -833 -1582 -1439 -624 -503 -344 178 361 244 -88
3003 -88 -461 28 265 202 231 -419 -1114 -1064 -786 -942 -1294 -1115 -292 -875 -1582 -976 410 312 146 13 753
3024 753 694 45 -188 151 558 28 -704 -1134 -913 -844 -262 -790 -717 -256 477 -70 -428 349 1316 1136 466
3045 466 382 631 520 -347 -129 364 -92 -626 -651 -681 -368 -208 536 219 -78 225 958 597 476 1025 1843
3066 1843 1293 341 174 317 110 151 -542 -110 -183 -366 -293 121 104 510 1085 814 641 800 1324 1366 983
3087 983 661 648 404 -403 -587 191 -239 -403 -217 -180 -477 -316 219 664 547 710 870 1099 214 504 1056
3108 1056 912 -88 -827 22 -306 -725 -1098 -235 198 -478 -641 -313 139 433 568 641 770 569 802 344
3128 344 -108 -78 163 -117 -1068 -1447 -708 -359 -678 -840 -501 -199 -124 -10 415 581 784 558 709 16 47
$$ packed form
2982B67k7J54N10p08m51p2K45q56j54O61J34n36p49J43Q15J21J59N22J83j17l32
3003h8l73M89K37o3K9o50o95N0K78j56l52J79Q23n83p07O06J386r8j66j33P40
3024G53n9o49k33L39M07n30p32m30K21O9N82n28P3M61P33n47l58P77R67j80o70
3045D66q4K49j11q67K18M93m56n34k5l0L13J60P44l17k97L03P33l61j21N49Q18
3066A843n50r52j67J43k07M1o93M32p3j83P3M14j7M06N75k71j73J59N24M2l83
3087I83l22j3k44q07j84P78m30j64J86L7k97J61N35M45j17J63J60K29q85K90N52
3108A056j44j000p39Q49l28m19l73Q63M33o76j63L28M52K94J35P3J29k01K33m58
3128C44m52L0K41k80r51l79P39L49l19j62L39L02P5J14M25J66K03k26J51o93L1
$$ plain form
3149 47 103 -272 -303 -597 -651 -805 -1450 -1076 -432 151 -261 -54 22 559 -58 -2 960 1039 573 211 273 -44 -538
3172 -538 -177 -170 -336 -786 -798 -505 -47 13 359 634 655 690 573 353 645 1107 1011 202 -169 -240 -111 -683 -882
3195 -882 -203 225 -375 -862 -330 512 680 589 741 753 667 408 109 533 851 677 57 -932 -634 -301 -437
3216 -437 -886 -951 -64 432 -293 -853 359 1306 930 -84 284 800 184 -328 -263 37 100 -523 -1311 -1467
3236 -1467 -872 -644 -452 -585 -103 289 181 -588 -495 686 1245 206 -319 -186 194 -684 -923 -255 -128
3255 -128 -581 -1455 -1758 -889 -498 -75 -413 124 559 247 -37 -135 537 669 521 -430 -663 -379 -658 -1008
3275 -1008 -423 -330 -368 -742 -1117 -525 3 549 488 411 539 480 663 49 505 978 665 -274 -627 -459 -241
3296 -241 -246 -365 -148 434 69 -314 349 805 1383 911 963 956 598 543 428 667 502 607 -209 -381 -343 44
$$ packed form
3149D7N6l75l1k94n4j54o45L74O44N83m12K07P6N37o17N6R62P9m66l62O2l17m94
3172e38L61Pj66m50j2K93M58O0L46K75K1L5j17k20K92M62r6q09l71p1J29n72j99
3195h82O79M28o00m87N32Q42J68r1J52J2q6k59k99M24L18j74o20r89K98L33j36
3216d37m49o5Q87M96p25n60J212R47l76j014L68N16o16n12O5L00O3o23p88j56
3236a467N95K28J92j33M82L92j08p69R3J181N59j039n25J33L80q78k39O68J27
3255a28m53q74l03Q69L91M23l38N37M35l12k84r8O72J32j48r51k33K84k79l50
3275a008N85R3l8l74l75N92N28N46o1p7J28n9J83o14M56M73l13r39l53J68K18
3296b41nj19K17N82l65l83O63M56N78m72N2pl58n5j15K39j65J05q16j72L8L87
$$ plain form
3318 44 270 251 367 547 516 256 439 927 1411 1250 755 630 584 554 39 434 193 365 -321 -556 -342 -80
3340 -80 356 342 352 278 330 243 473 779 1155 1000 419 35 -360 -187 -301 -551 46 -348 -580 -657 -474 -284
3362 -284 229 552 484 444 452 -111 90 440 216 -109 111 -266 -975 -895 -616 -393 -404 -497 -400 -657 -281 -388 264
3385 264 349 710 355 322 -178 -195 -129 80 -315 -551 -733 -799 -1132 -914 -549 12 -182 -639 -520 -86 399 411
3407 411 73 516 684 250 -324 -434 -276 -258 -156 -847 -743 -484 -486 -810 -8 -68 383 9 -260 -60 516
3428 516 476 567 403 434 -14 -71 -171 -391 -241 -191 -423 -777 -592 -284 127 30 202 332 487 598 252 408
3450 408 492 626 318 -246 -364 -110 -414 -215 -270 -190 60 150 -393 -78 508 614 396 279 770 671 525 175
3472 175 172 22 533 -48 -445 -819 -333 -509 -436 -473 -216 157 125 -60 -99 729 762 549 60 372 7 170
$$ packed form
3318D4K26j9J16J80l1k60J83M88M84j61m95j25m6l0n15L95k41J72o86k35K14K62
3340h0M36j4J0p4N2q7K30L06L76j55n81l84l95J73j14k50N97l94k32p7J83J90
3362b84N13L23o8m0Qn63K01L50k24l25K20l77p09Q0K79K23j1r3R7k57L76j07O52
3385B64Q5L61l55l3n00j7O6K09l95k36j82o6l33K18L65N61j94m57J19M34M85J2
3407D11l38M43J68m34n74j10J58J8J02o91J04K59kl24Q02o0M51l74k69K00N76
3428E16m0R1j64L1m48n7j00k20J50N0k32l54J85L08M11r7J72J30J55J11l46J56
3450D08Q4J34l08n64j18K54l04J99n5Q0K50R0n43L15N86J06k18j17M91r9j46l50
3472A75lj50N11n81l97l74M86j76P3l7K57L73l2j85l9Q28L3k13m89L12l65J63
$$ plain form
3494 170 -352 -503 -494 -562 -697 -1036 -641 -171 -153 -348 -55 -269 219 563 421 316 454 485 -149 -664 -75 183
3516 183 -188 -316 -575 -745 -562 -409 -160 -119 277 96 217 399 75 229 943 417 -59 160 -75 -175
3536 -175 -420 -41 23 -416 -594 -546 -295 -30 293 375 627 239 674 549 394 181 579 669 300 44 -103
3557 -103 -140 96 -114 -159 461 185 -17 114 571 535 1121 638 443 743 1072 639 173 -54 225 439 -384
3578 -384 -779 -437 156 220 -123 -230 357 591 651 281 556 953 909 362 192 356 203 65 -418 -498 -505 -539
3600 -539 -186 -531 -37 -80 5 103 258 97 380 256 442 622 56 90 -256 -639 -360 -398 -300 -583 -706 -665
3622 -665 -633 -541 -326 -7 -155 -328 -319 1 58 118 230 112 -281 -621 -896 -682 -414 -568 -628 -348 -342 -851 -625
3645 -625 -296 146 97 131 -128 -267 33 55 -96 139 344 -312 -407 -986 -528 -338 -236 -412 -277 -146 -61 -182
$$ packed form
3494A70n22j51Ro8j35l39L95M70J8j95K93k14M88L44j42j05J38L1o34n15N89K58
3516A83l71j28k59j70J83J53K49M1L96j81J21J82l24J54P14n26m76K19k35j00
3536a75k45L79O4m39j78M8K51K65L23Q2K52l88M35j25j55k13L98R0l69k56j47
3557a03l7K36k10m5O20k76k02J31M57l6N86m83j95L00L29m33m66k27K79K14q23
3578c84l95L42N93O4l43j07N87K34O0l70K75L97m4n47j70J64j53j38m83q0pl4
3600e39L53l45M94m3Q5R8J55j61K83j24J86J80n66L4l46l83K79l8R8k83j23M1
3622f65L2R2K15L19j48j73RL20N7O0J12j18l93l40k75K14K68j54o0K80On09K26
3645f25L29M42m9L4k59j39L00K2j51K35K05o56r5n79M58J90J02j76J35J31Q5j21
$$ plain form
3667 -182 152 328 496 139 89 191 -7 176 170 -67 -151 -209 -684 -581 -378 -189 363 69 -56 111 275 -226
3689 -226 476 427 618 561 561 -140 -118 127 45 386 -153 -61 -383 -211 -209 20 238 660 326 445 -5 247 502
3712 502 882 901 64 140 354 -22 -237 -219 125 92 -169 -511 -247 104 52 508 366 349 177 41 191 251
3734 251 473 525 307 -463 -393 -393 -335 -526 -595 -1 288 -235 -556 -95 86 858 319 92 329 34 99 238
3756 238 -287 314 86 -485 -475 -609 -202 -428 -344 -205 68 283 -276 66 592 671 456 74 42 -128 152
3777 152 -10 22 -224 -60 -124 -442 -398 -390 -158 198 185 433 123 333 348 510 318 447 615 251 79 -275
3799 -275 140 139 -195 -123 -464 -192 -238 -368 27 278 545 427 322 172 428 789 311 219 -57 332 -200 -280
3821 -280 -502 -34 267 -98 -191 -77 23 219 254 614 770 676 532 130 -255 509 324 1 -307 -270 -289 -220
$$ packed form
3667a82L34J76J68l57n0J02j98J83ok37q4n8m75J03K03J89N52k94j25J67J64n01
3689b26P02m9J91n7%p01K2K45q2L41n39R2l22J72KK29K18M22l34J19m50K52K55
3712E02L80J9q37P6K14l76k15J8L44l3k61l42K64L51n2M56j42j7j72j36J50O0
3734B51K22N2k18p70P0%N8j91o9N94K89n23l21M61J81P72n39k27K37k95O5J39
3756B38n25O01k28n71J0j34M07k26Q4J39K73K15n59L42N26P9k15l82l2j70K80
3777A52j62L2k46J64o4l18M4QK32L56j3K48l10K10J5J62j92J29J68l64j72l54
3799b75M15jl34P2l41K72m6j30L95K51K67j18j05j50K56L61m78r2k76L89n32q0
3821b80k22M68L01l65r3J14J00J96L5L60J56r4j44m02l85P64j85l23l08L7j9O9
$$ plain form
3843 -220 -445 94 90 49 39 -263 -158 187 665 571 -32 490 522 -98 -603 -42 21 5 -513 -373 -456 -316 -388
3866 -388 -416 -64 -8 -218 -337 -123 336 186 89 -288 -658 -213 -338 -160 -660 -656 -464 -572 -197 -631 -497 -383
3888 -383 -417 -317 28 -72 52 170 -37 -117 -137 14 69 -597 -726 -303 -65 -581 -410 -216 -174 -91 -670 -155
3910 -155 157 8 -64 -192 192 264 131 128 172 -380 -332 25 -84 -278 233 72 -56 67 43 204 175 111 247
3933 247 605 884 234 288 309 570 269 -163 -44 84 -21 -98 57 -67 198 296 345 206 213 471 1038 338
3955 338 338 477 212 -69 -39 187 -65 415 -168 -81 -229 139 382 176 316 -72 409 260 168 450 659 316
3977 316 257 63 -41 32 -175 -267 95 2 -277 -114 61 -99 65 393 241 77 284 348 268 194 76 200
3999 200 175 -126 -494 -361 -365 -518 -492 -255 162 -402 -116 -91 -157 -28 466 175 5 109 96 215 -161 -520
$$ packed form
3843b20k25N39mm1j0l02J05L45M78r4o03N22L2o20n05N61O3j6n18J40q3J40p2
3866c88k8L52N6k10j19K14M59j50r7l77l70M45j25J78n00MJ92j08L75m34J34J14
3888c83l4J00L45j00J24J18k07q0k0J51N5o66j29M23K38n16J71J94M2Q3n79N15
3910a55L12j49p2j28L84P2j33lM4n52M8L57j09j94N11j61j28J23k4J61k9o4J36
3933B47L58K79o50N4K1K61l01m32J19J28j05p7J55j24K65R8M9j39PK58N67p00
3955C38%J39k65k81L0K26k52M80n83Q7j48L68K43k06J40l88M81j49r2K82K09l43
3977C16n9j94j04P3k07r2L62r3k79J63J75j60J64L28j52j64K07O4q0p4j18J24
3999B00k5l01l68J33mj53K6K37M17n64K86K5o6J29M94k91j70J04j3J19l76l59
$$ plain form
4021 -520 -179 16 -562 -457 -97 -201 -562 -236 -77 196 61 44 115 -100 24 -200 -72 76 -293 -2 207
4042 207 -34 -243 -140 -130 -240 205 10 -85 -355 -70 310 207 -64 275 318 246 -16 141 -163 -323 -282 -294
4064 -294 156 -183 -210 -223 5 277 208 370 228 159 193 212 145 135 450 384 -62 -261 -287 -2 -102 -380 -90
4087 -90 58 -288 -427 27 338 518 63 -86 183 -47 150 28 120 -47 -128 -39 -510 -639 2 -125 68
4108 68 -433 -135 88 -369 -153 11 648 288 -61 -139 52 -97 -122 -124 179 -114 -607 -311 -635 -290 -300 -107
4130 -107 -303 -108 -30 123 -105 -305 -225 404 -53 -425 -337 33 244 35 -438 -284 -484 -742 -227 25 5
4151 5 -84 -131 74 120 48 143 35 77 214 214 -176 -290 -170 34 7 135 70 -135 -59 -553 346 452 425 162 200
4176 200 462 50 293 336 385 430 31 -27 -60 82 33 157 343 290 181 349 106 158 543 633 116 -38 573
$$ packed form
4021e20L41J95n78J05L60j04l61L26J59K73j35j7P1k15J24k24J28J48l69K91K09
4042B07k41k09J03J0j10M45j95r5k70K85L80j03k71L39M3p2k62J57l04j60M1j2
4064b94M50l39k7j3K28K72o9J62j42o9L4J9o7j0L15o6m46j99k6K85j00k78K90
4087i0J48l46j39M54L11J80m55j49K69k30J97j22R2j67q1Q9m71j29O41j27J93
4108F8n01K98K23m57K16J64O37l60l49p8J91j49k5kL03k93m93K96l24L45j0J93
4130a07j96J95P8J53k28k00Q0O29m57l72Q8L70K11k09m73J54k00k58N15K52k0
4151Eq9m7K05M6p2R5j08M2J37%l90j14J20K04k7J28o5k05P6m94Q99J06k7k63L8
4176B00K62m12K43M3M9M5l99n8l3J42m9J24J86n3j09J68k43N2L85R0n17j54O11
$$ plain form
4199 573 266 75 321 396 465 -14 -82 -365 -6 281 -157 157 119 200 38 -64 163 477 414 501 169 75 270
4222 270 177 258 -201 298 189 -305 -354 -202 237 128 290 363 115 229 119 132 -22 -30 160 -4 -303 -238 167
4245 167 -145 -258 -198 -61 -193 -434 -609 -49 -75 -262 -106 -44 3 -224 285 -12 136 -207 -364 -47 -597
4266 -597 -108 -148 153 -235 -374 -206 112 -81 -220 154 4 -38 -403 -101 -46 -147 -283 -51 -200 -376 -322
4287 -322 -119 -164 -310 153 161 148 -126 -449 13 270 73 312 170 -425 -108 277 149 -62 -108 89 -225 -240
4309 -240 -213 -199 126 -5 68 85 -111 88 235 173 348 52 175 94 325 -1 12 -1 -326 -40 -61 -60 -213 62
4333 62 206 377 23 106 324 272 212 125 114 -59 -98 156 103 -222 -64 56 66 -508 -8 275 116 -54 85
4356 85 -27 -112 -163 21 144 132 318 -8 -227 -34 -120 -17 -9 -301 -223 -360 -30 -357 111 456 -22 -45 17
$$ packed form
4199E73l07j91K46P5O9m79o8k83L59K87m38L14l8Q1j62j02K27L14o3Q7l32r4J95
4222B70r3Q1m59M99j09m94m9J52M39j09J62P3k48J14j10J3j54qJ90j64k99O5M05
4245A67l12j13O0J37j32k41j75N60k6j87J56O2M7k27N09k97J48l43j57L17n50
4266e97M89m0L01l88j39J68L18j93j39L74j50m2l65L02N5j01j36K32j49j76N4
4287c22K03m5j46M63Qj3k74l23M62K57j97K39j42n95L17L85j28k11m6J97l14j5
4309b40K7J4L25j31P3J7j96J99J47o2J75k96J23q1K31l26J3j3l25K86k1Jj53K75
4333F2J44J71l54Q3K18n2o0q7j1j73l9K54n3l25J58J20J0n74N00K83j59j70J39
4356H5j12q5n1J84J23j2J86l26k19J93q6J03Qk92P8j37L30l27M68L45m78k3O2
$$ plain form
4379 17 230 -3 -142 -188 251 201 -178 -140 -143 -309 -150 -19 -266 -258 -187 20 69 275 -68 130 317 -263 -321 37
4403 37 27 -147 -177 -148 -53 -265 371 -407 -54 206 -8 -89 -49 -68 6 100 209 -138 319 191 25 -71 -99 226
4427 226 168 251 146 -43 59 -290 -40 25 289 243 -156 -74 214 416 -86 56 355 349 487 -271 -17 -18 277
4450 277 307 45 17 405 124 98 -83 382 77 -12 355 -77 75 584 225 59 167 183 -123 -260 -170 -327
4472 -327 169 98 -70 -316 23 -2 -222 26 -263 -73 -6 115 231 -211 27 -67 -226 -509 -13 172 -213
4493 -213 -384 -135 11 24 -49 -221 -50 -220 -341 -345 -35 -394 -428 -248 -195 -189 -479 -301 -307 -310 -538 -92 -213 -399
4517 -399 -200 -131 -192 -507 -150 -97 -203 -453 -163 -335 -188 -214 -169 -44 -565 -332 -134 -288 -328 25 -42 54 -191
4540 -191 -265 -378 -39 125 -245 -148 -111 -12 -5 -401 -407 75 6 87 -98 -322 104 0 137 275 -88 -93 88 143
$$ packed form
4379A7K13k33j39m6M39n0l79L8lj66J59J31k47QP1K07M9K06l43J98J87n80n8L58
4403C7j0j74l0K9R5k12O36p78L53K60k14q1M0j9P4R4J09l47M57j28j66r6k8L25
4427B26n8Q3j05j89J02l49K50O5K64m6l99Q2K88K02n02J42K99oJ38p58K54jK95
4450B77L0k62k8L88k81k6j81M65l05q9L67m32J52N09l59j66J08J6l06j37R0j57
4472c27M96p1j68k46L39k5k20K48k89J90O7J21J16m42K38r4j59k83M96J85l85
4493b13j71K49J46J3p3j72J71j70j21mL10l59l4J80N3Ok90J78olk28M46j21j86
4517c99J99O9o1l15L57N3j06k50K90j72J47k6M5J25n21K33J98j54m0L53o7R6k45
4540a91p4j13L39J64l70R7L7R9Pl96oM82o9Q1j85k24M26j04J37J38l63nJ81N5
$$ plain form
4564 143 272 152 124 156 44 159 -101 244 18 45 47 316 36 -159 146 122 78 286 301 386 197 75 143
4587 143 -79 121 131 -201 75 146 -20 273 152 73 58 -3 94 50 104 131 271 260 -73 -202 11 -92 -256
4610 -256 143 -4 36 34 -349 -172 -19 -20 296 -96 -147 -42 149 -152 18 34 261 -302 -52 -204 -150 -64 48
4633 48 386 111 15 -370 -49 73 198 118 62 -136 -136 71 43 41 -41 -153 37 -339 -125 122 73 -65 -66 317
4657 317 2 -358 116 82 -172 -55 -143 -17 56 -89 -166 -39 438 57 284 242 127 69 69 11 277 107 -48
4680 -48 -209 -39 110 318 18 -14 205 130 -152 -359 59 -15 446 -15 -65 371 36 30 158 -17 38 186 -19
4703 -19 -209 52 149 136 39 -140 64 -174 39 -136 119 498 131 -217 -83 72 -30 117 103 168 -423 -277
4725 -277 46 234 18 -124 94 25 -63 -184 -43 -4 -485 -151 16 60 -382 -33 -42 -66 -388 183 -61 -48 -209
$$ packed form
4564A43J29j20k8L2j12J15k60L45k26K7KK69k80j95L05k4m4K08J5Q5j89j22O8
4587A43k22K00J0l32K76P1j66K93j21p9j5o1R7m4N4K7J40j1l33j29K13j03j64
4610b56L99j47M0kl83J77J53jL16l92n1J05J91l01J70J6K27n63K50j52N4Q6J12
4633D8L38k75r6l85L21J22J25q0n6j98%K07k8kq2j12J90l76K14K47m9j38jL83
4657C17l15l60M74l4k54J17q8J26P3j45p7J27M77l81K27m2j15n8%n8K66j70j55
4680d8j61J70J49K08l00l2K19p5k82k07M18p4M61m61n0M36l35oJ28j75N5J48k05
4703a9j90K61R7j3r7j79K04k38K13j75K55L79l67l48J34J55j02J47j4O5n91J46
4725b77L23J88k16j42K18o9q8j21J41L9m81L34J67M4m42L49rk4l22N71k44J3j61
$$ plain form
4748 -209 -147 -109 -265 57 -214 -101 -283 -13 -30 87 -177 -326 81 -181 55 -8 142 -135 -382 -258 -518
4769 -518 -94 -281 -175 -105 -521 -377 -45 -144 -276 -71 -5 -72 -243 -439 -152 115 -31 -352 -105 149 -99
4790 -99 -181 -13 -281 -177 271 -229 -2 -226 99 -51 -289 -19 36 -28 -160 302 409 130 -344 -74 -17 69
4812 69 -187 148 60 108 103 211 165 4 215 175 9 92 43 384 3 -189 -230 41 275 87 -161 176 462
4835 462 453 111 220 191 379 214 451 143 90 517 307 166 80 130 424 126 156 436 216 268 -68 -113 82
4858 82 24 101 142 200 -106 106 229 350 -34 0 25 -7 -177 -149 260 168 -100 -103 -133 15 -163 326 196 -213
4882 -213 -37 11 109 -105 -114 17 21 -359 -70 -72 236 -208 -45 -120 -252 -611 -28 -172 -81 -141 -244 -220 -80 -74 101
4907 101 192 -117 32 -380 127 -160 -129 194 -43 7 -84 -256 273 47 -293 -120 -63 -250 105 34 170 -173
$$ packed form
4748b09O2L8j56L22k71J13j82K70j7J17k64j49M07k62K36o3J50k77k47J24k60
4769e18M24j87J06P0m16J44L32r9j32K05O6o7j71j96K87K67j46l21K47K54k48
4790i9q2J68k68J04M48n00K27k24L25j50k38K70N5o4j32M62J07k79m74K70N7Q6
4812F9k56L35q8M8nJ08m6j61K11m0j66Q3m9L41l81j92m1K71K34j88k48L37K86
4835D62rl42J09k9J88j65K37l08n3M27k10j41q6N0K94k98L0K80k20N2l36m5J95
4858H2n8P7M1N8l06K12J23J21l84L4K5l2j70K8M09r2k68ll0J48j78M89j30m09
4882b13J76M8R8k14rJ31Ml80K89kL08m44J63p5j32l59N83j44R1o0j03K4J40OJ75
4907A01R1l09J49m12N07k87L1L23k37N0r1j72N29k26l40J73N7j87L55p1J36l43
$$ plain form
4929 -173 95 88 -117 -158 55 -272 -198 -228 -85 14 -49 -158 268 -151 -273 313 33 -68 61 -14 -5 -16 83 247
4953 247 -72 171 192 174 -44 -141 144 159 -113 220 142 89 -211 165 206 247 -93 68 -2 -74 -7 155 18 225
4977 225 -290 -64 -68 -191 -27 -86 93 80 -375 16 82 101 23 -60 49 -267 -207 -252 10 -4 -68 -125 240 -457
5001 -457 -8 7 -15 -196 117 -55 288 -93 -207 -197 2 -39 -188 73 -110 12 137 303 -54 220 -19
5022 -19 -231 -354 -3 -131 -11 99 151 -186 85 -43 -295 196 60 -7 58 129 -164 -166 111 -93 42 52 -80
5045 -80 -156 104 212 141 39 32 -23 -19 -101 379 190 -10 207 -51 -57 126 250 224 5 128 245 205 251 -7 204
5070 204 274 210 286 -58 -138 73 214 305 75 -94 175 223 145 33 -133 227 116 -104 214 75 372 290 199
5093 199 -8 250 329 -16 -31 142 507 -103 96 140 90 163 358 -76 -32 108 69 43 -142 -77 117 -133 -219
$$ packed form
4929a73K68pk05m1K13l27P4l0J43R9o3j09M26m19j22N86k80j01J29p5Rj1R9J64
4953B47l19K43K1j8k18r7K85J5k72L33p8n3l00L76M1M1l40J61p0p2O7J62j37K07
4977B25n15K26mj23J64n9J79j3m55L91O6J9p8q3J09l16O0m5K62j4o4n7L65o97
5001d57M49J5k2j81L13j72L43l81j14J0J99m1j49K61j83J22J25J66l57K74k39
5022a9k12j23L51j28J20J10N2l37K71j28k52M91j36o7O5P1k93kK77k04J35J0j32
5045h0p6K60J08p1j02pn5Mq2M80j89k00K17k58oJ83J24k6k19J23J17m0M6k58K11
5070B04P0o4P6l44q0K11J41R1k30j69K69M8p8j12j66L60j11k20L18j39K97q2r1
5093A99k07K58P9l45j5J73L65o10J99M4n0P3J95m34M4J40l9k6j85O5J94k50q6
$$ plain form
5116 -219 131 -214 -119 -160 -173 275 -50 -320 -44 -24 32 70 -279 64 -144 -116 -340 212 -109 138 -27 62 -45
5139 -45 -294 -206 -19 -128 -273 -208 -216 -77 -187 -248 -176 76 -112 -4 -63 -294 -163 1 24 -201 2 -128 -235
5162 -235 31 140 -88 20 -119 -9 -12 -105 63 -117 133 -217 18 34 -108 52 -134 29 -319 25 -108
5183 -108 -283 -288 -303 -64 -35 114 108 -94 67 48 106 121 -57 94 60 -41 8 239 123 89 107 49 165 187 7
5208 7 -231 -16 25 183 -9 -141 69 -101 211 81 83 191 -17 386 92 -112 -164 -37 2 54 74 128 197 29
5232 29 -305 42 162 117 196 -44 299 -49 -2 115 169 -241 -17 258 -18 13 -143 -184 -220 -265 -130 199 -379
5255 -379 -169 101 54 -13 164 325 -115 -68 -211 -314 -226 -54 -113 228 -248 95 -223 -78 -139 81 417 273
5277 273 57 121 230 24 -236 -78 202 14 193 18 58 -213 94 -170 -85 -63 113 -168 114 100 51 323
$$ packed form
5116b19L50l45R5m1j3M48l25k70K76K0N6L8l49L43k08K8k24N52l21K47j65Q9j07
5139d5k49Q8J87j09j45O5qJ39j10o1P2K52j88J08n9k31J31J64K3k25K03j30j07
5162b35K66J09k28J08j39J10lr3J68j80K50l50K35J6j42J60j86J63l48L44j33
5183a08j75nj5K39K9J49ok02J61j9N8J5j78J51l4j01M9K31j16l4J8n8J16K2j80
5208Gk38K15M1J58j92j32K10j70L12j30KJ08k08M03k94k04n2J27L9N2K0N4O9j68
5232B9l34L47J20m5P9k40L43l48M7J17N4m10K24K75k76L1j56m1l6m5J35L29n78
5255c79K10K70m7o7J77J61m40M7j43j03Q8J72n9L41m76L43l18J45o1K20L36j44
5277B73k16O4J09k06k60J58K80j88J79j75M0k71L07k64Q5K2J76k81K82j4m9K72
$$ plain form
5299 323 -152 -107 46 -137 251 12 -95 -48 27 263 262 -39 179 133 264 258 292 526 198 225 62 417 95
5322 95 286 332 284 191 118 30 236 -111 211 359 0 129 371 -113 278 203 257 181 70 44 217 -23 127
5345 127 246 375 -99 24 209 230 95 70 -62 -234 -251 39 -240 -308 -60 216 174 80 -229 319 -321 46
5367 46 -189 -178 -144 -107 -294 -458 31 101 179 3 55 -84 -72 13 -99 -69 -276 -12 -136 -230 -328 -264 -21 -112 18
5392 18 -226 -419 34 30 -190 -91 -83 29 -394 -30 -264 -113 -159 -464 173 -233 -208 -288 -226 -168 71 -217 -258 -71
5416 -71 -123 -227 -251 -29 35 8 199 -288 24 -83 149 -102 -150 -9 -135 108 -112 188 98 -55 43 -8 164
5439 164 358 45 253 197 -7 144 -30 -29 -85 468 -15 -110 -210 -61 56 110 -322 242 237 374 -102 243 412
5462 412 198 127 109 133 51 -46 83 -106 12 -72 216 66 69 40 -148 -136 -72 244 315 60 -18 156 120 -161 78
$$ packed form
5299C23m75M5J53j83L88k39j07M7P5K36jl01K18m6J31oL4K34l28K7j63L55l22
5322I5J91M6m8r3p3q8K06l47L22J48l59J29K42m84L91p5N4p6j11k6J73k40J50
5345A27J19J29m74J23J85K1j35k5j32j72j7K90k79o8K48K76m2r4l09N48o40L67
5367D6k35J1L4L7j87j64M89P0P8j76N2j39J2Q5j12L0k07K64j24r4r8O4K43r1J30
5392A8k44j93M53mk20R9QJ12m23L64k34J51m6l05O37m06K5q0O2N8K39k88m1J87
5416g1n2j04k4K22O4k7J91m87L12j07K32k51m8J41j26K43k20L00r0j53R8n1J72
5439A64J94l13K08n6k04J51j74Jn6N53m83r5j00J49J17N4m32N64nJ37m76L45J69
5462D12k14p1j8K4q2r7J29j89J18q4K88j50Lk9j88J2O4L16P1k55p8J74l6k81K39
$$ plain form
5487 78 58 155 131 90 28 36 58 -6 219 50 -154 -23 -53 -143 226 -60 71 23 -127 53 -170 87 15 -213 -103
5512 -103 -54 -124 23 -135 -159 159 57 71 -142 -138 87 7 6 -124 107 84 -182 144 195 -158 -223 -302 -38 -116 -276
5537 -276 -89 -137 -45 163 177 217 32 -121 -130 126 84 171 -167 -223 -127 -275 -192 17 -43 -71 208 -169 -90 -163 -37
5562 -37 108 79 -7 24 -58 88 179 72 -121 72 -38 -75 -46 -220 -132 -249 -237 114 -235 311 7 381 18
5585 18 222 165 102 -98 -243 155 -88 -260 -193 -280 38 41 296 -26 129 234 39 162 202 75 23 -31 -120 -51
5609 -51 -153 -71 -98 -264 -175 -333 31 -199 -89 -42 -202 126 14 -52 56 -89 248 -116 -307 -81 31 -348
5631 -348 114 -460 92 141 -236 -145 -36 130 -187 -248 -173 -89 -80 60 28 -98 -253 -285 -17 -93 195 -358 -170
5654 -170 -276 -191 -80 107 -121 -177 -202 -127 117 -68 -313 120 -104 28 247 -136 -163 129 141 136 426 1 201
$$ packed form
5487G8k0R7k4m1o2QK2o4K25j69k04J31l0r0L69k86J31m8j50J80k23K57p2k28J10
5512a03M9p0J47j58k4L18j02J4k13MK25q0jj30K31k3k66L26N1l53o5p9K64p8j60
5537b76J87m8R2K08J4M0j85j53rK56m2Q7l38n6R6j48Q3K09o0k8K79l77P9p3J26
5562c7J45k9q6L1q2J46R1j07j93J93j10l7K9j74Q8j17J2L51l49N46l04L74l63
5585A8K04n7o3k00j45L98k43j72O7q7L18LK55l22J55J05j95J23M0j27n2n4q9O9
5609e1j02Q2k7j66Q9j58L64k30J10M7j60L28j12o6J08j45L37l64j91K26J12l79
5631c48M62n74N52M9l77R1J09J66l17o1P5Q4RJ40l2j26j55l2K68p6K88n53J88
5654a70j06Q5J11J87k28n6k5P5K44j85k45M33k24J32K19l83k7K92J2nK90m25K00
$$ plain form
5677 201 -140 43 -26 217 66 -255 113 -32 -44 291 190 0 230 -15 -34 -54 72 2 512 -107 251 259
5699 259 330 146 -78 434 -14 -52 20 -108 -129 114 -71 121 179 -99 192 80 -79 18 253 183 80 138 -96
5722 -96 92 117 231 199 281 25 81 -117 73 -128 14 -157 -2 -170 -294 -216 -116 -100 173 67 -195 -75
5744 -75 -85 312 139 97 -131 -95 88 -27 -15 -403 -65 120 -51 -33 -466 -317 66 -65 31 43 208 94 88
5767 88 190 -195 72 -162 -231 133 -100 -240 72 -174 -160 -21 -226 -74 -58 -149 138 -263 -110 -28 63 -220
5789 -220 -43 -16 58 123 -132 -266 -30 -241 -79 -179 -62 -40 92 -210 -154 300 -86 100 -99 -39 -178 116
5811 116 -56 72 -292 35 -148 -139 -225 -16 -152 -153 132 132 -30 -10 64 -112 252 167 158 65 14 36 71 -29 -149
5836 -149 -152 -81 -130 -53 -70 145 -46 114 169 137 -277 233 141 82 211 -131 155 -37 66 81 158 3 128 -4
$$ packed form
5677B01l41J83o9K43j51l21L68j45j2L35j01j90K30k45j9k0J26p0N10o19L58Q
5699B59P1j84k24N12m48l8P2j28k1K43j85J92N8k78K91j12j59R7K35p0j03N8k34
5722i6J88K5J14l2Q2k56N6j98J90k01J42j71J55j68j24P8J00J6K73j06k62J20
5744g5j0L97j73m2k28L6J83j15J2l88L38J85j71J8m33J49L83j31R6J2J65j14o
5767H8J02l85K67k34o9L64k33j40L12k46J4J39k05J52J6r1K87m01J53Q2R1k83
5789b20J77K7P4O5k55j34K36k11J62j00J17K2J32l02N6M54l86J86j99O0j39K94
5811A16j72J28l64L27j83Rq6K09j36jK85%j62K0P4j76L64q5rr3n1K2L5j00j20
5836a49lP1m9P7j7K15j91J60N5l2m14N10r2n9J29l42K86j92J03J5P7j55J25j32
$$ plain form
5860 -4 167 265 41 128 192 245 171 -350 -197 -49 -57 141 -205 73 -147 -91 -271 -26 -45 17 -81 71 -149 76
5884 76 234 74 -105 -56 122 -24 39 -136 94 -150 -84 -121 -128 -193 67 -23 -68 94 -154 -18 0 -107 64 -39
5908 -39 -124 -272 -51 -122 0 152 60 -128 230 -172 243 -62 7 84 -96 -97 305 212 -30 245 -115 169 -8
5931 -8 -112 -178 -53 -197 -227 83 53 -52 -169 -22 303 -3 197 299 67 58 205 29 113 244 -138 -84 83
5954 83 429 -202 -20 255 56 -33 -208 55 239 475 -74 17 199 127 19 78 -124 50 145 -200 63 46
5976 46 209 96 176 -163 244 -153 -85 119 290 74 229 57 -220 218 400 235 -250 -40 -62 284 -264
5997 -264 -527 25 41 -214 -190 -11 -12 193 -25 -300 23 -310 -164 -72 -24 -137 -325 -309 -273 -391 -120 12 -160
6020 -160 -67 -192 -315 -94 -146 138 -57 -229 137 -123 -44 -7 -355 125 -216 -182 -298 -40 162 -166 -119 -62
$$ packed form
5860dJ71R8k24Q7O4N3p4n21J53J48qJ98l46K78k20N6j80K45j9O2r8J52k20K25
5884G6J58j60j79M9J78j46O3j75K30k44O6l7po5K60r0m5J62k48J36J8j07J71j03
5908c9q5j48K21p1J22J52r2j88L58m02M15l05O9P7j80jM02r3k42K75l60K84j77
5931hj04o6J25j44l0L10l0j05j17J47L25l06K00J02k32rJ47j76Q4J31l82N4J67
5954H3L46o31J82K75j99q9j75K63J84K36n49R1J82p2j08N9k02J74R5l45K63j7
5976D6J63j13Q0l39M07l97O8K04J71k16J55j72k77M38J82j65m85K10k2L46n48
5997b64k63N52J6k55K4J79jK05k18k75L23l33J46R2M8j13j88J6L6j18K71J32j72
6020a60R3j25j23K21n2K84j95j72L66k60P9L7l48M80l41L4j16K58K02l28M7N7
$$ plain form
6042 -62 -64 -171 -25 -265 125 82 -3 -205 -62 1 201 -272 153 -265 96 159 122 -27 172 69 83 -107 -112 275
6066 275 67 316 93 153 -156 -212 -54 52 -56 204 -334 33 -79 96 -59 -32 64 1 213 -52 93 107
6088 107 129 147 433 129 6 63 45 59 365 -57 -99 -21 -35 98 -71 216 66 7 -170 390 322 -238 107
6111 107 310 10 -5 -6 11 71 -271 -220 172 179 -235 96 208 23 194 -61 -30 -194 -166 122 4 -203 146
6134 146 308 -79 -17 163 11 135 -67 0 5 -248 -72 -224 34 -83 -114 34 173 -165 -254 -106 -49 -246
6156 -246 -145 -29 -21 -28 -179 14 -111 207 -98 -314 -154 -154 -62 -33 -54 -362 267 229 43 -131 -315 -32 -1 6
6180 6 -171 -72 -5 95 -106 134 -383 -26 122 -101 29 76 242 157 -101 -263 -29 277 -108 377 195 -70
6202 -70 -404 199 -121 141 93 -96 88 390 210 11 0 -164 -223 -159 -115 -54 -302 -105 -302 156 109 142 -104
$$ packed form
6042f2kj07J46k40L90m3q5k02J43O3K00m73M25m18L61O3l7j49J99j03J4j90nL87
6066B75k08K49k23O0l09n6J58J06j08K60n38L67j12J75j55K7R6o3K12k65J45J4
6088A07K2J8K86l04j23N7j8J4L06m22m2P8j4J33j69K87j50n9j77N60o8n60L45
6111A07K03l00j5jJ7O0l42N1L92Pm14L31J12j85J71k55L1j64K8K88j18k07L49
6134A46J62l87O2J80j52J24k02O7Nk53J76j52K58j17l1J48J39l38q9J48N7j97
6156b46J01J16Qpj51J93j25L18l05k16J60%R2K9k1l08O29l8j86j74j84K83L1P
6180Fj77R9O7J00k01K40n17L57J48k23J30M7J66q5k58j62K34L06l85M85j82k65
6202g0l34O03l20K62m8j89J84L02j80j99j1j64n9O4M4O1k48J97j97M58m7L3k46
$$ plain form
6225 -104 56 118 205 -70 310 201 -30 163 214 206 -74 -79 -9 63 78 -220 58 -43 49 29 -118 -48 -301 52
6249 52 -6 -114 -32 -37 244 -67 -155 329 -143 -67 -159 47 -93 -232 -14 -8 -160 149 -315 -430 -221 -369 97
6272 97 -126 -160 -286 -46 -1 211 -82 108 -192 -106 -122 -243 -15 209 -177 -138 -117 24 50 -103 48 -292 169
6295 169 -72 38 99 -43 133 325 -222 13 404 -293 -195 272 12 129 -121 111 -14 -142 242 279 -58
6316 -58 -90 -36 170 2 -78 189 -35 -141 -75 -19 169 -129 87 99 12 205 67 70 19 -11 25 64 33 79 8 51
6342 51 118 108 -57 86 -176 -110 -163 292 86 11 -184 -82 17 66 -9 192 -234 -7 265 -36 56 -2 123 -16
6366 -16 191 -77 -344 129 -6 -159 106 -48 89 167 189 17 240 64 126 -153 -59 -286 -53 75 -93 -121
6388 -121 -168 -88 -31 265 65 -189 -64 36 158 -64 -67 -144 -39 152 -177 -133 -88 272 -135 -173 40 -265 -109
$$ packed form
6225a04J60O2Q7k75L80j09k31J93N1qk80nP0P2J5k98K78j01R2k0j47P0k53L53
6249E2n8j08Q2nK81l11q8M84m72P6r2K06j40j39K18Oj52L09m64j15K09j48M66
6272I7k23l4j26K40M5K12k93J90l00Q6j6j21K28K24l86L9K1J41K6j53J51l40M61
6295A69k41J10O1j42J76J92n47K35L91o97R8M67k60J17k50K32j25j28L84L7l37
6316e8l2N4K06j68q0K67k24j06O6N6J88k98K16J2q7J93j38Ln1l0L6L9l1M6p1M3
6342E1O7j0j65J43k62O6n3M55k06p5j95J02R9M9p5K01m26K27K72l01R2n8J25j39
6366a6K07k68k67M73j35j53K65j54J37P8K2j72K23j76O2k79R4k27K33J28j68k8
6388a21m7Q0N7K96k00k54J25J00J22k22lp7J05J91l29M4M5L60m07l8K13l05J56
$$ plain form
6411 -109 93 -159 -45 -2 152 54 6 123 -20 -239 -216 -178 -321 38 -11 -78 116 -88 250 260 18 216 109
6434 109 134 293 112 419 67 -18 -384 -2 -71 -176 -148 -126 -177 -314 41 146 75 164 206 -119 -19 -181 18
6457 18 -49 186 -85 -135 6 -71 -57 21 -42 -2 221 167 -89 186 -250 171 245 165 139 -146 -36 -67 110 501
6481 501 -239 -199 -30 -255 -349 -226 -175 -199 42 -15 182 -150 171 -141 34 38 -67 -60 310 101 -163 113 -178
6504 -178 19 26 38 39 -239 -76 -68 -40 249 -241 102 122 66 203 101 -165 -558 -121 124 -179 -147 -180 -210 -151 -125
6529 -125 5 -140 210 222 187 -181 49 -475 27 -328 -172 146 32 -207 -139 -30 167 -44 55 -226 56
6550 56 55 -99 -17 53 -14 -184 -14 -155 38 -29 23 187 177 -66 104 70 -106 70 207 281 89 330 241 46
6574 46 -24 194 -49 -40 41 101 -23 -57 -250 -124 -112 -82 4 -69 -258 157 120 182 251 153 168 -69 -43 142 44 142
$$ packed form
6411a09K02k52J14M3J54r8m8J17j43k19K3L8j43L59m9o7J94k04L38J0k42J98j07
6434A09K5J59j81L07l52q5l66L82o9j05K8K2n1j37L55J05p1Q9M2l25J00j62J99
6457A8o7K35k71n0J41p7J4P8o3M0K23n4k56K75m36M21P4q0k6k85J10l1J77L91
6481E01p40M0J69k25r4J23N1k4K41n7J97l32L21l12J75Mj05PL70k09k64K76k91
6504a78J97PJ2Jk78J63QK8K89m90L43K0n6J37j02k66l93M37K45l03L2l3l0N9K6
6529a25J30j45L50J2l5l68K30n24N02l55J56L18j14k39O8J09J97k11R9k81K82
6550E6jj54Q2P0o7j70J70j41J93o7N2J64j0k43J70l4j76J76J37P4j92K41q9j95
6574D6p0K18k43RQ1O0j24l4j93J26J2L0Q6p3j89M15l7O2O9r8J5k37K6J85r8R8
$$ plain form
6600 142 114 118 -8 -75 360 -175 -53 173 120 -16 -9 207 39 66 168 6 68 -47 94 -79 34 -127 -442
6623 -442 -118 38 -83 -170 -50 -99 -77 -2 -471 -89 424 153 -388 -122 8 97 -110 -219 132 -150 -260 -153
6645 -153 52 113 97 -81 77 198 143 244 -335 148 12 -36 -26 67 81 -308 123 -125 -132 133 22 -200 23
6668 23 245 -286 -104 29 -57 -158 29 -128 -133 -221 -241 -274 104 82 -8 74 -130 -133 54 -494 84 105 -73 137
6692 137 -117 68 91 91 -238 -91 5 -148 -40 8 -277 388 -27 -198 139 -60 16 2 33 -76 -121 9 197
6715 197 121 -103 -268 8 -203 102 84 18 -118 -111 -61 -101 108 39 -93 138 -25 98 -38 10 127 61 -183
6738 -183 63 99 -398 -62 388 119 150 270 -32 -90 -169 -73 -183 -29 -327 -17 -301 6 -182 -288 48 -182
6760 -182 70 -83 -74 -293 184 175 -205 -1 -246 42 -45 -15 208 43 -47 -120 58 99 -177 -119 145 -187 -67
$$ packed form
6600A42k8Mj26o7M35n35J22K26n3j36PK16j68K7J02j62O2j15J41j73J13j61l15
6623d42L24J56j21q7J20m9K2P5m69L82N13k71n41K66J30Q9k07j09L51k82j10J07
6645a53K05O1j6j78J58J21n5J01n79M83j36m8J0R3J4l89M31k48pK65j11k22K23
6668B3K22n31J82J33q6j01J87j57nq8k0l3L78k2r0Q2k04lJ87n48N78K1j78K10
6692A37k54J85K3%l29J47R6j53J08M8k85O65m15j71L37j99P6j4L1j09m5J30J88
6715A97p6k24j65K76k11L05j8o6j36PN0m0K09o9j32K31j63J23j36M8J17o6k44
6738a83K46L6m97L36M50k69L1J20l02n8p9R6j10J54k98L10k84L07j88j06L36k30
6760a82K52j53Rk19M77rl80K04k45K88q7L0K23j65r0p3J78M1k76N8K64l32J20
$$ plain form
6783 -67 49 -55 -143 399 -422 -86 101 -351 124 -29 115 20 78 -211 119 170 -11 86 -62 -387 267 64
6805 64 66 155 3 -136 5 -42 21 273 -63 11 -122 153 -109 18 271 -150 -121 17 33 168 245 44 -135
6828 -135 19 229 -266 223 136 287 298 -54 103 -72 -13 186 428 -18 -63 230 188 326 -293 -79 -111 -213
6850 -213 38 -162 188 -17 -137 -120 205 -148 90 -11 36 -73 -193 91 183 -309 -160 30 113 259 6
6871 6 -111 -296 -172 -14 30 26 -142 -80 116 27 -79 -192 65 105 -299 -39 -183 -26 -72 -179 43 -157 -236
6894 -236 -31 -171 62 -12 -219 82 -132 123 -105 -109 172 82 24 50 46 -120 -136 104 96 100 46 -62 96 -87 -116
6919 -116 -120 -115 -108 42 -31 231 -159 26 -36 -359 -61 -181 -301 -15 -317 28 163 -197 -214 -1 286 -75 42
6942 42 47 -318 41 -96 74 91 5 -128 188 116 -198 -300 -226 57 285 86 145 53 -379 -51 -145 -160 169 195
$$ packed form
6783f7J16j04q8N42q21L36J87m52M75j53J44r5N8k89L30N1j81R7j48l25O54k03
6805F4KQ9j52j39J41m7O3K52l36P4j33K75k62J27K53m21K9J38J6J35P7k01j79
6828a35J54K10m95M89q7J51J1l52J57j75N9J99K42m46m5K93m2J38o19K14l2j02
6850b13K51k00L50k05j20J7L25l53K38j01M7j09j20K84R2m92J49J90Q3J46k53
6871Fj17j85J24J58M4mj68O2J96q9j06j13K57M0m04K60j44J57m6j07K22k00p9
6894b36K05j40K33p4k07L01k14K55k28mK81r0n8K6mj66j6K40qMn4j08J58j83k9
6919a16mNPJ50p3K62l90J85o2l23K98j20j20K86l02L45J35l60j7K13K87l61J17
6942D2Nl65L59j37J70J7q6j33L16p2l14j02P4K83K28j99N9r2m32L28r4j5L29K6
$$ plain form
6966 195 -218 -12 -110 -195 125 150 267 -27 -167 208 79 37 307 -51 -289 131 289 115 -222 132 27
6987 27 50 5 -95 152 123 -69 -52 -160 -192 145 61 28 47 87 197 -79 -94 107 179 273 -140 -277 27 -151
7011 -151 -168 -177 -32 94 -257 211 -122 -54 179 -107 -235 -152 80 157 161 -25 72 32 -77 -59 -434 -338 -183 -158
7035 -158 150 126 140 164 194 -228 -302 -107 207 51 50 -128 78 -193 54 152 214 -50 -50 -124 -1 -47 81 14 16
7060 16 -39 189 105 30 160 -73 -122 -35 -254 78 216 -249 151 50 67 237 -157 -5 -185 -259 9 78 -145
7083 -145 81 18 -127 -128 97 -137 -339 -249 -168 142 -99 128 39 110 32 -80 138 34 46 -99 -21 189 37
7106 37 46 142 -70 87 -64 41 -124 -26 -57 -309 -128 -25 -27 -109 -299 -4 69 -234 -70 -152 -119 106 1 40
7130 40 -104 -38 120 180 -321 -18 -166 154 -208 133 -153 255 -11 -70 102 -9 -18 -410 -328 8 -98 -238
$$ packed form
6966A95m13K06r8q5L20K5J17k94j40L75j29m2K70l58k38M20J58j74l37L54j05
6987B7K3m5j00K47k9j92J7j08l2L37q4l3J9M0J10k76j5K01P2R4m13j37L04j78
7011a51j7rJ45J26l51M68l33O8K33k86j28Q3K32P7Mj86R7m0j09J8l75R6J55K5
7035a58L08k4J4K4L0m22p4J95L14j56jj78K06k71K47R8O2k64%p4J23m6J28o7K
7060A6n5K28q4p5J30k33m9Q7k19L32J38m65M00j01J7J70l94J52j80p4K68O9k23
7083a45K26o3j45jK25k34k02R0Q1L10k41K27q9P1p8j12K18j04J2j45P8K10j52
7106C7RR6k12J57j51J05j65R8l1k52J81J03kq2j90K95P3l03J64q2L3K25j05L9
7130D0j44O6J58O0n01L03j48L20l62L41k86M08k66n9J72j11rl92Q2L36j06j40
$$ plain form
7152 -238 13 -88 -46 -182 -73 -5 11 -211 25 -203 -42 198 17 82 137 90 73 128 25 267 91 -230 -122
7175 -122 -77 -47 -24 -290 182 -34 -117 125 -121 200 155 -94 245 -80 74 112 -92 120 -101 102 -50 133
7197 133 146 -4 -98 -89 -197 -15 -371 69 -21 -162 -2 119 73 -125 -23 27 -59 -91 -27 0 316 -68 78 159
7221 159 23 88 285 111 -55 -68 47 96 35 -87 -86 36 -23 12 98 190 131 152 357 133 312 50 5 199
7245 199 191 139 19 181 -77 91 -267 -98 -134 297 9 171 -204 52 -34 180 -76 -266 -126 47 57 -163
7267 -163 180 -107 170 -238 -278 -296 155 63 181 239 -19 -118 111 33 55 212 40 161 -160 28 -6 -156 -392
7290 -392 -195 -70 76 24 239 -50 -193 221 37 -106 151 355 -40 1 298 -84 74 -57 163 -309 -70
7311 -70 110 -47 211 -50 39 260 -27 -84 -12 111 162 49 220 183 21 89 57 184 -251 -101 -191 -74 405
$$ packed form
7152b38K51j01M2j36J09O8J6k22K36k28J61K40j81O5N5m7j7N5j03K42j76l21J08
7175a22M5L0K3k66M72k16q3K42k46L21m5k49L39l25J54L8k04K12k21K03j52J83
7197A33J3j50r4Rj08J82l56M40r0j41J60J21m6j98J02N0q6l2O4K7L16l84J46Q1
7221A59j36O5J97j74j66j3J15M9o1j22JJ22n9L5Q6R2n9K1K05k24J79k62m5J94
7245A99qn2j20J62k58J68l58J69l6M31k88J62l75K56q6K14k56j90J40J73J0k20
7267a63L43k87K77m08m0j8M51r2J18N8k58r9K29p8K2J57j72J21l21J88l4j50k36
7290c92J97J25J46n2K15k89j43M14j84j43K57K04l95M1K97l82J58j31K20m72K39
7311g0J80j57K58k61Q9K21k87n7P2J23N1j13J71l7j62O8l2J27m35J50r0J17M79
$$ plain form
7334 405 -83 47 -19 -12 305 -245 -278 -106 -195 40 -235 -65 50 -157 71 -72 239 -17 32 -38 -134 163 -124
7357 -124 -53 -299 -92 -267 -116 -102 -208 15 -110 -13 -107 134 -70 -65 -145 -37 -278 -120 132 -161 218 -132
7379 -132 203 231 -300 256 -35 -31 -36 201 -282 123 -175 -12 -186 -218 -183 -127 -17 -2 -183 -40 -104 -29 -237 35
7403 35 66 -103 -117 -33 123 110 -43 223 -71 -119 218 85 -83 -202 -112 -63 -164 222 129 -147 284 -99 272
7426 272 281 13 -62 100 -123 90 148 110 -21 -56 215 -43 125 138 86 267 132 84 36 18 -175 163 118 87
7450 87 93 224 27 -162 -136 160 -86 232 -27 185 38 85 -143 -1 50 94 -150 -211 86 -156 214 245 -236
7473 -236 -111 214 222 -59 53 -89 129 363 -16 -103 59 76 -46 -32 -136 -143 -272 -213 112 -68 -92 -110 27
7496 27 -8 -59 -141 -31 162 -134 -25 42 -47 -87 43 -43 -142 -193 -275 251 131 18 77 296 -258 224 -39 -162
$$ packed form
7334D05m88J30o6PL17n50l3J72q9K35k75J70J15k07K28j43L11k56M9p0r6K97k87
7357a24P1k46K07j75J51J4j06K23j25R7r4K41k04Nq0J08k41J58K52k93L79l50
7379a32L35K8n31N56k91MnK37m83M05k98J63j74l2L5N6J10J5j81J43o4P5k08K72
7403C5L1j69j4Q4J56j3j53K66k94m8L37j33j68j19R0M9j01L86r3k76M31l83L71
7426B72Rk68p5J62k23K13N8l8j31l5K71k58J68J3n2J81j35m8m8j8j93L38m5l1
7450H7OJ31j97j89K6K96k46L18k59K12j47M7k28J42N1M4k44o1K97k42L70L1m81
7473b36J25L25Qk81J12j42K18K34l79q7J62J7j22J4j04pj29N9L25j80k4j8J37
7496B7l5n1q2J10J93k96J09O7q9m0J30q6r9n1q2N26j20j13N9K19n54M82k63j23
$$ plain form
7520 -162 -20 3 -226 15 182 -77 157 -72 -51 116 84 126 213 -174 466 -107 21 -144 -40 -184 -192 -113 -12
7543 -12 -61 68 222 34 -41 -209 -346 -47 159 -83 -118 89 -28 -151 133 -117 58 -221 145 -97 141
7564 141 131 9 168 -26 211 -44 -490 -229 155 -5 -17 162 -58 171 60 -202 -45 243 101 -286 -173
7585 -173 162 -60 -110 83 0 38 21 -150 90 -118 155 281 -79 133 -17 -7 -174 -2 -134 25 26 -198
7607 -198 378 127 -181 85 312 77 232 -317 30 -109 -268 -25 -41 45 92 -278 -145 -141 -26 -41 -88 -126 -78
7630 -78 -140 -18 34 349 20 -213 42 -56 64 -72 -249 209 -74 -175 120 -55 -36 -118 -53 11 -178 -121 241
7653 241 -20 40 -64 -13 111 -114 -18 53 -217 -132 -137 157 205 0 -124 27 145 -11 96 -26 -242 -165 -18
7676 -18 -26 -113 156 234 -106 -170 -377 -260 264 365 171 168 -155 -149 -370 60 64 9 -51 -393 -102 11 190 -405 -107
$$ packed form
7520a62J42K3k29K41J67k59K34k29K1J67l2M2Q7l87O40n73J28j65J04j44qP9J01
7543a2m9J29J54j88p5j68j37K99K06k42l5K07j17j23K84k50J75k79L66k42K38
7564A41j0j22J59j94K37k55m46K61L84j60j2J79k20K29j11k62J57K88j42l87J13
7585a73L35k22n0J93q3L8j7j71K40k08K73J26l60K12j50J0j67J72j32J59Jk24
7607a98N76k51l08K66K27k35J55n49L47j39j59K43j6Q6M7l70J33MJ15j5m7l8M8
7630g8o2J22N2L15l29k33K55r8J20j36j77M58k83j01K95j75J9q2O5O4j89N7L62
7653B41k61O0j04N1J24k25R6P1k70Q5nK94M8k05j24J51J18j56J07j22k16P7J47
7676a8qq7K69P8l40o4k07J17N24J01j94ll23Ok21M30Mn5o0l42K91J13J79n95K98
$$ plain form
7701 -107 269 -218 -154 24 78 6 220 -52 215 -43 -305 -12 106 21 226 210 22 -24 339 -78 97 -4
7723 -4 74 116 94 -269 120 295 231 -101 -66 -65 37 13 16 344 -211 -68 105 -39 108 -239 -167 -62 102 1
7747 1 -20 63 -173 262 -159 -8 -59 52 233 185 184 7 76 253 -283 -322 -57 251 -66 -88 3 85 -200 -116 85
7772 85 -85 411 29 -210 297 -73 -125 15 -49 -163 203 -133 7 52 -325 -173 -208 -45 153 -89 189 -26
7794 -26 -4 -180 -234 55 -310 90 102 85 -63 -123 109 -220 145 -203 104 -115 -93 135 -72 -105 1 -5 -35 -140
7818 -140 -70 194 69 166 35 30 73 -103 -156 -94 -110 41 -87 70 202 -99 -30 -97 226 -68 -267 -82 179
7841 179 358 141 26 -65 311 -53 267 62 89 14 112 6 -32 -2 -134 87 -192 -25 -77 -102 -15 345 73
7864 73 113 223 178 106 122 -1 -178 51 -141 -17 -22 -157 205 166 91 68 -117 129 276 -133 -239 176 -23
$$ packed form
7701a07L76m87O4J78N4p2K14k72K67k58k62K93J18q5K05j6j88m6L63m17J75j01
7723dP8M2k2l63L89J75o4l32L5JJ02k4LL28n55J43J73j44J47l47P2J05J64j01
7747Ak1Q3k36M35m21J51n1J11J81m8jj77O9J77n36l9K65L08l17k2R1Q2k85Q4K01
7772H5j70M96l82k39N07l70n2J40o4j14L66l36J40M5l77J52l5J63J98k42K78k15
7794b6K2j76n4K89l65M00J2j7j48o0K32l29L65l48L07k19K2K28k07l3J06ol0j05
7818a40P0K64j25R7j31nM3j76n3O2j6J51j28J57J32l01O9o7L23k94j99J85K61
7841A79J79k17j15r1L76l64L20k05K7p5R8j06l8L0j32K21k79J67n2k5Q7L60k72
7864G3M0J10m5p2J6j23j77K29j92J24nj35L62l9p5k3j85K46J47m09j06M15j99
$$ plain form
7887 -23 253 95 -236 251 -188 105 165 -199 110 59 35 -137 180 134 -154 -58 166 56 246 205 -71 -94 -51
7910 -51 84 -335 172 -17 -223 -147 -179 74 6 -215 12 -11 58 -33 20 -57 8 -6 -286 290 -74 -23 -47 180
7934 180 -41 15 77 -66 195 130 16 -181 32 -97 24 18 -163 144 -262 59 317 -191 9 -104 11 125
7956 125 24 34 -68 -53 -106 51 39 131 -193 -80 -39 -133 -135 -396 -7 111 44 -19 58 -67 -62 -110 -262 264 106
7981 106 -131 -114 -226 23 -318 -137 -198 70 38 -167 -210 96 -88 -113 258 -203 214 -124 86 152 91 446
8003 446 -26 -41 29 -150 60 -65 75 98 92 34 -302 -10 -3 94 89 -71 26 183 262 -205 23 82 -118 -155 152
8028 152 -167 8 75 226 -119 109 132 -44 120 -154 -149 74 112 192 177 -16 -137 10 194 -6 216 53
8050 53 -256 90 203 -25 99 -57 90 -234 180 258 -31 -53 175 10 -47 214 -39 -45 86 1 195 -88
$$ packed form
7887b3K76j58l31M87m39K93O0l64L09n1k4j72L17m6k88R6K24j10J90m1k76k3M3
7910e1J35m19N07j89k06P6l2K53o8k21K27k3O9r1N3p7O5j4k80N76l64N1k4K27
7934A80k21N6O2j43K61o5j14j97K13j29J21oj81L07m06L21K58n08K00j13J15J14
7956A25j01J0j02J5n3J57j2R2l24J13M1r4kk61L89J18o7o3P7j25Nm8j52N26j58
7981A06k37J7j12K49l41J81o1K68l2k05m3L06j84k5L71m61M17l38K10O6o1L55
8003D46m72j5P0j79K10j25J40K3on8l36K92PR7nj60R7J57P9m67K28N9k00l7L07
8028A52l19J75O7J51l45K28K3j76J64k74NK23L8Q0j5j93j21J47J84k00K22j63
8050E3l09L46J13k28J24j56J47l24M14P8k89k2K28j65n7K61k53oJ31q5J94k83
$$ plain form
8072 -88 -38 -25 -93 141 -17 -233 204 -94 -12 -47 -15 35 50 -191 -25 297 98 -14 17 36 223 -238 223 164
8096 164 98 156 24 57 -99 50 -27 68 -494 19 285 -4 -57 108 81 -135 28 86 204 -183 -13 73 -159
8119 -159 -48 -27 -118 211 -393 -21 -39 -220 19 -122 -37 61 279 53 -66 -154 8 295 -53 -172 -52 184
8141 184 -165 -17 26 -179 171 82 -342 -19 434 219 55 262 -442 -70 -150 -289 156 9 73 -19 75 -97
8163 -97 1 6 209 -108 -57 -112 -263 -47 -73 -274 28 189 -70 14 -105 89 -42 -176 -98 237 54 70 -22 -189
8187 -189 -101 -136 -138 -97
$$ packed form
8072h8N0J3o8K34j58k16M37k98Q2l5L2N0J5k41J66L22j99j12L1J9J87m61M61n9
8096A64o6N8j32L3j56J49p7R5n62N13K66k89n3J65k7k16J63N8J18l87J70Q6k32
8119a59J11K1r1L29o04L72j8j81K39j41Q5R8K18k26j19q8J62K87l48j19J20K36
8141A84l49J48M3k05L50q9m24L23M53k15j64K07p04L72q0j39M45j47O4r2R4j72
8163i7R8NK03l17N1n5j51K16k6k01L02J61k59Q4j19J94j31j34P8L35j83J6r2j67
8187a89Q8l5kM1
8191i7
$$ Imaginary data points
##PAGE= N=2
##DATA TABLE= (X++(I..I)), XYDATA
$$ plain form
0 0 0 0 0 0 0 0 0 8 -8 8 -8 9 -16 16 -17 24 -28 32 -39 45 -53 61 -69 81 -92 106 -119 134 -155 172 -195
31 -195 219 -243 273 -302 336 -375 415 -460 509 -564 624 -691 764 -848 941 -1049 1170 -1316
49 -1316 1481 -1680 1925 -2231 2628 -3161 3919 -5082 7073 -11122 22562 -116077 -449729 -64265
63 -64265 277185 48465 -237298 -51980 174666 44663 -143321 -60766 60769 37049 9336
74 9336 31947 -27805 -83112 14829 115716 30742 -65635 -3581 36866 -89246 -151055 -5071
86 -5071 105486 14860 -63622 10515 54773 -33294 -68230 27356 72679 2642 -24090 22604
98 22604 8272 -43002 8903 87472 18926 -102171 -74532 14264 -21329 -75820 19459 115349
110 115349 24510 -85676 -13717 77987 -452 -77376 22021 113415 17951 -86311 -23228
$$ packed form
0@%%%%%%%Qj6J6j6J7k5L2l3M1n2O0p1Q4r8J14j30J50j73J98k25K53k89L27l67
31a95M14m62N16n75O38p11P90q75R69j073J188j315J455j612J789j990K219k486
49a316K797l161L605m156M859n789P080r001J2155j8195L3684j38639l33652L85464
63f4265L41450k28720k85763J85318K26646j30003j87984Q2555J21535k3720k7713
74I336K2611n9752n5307R7941J00887q4974r6377O2054M0447j26112o1809J45984
86e071J10557r0626p8482P4137M4258q8067l4936R5586M5323p0037k6732M6694
98B2604j4332n1274N1905P8569o8546j21097K7639Q8796l5593n4491R5279R5890
110A15349r0839j10186P1959R1704p8439p6924R9397R1394r5464j04262O3083
$$ plain form
121 -23228 60758 22858 -30236 -18548 -30790 -72035 -35968 34123 15324 -24301 33116 86221
133 86221 10452 -73766 -28491 45553 31762 6977 26206 7142 -43940 -11421 59165 14883
145 14883 -84642 -57300 40564 20613 -64455 -28774 79157 76495 -6763 -17070 26087 10976
157 10976 -27232 1530 44563 21879 -15193 -3344 11882 -9479 -20398 -8200 -19953 -40688
169 -40688 -8345 36346 11975 -27122 19375 82900 38227 -49981 -35721 38310 29766 -30853
181 -30853 -18771 35029 20907 -28307 -22962 172 -21184 -37427 -5792 7342 -17262 -1078
193 -1078 52634 40866 -18674 -5361 52987 22202 -58463 -39330 44604 37612 -33349 -29798 23174
206 23174 10933 -34465 -24311 -3090 -26495 -22936 37619 49315 -12947 -20573 53158 63528
$$ packed form
121b3228Q3986l7900n3094J1688j2242m1245L6067P0091j8799l9625N7417N3105
133H6221p5769q4218M5275P4044j3791k4785J9229j9064n1082L2519P0586m4282
145A4883r9525K7342R7864j9951q5068L5681J07931k662q3258j0307M3157j5111
157A0976l8208K8762M3033k2684l7072J1849J5226k1361j0919J2198j1753k0735
169d0688L2343M4691k4371l9097M6497O3525m4673q8208J4260P4031q544o0619
181c0853J2082N3800j4122m9214N345K3134k1356j6243L1635J3134k4604J6184
193a078N3712j1768n9540J3313N8348l0785q0665J9133Q3934o992p0961L551N2972
206B3174j2241m5398J0154K1221k3405L559O0555J1696o2262p626P3731J0370
$$ plain form
218 63528 -20665 -53264 6629 30413 -15426 -25810 10492 5637 -25641 -4754 21345 -23463
230 -23463 -63074 -8944 50584 13783 -31737 14139 64679 24973 -23258 404 19122 -21038
242 -21038 -34958 11778 20932 -30193 -31947 27561 28916 -37109 -45453 13179 21664 -20602 -9591
255 -9591 42821 38738 33 12456 36246 1044 -34665 -3028 20794 -21044 -38704 17404
267 17404 40117 -19042 -43370 15712 36324 -23852 -43912 18301 48078 9589 203 34829
279 34829 28590 -10126 -2928 18342 -17240 -50967 -6851 36788 -3735 -44924 -2085 39929
291 39929 -234 -39419 -6505 21807 -3381 -6542 34867 35397 -10747 -6376 38018 16579 -50255
304 -50255 -45398 12767 11594 -34025 -23683 19253 10401 -18766 -1963 14214 -17579 -27445 21671
$$ packed form
218F3528q4193l2599N9893K3784m5839j0384L6302m855l1278K0887K6099m4808
230b3463l9611N4130N9528l6801m5520M5876N0540l9706m8231K3662J8718m0160
242b1038j3920M6736R154n1125j754N9508J355o6025q344N8632Q485m2266J1011
255i591N2412m083l8705J2423K3790l5202l5709L1637K3822m1838j7660N6108
267A7404K2713n9159k4328N9082K0612o0176k0060O2213K9777l8489r386L4626
279C4829o239l8716P198K1270l5582l3727M4116M3639m0523m1189M2839M2014
291C9929m0163l9185L2914K8312k5188l161M1409N30m6144M371M4394k1439o6834
304e0255M857N8165j173m5619J0342M2936q852k9167J6803J6177l1793r866M9116
$$ plain form
317 21671 40704 -7571 -21834 31398 46419 -13451 -41792 -5320 3609 -34851 -34289 7600 9413
330 9413 -18841 -4300 23695 -3040 -34039 -2098 31289 69 -25790 14087 41404 997
342 997 -24681 9529 19148 -30842 -50630 -10337 2741 -26763 -16599 28731 21078 -24802 -18510
355 -18510 20719 10205 -22727 -2545 32122 14651 -12103 6167 19551 -10569 -21606 6343
367 6343 -946 -49792 -43327 21968 36039 -13434 -17050 33655 32586 -24867 -32936 17128 34581
380 34581 7150 1926 16274 3280 -11980 4175 11743 -18045 -29685 -1284 2954 -28232 -16603
393 -16603 40093 47264 -3449 -16342 18722 13579 -26015 -9985 46252 40549 -16219 -23379 14604
406 14604 11824 -24285 -21955 6774 2515 -19778 -14062 1756 5658 23723 45594 19627 -30991
$$ packed form
317B1671J9033m8275j4263N3232J5021n9870k8341L6472Q929l8460N62M1889J813
330I413k8254J4541K7995k6735l0999L1941L3387l1220k5859L9877K7317m0407
342I97k5678L4210R619m9990j9788M0293J3078k9504J0164M5330p653m5880O292
355a8510L9229j0514l2932K0182L4667j7471k6754J8270J3384l0120j1037K7949
367F343p289m8846O465O5295J4071m9473l616N0705j069n7453q069N0064J7453
380C4581k7431n224J4348j2994j5260J6155P568k9788j1640K8401M238l1186J1629
393a6603N6696P171n0713j2893L5064n143l9594J6030N6237n703n6768p160L7983
406A4604k780l6109K330K8729m259k2293N716J5818L902J8065K1871k5967n0618
$$ plain form
419 -30991 -23515 25272 21643 -20467 -4354 49512 31666 -39367 -48374 5139 19723 -13105 -18066
432 -18066 4030 -1057 -15077 7075 32080 20333 6832 16269 4925 -31303 -27363 20681 34958
445 34958 4077 -5354 6962 -15511 -46888 -19584 26389 9508 -30049 -9550 29942 8882
457 8882 -25374 8622 55436 25491 -33981 -33211 2440 5981 -3682 9679 16913 -5756 -21546
470 -21546 -16638 -22999 -28371 4010 37616 11794 -30450 -10866 34431 24355 -11474 -28 25413
483 25413 -58 -35705 -19214 12595 6819 -1650 15872 7936 -37768 -46367 3074 26701 -1990
496 -1990 -8938 25186 27962 -9542 -13858 19565 22525 -5166 -6810 4381 -16637 -32506 4918
509 4918 38250 6891 -31841 -12900 10254 -15423 -33077 8092 44467 21266 -7657 2736
$$ packed form
419c0991P476M8787l629m2110J6113N3866j7846p1033r007N3513J4584l2828m961
432a8066K2096n087j4020K2152K5005j1747j3501R437j1344l6228L940M8044J4277
445C4958l0881r431J2316k2473l1377K7304M5973j6881l9557K0499L9492k1060
457H882l4256L3996M6814k9945n9472P70L5651L541r663J3361P234k2669j5790
470b1546M908o361n372L2381L3606k5822m2244J9584M5297j0076l5829J1446K5441
483B5413k5471l5647J6491L1809n776q469J7522p936m5704q599M9441K3627k8691
496a990o948L4124K776l7504m316L3423K960k7691j644J1191k1018j5869L7424
509D918L3332l1359l8732J8941K3154k5677j7654M1169L6375k3201k8923J0393
$$ plain form
521 2736 13432 -1588 -3646 13205 5499 -19689 -14357 6140 -4668 -18260 8051 28517 -6673
534 -6673 -40593 -13197 21590 5708 -10792 20428 40706 5444 -22017 2356 18058 -9031
546 -9031 -20369 6826 9632 -23366 -23930 14217 19794 -13317 -17859 7641 4418 -18178 -6676
559 -6676 23106 19887 1617 9365 16613 -7643 -22354 -2181 7339 -15946 -21516 5273 8535
572 8535 -18363 -15542 15945 10729 -24113 -17435 19065 14180 -15669 -3542 31143 19408 -15806
585 -15806 -11336 8585 -8101 -29249 -9487 11610 -6984 -21757 2610 16809 -7570 -19698
597 -19698 4862 14181 -7603 -8599 16518 16380 -5886 1353 21945 2754 -29184 -15839 12693
610 12693 -3049 -28785 -8693 20995 7286 -14191 -344 13684 -2867 -9361 11932 14849
$$ packed form
521B736J0696j5020k058J6851p706k5188N332K0497j0808j3592K6311K0466l5190
534f673l3920K7396L4787j5882j6500L1220K0278l5262k7461K4373J5702k7089
546i031j1338K7195K806l2998n64L8147N577l3111m542K5500l223k2596J1502
559f676K9782l219j8270P748P248k4256j4711K0173R520k3285n570K6789L262
572H535k6898K821L1487n216l4842O678L6500m885k9849J2127L4685j1735l5214
585a5806M470J9921j6686k1148J9762K1097j8594j4773K4367J4199k4379j2128
597a9698K4560R319k1784r96K5117j38k2266P239K0592j9191l1938J3345K8532
610A2693j5742k5736K0092K9688j3709k1477J3847J4028j6551o494K1293K917
$$ plain form
622 14849 -6779 72 28500 16353 -21756 -14177 20451 6168 -35733 -23713 19997 14623 -19439
635 -19439 -8841 24805 16547 -12151 -5306 13714 4986 -3544 14293 19581 -3308 -6569 16785
648 16785 11742 -22218 -22291 9754 9602 -19382 -13965 18654 17846 -5136 1198 18893 3470 -13867
662 -13867 6801 25297 2232 -13705 12708 26579 -6580 -26737 620 14696 -13915 -26040
674 -26040 4166 17229 -4795 -6911 19189 18400 -10248 -8415 16729 9979 -13835 -2571 21315
687 21315 7643 -17166 -4474 12138 -9439 -27384 -5271 10683 -10114 -17279 12812 23600
699 23600 -4677 -12209 15164 17149 -13911 -16380 13152 13948 -11989 -8948 13247 3268 -21116
712 -21116 -12589 4951 -8828 -21038 1364 17538 -2366 -11358 13982 22278 -6039 -15573 9060
$$ packed form
622A4849k1628O851K8428j2147l8109P579L4628j4283m1901J2020M3710n374l4062
635a9439J0598L3646q258k8698O845J9020q728q530J7837N288k2889l261K3354
648A6785n043l3960p3L2045j52k8984N417L2619q08k2982O334J7695j5423j7337
662a3867K0668J8496k3065j5937K6413J3871l3159k0157K7357J4076k8611j2125
674b6040L0206J3063k2024k116K6100p89k8648J833K5144o750k3814J1264K3886
687B1315j3672k4809J2692J6612k1577j7945K2113J5954k0797p165L0091J0788
699B3600k8277p532K7373J985l1060k469K9532P96k5937L041K2195r979k4384
712b1116Q527J7540j3779j2210K2402J6174j9904q992K5340Q296k8317r534K4633
$$ plain form
725 9060 13142 -13956 -15167 12388 12626 -13574 -13177 6870 -3015 -25140 -12873 12909 3190 -14196
739 -14196 2865 22955 5976 -12562 3974 17464 -2981 -17578 -496 9399 -6922 -10578
751 -10578 8455 7134 -15997 -16387 4108 -289 -17724 -3847 22862 13370 -9960 829 20603
764 20603 5035 -15441 181 17116 -2960 -20969 -1632 14788 -2550 -13169 4488 8280
776 8280 -14321 -18178 5699 11785 -1564 5923 23994 10314 -15212 -4627 17665 4591 -15817
789 -15817 -2703 13990 -5215 -22350 -1134 17959 -12 -15576 -526 6412 -11558 -12407 16076
802 16076 25781 5003 -3515 7787 1959 -14928 -6820 13086 4833 -14593 -7970 6137 -5939
815 -5939 -16082 3872 19289 -2224 -21746 -5538 12246 2226 -2059 18485 22627 -5166 -20153
$$ packed form
725I060M082k7098j211K7555K38k6200L97K0047r885k2125J2267K5782r719j7386
739a4196J7061K0090j6979j8538J6536J3490k0445j4597J7082R895j6321l656
751a0578J9033j321k3131l90K0495m397j7435J3877K6709r492k3330J0789J9774
764B0603j5568k0476J5622J6935k0076j8009J9337J6420j7338j0619J7657L792
776H280k2601l857K3877O086j3349P487J8071j3680k5526J0585K2292j3074k0408
789a5817J3114J6693j9205j7135K1216J9093j7971j5564J5050O938j7970q49K8483
802A6076R705k0778q518J1302n828j6887Q108J9906q253j9426O623J4107j2076
815e939j0143J9954J5417k1513j9522J6208J7784j0020m285K0544M142k7793j4987
$$ plain form
828 -20153 -3764 4666 -8135 -7508 9121 5398 -15259 -14447 3310 2859 -5229 4322 11964 -6789
842 -6789 -19322 2911 23613 9315 -4595 8081 10328 -16755 -27706 -1655 14802 -1023
854 -1023 -9905 2741 3319 -15080 -13436 10449 15887 -127 -4640 3066 -777 -4605 10194 20657
868 20657 4872 -10295 -4066 -2076 -17321 -14884 12923 21621 -3556 -16092 128 7044 -5946
881 -5946 -2929 18218 16976 -6756 -10500 8701 12621 1154 4307 12409 -918 -19191 -12769 3032
895 3032 2025 -440 11554 12712 -7501 -14908 4079 14607 2459 214 13542 10107 -9618
908 -9618 -7311 13542 12097 -7273 -7050 5312 -5037 -21462 -8471 16602 13945 -3189 -2304 4928
922 4928 -2193 -6211 6432 12959 1223 -1265 8620 3254 -13225 -7602 13362 7956 -17186 -17148
$$ packed form
828b0153J6389Q430j2801O27J6629l723k0657Q12J7757m51q088R551P642j8753
842f789j2533K2233K0702j4298j3910J2676K247k7083j0951K6051J6457j5825
854a023q882J2646N78j8399J644K3885N438j6014m513P706l843l828J4799J0463
868B0657j5785j5167O229J990j5245K437K7807Q698k5177j2536J6220O916j2990
881e946L017K1147j242k3732l744J9201L920j1467L153Q102j3327j8273O422J5801
895C032j007k465J1994J158k0213p407J8987J0528j2148k245J3328l435j9725
908i618K307K0853j445j9370K23J2362j0349j6425J2991K5073k657j7134Q85P232
922D928p121m018J2643O527j1736k488R885n366j6479N623K0964n406k5142L8
$$ plain form
936 -17148 3941 3691 -11786 -3027 17299 11158 -9833 -8570 5487 3022 -4611 4012 10990 -1129
950 -1129 -9020 306 2104 -10958 -10506 4784 2444 -16457 -13642 7912 8971 -5702 -1914 12426
964 12426 3805 -14234 -5757 11357 3054 -10832 -707 12289 -2452 -18163 -8060 4587 -3999
977 -3999 -11099 -1924 1781 -6167 -2157 11214 6212 -9141 -1803 14014 2708 -17304 -6433 15565
991 15565 7980 -12608 -8183 7057 -584 -14750 -7226 5414 -144 -6336 3506 8865 -791 -2375
1005 -2375 9013 8284 -5842 -4874 7793 4241 -9210 -3645 10344 3172 -11486 -5403 5860 -2251
1019 -2251 -11645 540 12056 2303 -5237 7967 14511 -1482 -8659 6021 11767 -3738 -9239
1032 -9239 3836 6735 -5019 -5380 5666 1903 -9715 -4129 7193 1355 -7365 4470 16350
$$ packed form
936a7148K1089k50j5477Q759K0326o141k0991J263J4057k465p633Q623O978j2119
950a129p891R326J798j3062M52J5290k340j8901K815K1554J059j4673L788J4340
964A2426q621j8039Q477J7114q303j3886J0125J2996j4741j5711J0103J2647q586
977c999p100R175L705p948M010J3371n002j5353P338J5817j1306k0012J0871K1998
991A5565p585k0588M425J5240p641j4166P524J2640n558o192R842N359r656j584
1005b375J1388p29j4126R68J2667l552j3451N565J3989p172j4658O083J1263q111
1019b251r394J2185J1516r753p540J3204O544j5993p177J4680N746j5505n501
1032i239J3075K899j1754l61J1046l763j1618N586J1322n838q720J1835J1880
$$ plain form
1045 16350 5562 -6512 2104 9796 -109 -6759 2064 5692 -4260 -6103 3544 3166 -6509 -3707
1059 -3707 5140 -407 -9696 -578 11429 3787 -4960 5414 14316 -547 -12037 905 10787 -2917
1073 -2917 -13316 -266 9134 -3106 -11214 307 6742 -3857 -8237 2111 5474 -2018 -1363 8748
1087 8748 7106 -2573 -1754 4204 -929 -8368 -2197 3379 -3102 -6650 1498 3854 -6590 -7124 5418
1102 5418 5797 -7310 -6039 8900 9381 -4054 -2750 10360 6697 -8544 -7234 3945 792 -8830
1116 -8830 -2175 7098 -1000 -9549 240 9036 -1424 -8784 3202 11977 271 -7163 4892 12264
1130 12264 2003 -5424 232 2217 -4705 -5385 2173 738 -3997 353 6024 -1036 -7584 1423 9362
1145 9362 1267 -5284 3721 10321 1092 -4319 4249 7640 -2836 -7431 304 1370 -7394 -4500 7781
$$ packed form
1045A6350j0788j2074Q616P692r905o650Q823L628r952j843R647l78r675K802
1059c707Q847n547r289R118J2007p642q747J0374Q902j4863j1490J2942R882j3704
1073b917j0399J3050R400j2240q108J1521O435j0599m380J0348L363p492O55J0111
1087H748j642r679Q19N958n133p439O171N576o481l548Q148K356j0444n34J2542
1102E418L79j3107J271J4939M81j3435J304J3110l663j5241J310J1179l153r622
1116h830O655R273q098q549R789Q796j0460p360J1986Q775j1706p434J2055P372
1130A2264j0261p427N656J985o922o80P558j435m735M350N671p060o548R007P939
1145I362q095o551R005O600r229n411Q568L391j0476m595P735J066q764K894J2281
$$ plain form
1160 7781 5918 -5917 -4088 7237 3565 -6904 -742 11415 6469 -5763 -1371 7448 846 -6934
1174 -6934 864 6284 -4487 -12464 -2782 5381 -793 -4168 3690 5655 -3144 -5034 1861 2015 -2089
1189 -2089 4091 9433 -1561 -11871 -2239 8619 -451 -11569 -3281 5304 -4395 -12889 -2380 8569
1203 8569 2917 -2471 984 698 -6825 -4109 6379 5415 -3664 -1015 4646 -3868 -13749 -3823 9097
1218 9097 1055 -12605 -6241 4849 -1086 -8935 614 12292 4382 -7506 -5018 1202 -1570 -1175
1232 -1175 6207 5354 -4827 -6541 -919 -3056 -8302 141 8953 -60 -11946 -4164 8055 2159
1246 2159 -5574 5230 13500 -452 -14221 -4220 9600 5236 -1831 2083 3016 -6877 -8465 1164
1260 1164 2764 -2791 1792 9662 300 -11826 -2287 14131 9474 -3031 -255 5953 -2402 -9230
$$ packed form
1160G781j863j1835J829J1325l672j0469O162J2157m946j2232M392Q819o602p780
1174f934P798N420j0771p977R682Q163o174l375P858J965q799j890O895J54m104
1189b089O180N342j0994j0310R632J0858r070j1118Q288Q585r699q494J0509J0949
1203H569n652n388L455k86p523K716J0488r64r079K649N661q514r881R926J2920
1218I097q042j3660O364J1090n935p849R549J1678p910j1888K488O220k772L95
1232a175P382q53j0181j714N622k137n246Q443Q812r013j1886P782J2219n896
1246B159p733J0804Q270j3952j3769J0001J3820m364p067L914R33r893j588R629
1260A164J600n555M583P870r362j2126R539J6418m657j2505K776O208q355o828
$$ plain form
1274 -9230 2907 12201 2333 -5657 1044 2700 -8080 -7835 7657 12123 450 -3872 3296 2797
1288 2797 -3233 2481 12003 5837 -6028 -3195 4018 -599 -4475 4778 9908 -1452 -9485 -1728
1302 -1728 4141 -2950 -2895 9186 11169 -2802 -7913 2840 7473 -106 -880 5902 2418 -7075 -5243
1317 -5243 3444 1927 -3464 1772 6118 -4177 -11054 -1174 7956 1997 -2015 5924 6441 -6251 -8757
1332 -8757 5073 9386 -3616 -7460 2614 3683 -6968 -8212 2609 4750 -1309 -1874 -979 -5769
1346 -5769 -5030 6440 9920 -2698 -6924 4305 6972 -6556 -9853 4037 8622 -4120 -9012 95
1360 95 2778 -5324 -4316 4809 3346 -5497 -3980 3554 1847 -2409 2448 6218 -564 -5349 1301
1375 1301 3436 -5019 -6909 3695 6960 -4240 -8138 1595 5035 -2442 -3876 4280 4280 -3390 -2151
$$ packed form
1274i230J2137R294r868p990O701J656j0780K45J5492M466j1673m322P168m99
1288B797o030N714R522o166j1865K833P213m617l876R253N130j1360q033P757
1302a728N869p091N5J2081J983j3971n111J0753M633p579p74O782l484r493J832
1317e243Q687j517n391N236M346j0295o877R880R130n959m012P939N17j2692k506
1332h757J3830M313j3002l844J0074J069j0651j244J0821K141o059n65Q95m790
1346e769P39J1470L480j2618m226J1229K667j3528l297J3890M585j2742m892R107
1360I5K683q102J008R125j463q843J517P534j707m256M857L770o782m785O650
1375A301K135q455j890J0604L265j1200l898R733L440p477j434Q156%p670J239
$$ plain form
1390 -2151 5083 3810 -2540 -31 6037 220 -6605 -1194 4136 -1668 -5105 3371 6442 -4289 -8316
1405 -8316 3095 8887 -1472 -6671 3590 7598 -722 -4659 2057 3931 -1522 -1044 2385 -2249
1419 -2249 -7311 -224 6819 257 -6335 -158 5815 -794 -6026 1467 6010 -708 -3131 4135 4194
1434 4194 -4896 -5285 5020 4645 -6176 -6440 2373 2077 -5562 -3421 5043 2080 -5638 -2357 4133
1449 4133 393 -5559 256 6587 905 -5728 -1676 2324 -1742 -4341 917 2075 -4773 -5631 2261
1464 2261 3123 -3284 -3216 3728 2092 -4234 -2412 3321 1159 -3322 1606 4717 -2539 -7044 427 5449
1480 5449 -2647 -6799 1277 4580 -3586 -5725 3810 6015 -2960 -4699 4385 4827 -3985 -4289 4591
1495 4591 5618 -1875 -3298 807 -36 -2238 1184 2846 -2759 -3630 3929 5559 -3175 -4620 5510
$$ packed form
1390b151P234j273o350K509O068n817o825N411N330n804l437Q476L071j0731m027
1405h316J1411N792j0359n199J0261M008q320l937O716J874n453M78L429m634
1419b249n062P087P043o562o592O177N973o609n232P493M543o718k423P266N9
1434D194r090l89J0305l75j0821k64Q813k96p639K141Q464k963p718L281O490
1449D133l740n952N815O331n682o633M052M000m066k599N258J158o848q58P892
1464B261Q62o407O8O944j636o326J822N733k162m481M928L111p256m505P471N022
1480E449q096m152Q076L303q166k139R535K205q975j739R084M42q812l04Q880
1495D591J027p493j423M105q43k202L422J662n605q71P559J630q734j445J0130
$$ plain form
1510 5510 7987 -2086 -5056 2945 5793 -1257 -1860 4282 3620 -3556 -2166 3892 2428 -2509 659
1525 659 5073 1053 -2676 2229 5200 -303 -1803 5650 6199 -4002 -5454 5630 8016 -2212 -5066
1540 -5066 4418 5608 -3227 -4237 3185 4887 -1177 -936 3970 1420 -2366 1013 4733 727 -1749
1555 -1749 2955 3177 -4195 -4257 5485 6126 -4620 -5882 3687 5069 -4579 -5694 4147 6304 -2063 -3502
1571 -3502 1856 1100 -2756 270 4821 -76 -5182 -962 3060 -1996 -4926 1389 4241 -2453 -5297
1586 -5297 451 1939 -3644 -2076 5098 2881 -6084 -5609 3385 3048 -4501 -2359 4181 926 -6753
1601 -6753 -3980 2348 913 -3352 -220 2221 -3043 -6302 -34 3624 -480 -2180 2246 681 -5931
1616 -5931 -4239 4059 3001 -3406 -2369 2873 -576 -7195 -2762 5335 3189 -3200 -2265 1235 -1926
$$ packed form
1510E510K477j0073k970Q001K848p050o03O142o62p176J390O058j464m937L168
1525F59M414m020l729M905K971n503j500P453N49j0201j452J1084K386j0228k854
1540e066R484J190q835j010P422J702o064K41M906k550l786L379L720m006k476
1555a749M704K22p372o2R742O41j0746j262R569J382r648j115R841K157q367j439
1571c502N358p56l856L026M551m897n106M220M022n056k930O315K852o694k844
1586e297N748J488n583J568P174k217q965M75Q994l37p549K142O540l255p679
1601f753K773O328j435m265L132K441n264l259O268L658m104j700M426j565o612
1616e931J692Q298j058o407J037N242l449o619M433Q097k146o389R35L500l161
$$ plain form
1631 -1926 -4140 1960 5250 419 -3214 -116 624 -3573 -1655 4821 3166 -3537 -2705 1985 -295
1646 -295 -4583 658 7864 3026 -5807 -3969 2752 2187 -1092 1756 4263 -130 -3860 -1126 1262
1661 1262 -456 598 4678 1879 -5355 -4127 2412 3372 -917 708 4569 553 -6038 -2748 4545
1676 4545 3450 -720 704 2052 -2495 -4658 363 4108 757 -1116 1585 -4 -5370 -2799 4802
1691 4802 4895 -2393 -2766 2484 602 -5146 -2477 5405 4337 -2505 -3484 -261 -973 -2193 1499 3095
1707 3095 -159 -2552 -475 -834 -3843 -641 5952 3172 -5183 -4681 2145 2018 -3974 -1824 5099 3408
1723 3408 -4889 -5659 337 2393 -140 313 1723 -1315 -2880 -544 742 -1553 -14 4372 1186
1738 1186 -5515 -4417 3594 4407 -2320 -1945 3868 2659 -4854 -4427 3136 4806 -540 -1738 1426 920
$$ packed form
1631a926k214O100L290m831l633L098P40m197J918O476j655o703Q32M690k280
1646b95m288N241P206m838q833J838O721n65l279K848K507m393l730K734K388
1661A262j718J054M080k799p234J228O539R60m289J625L861m016o591L290P293
1676D545j095m170J424J348m547k163N021L745l351j873K701j589n366K571P601
1691D802R3p288l73N250j882n748K669P882j068o842r79L223p12j220L692J596
1707C095l254k393K077l59l009L202O593k780q355N02O826j27n992K150O923j691
1723C408q297p70N996K056k533M53J410l038j565K336J286k295J539M386l186
1738A186o701J098Q011Q13o727L75N813j209p513M27P563J670n346j198L164n06
$$ plain form
1754 920 -1897 -261 2130 966 200 2214 742 -2943 -1101 4681 3906 -2029 -1359 3923 2065 -3842
1770 -3842 -2121 4948 4598 -1663 -2452 1917 1667 -1611 338 3068 1392 -703 748 1846 -1294 -941
1786 -941 3463 4015 -1174 -2412 1651 2208 -1605 -695 3321 2432 -2213 -1682 1673 325 -1663 1084
1802 1084 3879 -59 -3502 90 3138 -272 -2338 1711 3262 -1727 -3897 435 2742 -900 -2206
1817 -2206 1525 1907 -2309 -2276 932 737 -1703 -182 1919 -825 -3562 -103 2780 -985 -3777 433
1833 433 2310 -2539 -4868 -70 2457 -1536 -3476 475 901 -2816 -2543 1005 556 -2178 -1018 1265
1849 1265 -1561 -3883 -275 2800 -1188 -4548 -1125 2245 -1665 -4791 -33 3398 -428 -3752 -819
1864 -819 1103 -699 -1399 1756 1097 -2461 -1639 1453 -311 -2836 -201 2798 -347 -4088 -834 3045
$$ packed form
1754I20k817J636K391j164p66K014j472l685J842N782p75n935O70N282j858n907
1770c842J721P069l50o261p89M369k50l278J949K730j676k095J451J098l140L53
1786i41M404N52n189j238M063N57l813R10M016q89m645N31L355j348j988K747
1802A084K795l938l443L592L048l410k066M049J551m989k170M332K307l642j306
1817b206L731L82m216L3L208j95k440J521K101k744k737L459K883l765k792M210
1833D33J877m849k329M798K527l993j940L951M26l717K73L548m49k734J160K283
1849A265k826k322L608L075l988l360L423L370l910l126M758L431l826l324K933
1864h19J922j802p00L155o59l558Q22L092j764k525K635K999l145l741L254L879
$$ plain form
1880 3045 405 -2567 790 3479 -72 -3150 565 3105 83 -1323 1418 2052 -1576 -1661 2014 1186
1896 1186 -2474 -848 3100 1059 -3182 -494 4647 2231 -2486 -482 2973 1132 -1935 808 3323
1911 3323 957 -1419 1219 1282 -1637 -1017 2533 1886 -2220 -608 3406 1596 -2539 667 5031 1697
1927 1697 -3581 -588 3711 1420 -1895 278 3154 458 -2567 -764 1519 -249 -879 1661 1517
1942 1517 -1372 -984 2090 1288 -1379 177 2674 -47 -2974 -498 3143 241 -2706 413 2558
1957 2558 -1878 -4302 -28 3142 176 -2247 1011 1954 -1568 -2163 1738 2301 -914 -1238 830 209
1973 209 -2545 -606 2704 580 -3139 -1215 1085 -1659 -3184 1088 4044 64 -2547 510 2391
1988 2391 -827 -2240 1836 2843 -1195 -2317 475 206 -2065 321 2529 -230 -3474 -778 2353
$$ packed form
1880C045k640k972L357K689l551l078L715K540l022j406K741O34l628q5L675q28
1896A186l660J626L948k041m241K688N141k416m717K004L455j841l067K743K515
1911C323k366k376K638O3k919O20L550o47m106J612M014j810m135L206M364l334
1927A697n278K993M299k291l315K173K876k696l025J803K283j768o30K540j44
1942A517k889L88L074q02k667J556K497k721k927K476L641k902k947L119K145
1957B558m436k424M274L170k966k423L258R43l522n95L901N63l215l24K068o21
1973B09k754J939L310k124l719J924K300k744j525M272K956l980k611L057J881
1988B391l218j413M076J007m038j122K792k69k271K386K208k759l244K696L131
$$ plain form
2003 2353 132 -1587 2466 4423 -401 -3629 286 3240 -26 -2029 1781 2766 -1652 -3266 461
2018 461 1882 -31 -199 1394 53 -2023 -10 2871 1516 -105 2122 2573 -1243 -3525 580 3521
2034 3521 860 -1665 296 1376 -1908 -2620 1184 2835 -203 -876 1207 576 -1736 305 4153 2309
$$ packed form
2003B353k221j719M053J957m824l228L915K954l266k003L810R85m418j614L727
2018D61J421j913j68J593j341k076K013K881j355j621K227M51l816k282M105K941
2034C521k661k525J961J080l284p12L804J651l038o73K083o31k312K041L848j844
$$ [...]
8191E9
##END NTUPLES=NMR FID
##END=
