##TITLE=1H_SAV-39-NaOH
 Py-d5, 8 sc, 
 18.10.2019
##JCAMPDX= 6.0         $$ Bruker NMR JCAMP-DX V2.0
##DATA TYPE= NMR FID
##DATA CLASS= NTUPLES
##ORIGIN= UXNMR, Bruker Analytische Messtechnik GmbH
##OWNER= root
$$ XWIN-NMR		Version 3.5
$$ Fri Oct 18 15:57:15 2019 Russian Standard Time (UT+4h)  she@DPX200
##.OBSERVE FREQUENCY= 200.1315
##.OBSERVE NUCLEUS= ^1H
##.DELAY= (6, 6)
##.ACQUISITION MODE= SIMULTANEOUS
##.ACQUISITION SCHEME= undefined
##.AVERAGES= 8
##.DIGITISER RES= 18
##SPECTROMETER/DATA SYSTEM= spect
##.PULSE SEQUENCE= zg30
##.SOLVENT NAME= Pyr
##.SHIFT REFERENCE= (INTERNAL, Pyr, 0, 15.7039)
##AUDIT TRAIL= $$ (NUMBER, WHEN, WHO, WHERE, WHAT)
$$ ##TITLE= Audit trail, XWIN-NMR		Version 3.5
$$ ##JCAMPDX= 5.01
$$ ##ORIGIN= Bruker BioSpin GmbH
$$ ##OWNER= she
$$ F:/spectra/data/she/nmr/H-F/1/audita.txt
$$ ##AUDIT TRAIL=  $$ (NUMBER, WHEN, WHO, WHERE, WHAT)
(   1,<2019-10-18 15:56:09.21 +0400>,<she>,<DPX200>,
      <created by zg, POWCHK disabled, PULCHK disabled
       configuration hash MD5:
       00 E9 B6 7A A2 85 ED C7 34 08 36 98 17 FE 4E 26
       data hash MD5: 16K
       E8 95 F1 60 5B E7 AC 30 98 C1 07 80 0B CD 30 67>)
$$ ##END=
$$ 
$$ hash MD5
$$ 5A 14 79 16 64 06 61 7B 94 1A EB A7 50 FA 08 E2
##$RELAX= 
##$RELAX= 
##$RELAX= 
##$RELAX= 
##$RELAX= 
##$RELAX= 
$$ Bruker specific parameters
$$ --------------------------
##$DU= <F:/spectra>
##$EXPNO= 1
##$NAME= <H-F>
##$PROCNO= 1
##$TYPE= <nmr>
##$USER= <she>
##$AMP= (0..31)
100 100 100 100 100 100 100 100 100 100 100 100 100 100 100 100 100 100 
100 100 100 100 100 100 100 100 100 100 100 100 100 100 
##$AQSEQ= 0
##$AQ_mod= 1
##$AUNM= <au_zg>
##$AUTOPOS= <>
##$BF1= 200.13
##$BF2= 200.13
##$BF3= 200.13
##$BF4= 200.13
##$BF5= 200.13
##$BF6= 200.13
##$BF7= 200.13
##$BF8= 200.13
##$BYTORDA= 1
##$CFDGTYP= 0
##$CFRGTYP= 5
##$CHEMSTR= <none>
##$CNST= (0..31)
1 1 145 1 1 1 1 1 1 1 1 1 1 1 1 1 1 1 1 1 1 1 1 1 1 1 1 1 1 1 1 1 
##$CPDPRG= <>
##$CPDPRG1= <>
##$CPDPRG2= <>
##$CPDPRG3= <>
##$CPDPRG4= <mlev>
##$CPDPRG5= <mlev>
##$CPDPRG6= <mlev>
##$CPDPRG7= <mlev>
##$CPDPRG8= <mlev>
##$CPDPRGB= <>
##$CPDPRGT= <>
##$D= (0..31)
0 1.2 0 0 0 0 0 0 0 0.06 0 0.03 0 0 0 0 0.0002 0 0 0 0 0 0 0 0 0 0 0 0 
0 0 0 
##$DATE= 1571399768
##$DBL= (0..7)
120 120 120 120 120 120 120 120 
##$DBP= (0..7)
150 150 150 150 150 150 150 150 
##$DBP07= 0
##$DBPNAM0= <>
##$DBPNAM1= <>
##$DBPNAM2= <>
##$DBPNAM3= <>
##$DBPNAM4= <>
##$DBPNAM5= <>
##$DBPNAM6= <>
##$DBPNAM7= <>
##$DBPOAL= (0..7)
0.5 0.5 0.5 0.5 0.5 0.5 0.5 0.5 
##$DBPOFFS= (0..7)
0 0 0 0 0 0 0 0 
##$DE= 6
##$DECBNUC= <off>
##$DECIM= 24
##$DECNUC= <off>
##$DECSTAT= 4
##$DIGMOD= 1
##$DIGTYP= 9
##$DL= (0..7)
0 120 120 120 120 120 120 120 
##$DP= (0..7)
150 150 150 150 150 150 150 150 
##$DP07= 0
##$DPNAME0= <>
##$DPNAME1= <>
##$DPNAME2= <>
##$DPNAME3= <>
##$DPNAME4= <>
##$DPNAME5= <>
##$DPNAME6= <>
##$DPNAME7= <>
##$DPOAL= (0..7)
0.5 0.5 0.5 0.5 0.5 0.5 0.5 0.5 
##$DPOFFS= (0..7)
0 0 0 0 0 0 0 0 
##$DQDMODE= 0
##$DR= 18
##$DS= 0
##$DSLIST= <SSSSSSSSSSSSSSS>
$$ [...]
##$SUBNAM2= <"">
##$SUBNAM3= <"">
##$SUBNAM4= <"">
##$SUBNAM5= <"">
##$SUBNAM6= <"">
##$SUBNAM7= <"">
##$SUBNAM8= <"">
##$SUBNAM9= <"">
##$SW= 24.0689530833862
##$SWIBOX= (0..15)
0 0 2 0 0 0 0 0 0 0 0 0 0 0 0 0 
##$SW_h= 4816.95568400771
##$TD= 16384
##$TD0= 1
##$TE= 0
##$TE2= 300
##$TE3= 300
##$TEG= 300
##$TL= (0..7)
0 120 120 120 120 120 120 120 
##$TP= (0..7)
150 150 150 150 150 150 150 150 
##$TP07= 0
##$TPNAME0= <>
##$TPNAME1= <>
##$TPNAME2= <>
##$TPNAME3= <>
##$TPNAME4= <>
##$TPNAME5= <>
##$TPNAME6= <>
##$TPNAME7= <>
##$TPOAL= (0..7)
0.5 0.5 0.5 0.5 0.5 0.5 0.5 0.5 
##$TPOFFS= (0..7)
0 0 0 0 0 0 0 0 
##$TUNHIN= 0
##$TUNHOUT= 0
##$TUNXOUT= 0
##$USERA1= <user>
##$USERA2= <user>
##$USERA3= <user>
##$USERA4= <user>
##$USERA5= <user>
##$V9= 5
##$VALIST= <valist>
##$VCLIST= <CCCCCCCCCCCCCCC>
##$VD= 0
##$VDLIST= <DDDDDDDDDDDDDDD>
##$VPLIST= <PPPPPPPPPPPPPPP>
##$VTLIST= <TTTTTTTTTTTTTTT>
##$WBST= 1024
##$WBSW= 4
##$XGAIN= (0..3)
0 0 0 0 
##$XL= 0
##$YL= 0
##$YMAX_a= 222935
##$YMIN_a= -279376
##$ZGOPTNS= <>
##$ZL1= 120
##$ZL2= 120
##$ZL3= 120
##$ZL4= 120
##$ABSF1= 10
##$ABSF2= 0
##$ABSG= 5
##$ABSL= 3
##$ALPHA= 0
##$AQORDER= 0
##$ASSFAC= 0
##$ASSFACI= 0
##$ASSFACX= 0
##$ASSWID= 0
##$AUNMP= <proc_1d>
##$AZFE= 0.1
##$AZFW= 0.1
##$BCFW= 1
##$BC_mod= 2
##$BYTORDP= 1
##$COROFFS= 0
##$CY= 11.3945322036743
##$DATMOD= 1
##$DC= 2
##$DFILT= <>
##$DTYPP= 0
##$F1P= 20.1720416913024
##$F2P= 0.152960286110954
##$FCOR= 0.5
##$FTSIZE= 0
##$FT_mod= 4
##$GAMMA= 1
##$GB= 0.15
##$INTBC= 1
##$INTSCL= 1
##$ISEN= 128
##$LB= 0.24
##$LEV0= 0
##$LPBIN= 0
##$MAXI= 10000
##$MC2= 0
##$MEAN= 0
##$ME_mod= 0
##$MI= 1.114404
##$NCOEF= 0
##$NC_proc= 0
##$NLEV= 6
##$NOISF1= 3.799351
##$NOISF2= 2.8
##$NSP= 1
##$NTH_PI= 0
##$NZP= 0
##$OFFSET= 15.70392
##$PC= 1
##$PHC0= -9570.984
##$PHC1= 13.80089
##$PH_mod= 1
##$PKNL= yes
##$PPARMOD= 0
##$PSCAL= 0
##$PSIGN= 0
##$REVERSE= no
##$SF= 200.130013532006
##$SI= 16384
##$SIGF1= 3
##$SIGF2= 2
##$SINO= 400
##$SIOLD= 16384
##$SREGLST= <1H.CDCl3>
##$SSB= 0
##$STSI= 0
##$STSR= 0
##$SW_p= 3612.71676300578
##$SYMM= 0
##$S_DEV= 0
##$TDeff= 0
##$TDoff= 0
##$TI= <>
##$TILT= no
##$TM1= 0
##$TM2= 0
##$TOPLEV= 0
##$USERP1= <user>
##$USERP2= <user>
##$USERP3= <user>
##$USERP4= <user>
##$USERP5= <user>
##$WDW= 1
##$XDIM= 8192
##$YMAX_p= 0
##$YMIN_p= 0
$$ End of Bruker specific parameters
$$ ---------------------------------
##NTUPLES= NMR FID
##VAR_NAME=  TIME,          FID/REAL,        FID/IMAG
##SYMBOL=    X,             R,               I
##VAR_TYPE=  INDEPENDENT,   DEPENDENT,       DEPENDENT
##VAR_FORM=  AFFN,          ASDF,            ASDF
##VAR_DIM=   8192,          8192,            8192
##UNITS=     SECONDS,       ARBITRARY UNITS, ARBITRARY UNITS
##FACTOR=    0.0002076,     1,               1
##FIRST=     0,             0,               0
##LAST=      1.7004516,     0,               0
##MIN=       0,             -279376,         0
##MAX=       1.7004516,     222935,          0
$$ Real data points
##PAGE= N=1
##DATA TABLE= (X++(R..R)), XYDATA
$$ [...]
$$ plain form
1945 1997 1876 388 559 1366 806 -1000 -1065 691 755 -190 481 1667 1542 132 169 1761 1163 -150
1963 -150 124 969 583 -207 127 1217 709 -1039 -853 27 -458 -1897 -947 661 496 -729 -250 1186
1981 1186 674 -432 -537 121 -881 -1943 -1563 -93 -356 -1713 -1104 39 -482 -1788 -1407 -167 -939
1998 -939 -1406 -826 313 3 -560 249 973 -72 -1798 -1250 -507 -923 -1891 -1329 196 -296 -771 206 978
2017 978 206 -851 -352 531 524 -445 515 931 850 -171 592 1149 86 -556 -567 491 39 -632 443 1679
2037 1679 1038 135 1315 2156 1284 -301 360 1260 364 -440 689 1469 656 -386 125 905 239 -591
2055 -591 1 598 10 -186 921 1626 876 -134 607 927 -125 -1126 -735 246 -417 -1037 -253 794
2073 794 54 -750 -104 255 -542 -1163 -411 300 -223 -589 89 653 -646 -1300 -503 -417 -1380 -1691 -631 -360
$$ packed form
1945A997j21j488J71Q07n60j806o5J756O4r45O71J186j25j410L7J592n98j313
1963a50K74Q45l86p90L34J090n08j748J86Q80m85j439R50J608j65j225M79J436
1981A186n12j106j05O58j002j062L80J470k63j357O09J143n21j306L81J240p72
1998i39m67N80J139l10n63Q09P24j045j726N48P43m16r68N62J525m92m75R77P72
2017I78p72j057M99Q83pr69R60M16q1j021P63N57j063o42j1J058m52o71J075J236
2037A679o41r03J180Q41q72j585O61R00q96q04J129P80q13j042N11P80o66q30
2055e91N92N97n88j96J107P05p50j010P41L20j052j001L91R81o63o20P84J047
2073G94p40q04O46L59p97o21P52P11n23l66O78N64j299o54P97Q6r63l11J060K71
$$ plain form
2093 -360 -893 -1024 173 922 -200 -1042 41 350 -660 -1060 -242 368 -485 -972 -199 593 -150 -914 -173
2112 -173 -259 -978 -946 399 886 332 277 925 1117 98 -303 493 804 -262 -829 235 731 -104 -93 1473
2132 1473 1613 -338 -495 574 1082 325 121 938 1053 235 385 1189 1161 -24 -717 81 169 -483 -399 815
2152 815 974 222 -117 852 1141 380 -97 246 393 -368 -631 741 781 -24 -731 -122 146 -612 -769 -210
2172 -210 -177 -953 -481 492 756 233 -248 333 69 -757 -988 -20 -243 -1096 -887 57 452 -908 -963 51
2192 51 16 -777 -858 -17 6 -716 -974 544 450 -164 -464 -610 -427 -903 -510 146 -50 -775 -824 478 688
2213 688 -24 382 642 -173 -1013 -407 894 681 -177 -4 269 326 -154 208 858 430 -1050 -864 464
2232 464 912 274 224 836 572 -36 471 1012 530 -618 -393 432 312 -110 638 733 433 -639 -231 582
$$ packed form
2093c60n33j31J197P49j122q42J083L09j010m00Q18O10q53m87P73P92p43p64P41
2112a73q6p19L2J345M87n54n5O48J92j019m01P96L11j066n67J064M96q35J1J566
2132A473J40j951j57J069N08p57k04Q17J15q18J50Q04k8j185o93P98Q8o52Q4J214
2152H15J59p52l39R69K89p61m77L43J47p61k63J372M0q05p07O09K68p58j57N59
2172b10L3p76M72R73K64n23m81N81k64q26k31R68k23q53K09R44L95j360n5J014
2192E1l5p93q1Q41K3p22k58J518r4o14l00j46J83m76L93O56j96p25m9J302K10
2213F88p12M06K60q15q40O06J301k13q58J73K73N7m80L62O50m28j480J86J328
2232D64M48o38n0O12k64o08N07N41m82j148K25Q25j20m22P48R5l00j072M08Q13
$$ plain form
2252 582 505 -211 51 379 748 -204 566 938 461 -567 -649 276 -246 -718 -725 283 26 -107 -89 600 -105
2273 -105 -910 -301 324 -105 -890 -448 205 -49 -567 -70 371 -623 -1286 -753 -94 -501 -985 -289 121 -8
2293 -8 -516 32 917 88 -606 -923 -283 -630 -843 -70 423 -79 -629 -23 367 70 -604 -227 289 -187 -707
2314 -707 287 854 378 -196 16 495 -127 -850 -51 610 316 -272 -20 674 396 -26 469 463 175 -286 435
2335 435 678 283 -71 578 561 267 -168 -53 733 -52 -694 130 291 140 -267 822 860 29 -164 -23
2355 -23 586 140 -547 -175 459 -55 -318 -109 262 253 -334 -127 128 -582 -683 189 54 -29 -177 65 147 -268
2377 -268 -391 -183 96 -633 -756 -225 -14 -126 -570 259 626 -460 -737 -94 123 -329 -599 -29 201 -654
2397 -654 -310 227 670 -99 -468 -257 -235 -325 127 320 277 -353 -668 619 692 139 -114 118 -144 -325 -105
$$ packed form
2252E82p7p16K62L28L69r52P70L72m77j028q2R25n22m72pJ008k57j33J8O89p05
2273a05q05O09O25m29p85M42O53k54n18M97M41r94o63N33O59m07m84O96M10j29
2293hn08N48Q85q29o94l17O40l47k13P73M93n02n50O06L90k97o74L77N16m76n20
2314g07R94N67m76n74K12M79o22p23P99O61k94n88K52O94k78m22M95ok88m61P21
2335D35K43l95l54O49j7k94m35J15P86p85o42Q24J61j51m07J089L8q31j93J41
2355b3O09m46o87L72O34n14k63K09L71rn87K07K55p10j01Q72j35q3j48K42Q2m15
2377b68j23K08K79p29j23N31K11j12m44Q29L67j086k77O43K17m52k70N70K30q55
2397f54L44N37M43p69l69K11K2r0M52J93m3o30l15J287P3n53k53K32k62j81K20
$$ plain form
2418 -105 408 545 302 45 431 613 41 -229 270 501 121 -177 654 730 -74 151 769 595 -98 -156 152
2439 152 283 -209 -183 644 543 19 155 486 327 -247 -240 290 213 -259 -276 430 451 112 -380 -104 180 -150
2461 -150 -29 -7 -115 -320 -329 130 336 -503 -207 157 85 -583 -274 14 124 -446 -182 368 235 -300 -403
2482 -403 220 -212 -518 -342 318 96 -208 -205 226 175 -156 -173 -14 -450 -486 -360 423 3 -246 -103 440 -115
2504 -115 -257 -485 334 -116 -658 -316 817 202 -385 75 269 1 -258 -203 464 145 -545 57 737 296
2524 296 -143 -51 340 266 -47 -80 424 -218 -290 323 545 421 -276 379 404 87 -418 -56 224 163 -617 -112
2546 -112 345 232 -2 -179 126 -118 -398 6 587 160 -614 -255 264 308 -117 118 270 -192 -499 21
2566 21 294 -215 -296 -244 174 108 -335 170 315 -473 -734 -75 376 -126 -317 -57 396 -13 -259 298 142
$$ packed form
2418a05N13J37k43k57L86J82n72k70M99K31l80k98Q31P6q04K25O18j74o93n8L08
2439A52J31m92K6Q27j01n24J36L31j59n74PN30p7m72j7P06K1l39m92K76K84l30
2461a50J21K2j08k05rM59K06q39K96L64p2o68L09K88J10n70K64N50j33n35j03
2482d03O23m32l06J76O60k22l04LM31n1l31j7J59m36l6J26P83m20k49J43N43n55
2504a15j42k28Q19m50n42L42J133o15n87M60J94k68k59N5O67l19o90O02O80m41
2524B96m39R2L91p4l13l3N04o42p2O13K22j24o97O55K5l17n05L62K80o1p80N05
2546a12M57j13k34j77L05k44k80M04N81m27p74L59N19M4m25K35J52m62l07N20
2566B1K73n09q1N2M18o6m43N05J45p88k61O59M51n02j91K60M53m09k46N57j56
$$ plain form
2587 142 -176 -517 -80 266 -175 -407 90 180 -231 -264 171 260 -121 -732 39 387 -251 -25 492 272 86
2608 86 -254 258 557 -94 -457 175 93 -35 -97 485 467 -294 -344 -113 493 -130 -194 -96 41 78 -14 455 595
2631 595 -137 -541 313 509 -25 -270 335 246 -466 27 313 560 112 -205 -52 231 -296 -236 135 185 -437
2652 -437 -156 263 316 -15 -210 143 283 -14 -265 -87 -49 -436 -318 -1 339 -425 -383 120 252 -117 -242
2673 -242 141 145 -219 -206 -11 117 -113 -161 -94 -67 -245 -186 279 199 -194 -450 249 177 25 -95 73 -51 -499
2696 -499 -111 404 178 -132 -220 279 -109 -299 -365 -56 164 -187 330 230 163 -497 -111 192 -16 -304 -40
2717 -40 10 319 139 48 406 -40 -280 -537 84 211 -40 -261 -55 -70 92 46 447 370 -128 -276 238 573
2739 573 49 -107 228 -73 -148 79 269 191 -28 -132 60 -289 -261 280 415 369 -289 29 268 206 -44 249
$$ packed form
2587A42l18l41M37L46m41k32M97R0m11l3M35Q9l81o11P71L48o38K26N17k20j86
2608H6l40N12K99o51l63O32q2j28o2N82j8p61n0K31O06o23o4R8J37L7r2M69J40
2631E95p32m04Q54J96n34k45O05q9p12M93K86K47m48l17J53K83n27O0L71N0o22
2652d37K81M19N3l31j95L53J40k97k51J78L8l87J18L17L40p64M2N03J32l69j25
2673b42L83Ml64J3J95J28k30m8O7K7j78N9M65q0l93k56O99p2j52j20J68j24m48
2696d99L88N15k26l10q8M99l88j90o6L09K20l51N17j00o7o60L86L03k08k88K64
2717d0N0L09j80r1L58m46k40k57O21J27k51k21K06j5J62m6M01p7m98j48N14L35
2739E73n24j56L35l01p5K27J90p8k19j04J92l49K8N41J35m6o58L18K39o2k50K93
$$ plain form
2761 249 -77 192 -50 -52 342 -87 -538 178 473 505 -552 -74 153 -228 -175 -156 669 -31 -197 -123 107 -175
2783 -175 -203 -133 177 253 -253 54 259 220 -382 -214 33 57 -181 64 256 -144 -498 60 575 291 -533 -3
2805 -3 -112 -121 -182 266 399 52 -336 -229 465 324 -335 95 -375 62 -166 123 -90 -238 -360 -515 272 -177
2827 -177 136 -344 359 176 -500 -44 263 42 -19 -13 498 42 -20 -14 -44 -249 -60 110 261 -99 -258 14
2849 14 -76 347 -171 111 72 11 -139 -212 490 267 -421 83 552 122 -16 23 483 -105 -413 300 205 109 -469
2872 -469 -98 346 84 -449 206 408 46 -119 242 227 -14 -377 -28 -170 -40 -232 114 382 -243 -56
2892 -56 -13 465 121 34 131 42 -38 -29 78 -11 -232 -211 -164 -195 -345 -329 -73 -45 -308 -366 144 191 -201 -180 114 190
2918 190 98 -324 115 81 -379 -331 -55 139 -92 -164 227 -119 58 155 296 362 -2 -33 59 365 -151 -377 -49
$$ packed form
2761B49l26K69k42kL94m29m51P16K95L2j057M78K27l81N3J9Q25p00j66P4K30k82
2783a75k8P0L10P6n06L07K05l9o02J68K47K4k38K45J92m00l54N58N15k84q24N30
2805cj09ro1M48J33l47l88J07O94j41o59M30m70M37k28K89k13j48j22j55P87m49
2827a77L13m80P03j83o76M56L07k21o1ON11m56o2Ol0k05J89J70J51l60j59K72
2849A4r0M23n18K82l9o1j50p3P02k23o88N04M69m30j38L9M60n88l08P13r5r6n78
2872d69L71M44k62n33O55K02l62j65L61j5k41l63L49j42J30j92L46K68o25J87
2892e6M3M78l44q7R7q9q0RJ07q9k21K1M7l1j50J6K56K8k63n8N10M7l92K1K94P6
2918A90r2m22M39l4m60M8K76J94k31p2L91l46J77R7J41O6l64l1R2L06n16k26L28
$$ plain form
2941 -49 68 -307 -128 235 111 -317 -261 290 325 -209 86 -120 224 -81 326 194 243 -51 -447 247 -3
2962 -3 151 151 121 132 188 99 303 54 38 110 152 327 -162 -183 297 -39 -480 -88 117 173 139 -50 130 -112 -96
2987 -96 -64 -49 -230 -271 -35 100 326 310 -225 66 173 -162 77 -199 -56 -387 -219 -23 -63 -300 69 101
3009 101 -55 -229 -109 318 -162 -397 -221 82 296 -144 -250 251 181 -237 -163 -98 -138 -65 187 307 33 241
3031 241 -12 201 -106 -37 -34 31 166 -398 56 -12 78 -112 144 85 24 -110 7 246 -65 45 222 415 -73
3054 -73 20 162 122 -331 70 -169 213 177 30 -283 167 -24 -160 45 453 99 -477 60 119 364 212 130
3076 130 -33 -65 88 160 45 65 -322 -37 86 -34 175 52 463 148 59 -165 -136 -127 -194 -364 95 -5 -266
3099 -266 -17 -167 12 -211 -94 4 -162 13 73 152 -51 -123 528 17 -144 -53 -205 45 -193 -227 -302 61
$$ packed form
2941d9J17l75J79L63j24m28N6N51L5n34K95k06L44l05M07j32M9k94l96O94k50
2962cJ54%l0J1N6q9K04k49j6P2M2J75m89k1M80l36m41L92K05N6l4j89J80k42J6
2987i6L2J5j81m1K36J35K26j6n35K91J07l35K39k76J43l31J68J96m0k37L69L2
3009A01j56j74J20M27m80k35J76L03K14m40j06N01p0m18P4O5m0P3K52J20k74K08
3031B41k53K13l07O9LO5J35n64M54o8R0j90K56n9o1j34J17K39l11J10J77J93m88
3054g3R3J42m0m53M01k39L82l6j47l13M50j91j36K05M08l54n76N37N9K45j52q2
3076A30j63l2J53P2j15K0l87K85J23j20K09j23M11l15q9k24K9Ro7j70M59j00k61
3099b66K49j50J79k23J17R8j66J75O0P9k03p2O51n11j61R1j52K50k38l4p5L63
$$ plain form
3121 61 -68 -30 55 117 -161 -216 123 83 60 226 85 83 115 -287 -56 366 -549 -380 73 20 163 74 233 77
3145 77 -81 -205 467 209 286 -217 -105 -1 -142 -136 -78 545 -138 -329 -156 -38 -59 -375 -4 268 -133 -156
3167 -156 232 136 146 -110 121 133 -170 -5 -73 7 -180 -167 299 166 -440 -246 -45 268 -52 -155 -41 52
3189 52 167 25 150 -118 -18 -4 -92 -6 -341 -183 -58 -73 -60 -163 -42 141 228 -62 -161 7 -193 68 -21
3212 -21 166 -404 -72 208 -250 -139 -7 -147 -19 -68 -136 333 57 65 1 141 214 83 -272 -158 -219 -129 -202
3235 -202 149 162 246 9 144 213 33 -185 327 -80 -339 414 536 59 -111 -50 -49 439 -31 184 -141 95
3257 95 -175 5 110 26 207 13 317 89 -167 15 247 -109 -186 -86 191 -12 52 309 21 85 -106 78
3279 78 360 401 -126 249 196 43 374 145 145 164 -148 -96 93 33 -419 83 -90 -165 -54 -22 287 168 -310
$$ packed form
3121F1j29L8Q5O2k78n5L39m0k3J66j41kL2m02K31M22r15J69M53n3J43q9J59j56
3145G7j58j24O72k58P7n03J12J04j41ON8O23o83j91J73J18k1l16L71K72m01k3
3167a56L88r6J0k56K31J2l03J65o8Q0j87J3M66j33o06J94K01L13l20j03J14R3
3189E2J15j42J25k68J00J4q8Q6l35J58J25j5J3j03J21J83Q7k90r9J68k00K61q9
3212b1J87n70L32K80m58J11J32j40J28m9o8M69k76Qo4J40P3j31l55J14o1R0p3
3235b02L51J3Q4k37J35O9j80k18N12m07k59P53J22m77j70O1JM88m70K15l25K36
3257I5k70J80J05q4J81j94L04k28k56J82K32l56p7J00K77k03O4K57k88O4j91J84
3279G8K82M1n27L75n3j53L31k29%J9l12N2J89o0m52N02j73p5J11L2L09j19m78
$$ plain form
3302 -310 -36 161 304 -90 87 96 167 -1 29 172 24 -426 30 -93 6 -80 -146 -43 34 -42 173 170 -265 -79
3326 -79 -26 176 -6 -29 7 207 -50 -52 -139 -17 -264 -77 -243 343 -86 -39 33 130 155 170 350 331 -25 -131
3350 -131 -306 262 159 -1 148 191 -49 -73 140 119 71 -209 126 326 1 285 249 445 99 31 260 261 5
3373 5 -5 -26 239 177 16 476 -81 255 102 263 102 41 -24 -128 240 -88 -30 271 -33 52 -137 -162 -198 -92
3397 -92 -307 -89 -5 -134 48 -305 232 -43 -216 -3 -51 -88 -252 -350 -4 -335 -233 128 -28 -225 -226 -316 202
3420 202 -159 209 144 43 -386 89 -74 229 -241 -331 -84 -170 45 42 159 72 9 -82 63 262 76 30 154
3443 154 168 119 55 94 150 -38 -137 32 217 -367 -355 -175 76 188 58 135 392 144 209 461 348 415 37
3466 37 135 276 -316 -120 276 220 -82 -25 -316 -167 -300 142 -167 -17 99 -106 -66 189 -193 -127 -210 -54
$$ packed form
3302c10K74J97J43l94J77RP1j68L0J43j48m50M56j23R9q6o6J03P7p6K15lm35J86
3326g9N3K02j82k3L6K00k57kq7J22k47J87j66N86m29M7P2R7K5J5J80j9l56j06
3350a31j75N68j03j60J49M3k40k4K13k1m8k80L35K00l25K84l6J96l46o8K29Jk56
3373Ej0k1K65o2j61M60n57L36j53J61j61o1o5j04L68l28N8L01l04Q5j89k5l6J06
3397i2k15K18Q4j29J82l53N37k75j73K13m8l7j64r8L46l31J02L61j56j97jr0N18
3420B02l61L68o5j01m29M75j63L03m70r0K47q6K15lJ17q7o3r1J45J99j86m6J24
3443A54J4m9o4L9N6j88r9J69J85n84J2J80K51J12j30P7K57k48O5K52j13O7l78
3466C7R8J41n92J96L96n6l02N7k91J49j33M42l09J50J16k05M0K55l82O6q3J56
$$ plain form
3488 -54 -309 -99 -159 -277 -317 -256 132 -270 -163 -410 -378 -233 -105 64 -46 141 -186 -31 -46 -300 -64 -206
3510 -206 93 -288 -173 -215 -247 -162 -73 196 312 145 21 -214 297 41 45 -12 -3 318 -164 -53 133 151 26
3533 26 -168 32 51 57 368 542 -116 154 104 152 147 22 220 191 -27 -157 262 394 440 74 470 -7 -119
3556 -119 257 65 38 403 220 -50 71 -28 236 55 261 29 -254 110 74 -236 -10 -44 -13 367 309 20
3578 20 357 -275 -188 39 26 -131 -93 35 -74 139 -100 88 -287 -168 -319 78 216 -145 5 115 278
3599 278 -149 -11 65 81 28 16 -224 4 -181 -72 132 121 104 121 142 116 -212 17 25 15 135 -125 21 -47
3623 -47 -51 303 102 223 110 11 42 192 107 211 206 514 191 74 310 340 113 -195 346 321 133 11 -83 152
3647 152 65 -86 65 158 -110 -282 -266 327 217 -125 176 -55 46 219 89 218 43 -47 -260 -77 -313
$$ packed form
3488e4k55K10o0j18m0O1L88m02J07k47L2J45J28J69j10J87l27J55j5k54K36j42
3510b06K99l81J15m2l2Q5Q9K69J16j67j24k35N11k56Mn7RL21m82J11J86J8j25
3533B6j94K00J9OL11J74o58K70n0M8nj25J98k9k18j30M19J32M6l66L96m77j12
3556a19L76j92k7L65j83k70J21r9K64j81K06k32k83L64l6l10K26l4L1L80n8k89
3578B0L37o32Q7K27j3j57L8J28j09K13k39J88l75J19j51L97J38l61J50J10J63
3599B78m27J38P6J6n3j2k40K28j85J09K04j1j7J7K1k6l28K29Qj0J20k60J46o8
3623d7mL54k01J21j13r9L1J50q5J04nL08l23j17K36L0k27l08N41k5j88j22r4K35
3647A52q7j51J51R3k68j72J6N93j10l42L01k31J01J73j30J29j75r0k13J83k36
$$ plain form
3668 -313 -72 298 -182 -103 -230 -116 10 -343 -253 85 40 -3 -79 77 -75 -180 -297 -147 3 5 -222 -184 7
3691 7 118 59 204 -24 -409 -82 -153 -136 248 63 -132 -129 76 -163 161 -310 -56 -424 -128 110 -86 -75 234
3714 234 -168 -153 -114 100 -1 -267 -180 127 93 82 -107 -163 -159 -123 2 -84 121 -24 151 257 -42 182 344
3737 344 312 -264 -46 -91 -293 17 -499 -256 -74 28 -65 22 -86 119 -68 -271 297 306 -96 -132 -58 13 -108
3760 -108 -72 76 -22 -321 -98 -97 -223 -8 125 15 43 54 -106 -56 -28 122 -146 -264 -149 -228 -135 -256 115
3783 115 -58 -16 63 131 84 -121 -125 185 -162 82 298 -294 -128 168 -80 -9 -286 123 72 -91 -139 -65 10 175
3807 175 30 111 -156 -9 -9 -101 -58 -120 -89 -23 134 -82 -160 166 98 246 223 110 148 -57 0 -173 78 -115
3831 -115 -62 90 125 127 205 -222 59 -419 95 -37 92 51 -50 13 -173 -107 -81 64 -132 -98 45 144 62 -28
$$ packed form
3668c13K41L70m80P9j27J14J26l53R0L38m5m3p6J56j52j05j17J50J50Kk27L8J91
3691GJ11n9J45k28l85L27p1J7L84j85j95LK05k39L24m71K54l68K96K38j96J1L09
3714B34m02J5L9K14j01k66Q7L07l4j1j89n6ML6J25q6K05j45J75J06k99K24J62
3737C44l2n76K18m5k02L10n16K43J82J02r3Q7j08K05j87k03N68Rm02l6P4P1j21
3760a08L6J48r8k99K23Jj26K15J33j10K8J1j60N0K8J50k68j18J15p9R3j21L71
3783A15j73M2P9O8m7k05mL10l47K44K16n92J66K96k48P1k77M09n1j63m8P4P5J65
3807A75j45Q1k67J47%r2M3o2L1O6J57k16p8L26o8J48k3j13L8k05N7j73K51j93
3831a15N3J52L5KP8m27K81m78N14j32J29m1j01O3j86O6K6J45j96L4J43R9q2r0
$$ plain form
3855 -28 52 236 24 11 131 45 -33 -26 64 189 164 444 96 186 120 88 -116 26 284 235 -24 -95 51 70 112
3880 112 295 95 20 175 -8 -18 211 298 -26 358 -14 -70 -85 -67 195 -54 156 204 -129 -115 -41 42 -65
3903 -65 41 -34 49 -282 -46 -105 64 53 -166 -175 -324 229 15 125 124 -51 -98 326 0 42 256 -279 -192 73
3927 73 335 400 -58 238 163 177 -46 -1 -242 116 -14 -76 -147 15 -172 72 62 111 130 71 123 136 45 -122 69
3952 69 -103 104 118 17 -4 159 -58 195 6 -240 48 -274 174 129 192 185 -133 -105 44 107 -23 15 -184
3975 -184 108 -63 130 83 -106 226 -66 12 -145 -71 -55 -231 -146 -125 22 -92 -142 21 -87 -256 35 -70
3997 -70 -36 -314 -152 -208 -343 -15 4 47 -402 -91 -97 -258 -352 -385 10 -105 257 -97 -30 -18 -193 -159 -161 -32 41
4022 41 -240 -10 123 -3 -42 -96 -5 -80 -99 -201 89 -21 117 -229 -206 56 244 -34 205 -84 -96 108 19
$$ packed form
3855b8Q0J84k12j3J20q6p8PR0J25k5K80l48R0o6l2k04J42K58m9k59p1J46J9M2
3880A12J83k00p5J55j83j0K29Q7l24L84l72n6j5J8K62k49K10M8l33J4P4Q3j07
3903f5J06p5Q3l31K36n9J69j1k19rj49N53k14J10jj75m7M24l26M2K14n35Q7K65
3927G3K62O5m58K96p5J4k23M5k41L58j30o2p1J62j87K44j0M9J9n9N2J3r1j67J91
3952F9j72K07J4j01k1J63k17K53j89k46K88l22M48m5O3pl18K8J49O3j30L8j99
3975a84K92j71J93m7j89L32k92P8j57P4J6j76Q5K1J47j14n0J63j08j69K91j05
3997g0L4k78J62n6j35L28J9M3m49L11oj61r4l3L95j15L62l54O7J2j75L4kJ29P3
4022D1k81K30J33j26l9n4R1p5j9j02K90j10J38l46K3K62J88k78K39k89j2K04q9
$$ plain form
4045 19 168 268 -130 133 -11 35 410 141 -297 97 -266 144 -93 227 -102 -227 5 -164 -132 -132 38 351
4067 351 -49 16 6 274 217 -383 222 -392 -142 -81 -111 -89 -12 -131 120 -132 -171 -292 106 20 -190 -101 -284
4090 -284 -61 242 -25 12 -6 -63 298 37 -275 -35 64 -24 -49 -457 -364 163 41 114 173 103 -198 86 180 134
4114 134 -96 -66 -169 181 38 118 311 24 -74 -330 -136 124 5 133 108 -43 76 151 143 201 50 -48 143
4137 143 164 -129 111 -115 -60 -58 14 9 276 189 -4 9 -64 268 -95 19 -190 124 -106 180 271 -170 69 -75
4161 -75 -66 -57 137 229 -23 224 -373 142 86 275 17 175 -255 76 -348 -155 -129 -12 -139 -164 -54 142 -280
4184 -280 -76 26 85 133 138 -191 17 -13 169 247 258 73 137 -205 -4 -384 45 -146 -115 94 53 -264 70
4207 70 46 -167 -39 -97 169 -294 -10 -84 216 230 -51 6 -72 -5 151 93 259 154 179 33 71 -292 25 36
$$ packed form
4045A9J49J00l98K63j44M6L75k69m38L94l63M10k37L20l29j25K32j69L2%J70L13
4067C51m00O5j0K68n7o00O05o14K50O1l0K2P7j19K51k52l9j21L98q6k10Q9j83
4090b84K23L03k67L7j8n7L61k61l12K40R9q8k5m08R3N27j22P3N9p0l01K84R4m6
4114A34k30L0j03L50j43Q0J93k87r8k56J94K60j19J28k5j51J19P5qN8j51r8J91
4137A43K1k93K40k26N5KP2nK67q7j93J3p3L32l63J14k09L14k30K86R1m41K39j44
4161g5RRJ94R2k52K47n97N15n6J89k58J58m30L31m24J93K6J17j27k5J10J96m22
4184b80K04J02N9M8Nl29K08l0J82P8J1j85O4l42K01l80M29j91L1K09m1l17L34
4207G0k4k13J28n8K66m63K84p4L00J4k81N7p8O7J56n8J66j05K5j46L8l63L17J1
$$ plain form
4231 36 -145 -319 46 -40 81 10 17 82 -78 67 -3 92 53 137 53 9 87 105 -108 259 290 65 144 154 167 16
4257 16 71 -24 136 216 88 62 137 -348 -139 -109 53 211 -44 168 -64 -107 150 -63 -149 -45 86 -77 114
4280 114 -96 192 -321 -221 -51 -177 -206 334 -153 131 153 -347 72 -194 -54 -69 -76 71 -46 160 -92 -101
4302 -101 -99 -115 173 -130 68 -172 89 -2 275 70 -113 -119 -149 128 -41 366 -95 -161 -140 -72 193 33 -32 85
4326 85 -373 -73 -78 48 12 59 57 -71 71 -113 80 32 -100 -99 -186 -61 -99 201 -13 -10 23 -61 -66 -143 -110 35 -156
4353 -156 130 -13 -92 68 46 -320 -5 -3 -253 -44 -132 -113 -115 201 134 -22 13 14 213 52 155 74 191 -347
4377 -347 -95 150 -3 -22 -120 223 38 -194 42 25 -341 101 29 66 216 17 89 -314 -77 306 37 117
4399 117 -163 -103 -123 -287 -54 167 148 64 -130 -101 195 74 -57 166 -65 -376 -40 126 155 136 -196 154
$$ packed form
4231C6j81j74L65q6J21p1PO5j60J45p0R5l9Q4q4m4P8J8k13L67L1k25P9J0J3j51
4257A6N5r5J60Q0j28k6P5m85K09L0J62J58k55K12k32m3K57k13q6J04J31j63J91
4280A14k10K88n13J00J70j26k9N40m87K84K2n00M19k66J40j5pJ47j17K06k52r
4302a01Kj6K88l03J98k40K61r1K77k05j83ol0K77j69M07m61o6K1O8K65j60o5J17
4326H5m58L00nJ26l6M7kj28J42j84J93m8j32Jq7J25l8L00k14LL3q4np7L3J45j91
4353a56K86j43p9J60k2l66L15Kk50K09q8J9kL16o7j56L5JJ99j61J03q1J17n38
4377c47K52K45j53j9r8L43j85k32K36j7l66M42p2L7J50j99P2m03K37L83k69Q0
4399A17k80O0k0j64K33K21j9q4j94K9K96j21j31K23k31l11L36J66K9j9l32L50
$$ plain form
4421 154 -159 128 -129 -109 99 70 380 -86 30 95 -14 8 -130 103 -60 10 -45 11 -163 -272 253 80
4443 80 -48 -531 29 26 235 147 155 182 -181 33 -68 26 -117 -278 35 41 -31 82 108 15 -26 -176 -35 -7 -105
4468 -105 -314 -105 241 -39 -132 -117 -46 46 173 134 192 4 172 97 101 -41 -59 112 184 160 -9 -34 97 4 -58
4493 -58 -201 -319 115 -159 66 13 -102 118 143 134 148 -275 -65 -20 -290 -20 75 -62 -2 -292 -29 280 -58
4516 -58 -371 263 -117 -111 -55 175 78 269 -14 -17 -142 77 -26 101 -21 -148 62 61 -74 63 -12 -23 -95 300
4540 300 7 160 134 -19 98 -115 136 -85 -10 -100 57 -19 -145 -29 -160 -86 80 117 221 160 373 28
4562 28 -323 -125 -18 -169 31 -38 -175 -196 -162 -46 -113 47 68 -50 -159 -57 -147 109 -246 -7 -82 -115 40
4585 40 -104 38 -42 253 104 133 60 -85 2 -218 165 -74 -251 -249 -43 182 131 82 127 -81 -39 -354 -115 -95
$$ packed form
4421A54l13K87k57K0K08k9L10m66J16O5j09K2j38K33j63P0n5N6j74j09N25j73
4443H0j28m83N60lK09q8QK7l63K14j01R4j43j61L13Op2J13K6r3m1j50J41K8r8
4468a05k09K09L46k80r3J5P1R2J27l9N8j88J68p5Mj42j8J71P2k4j69k5J31r3o2
4493e8j43j18M34k74K25n3j15K20K5rJ4m23K10M5k70K70R5j37O0k90K63L09l38
4516e8l13O34l80ON6K30r7J91k83lj25K19j03J27j22j27K10jj35J37p5j1p2L95
4540C00k93J53k6j53J17k13K51k21P5r0J57p6j26J16j31P4J66L7J04o1K13l45
4562B8l51J98J07j51K00o9j37k1L4J16o7J60K1j18j09J02r0K56l55K39p5l3J55
4585D0j44J42q0K95j49K9p3j45Q7k20L83k39j77KK06K25n1m9M5k08M2l15K39K0
$$ plain form
4609 -95 -116 6 86 -218 -42 124 177 -78 -284 111 -85 -27 -47 -23 40 -52 -169 68 80 -105 167 111 71 227
4633 227 117 -38 -292 43 -116 101 -26 45 351 116 -184 -193 116 133 -140 -303 -48 -353 177 -66 -168
4654 -168 -131 -57 -100 -288 7 236 -208 58 -29 -176 -90 187 -440 211 127 -49 279 -34 20 45 91 306 -7
4677 -7 -14 146 203 -4 63 226 -28 -299 -245 -109 -93 47 75 -19 89 125 99 206 244 194 -20 -88 -303 -216 127
4702 127 283 -150 62 218 260 220 -81 -80 33 -200 81 -216 182 239 -253 -75 -188 341 -194 10 -173 -214
4724 -214 172 14 -30 -177 33 -29 0 101 20 -186 -93 11 258 -155 -68 -85 12 -5 28 -118 7 -88 -108 -101 128
4749 128 272 -226 -292 177 200 177 -9 215 181 -29 -123 -167 92 -157 220 271 29 -285 218 12 -98 74
4771 74 279 22 56 48 103 122 79 -242 -112 166 -44 -17 94 225 428 -78 -98 103 17 95 46 7 11 334 -322
$$ packed form
4609i5k1J22Q0l04J76J66N3k55k06L95j96N8k0K4O3r2j17K37J2j85K72n6m0J56
4633B27j10j55k54L35j59K17j27P1L06k35l00rL09J7k73j63K55l05N30k43j02
4654a68L7P4m3j88K95K29m44K66q7j47Q6K77o27O51q4j76L28l13N4K5M6K15l13
4677gpJ60N7k07O7J63k54k71N4J36J6J40K8r4J08L6k6J07L8n0k14o8k15Q7L43
4702A27J56m33K12J56M2m0l01JJ13k33K81k97L98N7m92J78j13N29n35K04j83m1
4724b14L86j58m4j47K10o2K9J01q1k06R3J04K47m13Q7j7R7j7L3j46J25r5k0PK29
4749A28J44m98o6M69K3k3j86K24l4k10r4m4K59k49L77N1k42l14N03k06j10J72
4771G4K05k57L4qN5J9m3l21J30K78k10K7J11J31K03n06k0K01q6P8m9l9ML23o56
$$ plain form
4796 -322 -324 -86 -31 237 -187 -26 -84 -15 -174 -206 -251 -126 -74 193 -18 116 98 -251 -65 -279 146 120 44 61
4820 61 -17 -229 137 105 271 -215 -138 -50 267 125 -105 267 -45 -14 -162 -325 25 90 -248 -95 244 -98
4842 -98 182 296 -55 -309 -290 -6 -43 82 -1 241 267 -151 -93 92 -17 453 -340 302 14 283 152 -200
4864 -200 -173 -169 68 62 -333 -39 89 -140 25 106 81 -19 -118 165 73 -103 -245 41 -97 16 137 134 131 145 14
4889 14 -84 256 30 108 49 66 -114 -106 120 35 120 241 150 66 -232 -163 -291 17 -242 -217 91 -13 176 92 -88
4914 -88 -50 -78 -91 114 113 -65 36 90 5 191 36 -36 55 -57 -87 -56 -149 2 -7 -54 -16 -304 127 2 122 42
4940 42 237 -182 -196 -154 54 -86 -237 251 29 173 48 -106 80 187 27 -255 80 16 227 80 -111
4961 -111 -45 60 141 73 -127 3 161 -361 -34 -65 275 -34 69 -109 16 -129 264 34 -35 101 -12 74
$$ packed form
4796c22kK38N5K68m24J61n8O9j59l2m5J25N2K67k11J34j8l49J86k14M25k6p6J7
4820F1p8k12L66l2J66m86P7Q8L17j42k30L72l12L1j48j63L50O5l38J53L39l42
4842i8K80J14l51k54J9K84l7J25q3K42K6m18N8J85j09M70p93O42k88K69j31l52
4864b00K7MK37ol95K94J28k29J65Q1k5j00r9K83r2j76j42K86j38J13J21llJ4j31
4889A4r8L40k26P8n9J7j80QK26q5Q5J21r1q4k98O9j28L08k59K5L08j04J89q4j80
4914h8L8k8j3K05jj78J01N4q5J86j55p2R1j12l0L1r3J51rm7L8k88M31j25J20q0
4940D2J95m19j4M2K08j40j51M88k22J44j25j54J86J07j60k82L35o4K11j47j91
4961a11O6J05Q1o8k00J30J58n22L27l1L40l09J03j78J25j45L93k30o9J36j13Q6
$$ plain form
4983 74 -78 -110 -198 80 31 -39 135 -136 279 194 -204 103 4 -70 198 192 228 36 180 26 197 -240 -32 195
5007 195 91 243 -216 -91 -22 -13 185 83 125 226 -266 -20 -227 162 5 -95 -12 17 17 -118 -72 -3 -86 128
5031 128 17 -37 -161 279 348 -30 186 6 -85 -9 22 -122 254 56 -118 -75 102 -82 -193 93 20 -185
5053 -185 -141 -235 27 0 251 -73 -350 -263 -32 219 -34 -120 248 141 281 -19 -155 28 -268 -90 -159 9
5075 9 143 32 -24 -332 92 78 49 48 -183 29 -25 215 -103 162 44 -25 36 14 -77 -355 -107 -133 -259 3
5099 3 -333 -10 171 -142 47 213 152 78 -3 -97 244 208 -57 -61 157 -10 266 -254 -245 -36 27 36 11 -106 -62
5124 -62 260 123 -76 3 260 -1 -122 35 -87 112 164 -294 -66 -35 85 -150 -73 -6 50 33 -29 -41 151
5147 151 -21 -16 -28 -329 148 234 -11 161 92 -181 25 36 7 402 6 -20 -186 -282 -56 -297 5 204 139
$$ packed form
4983G4j52l2q8K78m9p0J74k71M15q5l98L07r9p4K68oL6j92J44j54J71m37K08K27
5007A95j04J52m59J25O9RJ98j02M2J01m92K46k07L89j57j00Q3K9%j35M6O9q3K14
5031A28j11n4j24M40O9l78K16j80r1P6L1j44L76j98j74M3J77j84j11K86p3k05
5053a85M4r4K62k7K51l24k77Q7K31K51k53q6L68j07J40l00j36J83k96J78o9J68
5075IJ34j11n6l08M24j4k9jk31K12n4K40l18K65j18o9O1k2r1k78K48k6j26K62
5099Cl36L23J81l13J89J66o1p4q1r4L41l6k65mK18j67K76n20RK09O3Rk5j17M4
5124f2L22j37j99P9K57k61j21J57j22J99N2m58K28L1J20k35P7O7N6j7o2j2J92
5147A51j72Nj2l01M77Q6k45J72o9k73K06J1k9L95l96k6j66r6K26k41L02J99o5
$$ plain form
5170 139 -105 72 95 170 -43 -93 87 -12 -34 40 -51 -108 -226 -86 16 -224 233 28 -19 363 70 239 114
5193 114 168 -49 61 7 -32 -220 -64 -188 277 182 -99 55 90 137 248 5 -83 -161 -136 27 400 169 199
5216 199 -154 56 -116 -52 90 -30 -185 -113 38 -45 58 -43 -16 -87 50 -85 251 134 -49 138 27 228
5238 228 -245 127 14 134 39 95 139 -4 207 161 2 -90 -193 216 -60 -62 -93 -3 -42 -20 -85 139 185 127 -74
5263 -74 63 -39 -218 -122 98 -169 -194 30 -135 181 -272 -37 177 -151 22 -7 12 -102 -101 -278 1 191
5285 191 -139 -172 -184 81 2 183 40 259 22 -61 141 50 -100 -210 -133 311 -46 -201 -137 185 267 245 28
5308 28 84 148 61 -59 371 92 -85 97 109 -41 -211 -29 17 -143 -134 152 -4 55 99 -198 225 -59 -555
5331 -555 229 -64 -78 336 47 36 73 -156 115 -105 349 155 -113 -49 -65 314 -89 -78 -173 66 -17 -168 98
$$ packed form
5170A39k44J77K3P5k13n0J80r9k2P4r1n7j18J40J02k40M57k05m7L82k93J69j25
5193A14N4k17J10n4l9j88J56j24M65r5k81J54L5M7J11k43q8p8K5J63L73k31L0
5216A99l53K10j72O4J42j20j55P2J51q3J03j01K7p1J37j35L36j17j83J87j11K01
5238B28m73L72j13J20r5N6M4j43K11m6j59r2j03M09k76kl1R0l9K2o5K24M6n8k01
5263g4J37j02j79R6K20k67k5K24j65L16m53K35K14l28J73k9J9j14Jj77K79J90
5285A91l30l3j2K65p9J81j43K19k37q3K02r1j50j10P7M44l57j55O4L22Q2k2k17
5308B8N6O4q7j20M30k79j77J82J2j50j70J82M6j60RK86j56N9M4k97M23k84m96
5331e55P84k93j4M14k89j1L7k29K71k20M54j94k68O4j6L79m03J1r5K39q3j51K66
$$ plain form
5354 98 -24 126 -215 155 251 -105 250 -167 -147 -157 -259 81 58 -5 400 -96 202 131 -130 -124 367 -199 -256
5377 -256 20 -73 -154 -283 -79 -54 27 -205 -200 14 -84 136 168 215 6 -71 -68 95 17 237 17 270 194 -139 27
5402 27 131 -1 168 255 88 -165 -193 -94 -73 -106 -224 181 55 6 -89 290 -90 64 -133 -30 267 133 5
5425 5 103 134 136 -236 144 164 74 190 31 70 -115 -303 -36 -14 28 138 62 175 26 -104 -43 -101 -221 -84 -253
5450 -253 -57 20 105 31 -102 5 20 162 72 -109 118 -176 247 124 113 -110 -324 -6 79 -21 106 -105
5472 -105 27 -10 -85 79 -155 97 76 -31 -2 47 192 -29 162 299 25 -134 75 -134 427 98 17 115
5494 115 49 41 -108 201 -235 -53 -80 -44 165 112 -85 -163 -109 -377 149 -205 -149 -22 -165 -41 -105 -38 -33 77
5518 77 -58 -3 108 40 -157 -40 83 31 -243 -378 157 45 14 -27 -121 -3 244 -124 9 -16 57 -106 -121
$$ packed form
5354I8j22J50l41L70R6l56L55m17K0j0j02L40k3o3M05m96K98p1k61OM91n66n7
5377b56K76r3q1j29K04K5Q1k32NK14r8K20L2M7k09p7LJ63p8K20k20K53p6l33J66
5402B7J04j32J69Q7j67k53k8R9K1l3j18M05j26m9r5L79l80J54j97J03K97j34j28
5425ER8L1Kl72L80K0r0J16j59L9j85j88K67K2M2J10p6J13j49j30O1n8j20J37j69
5450b53J96P7Q5p4j33J07J5J42r0j81K27k94M23j23j1k23k14L18Q5j00J27k11
5472a05J32l7p5J64k34K52k1j07K9M9J45k21J91J37k74j59K09k09N61l29q1R8
5494A15o6qj49L09m36J82k7L6K09n3j97p8N4k68N26l54N6J27j43J24o4O7NJ10
5518G7j35N5J11o8j97J17J23n2k74j35N35j12l1m1r4J18K47l68J33k5P3j63j5
$$ plain form
5541 -121 162 -275 9 40 -31 -43 151 -160 248 225 -151 137 -382 38 -37 27 18 126 -23 292 -218 -283 -229
5564 -229 32 -222 -202 -107 -19 -190 -36 -181 -176 -144 -148 65 35 97 175 -215 31 -13 -35 -27 -152 -209 -62 -40 -77 189
5590 189 -77 134 161 162 -220 10 185 208 1 89 32 137 44 -140 215 150 -82 58 -44 -156 -287 -189 -1
5613 -1 -253 176 60 -80 118 -98 -248 23 76 156 0 211 -157 -51 -30 79 -111 -60 16 -78 -239 -47 -123
5636 -123 94 109 205 9 -289 128 93 73 20 -210 -46 123 -56 72 -244 -177 -58 53 -45 -23 119 -83 -1
5659 -1 88 110 34 -189 -48 94 -1 35 115 -205 -137 5 -6 9 11 149 47 -190 250 95 380 40 -30 36 -310
5684 -310 -5 134 58 -276 -60 -51 -81 221 199 44 -53 -178 185 174 87 147 353 188 -120 49 149 52 -94
5707 -94 -133 144 -91 -25 41 -139 142 -338 102 140 -120 169 -53 -40 183 -117 -138 -42 158 44 -82 -58 130
$$ packed form
5541a21K83m37K84L1p1j2J94l11M08k3l76K88n19M20p5O4rJ08j49L15n10o5N4
5564b29K61k54K0R5Q8j71J54j45NL2mK13l0O2P8l90K46m4k2Qj25n7J47K2l7K66
5590A89k66K11K7Jl82K30J75K3k07Q8n7J05r3j84L55o5k32J40j02j12j31R8J88
5613ak52M29j16j40J98k16j50K71N3Q0j56K11l68J06K1J09j90N1P6r4j61J92p6
5636a23K17J5R6j96k98M17l5k0n3k30J64J69j79J28l16O7J19J11r8K2J42k02Q2
5659aQ9K2p6k23J41J42r5L6Q0l20O8J42j1J5KJ38j02k37M40j55K85l40p0O6l46
5684c10L05J39p6l34K16Rl0L02k2j55r7j25L63j1q7O0K06j65l08J69J00r7j46
5707i4l9K77k35O6O6j80K81m80M40L8k60K89k22J3K23l00k1R6K00j14j26K4J88
$$ plain form
5730 130 -122 55 -29 -8 -81 115 -106 -29 -218 128 61 177 -56 -112 210 12 -89 92 -64 196 -223 252
5752 252 365 152 -167 -213 -174 2 78 -94 -340 101 155 -129 20 0 -81 -80 -33 23 84 -87 -289 75 -64 -57
5776 -57 56 -125 -23 -273 -215 20 -59 60 70 54 160 -123 48 320 117 -219 -68 -89 -175 299 -296 -18
5798 -18 213 -13 66 -25 153 110 56 -319 -221 -20 -70 -13 171 -150 -99 -112 234 29 -114 -97 38 270 0 183
5822 183 -4 -109 146 247 57 -57 -70 -117 -21 83 142 20 138 32 109 -88 78 139 149 -135 19 -84
5844 -84 -28 155 -152 -99 92 187 -71 196 188 -276 -94 -153 95 214 166 -326 185 30 -98 184 93 111 -119
5867 -119 -218 0 -98 -208 -16 283 40 -114 -294 75 34 -306 65 126 -7 110 198 -398 -44 -23 91 93 -7
5890 -7 -355 -287 -82 -206 113 117 -107 79 11 -65 119 -267 82 50 -98 -122 -34 -72 -71 -73 57 11 -203 140 360
$$ packed form
5730A30k52J77q4K1p3J96k21P7j89L46o7J16k33n6L22j98j01J81j56K60m19M75
5752B52J13k13l19m6L9J76P6j72k46M41N4k84J49k0q1JM7N6O1j71k02L64j39P
5776e7J13j81J02k50N8K35p9J19J0j6J06k83J71K72k03l36J51k1q6M74n95K78
5798a8K31k26P9r1J78m3n4l75R8K01n0N7J84l21N1j3L46k05j43J7J35K32k70J83
5822A83j87j05K55J01j90j14j3m7R6J04N9j22J18j06P7j97J66O1J0k84J54j03
5844h4N6J83l07N3J91R5k58K67qm64J82n9K48J19m8m92N11j55j28K82r1J8k30
5867a19r9K18r8j10J92K99k43j54j80L69m1l40L71O1j33J17Q8n96L54K1J14Kj00
5890gl48O8K05j24L19Mk24J86o8p6J84l86L49l2j48k4Q8l8JkJ30m6k14L43K20
$$ plain form
5915 360 -35 9 43 227 -204 -82 -58 85 40 11 85 -77 -37 -182 -231 76 84 95 -24 -135 -60 16 213 -181
5939 -181 -165 148 -88 -111 -151 163 303 194 39 14 154 -41 133 71 -296 169 -140 -251 -113 173 -105 -144
5961 -144 -66 -205 -17 -37 -158 -205 -13 29 -123 -364 -268 33 77 -216 16 51 109 122 77 -29 77 -134 13
5984 13 -16 -127 -223 -86 239 165 70 99 114 -143 -154 105 -60 -203 -118 294 -86 -63 -138 -62 86 -149 260 -94
6008 -94 -129 110 -210 -256 212 32 24 -144 -69 -211 -82 77 284 187 -61 -182 -7 248 55 -58 35 41 39 -107
6032 -107 -140 280 31 170 -232 262 94 43 -59 -28 -24 85 -156 146 -46 69 194 -12 -239 -221 -108 128
6054 128 85 207 151 253 -14 201 130 -88 -42 -123 -76 189 90 -19 67 -337 -11 192 -67 -315 -352 -60 261
6077 261 81 9 -8 52 131 -34 86 -50 -181 103 -207 89 -149 -34 -44 -89 42 -396 -76 -301 5 188
$$ packed form
5915C60l95M4L4J84m31J22K4J43m5k9P4j62M0j45m9L07QJ1j19j11P5P6J97l94
5939a81J6L13k36k3m0L14J40j09j55k5J40j95J74o2l67M65l09j11J38K86k78l9
5961a44P8j39J88k0j21m7J92M2j52k41R6L01M4k93K32L5N8J3m5j06J06k11J47
5984A3k9j11r6J37L25p4r5K9J5k57j1K59j65j43Q5M12l80K3p5P6J48k35M09l54
6008i4l5K39l20m6M68j80qj68P5j42J29J59K07r7k48j21J75K55j93j13R3Okj46
6032a07l3M20k49J39m02M94j68n1j02L1MJ09k41L02j92J15J25k06k27J8J13K36
6054A28m3J22n6J02k67K15p1k18M6q1M7K65r9j09Q6m04L26K03k59k48l7K92L21
6077B61j80p2j7O0P9j65J20j36j31K84l10K96k38J15j0m5J31m38L20k25L06J83
$$ plain form
6099 188 125 8 -142 -87 -81 -43 -96 -98 -219 116 193 -163 147 -141 55 -193 57 6 -35 148 -50 102 -58 145
6123 145 175 -68 -205 -16 146 -149 -90 81 192 252 -76 -147 -35 16 139 -121 86 76 207 282 237 -45 33
6146 33 46 -10 152 242 97 -141 232 -141 -248 1 43 -63 -152 9 11 68 -323 -156 -94 115 306 -173 146
6169 146 30 42 -16 -315 29 38 -210 -137 -238 -337 17 -158 59 297 450 -21 -392 177 -90 82 8 -32 191
6192 191 114 103 18 -65 82 29 130 249 -205 167 -111 -35 -139 111 -227 -14 -196 99 -64 -222 -5 -208
6214 -208 -71 40 23 -19 388 18 187 -322 192 -70 -227 4 -188 -45 -128 77 89 154 77 239 -143 41
6236 41 195 5 -188 191 207 -103 -117 69 172 92 -39 -124 172 -121 55 -98 -104 70 -73 -124 169 -313 47
6259 47 -119 0 -148 451 -35 136 -110 -102 40 -8 -168 -19 -28 7 19 -405 -69 -105 11 -47 115 -126 -329
$$ packed form
6099A88o3j17j50N5OL8n3kj21L35P7l56L10k88J96k48K50n1m1J83j98J52j60K03
6123A45L0k43j37J89J62k95N9J71J11O0l28p1J12N1J23k60K07j0J31P5m5k82P8
6146C3J3n6J62R0j45k38L73l73j07K49M2j06q9J61KN7l91J67O2K09J91m79L19
6169A46j16J2n8k99L44Rk48P3j01r9L54j75K17K38J53m71l71N69k67J72p4m0K23
6192A91p7j1q5q3J47n3J01J19m54L72k78P6j04K50l38K13j82K95j63j58K17k03
6214b08J37J11j7m2M07l70J69n09N14k62j57K31j92J43q3K05J2O5p7J62l82J84
6236D1J54j90j93L79J6l10j4J86J03q0j31q5K96k93J76j53oJ74j43n1K93m82L60
6259D7j66J19j48N99m86J71k46QJ42m8j60J49rL5J2m24L36l6J16n8J62k41k03
$$ plain form
6282 -329 311 95 303 176 -159 103 158 -114 -147 87 14 -3 -55 -278 32 -33 194 -14 -110 -45 -1 -23 -152
6305 -152 -9 -35 74 6 -44 322 -33 -24 55 -71 108 -171 -18 -129 119 40 -138 48 26 -246 -89 239 10
6328 10 77 -69 99 132 6 -221 -148 63 -257 -20 168 80 -211 47 78 -167 202 -42 -129 -133 142 64 -128
6351 -128 -164 -91 93 316 -115 160 -58 -26 40 -125 109 -45 -53 -103 122 -126 301 -45 -133 -149 -337 -90 175
6374 175 106 63 148 -290 20 -182 72 112 126 -203 134 -155 138 32 85 115 -175 -116 -92 -85 -138 108 36 186
6398 186 10 -88 -277 -144 47 -302 -80 84 188 211 214 116 358 159 66 -150 -42 115 -26 -144 -21 464
6420 464 -186 21 -140 -88 211 297 195 -4 226 -16 214 55 41 -52 -43 -86 -26 -112 -95 68 78 172 152 -36
6444 -36 -3 -72 181 -56 -199 52 -130 227 -93 177 -114 262 -35 136 30 2 113 64 256 -275 -15 2
$$ packed form
6282c29O40k16K08j27l35K62N5k72l3K34p3j7n2k23L10o5K27k08r6O5M4k2j29
6305a52J43k6J09o8n0L66l55RP9j26J79k79J53j11K48p9j78J86k2k72J57L28k29
6328A0O7j46J68L3j26k27P3K11l20K37J88q8k91K58L1k45L69k44q7mK75p8j92
6351a28l6P3J84K23m31K75k18L2O6j65K34j54qn0K25k48M27l46q8j6j88K47K65
6374A75o9m3Q5m38L10k02K54M0J4l29L37k89K93j06N3L0k90N9K4Pn3K46p2J50
6398A86j76r8j89J33J91l49K22J64J04K3Lr8K42j99r3k16J08J57j41j18J23M85
6420D64o50K07j61N2K99Q6j02j99K30k42K30j59j4r3Rm3O0q6J7J63J0R4k0j88
6444c6L3o9K53k37j43K51j82L57l20K70k91L76k97J71j06k8J11m9J92n31K60J7
$$ plain form
6466 2 101 -12 -73 191 -390 -60 -189 -134 73 56 -141 138 37 -123 120 -29 -294 175 194 -39 47 109 -21
6489 -21 -108 10 -135 -54 -404 121 262 143 -30 -135 306 310 -126 45 -22 14 -45 268 -209 -37 -181 -162 81
6512 81 75 419 -161 -103 -98 -102 22 -68 301 -137 -57 12 -148 -85 100 -300 -124 -128 -49 -150 -490 -159 -12 190 117
6537 117 -152 -306 -254 187 254 -87 -208 27 73 107 195 1 261 -368 43 27 175 -22 -234 128 -180 -140
6559 -140 -45 -190 -1 -114 38 143 112 188 278 42 26 -103 50 208 180 59 78 26 72 -147 -109 150 36
6582 36 -109 40 147 84 156 -140 156 -283 18 -259 206 -4 -23 235 22 313 94 -314 -6 -64 8 -111
6604 -111 79 -63 77 -96 273 39 80 -288 -224 96 228 60 -26 83 119 -120 -319 280 125 -133 -317
6625 -317 31 -4 139 102 91 63 -128 -111 192 102 -223 95 -34 67 5 147 -84 198 -113 100 -83 -67 21
$$ packed form
6466BR9j13o1K64n81L30j29N5K07j7j97K79j01j60K43j49k65M69J9k33Q6O2j30
6489b1q7J18j45Q1l50N25J41j19j73j05M41Mm36J71o7L6n9L13m77J72j44J9K43
6512H1oL44n80N8NmJ24r0L69m38Q0O9j60O3J85m00J76mP9j01l40L31J47K02p3
6537A17k69j54N2M41O7l41j21K35M6L4Q8j94K60o29M11j6J48j97k12L62l08M0
6559a40R5j45J89j13J52J05l1P6R0k36j6j29J53J58k8j21J9n2M6k19L8K59j14
6582C6j45J49J07o3P2k96K96m39L01k77M65k10j9K58k13K91k19m08L08n8P2j19
6604a11J90j42J40j73L69k34M1l68O4L20J32j68q6J09L6k39j99N99j55k58j84
6625c17L48l5J43l7j1k8j91J7L03r0l25L18j29J01o2J42k31K82l11K13j83J6Q8
$$ plain form
6648 21 -27 -58 -130 46 -46 -17 133 128 227 -48 300 260 125 -54 -228 -98 -162 15 41 -25 -165 -15 106 115 13
6673 13 112 84 -179 212 -119 57 -215 -19 99 70 34 -234 199 -127 -101 -114 -119 -18 111 -189 181 48 18
6696 18 -167 -363 226 2 -334 -70 116 -116 341 -68 333 66 110 -180 -189 -114 -169 254 -47 33 -164 91
6718 91 121 133 76 231 -45 67 187 32 47 73 16 182 -33 215 -126 97 -68 -93 194 81 3 -259 211
6741 211 138 -101 152 211 -126 99 126 333 -151 41 -74 -39 92 176 37 -68 -134 -450 51 327 28 -119
6763 -119 188 -342 -309 3 -2 11 -24 -290 -107 -285 6 -103 -27 -65 151 13 -82 26 63 130 -40 66 10 182
6787 182 -102 41 -261 -43 99 -376 -89 99 -244 -95 -346 151 196 73 -140 2 26 185 -53 -22 -154
6808 -154 86 140 -2 -55 12 128 -41 -139 33 141 -16 -71 82 48 276 266 -6 -391 -16 103 49 238 199
$$ packed form
6648B1m8l1p2J76r2K9J50nR9k75L48m0j35j79j74J30o4J77K6o6j40J50J21Rj02
6673A3R9k8k63L91l31J76k72J96J18k9l6k68M33l26K6j3nJ01J29l00L70j33l0
6696A8j85j96N89k24l36K64J86k32M57m09M01k67M4k90rP5n5M23l01Q0j97K55
6718I1L0J2n7J55k76J12J20j55J5K6n7J66k15K48l41K23j65k5K87j13p8k62M70
6741B11p3k39K53N9l37K25K7K07m84J92j15L5J31Q4j39j05o6l16N01K76k99j47
6763a19L07n30L3L12nJ3l5k66J83j78K91j09P6l8K16j38r5J08L7O7j70J06n6J72
6787A82k84J43l02K18J42m75K87J88l43J49k51M97M5j23k13J42K4J59k38L1j32
6808a54K40N4j42n3O7J16j69r8J72J08j57n5J53l4K28j0k72l85L75J19n4J89l9
$$ plain form
6831 199 -84 -140 0 -47 142 57 -110 -38 -244 153 -21 126 55 -82 -78 -141 -74 105 340 95 -175 90 243
6854 243 -225 150 -55 108 -104 252 -60 482 -172 182 -59 54 315 -178 10 212 245 -76 52 163
6874 163 -17 -256 -176 -27 239 -222 -17 16 271 25 72 87 -41 -143 155 46 -34 -198 -149 246 -15 -124
6896 -124 -31 -89 -94 -69 122 33 -166 111 214 15 -120 -45 80 -225 69 -19 -37 -70 256 307 70 -231 49 447
6920 447 61 -293 -167 -50 -123 37 438 64 -32 -225 -22 -69 -32 2 103 -59 68 -70 175 378 36 -61
6942 -61 345 -124 -148 50 -242 -19 -7 120 -6 81 -330 -330 -52 224 -27 -198 297 98 -58 -215 70 -140
6964 -140 -141 -253 -20 67 21 215 121 -22 9 -129 55 -218 141 -148 157 438 54 -12 161 24 35 -118 -112
6987 -112 67 -120 -42 -30 221 -202 224 -149 -531 -175 22 169 -224 -281 177 44 43 31 -54 96 -183 -167 -19
$$ packed form
6831A99k83n6J40m7J89q5j67P2k06L97j74J47p1j37Mo3O7J79K35k45k70K65J53
6854B43m68L75k05J63k12L56l12N42o54L54k41J13K61m93J88K02L3l21J28J11
6874A63j80k39Q0J49K66m61K05L3K55k46M7J5j28j02K98j09q0j64M9L95k61j09
6896a24R3n8nK5J91q9j99K77J03j99j35P5J25l05K94q8j8l3L26N1k37l01K80L98
6920D47l86l54J26J17p3J60M01l74r6j93K03m7L7L4J01j62J27j38K45K03l42r7
6942f1M06m69k4J98k92K23J2J27j26Q7m11%K78K76k51j71M95j99j56j57K85k10
6964a40jj12K33Q7m6J94r4j43L1j38J84k73L59k89L05K81l84o6J73j37J1j53O
6987a12J79j87P8J2K51m23M26l73l82L56J97J47l93n7M58j33jj2q5J50k79J6J48
$$ plain form
7010 -19 123 92 58 -21 -37 27 162 21 165 28 -21 34 -180 121 134 -113 37 310 33 -6 -11 -172 -79 -90 -59
7035 -59 -81 174 -107 61 -102 172 32 -161 289 208 92 70 238 -92 50 110 -165 117 167 -169 16 -203
7057 -203 -88 40 -215 85 -100 52 13 -61 -404 -375 -41 132 -494 -413 18 -53 43 40 -139 -80 -79 96 -109 21
7081 21 13 -236 168 -101 -116 -252 -86 -42 -3 120 22 -3 -50 -99 132 -79 -39 48 -17 -120 -138 -43 95 -245 -127
7106 -127 27 13 67 2 -103 157 -195 69 -147 10 -134 -89 74 13 67 -233 -276 -119 35 73 265 123 -31
7129 -31 -13 -155 -54 48 -56 -42 -355 114 104 -316 70 -43 -231 -18 485 156 62 -48 24 -50 -110 250 48
7152 48 -185 174 52 142 212 -31 -147 -61 -137 -107 61 -182 30 134 259 -83 -44 9 233 67 -405 -83 -231
7175 -231 133 -13 288 153 -140 69 49 49 75 72 -2 -221 -9 -64 5 -226 -309 9 143 -109 -168 -93 -254 -53
$$ packed form
7010a9J42l1l4p9j6O4J35j41J44j37m9N5k14L01J3k47J50K73k77l9nj61R3j1L1
7035e9k2K55k81J68j63K74j40j93M50q1j16k2J68l30J42O0k75K82N0l36J85k19
7057b03J15J28k55L00j85J52l9p4l43K9L34J73o26Q1M31p1R6lj79N9JJ75k05J30
7081B1qk49M04k69j5j36J66M4L9J23r8k5m7m9K31k11M0Q7o5j03j8R5J38l40J18
7106a27J54j4N4o5j05K60l52K64k16J57j44M5J63o1N4l00m3J57J54L8J92j42j54
7129c1J8j42J01J02j04J4l13M69j0m20L86j13j88K13N03l29r4j10P2p4o0L60k02
7152D8k33L59j22R0P0k43j16Q6p6L0J68k43K12J04J25l42L9N3K24j66m72L22j48
7175b31L64j46L01j35k93K09k0%K6lp4k19K12n5O9k31q3L18J34k52n9P5j61K01
$$ plain form
7199 -53 3 40 -134 5 50 213 -1 346 -272 -42 -129 37 -39 99 -35 -370 -58 -59 -72 -10 112 -83 -55 -92
7223 -92 182 -233 219 85 126 119 41 68 10 215 -148 -113 108 38 -238 -65 -32 -66 -53 -90 -305 95 -237 -173 150
7248 150 63 98 120 -68 16 -131 42 -49 -169 23 -75 -108 -62 226 -8 -292 -5 73 6 218 -156 -193 10 -34
7272 -34 -20 159 -39 171 -164 -212 -6 203 -49 41 -52 -197 142 78 25 -129 -276 173 24 -435 38 -53 200
7295 200 2 51 -157 201 10 -375 65 -149 174 -135 -32 -79 -75 182 -105 -54 -28 244 -164 291 8 -171
7317 -171 63 -302 33 -12 -32 76 -44 -313 156 -266 44 -220 214 -120 45 243 137 134 -162 -57 -231
7338 -231 127 144 152 69 82 -42 -292 -22 19 -59 -145 -7 -190 150 -239 167 28 85 -215 -89 233 74 -120
7361 -120 -19 43 117 -112 42 -164 -27 139 -32 73 49 253 -102 -26 -112 41 -20 80 -37 -72 -134 -195 -287
$$ packed form
7199e3N6L7j74J39M5J63k14L47o18K30q7J66p6J38j34l35L12jj3O2J22j95K8l7
7223i2K74m15M52j34M1pp8K7n8K05l63L5K21p0k76J73L3l4J3l7k15M00l32O4L23
7248A50q7L5K2j88Q4j47J73r1j20J92r8l3M6K88k34k84K87P8o7K12l74l7K03m4
7272c4J4J79j98K10l35m8K06K09k52R0r3j45L39o4n3j54j47M49j49m59M73r1K53
7295B00j98M9k08L58j91l85M40k14L23l09J03m7MK57k87N1K6K72m08M55k83j79
7317a71K34l65L35m5k0J08j20k69M69m22L10k64M34l34J65J98j06lk96J05j74
7338b31L58J7Qq3J3j24k50K70M1p8q6J38j83L40l89M06j39N7l00J26L22j59j94
7361a20J01O2P4k29J54k06J37J66j71J05k4K04l55P6q6J53o1J00j17l5o2o1r2
$$ plain form
7384 -287 -20 -84 -116 166 422 -111 -48 -115 67 111 0 -121 -75 47 -41 84 -85 208 139 205 236 233 -124 -226
7408 -226 187 148 142 220 -103 116 -73 -109 125 136 -217 -95 -122 -42 79 -254 200 -96 39 199 -381 -195 120
7431 120 221 25 29 69 -232 -4 295 75 72 -182 -6 42 -66 -120 14 -164 164 -122 124 -178 91 -110
7453 -110 51 245 -79 208 147 -55 -127 27 112 -242 116 112 367 -2 -49 156 32 -118 34 68 35 198 41
7476 41 61 -79 -313 -218 100 58 -112 -4 -34 20 120 -135 259 131 353 -192 -14 -63 -65 -227 -78 -11 116
7499 116 -100 94 209 -120 50 -52 -108 106 158 253 -132 117 -202 -48 -380 -206 -148 315 178 -162 94
7520 94 -141 2 -60 -50 52 36 -52 127 -12 54 -244 -101 60 -21 -253 76 236 124 -141 -50 8 49 -4 -84
7544 -84 -57 -27 79 86 -153 -112 -149 -17 -161 -131 -75 -151 -56 -46 -24 100 297 -113 71 -65 262 -45 -74 201 43
$$ packed form
7384b87K67o4l2K82K56n33O3o7J82M4j11j21M6J22q8J25j69K93o9O6L1ll57j02
7408b26M13l9oP8l23K19j89l6K34J1l53J22k7Q0J21l33M54k96J35J60n80J86L15
7431A20J01j96MM0l01K28K99k20lk54J76M8j08n4J34j78L28k86K46l02K69k01
7453a10J61J94l24K87o1k02p2J54Q5l54L58mK55l69m7K05j24j50J52L4l3J63j57
7476D1K0j40k34R5L18m2j70J08l0N4J00k55L94j28K22n45J78m9kj62J49O7J27
7499A16k16J94J15l29J70j02n6K14N2R5l85K49l19J54l32J74N8M63j37l40K56
7520I4k35J43o2J0J02j6q8J79j39O6k98J43J61q1k32L29J60j12k65R1N8M1n3q0
7544h4K7L0J06Pk39M1l7J32j44L0N6p6R5J0K2J24J97m10J84j36L27l07k9K75j58
$$ plain form
7569 43 70 -70 383 121 150 160 -164 -169 -4 0 -106 15 -22 -162 140 -97 -58 -183 43 -117 82 -58 151
7592 151 4 -181 46 49 -489 -305 -154 -27 187 -101 228 -33 -237 22 -157 251 10 211 122 127 62 20
7614 20 -4 -115 130 -33 75 -116 78 125 263 156 74 -139 31 -72 15 -25 -122 -164 -87 135 -261 222 23
7637 23 -13 69 127 -18 -38 20 162 -215 26 -175 -194 -209 -201 -22 -3 -13 89 -54 -132 164 47 -49 -149 -119 -295
7662 -295 -25 56 -127 124 -111 -169 58 -38 23 -179 -5 -67 -190 197 -152 60 98 -10 -186 -70 -260 -314
7684 -314 -92 -97 141 175 -33 -42 -196 129 -219 -68 139 -82 57 3 -24 87 170 -223 100 136 16 -66 13 -183
7708 -183 -31 -23 311 95 194 -38 173 130 -73 -56 19 76 -128 56 -74 45 216 -232 -130 -227 -186 -68 166
7731 166 64 -237 35 102 -198 -28 -50 438 -44 -71 121 -44 116 40 221 -30 -28 205 -98 14 26 30 249
$$ packed form
7569D3K7j40M53k62K9J0l24nJ65Mj06J21l7j40L02k37L9j25K26j60J99j40K09
7592A51j47j85K27Ln38J84J51J27K14k88L29k61k04K59j79M08k41K01q9No5m2
7614B0k4j11K45j63J08j91J94M7J38j07q2k13J70j03Q7m0r7m2P7K22l96M83j99
7637B3l6Q2N8j45k0N8J42l77K41k01j9j5QJ79J9j0J02j43p8K96j17r6j00L0j76
7662b95K70Q1j83K51k35n8K27r6O1k02J74o2j23L87l49K12L8j08j76J16j90n4
7684c14K22nK38L4k08rj54L25l48J51K07k21J39n4k7J11Q3l93L23L6j20q2P9j96
7708a83J52QL34k16R9k32K11m3k03J7P5N7k04J84j30J19J71m48J02r7M1J18K34
7731A66j02l01K72O7l00J70k2M88m82k7J92j65J60p6J81k51KK33l03J12J2MK19
$$ plain form
7754 249 -133 152 -64 -125 -91 -106 32 -250 281 325 -70 -157 -153 -139 -54 29 172 123 101 -239 -63 -6 72 -149 27
7779 27 38 -316 124 -5 -285 196 -135 -22 -131 -64 48 -288 235 148 -63 112 -186 -118 224 -58 -7 -86
7801 -86 -32 -99 -128 145 22 -94 91 73 116 39 -165 -139 -36 -121 -28 -39 -138 15 -33 377 -49 -83 -190 40 -228
7826 -228 265 -279 -45 55 59 77 -70 -114 -245 -147 226 -78 -225 -101 -135 35 35 68 -104 -50 -123 -21 73 -85
7850 -85 211 127 -101 -193 184 61 -72 -158 -160 222 56 -41 177 41 -52 39 73 83 81 18 77 36 -58 13 454 -107
7876 -107 390 -16 138 236 18 100 -188 -254 -18 31 -123 -23 154 469 66 126 -141 158 -128 -147 143 64
7898 64 -90 -89 135 -48 -48 39 313 -60 253 331 44 -78 54 -46 180 64 48 145 252 427 -208 -193 -111 -66
7922 -66 -461 48 79 -81 37 -94 12 187 -42 410 -67 21 42 -362 -359 -21 203 -73 -37 53 54 -139 -98 -193
$$ packed form
7754B49l82K85k16o1L4j5J38k82N31M4l95q7MJ4Q5Q3J43m9k2l40J76N7P8k21J76
7779B7J1l54M40j29k80M81l31J13j09O7J12l36N23q7k11J75k98O8L42k82N1p9
7801h6N4o7k9K73j23j16J85j8M3p7k04K6J03q5R3j1r9J53m8M10m26l4j07K30k68
7826b28M93n44K34J00MJ8j47m4j31R8L73l04j47J24l4J70%L3j72N4p3J02R4j58
7850h5K96q4k28r2L77j23j33q6kL82j66r7K18j36r3R1L4J0ko3N9m1r4P1M41n61
7876a07M97m06J54R8k18Q2k88o6K36M9j54J00J77L15m03O0k67K99k86j9K90p9
7898F4j54JK24j83%Q7K74l73L13P8k87j22J32j00K26j16j6R7J07J75o35J5Q2M5
7922f6l95N09L1j60J18j31J06J75k29M52m77Q8K1m04LL38K24k76L6R0Jj93M1r5
$$ plain form
7946 -193 -200 -86 -313 201 59 -240 269 -275 130 210 -133 -68 8 9 173 56 -97 -282 101 43 3 27 174
7969 174 -8 77 -69 -200 202 120 -71 -63 -92 -72 -174 61 -10 -27 273 119 -13 28 -111 -49 -229 9 118
7992 118 178 191 72 172 -124 71 -208 75 194 238 360 171 -71 -142 335 -305 118 -10 28 33 120 -165 171
8015 171 -245 -140 51 -99 -65 17 -53 -281 -170 -73 27 116 238 -82 146 156 -164 251 148 220 83 -199
8037 -199 154 -142 -136 170 -188 -24 -235 -2 -195 -131 75 141 77 -35 369 -209 -47 -7 -11 -163 -72 -82 239
8060 239 11 56 21 -269 87 6 -214 199 105 224 -145 25 27 88 -125 41 153 -175 146 208 -43 247 -89
8083 -89 230 32 66 294 138 -68 -149 -173 -169 -81 -115 57 -195 66 103 151 285 81 145 119 -168 75 150 -111
8107 -111 -74 -122 268 -260 -41 100 171 188 57 -101 59 -14 -22 196 387 41 -197 -55 263 180 -155 -87 207
$$ packed form
7946a93pJ14k27N14j42k99N09n44M05Q0l43O5P6JJ64j17j53j85L83n8m0K4J47
7969A74j82Q5j46j31M02q2j91Qk9K0j02K35p1j7L00j54j32M1j39O2j80K38J09
7992A18O0J3j19J00k96J95k79K83J19M4J22j89k42p1M77o40M23j28L8NQ7k85L36
8015A71m16J05J91j50L4Q2p0k28J11R7J00Q9J22l20K28J0l20M15j03P2j37k82
8037a99L53k96OL06l58J64k11K33j93O4K06O6o4j12M04n78J62M0mj52R1j0L21
8060B39k28M5l5k90L56q1k20M13r4J19l69J70KO1k13J66J12l28L21O2k51K90l36
8083h9L19j98L4K28j56k06q1k4MQ8l4J72k52K61L7M8J34k04O4k6k87K43P5k61
8107a11L7m8L90n28K19J41P1J7j31j58J60p3qK18J91l46k38J42L18q3l35O8K94
$$ plain form
8130 207 181 184 221 81 -282 -237 -164 26 -18 74 165 -93 -195 -133 192 -282 -298 36 99 47 85 159 -153 -122 250
8155 250 -152 258 -102 -25 -43 -266 -135 -155 -25 242 20 152 -150 -46 39 -83 -118 15 217 -51 122 -144
8177 -144 -121 -45 45 -177 59 -102 -29 156 -120 -93 -85 -145 262 158
$$ packed form
8130B07k6LL7j40l63M5P3J90m4R2R1k58j02O2L25m74j6L34O3n2L8P4l12L1L72
8155B50m02M10l60P7j8k23J31k0J30K67k22J32l02J04Q5j22l5J33K02k68J73k66
8177a44K3P6R0k22K36j61P3J85k76K7Qo0M07j04
8191A58
$$ Imaginary data points
##PAGE= N=2
##DATA TABLE= (X++(I..I)), XYDATA
$$ plain form
0 0 0 0 0 0 0 0 0 7 -7 8 -8 8 -8 16 -16 20 -24 26 -32 40 -47 52 -60 70 -80 92 -103 117 -132 149 -170 188
32 188 -212 236 -264 294 -326 362 -403 446 -493 546 -606 671 -743 825 -916 1023 -1145 1288
50 1288 -1460 1667 -1924 2253 -2693 3309 -4237 5794 -8881 17361 -88154 -279376 -35035
63 -35035 182548 97897 -62725 10581 115284 44343 -56191 878 47770 -52000 -151576
74 -151576 -105249 -52589 -101212 -135718 -62865 -9842 -52239 -82635 -28413 8164 -19731 -19280
86 -19280 36262 33361 -43144 -55572 31056 65294 -15011 -79263 -45296 -10192 -39213 -54984
98 -54984 -14059 7482 -16909 -10161 47855 75739 46314 30774 50309 55248 42231 45925 45197
111 45197 10736 -5318 41244 79393 33646 -24119 3210 63824 53571 6324 24373 83861
$$ packed form
0@%%%%%%%Pj4J5j6J6j6K4l2L6m4N0n8P2q7R9j12J30j50J72j95K20k49K81l19L58
32A88m00M48n00N58o20O88p65Q49r39J039j152J277j414J568j741J939k168K433
50A288k748L127l591M177m946O002p546J0031j4675K6242j05515j91222K44341
63c5035K17583q4651j60622P3306J04703p0941j00534N7069M6892r9770r9576
74a51576M6327N2660m8623l4506P2853N3023m2397l0396N4222L6577k7895M51
86a9280N5542k901p6505j2428Q6628L4238q0305o4252L3967L5104k9021j5771
98e4984M0925K1541k4391O748N8016K7884k9425j5540J9535M939j3017L694p28
111D5197l4461j6054M6562L8149m5747n7765K7329O0614j0253m7247J8049N9488
$$ plain form
123 83861 82819 33021 37978 99182 111040 49886 9114 29049 40489 9279 -11202 8657
135 8657 22137 8214 3014 16000 16137 12453 32602 47869 15841 -22094 -1197 44250 41110
148 41110 5707 -1732 3102 -25452 -50361 -23911 4214 -33121 -86529 -65251 3374 19760
160 19760 -17220 -25358 9741 20767 -6603 -18672 -3813 -6532 -27779 -24078 -3847 -16659 -48982
173 -48982 -39461 -1511 -3509 -41696 -45732 -11189 3416 -4762 10602 38170 30835 10180 27004
186 27004 53735 30569 -13122 -9292 20860 12330 -17885 -8713 23377 21357 2087 19588 50542
199 50542 38817 7814 19939 58538 59071 33070 35338 56386 46474 19230 22283 37608 15863
212 15863 -18246 -11013 15133 8075 -8345 16610 49237 32403 2101 21487 54770 35073
$$ packed form
123H3861j042m9798M957O1204J1858o1154m0772J9935J1440l1210k0481J9859
135H657J3480j3923n200J2986J37l684K0149J5267l2028l7935K0897M5447l140
148D1110l5403p439M834k8554k4909K6450K8125l7335n3408K1278O8625J6386
160A9760l6980q138L5099J1026k7370j2069J4859k719k1247L701K0231j2812l2323
173d8982R521L7950j998l8187m036L4543J4605q178J5364K7568p335k0655J6824
186B7004K6731k3166m3691L830L0152q530l0215R172L2090k020j9270J7501L0954
199E0542j1725l1003J2125L8599N33k6001K268K1048r912k7244L053J5325k1745
212A5863l4109P233K6146p058j6420K4955L2627j6834l0302J9386L3283j9697
$$ plain form
224 35073 -6050 441 28977 11730 -25367 -17827 11681 605 -35600 -37882 -20021 -27589 -41882
237 -41882 -21858 3415 -9381 -29977 -10096 21517 12906 -14834 -18297 -13618 -33410 -49292 -31233
250 -31233 -18060 -43937 -63761 -35333 -5302 -23696 -48716 -27248 2250 -11008 -32823 -12037
262 -12037 16324 4493 -14565 1694 17483 -8635 -37286 -23666 -3819 -21521 -42951 -26596
274 -26596 -3017 -7176 -8271 17921 30310 6198 -4958 24525 40942 11324 -11066 11598
286 11598 30560 7297 -12550 5973 18181 -8638 -29007 -6833 13878 -3767 -17973 7277
298 7277 34036 24614 9773 20551 28685 11962 -944 5941 2420 -23642 -31462 -7372 2484
311 2484 -19720 -33003 -15492 -3649 -17931 -22878 -3464 3136 -16834 -19696 9254 20989 -6086
$$ packed form
224C5073m1123O491K8536j7247l7097P540K9508j1076l6205k282J7861p568j4293
237d1882K0024K5273j2796k0596J9881L1613q611k7740l463M679j9792j5882J8059
250c1233J3173k5877j9824K8428L0031j8394k5020K1468K9498j3258k1815K0786
262a2037K8361j1831j9058J6259J5789k6118k8651J3620J9847j7702k1430J6355
274b6596K3579m159j095K6192J2389k4112j1156K9483J6417k9618k2390K2664
286A1598J8962k3263j9847J8523J2208k6819k0369K2174K0711j7645j4206K5250
298G277K6759r422j4841J0778Q134j6723j2906O885l521k6062p820K4090R856
311B484k2204j3283J7511J1843j4282m947J9414O600j9970k862K8950J1735k7075
$$ plain form
324 -6086 -26186 -10890 -1651 -27206 -48104 -36681 -25070 -36952 -41162 -20545 -8694 -21577 -22583
337 -22583 2068 10862 -10618 -20755 -2438 7145 -9141 -14773 1088 613 -22151 -26083 -4744
350 -4744 -4824 -31020 -34428 -3728 11591 -5968 -8567 18558 32583 17927 12932 27792 24542 -1831
364 -1831 -8055 14942 21373 -1965 -13227 2253 9875 -339 1636 17523 14687 -4731 -1008
377 -1008 26243 35651 20478 17731 30984 26778 4936 1900 16340 10087 -16070 -22492 -4533
390 -4533 -1131 -14292 -8147 16214 18521 -5354 -12121 8092 19332 8297 2264 7510 1403 -13166
404 -13166 -6947 11540 4638 -24983 -34899 -19396 -11768 -20165 -17593 -2397 -1345 -9905 910 20464
418 20464 15872 -4351 -2814 13661 6819 -15760 -15042 3806 3095 -13841 -11419 4113 -289 -15898
$$ packed form
324f086k0100J5296R239k5555k0898J1423J1611j1882m210K0617J1851j2883j006
337b2583K4651Q794k1480j0137J8317R583j6286n632J5861m75k2764l932K1339
350d744q0k6196l408L0700J5319j7559k599K7125J4025j4656m995J4860l250k6373
364a831o224K2997O431k3338j1262J5480P622j0214J975J5887k836j9418L723
377a008K7251R408j5173k747J3253m206k1842l036J4440o253k6157o422J7959
390d533L402j3161O145K4361K307k3875o767K0213J1240j1035o033N246o107j4569
404a3166O219J8487o902k9621r916J5503P628q397K572J5196J052q560J0815J9554
418B0464m592k0223J537J6475o842k2579P18J8848p11j6936K422J5532m402j5609
$$ plain form
432 -15898 -7479 15496 15331 -688 6267 30283 32226 15646 16176 29387 23923 6023 3836 10959
446 10959 2124 -9066 4437 23885 16630 -1291 5539 26271 27531 18497 23775 30157 16462
459 16462 4554 22420 42301 27944 -31 -1331 11700 4909 -10224 -4736 8984 1679 -13294
472 -13294 -4089 17170 19172 9347 12626 18609 6362 -9020 -3282 10383 4605 -11442 -14014 -11454
486 -11454 -18455 -20370 -5865 27 -19694 -34185 -16936 5803 2463 -8553 945 12876 1538
499 1538 -12816 -3516 7664 -6604 -25846 -21139 -7736 -14170 -24596 -13784 2459 -1787 -12194
512 -12194 -5096 6370 3805 887 11241 17393 6817 1243 13541 18833 2381 -8794 1517
525 1517 8614 -6193 -16178 -1308 12928 6232 1579 17694 28735 15687 3734 16936 31097
$$ packed form
432a5898Q419K2975j65j6019O955K4016J943j6580N30J3211n464j7900k187P123
446A0959q835j1190J3503J9448p255j7921O830K0732J260r034N278O382j3695
459A6462j1908J7866J9881j4357k7975j300J3031o791j5133N488J3720p305j4973
472a3294R205K1259K002r825L279N983j2247j5382N738J3665n778j6047k572K560
486a1454p001j915J4505N892j9721j4491J7249K2739l340j1016R498J1931j1338
499A538j4354R300J1180j4268j9242M707J3403o434j0426J0812J6243m246j0407
512a2194P098J1466k565k918J0354O152j0576n574J2298N292j6452j1175J0311
525A517P097j4807r985J4870J4236o696m653J6115J1041j3048j1953J3202J4161
$$ plain form
538 31097 20549 3891 5791 13528 6423 -868 5977 10322 -1923 -12332 -6102 1001 -1383 -14
552 -14 12570 13911 -454 -3703 14420 22714 5582 -9953 -5742 -3952 -18298 -23834 -8574 -878
566 -878 -17993 -31349 -19194 -4716 -9655 -16466 -8360 -3065 -13503 -18211 -4335 5359 -4523 -15995
580 -15995 -14862 -15084 -23285 -25337 -17080 -17160 -27838 -28389 -14249 -7184 -13259 -10272 3507 4327 -10741
595 -10741 -12384 4571 10291 -4812 -13604 -2372 3594 -7489 -13946 -4783 -1198 -11141 -13369 507
609 507 8474 1411 262 13654 21045 14747 12045 17309 13639 2381 2796 13680 10176 -6144 -7721
624 -7721 7167 10819 -1456 -3037 10029 14060 2418 441 13939 19952 10622 7838 16108 13500
638 13500 -1348 -5232 6104 6001 -10905 -20113 -11667 -4344 -7598 -6197 959 -1811 -10440 -5063
$$ packed form
538C1097j0548j6658J900P737p105p291O845M345j2245j0409O230P103k384J369
552a4J2584J341j4365l249J8123Q294j7132j5535M211J790j4346n536J5260P696
566h78j7115j3356J2155J4478m939o811Q106N295j0438m708J3876R694r882j1472
580a5995J133k22q201k052Q257q0j0678n51J4140P065o075K987J3779Q20j5068
595a0741j643J6955N720j5103q792J1232N966j1083o457R163L585r943k228J3876
609E07P967p063j149J3392P391o298k702N264l670j1258M15J0884l504j6320j577
624g721J4888L652j2275j581J3066M031j1642j977J3498O013r330k784Q270k608
638A3500j4848l884J1336j03j6906r208Q446P323l254J401P156k770q629N377
$$ plain form
652 -5063 8483 6675 -7708 -9135 1092 -424 -12598 -12911 -4425 -8694 -22647 -22273 -11920 -13112
666 -13112 -22786 -18209 -3199 -1260 -10817 -8888 4694 7658 -2010 -5295 -928 -3177 -10396 -8560
680 -8560 -1446 -5838 -15484 -10950 589 -675 -9700 -5904 6711 7413 445 5767 17924 16610 6427
695 6427 8381 18698 14719 950 -701 8123 7304 -1867 -790 8627 9267 3715 8608 18377 16957
710 16957 8875 11962 21756 19976 10662 10911 17107 12509 3134 4712 9710 2448 -7299 -2783 6667
725 6667 2710 -5349 1176 13584 10957 1735 5624 14768 9689 -2049 -743 5548 -482 -10920
739 -10920 -8597 -847 -5332 -14740 -12224 -4363 -6256 -10206 -5509 133 -2454 -4669 2783 8085 14
754 14 -7792 -2545 3215 -4703 -15520 -11582 -4243 -8478 -15193 -9108 654 -2100 -7990 -2092 7769
$$ packed form
652e063J3546j808j4383j427J0227j516j2174l13Q486m269j3953L74J0353j192
666a3112r674M577J5010J939r557J929J3582K964r668l285M367k249p219J836
680h560P114m392r646M534J1539j264r025L796J2615P02o968N322J2157j314j0183
695F427J954J0317l979j3769j651Q824q19r171J077R417O40n552M893R769j420
710A6957q082L087R794j780r314K49O196m598r375J578M998p262r747M516R450
725F667l957q059O525J2408k627r222L889R144n079j1738J306O291o030j0438
739a0920K323P750m485r408K516P861j893l950M697N642k587k215P452N302q071
754A4p806N247N760p918j0817L938P339m235o715O085R762k754n890N898R861
$$ plain form
769 7769 5717 44 4800 11305 6395 -120 3948 10372 4310 -4827 -2638 1709 -2171 -4724 2896
784 2896 8741 2239 -1332 9243 19024 14058 6879 11698 16650 9960 2314 8054 13268 5885 -3534
799 -3534 -763 4669 650 -3692 2771 7935 1495 -3883 4052 14363 12221 5467 6238 7882 2986
814 2986 38 3298 2062 -7576 -11990 -5434 -3013 -10866 -12569 -2481 2432 -6918 -11988 -1909 6416
829 6416 568 -5522 -858 2749 -3745 -9079 -4508 -2167 -10690 -16111 -10975 -7180 -12472 -15078 -6580
844 -6580 -361 -4777 -6782 75 4705 -622 -3133 3250 5643 -2461 -7668 -2199 451 -5535 -8880
859 -8880 -2645 -475 -7407 -9145 -114 5620 1096 278 8068 11567 3658 746 9448 14238 5841
874 5841 -3772 -2778 1398 377 -529 1373 -114 -5258 -3845 4317 7507 3024 2873 7853 8710 1979
$$ packed form
769G769k052n673M756O505m910o515M068O424o062r137K189M347l880k553P620
784B896N845o502l571J0575R781m966p179M819M952o690p646N740N214p383r419
799c534K771N432m019m342O463N164o440n378P935J0311k142o754P71J644m896
814B986k948L260j236r638m414O556K421p853j703J0088M913r350n070J0079Q325
829F416n848o090M664L607o494n334M571K341q523n421N136L795n292k606Q498
844f580O219m416k005O857M630n327k511O383K393q104n207N469K650n986l345
859h880O235K170o932j738R031N734m524q18P790L499p909k912Q702M790q397
874E841r613R94M176j021r06J902j487n144J413Q162L190m483j51M980Q57o731
$$ plain form
890 1979 832 8293 9711 1812 -4211 -3481 -4612 -7915 -4361 1359 -2822 -12473 -11506 741 6306
905 6306 -110 -3671 958 3128 -1839 -3113 1459 1283 -4949 -7946 -6840 -8241 -11513 -8162 -3847
920 -3847 -6931 -13516 -9905 -166 1135 -3941 -2270 4637 3171 -3849 -2495 4594 1633 -7898 -8151
935 -8151 -547 -896 -9318 -9991 -1967 361 -4400 -3041 4171 5063 556 2381 9715 9611 3412 2725
951 2725 6109 3930 -1947 97 5004 1681 -5548 -4477 2302 2445 47 4366 10083 5259 -1822
966 -1822 3795 15815 14795 3043 -2002 3259 5936 1086 -1037 616 -821 -5860 -5622 -847 333
981 333 -1360 1402 5097 2079 -2516 1297 8969 7445 308 -2544 -600 -2773 -5696 -2544 -194
996 -194 -6670 -13529 -8939 220 -95 -6132 -4756 2392 2811 -1818 -473 4165 3066 -2202 -1617 866
$$ packed form
890A979j147P461J418p899o023P30j131l303L554N720m181r651R67J2247N565
905F306o416l561M629K170m967j274M572j76o232k997J106j401l272L351M315
920c847l084o585L611R739J301n076J671O907j466p020J354P089k961r531k53
935h151P604l49q422o73Q024K328m761J359P212Q92m507J825P334j04o199o87
951B725L384k179n877K044M907l323p229J071O779J43k398M319N717m824p081
966a822N617J2020j020j1752n045N261K677m850k123J653j437n039K38M775J180
981C33j693K762L695l018m595L813P672j524p137k852J944k173k923L152K350
996a94o476o859M590R159l15o037J376P148M19m629J345M638j099n268N85K483
$$ plain form
1012 866 -2482 -6538 -4624 -1253 -4156 -7625 -4374 -59 -1393 -3312 1968 6459 3715 881 5135
1027 5135 8795 3831 -1182 2896 7652 1934 -5508 -3329 2779 1405 -2190 267 3941 2447 202
1042 202 4713 9917 8407 4290 6036 8625 5149 1711 5080 6624 943 -4568 -1950 1647 -603
1057 -603 -2502 2020 4193 -265 -2291 4319 9600 5486 -59 2387 5823 1945 -2541 111 2476
1072 2476 -2216 -7396 -5213 -2306 -4252 -5980 -2622 -46 -3083 -4004 1056 4831 1501 -1247 988
1087 988 1819 -2901 -5148 -1115 -232 -6466 -9324 -4855 -1623 -5330 -7488 -2002 1424 -1929 -3428 1260
1103 1260 5689 2549 -133 2521 4218 149 -2516 -258 484 -3951 -5560 -1801 8 -3151 -3198 2200
1119 2200 4453 993 735 5650 7408 2542 1624 5804 6370 869 -1138 2641 3488 -2173 -5215 -643
$$ packed form
1012H66l348m056J914L371k903l469L251M315j334j919N280M491k744k834M254
1027E135L660m964n013M078M756n718p442K179O108j374l595K457L674j494k245
1042B02M511N204j510m117J746K589l476l438L369J544n681n511K618L597k250
1057f03j899M522K173m458k026O610N281m114n545K446L436l878m486K652K365
1072B476m692n180K183K907j946j728L358K576l037r21N060L775l330k748K235
1087I88Q31m720k247M033Q83o234k858M469L232l707k158N486L426l353j499M688
1103A260M429l140k682K654J697m069k665K258P42m435j609L759J809l159m7N398
1119B200K253l460k58M915J758m866r18M180N66n501k007L779Q47n661l042M572
$$ plain form
1135 -643 2257 -1348 -3017 847 4197 2985 2532 5747 5690 1736 1164 4796 4164 -1005 -3539 -398
1151 -398 -78 -3942 -4526 -446 -1098 -5575 -4626 1464 2308 -2146 -2317 3806 5106 -79 -2427 1403 1932
1168 1932 -2991 -5778 -3301 -3015 -6550 -6102 -2590 -2110 -5332 -4229 553 1553 -1169 -1217 1795 799
1184 799 -2037 -116 3755 686 -5000 -4417 98 -382 -6129 -6321 -1462 -204 -3826 -2381 2949 4077
1200 4077 1145 809 5215 4703 195 -414 2883 2620 -1743 -2472 318 -318 -2609 -1051 1205 -369
1216 -369 -3811 -620 5017 4857 665 2172 6355 4689 530 1055 4680 1939 -4251 -4015 23 -377
1232 -377 -3587 -2678 1576 1567 -1919 -1273 2658 3218 901 1632 3554 1293 -1201 1252 4198 307 -4878
1249 -4878 -3924 -983 -2959 -5639 -3083 646 -1209 -3818 -148 4976 3213 -885 106 3614 2265
$$ packed form
1135f43K900l605j669L864L350j212m53L215n7l954n72L632o32n169k534L141
1151c98L20l864n84M080o52m477R49O090Q44m454j71O123J300n185k348L830N29
1168A932m923k787K477K86l535M48L512M80l222J103M782J000k722m8L012r96
1184G99k836J921L871l069n686N83M515m80n747j92M859J258l622J445N330J128
1200D077k932l36M406n12m508o09L297k63m363p29K790o36k291J558K256j574
1216c69l442L191N637j60m192J507M183j666m159N25L625k741o190K36M038m00
1232c77l210R09M254rl486O46L931N60k317P31J922k261k494K453K946l891n185
1249d878R54K941j976k680K556L729j855k609L670N124j763m098R91L508j349
$$ plain form
1264 2265 -1971 -1420 1085 -353 -3396 -2172 18 -2154 -5210 -3213 352 -356 -1997 285 3395
1279 3395 2099 727 3610 5797 2109 -2010 -223 1362 -1548 -4409 -1196 1639 -1097 -4773 -2387
1294 -2387 2239 2239 -424 704 2731 815 -476 3355 6813 3339 -1107 -893 650 -866 -2567 -337
1310 -337 -239 -4239 -5965 -781 3780 2459 -815 1595 3829 1222 -1090 2167 4748 831 -2871 -1273
1326 -1273 1520 -215 -2442 -1052 56 -2861 -4678 -1012 1855 149 -656 2422 4407 1224 249
1341 249 3068 4086 -440 -3128 -683 946 -1795 -3441 -1002 1207 -1229 -2174 828 1986 -1146
1356 -1146 -1874 2073 4778 2513 565 2174 3032 735 -400 1406 586 -3925 -5713 -1382 1439 -478
1372 -478 -1730 946 2178 -313 -139 3620 4339 -1 -1439 1376 2403 -911 -1393 1347 2125 -2782
$$ packed form
1264B265m236N51K505j438l043J224K190k172l056J997L565p08j641K282L110
1279C395j296j372K883K187l688m119J787J585k910k861L213K835k736l676K386
1294b387M626%k663J128K027j916j291L831L458l474m446K14J543j516j701K230
1310c37R8m000j726N184M561j321l274K410K234k607k312L257K581l917l702J598
1326a273K793j735k227J390J108k917j817L666K867j706q05L078J985l183r75
1341B49K819J018m526k688K445J629k741j646K439K209k436r45L002J158l132
1356a146p28L947K705k265j948J609Q58k297j135J806q20m511j788M331K821j917
1372d78j252K676J232k491J74L759P19m340j438K815J027l314m82K740P78m907
$$ plain form
1388 -2782 -5688 -2983 -22 -875 -1639 -168 -253 -1415 658 4768 4488 -165 -1962 606 640 -2247 -2534
1405 -2534 -106 -406 -3934 -4286 -297 473 -2279 -2984 249 949 -1698 -1465 2460 4288 1485 104
1421 104 1444 750 -2042 -1970 118 -870 -4141 -3692 -46 776 -857 -408 2741 2699 -384 -195 3101 3099
1439 3099 244 487 3336 2869 -272 -1124 1013 1159 -2533 -2557 429 293 -2045 -422 3713 4086 1744
1456 1744 1142 3052 2560 185 584 2450 657 -2682 -1568 1163 574 -2006 -1559 1160 -562 -3727
1472 -3727 -2219 1556 2162 -93 512 2652 1475 -689 -220 2282 180 -4561 -4850 -1608 -542 -2326
1488 -2326 -1662 -471 -1316 -2463 -581 2134 652 -2446 -1565 1457 829 -1366 -157 2077 189 -3488
1504 -3488 -3087 -930 -1792 -3864 -2330 325 -571 -1745 572 3638 2670 -13 374 1937 1179 -1059
$$ packed form
1388b782k906K705K961q53p64J471q5j162K073M110k80m653j797K568L4k887k87
1405b534K428l00l528l52L989P70k752p05L233P00k647K33L925J828k803j381
1421A04J340o94k792P2K088r88l271M49L646Q22j633M49L149m2l083J89L296k
1439C099k855K43K849m67l141q52K137J46l692k4K986j36k338J623M135L73k342
1456A744o02J910m92k375L99J866j793l339J114K731n89k580M47K719j722l165
1472c727J508L775O06k255O05K140j177k164M69K502k102m741k89L242J066j784
1488b326O64J191q45j147J882K715j482l098Q81L022o28k195J209K234j888l677
1504c488M01K157q62k072J534K655q96j174K317L066r68k683L87J563p58k238
$$ plain form
1520 -1059 -167 1403 -21 -1576 -358 1811 -149 -2270 -936 1402 358 -1034 1333 3597 2237
1535 2237 890 3080 5148 2312 -900 -99 1360 -187 -2283 -65 1780 25 -1806 40 2972
1550 2972 1681 -771 214 2144 1225 207 1923 3098 1125 -449 504 1643 -1339 -3043 -1460 -442
1566 -442 -2345 -3778 -966 2079 620 -865 377 2321 463 -1650 0 1431 -682 -2600 -1181
1581 -1181 906 -342 -2513 -2041 -1179 -2212 -3429 -1570 -571 -1784 -1085 1240 2431 431 -782 749
1597 749 1513 -1196 -2596 -1037 -371 -2350 -2907 -385 1123 -877 -2275 -64 1338 99 -1270 876
1613 876 1848 932 369 2214 3102 735 -412 454 342 -1813 -2206 -2 451 -1163 -632 2240 3239 1202
1631 1202 437 2459 2762 30 -575 2066 2976 848 -380 775 1166 172 -476 159 -442 -2182 -1409
$$ packed form
1520a059Q92J570j424j555J218K169j960k121J334K338j044j392K367K264j360
1535B237j347K190K068k836l212Q01J459j547k096K218J845j755j831J846K932
1550B972j291k452R85J930r19j018J716J175j973j574R53J139k982j704J583J018
1566d42j903j433K812L045j459j485J242J944j858k113J650J431k113j918J419
1581a181K087j248k171M72Q62j033j217J859R99j213O99K325J191k000j213J531
1597G49P64k709j400J559O66j979n57K522J508k000j398K211J402j239j369K146
1613H76R72r16n63J845Q88k367j147Q66j12k155l93K204M53j614N31K872R99k037
1631A202p65K022L03k732o05K641R10k128j228J155L91r94o48O35o01j740P73
$$ plain form
1648 -1409 1316 2483 892 559 2619 2324 563 58 1122 635 -2144 -2254 100 441 -1869 -1914 756
1665 756 722 -1885 -2486 185 1022 -1168 -1479 479 1842 96 -626 1080 528 -1855 -2512 -1342 -1299 -3348
1683 -3348 -3190 -490 34 -1179 -954 780 327 -1438 -624 1153 839 -1432 -1841 921 693 -472 -691
1700 -691 201 -624 -2768 -2602 -378 -52 -916 -392 1134 1241 479 1545 3525 2070 -1146 -1066 877 894
1718 894 -435 -422 854 425 -1020 69 1661 710 -1101 -310 1730 1284 33 1333 4033 3766 836
1735 836 -248 1006 1236 -683 -597 177 -691 -1614 -91 2189 1610 -273 391 1738 836 -681 -11 1753
1753 1753 1452 -32 678 1118 -45 -1324 -549 353 -1314 -3035 -1769 105 -129 -726 446 1734 767
1770 767 -887 15 832 -548 -2373 -1374 275 -774 -2235 -1497 115 -461 -1940 -1784 -894 -1838 -2250
$$ packed form
1648a409K725J167j591l33K060k95j761n05J064m87k779j10K354L41k310m5K670
1665G56l4k607o01K671Q37k190l11J958J363j746p22J706n52k383o57J170M3k049
1683c348J58K700N24j213K25J734m53j765Q14J777l14k271m09K762k28j165k19
1700f91Q92q25k144J66K224L26q64N24J526J07p62J066J980j455l216Q0J943J7
1718H94j329J3J276m29j445J089J592r51j811P91K040m46j251J300K700k67k930
1735H36j084J254K30j919Q6P74q68r23J523K280n79j883O64J347r02j517O70J764
1753A753l01j484P10M40j163j279P75R02j667j721J266J874k34n97J172J288r67
1770G67j654R02Q17j380j825R99J649j049j461P38J612n76j479J56Q90r44m12
$$ plain form
1787 -2250 -459 1265 384 -705 122 1456 127 -1380 -330 21 -1376 -3133 -2121 -108 231 -446
1803 -446 173 650 -510 -1257 823 1948 386 -802 342 1398 1109 526 1398 1554 -125 -1980 -581
1820 -581 453 -343 -393 1204 1312 337 339 2519 3597 1462 -466 145 1535 650 180 1450 1681 31
1838 31 -631 428 1139 -193 -910 -166 702 97 -305 1197 2208 903 499 1317 1405 -278 -1354 -472
1856 -472 -550 -1606 -2002 251 600 -957 -1497 -467 789 -456 -1316 -475 -159 -894 -593 1205 1127 -897
1874 -897 -2281 -1224 -89 -1708 -2215 -1334 -1501 -2387 -1430 644 1243 -242 -1240 123 34 -1283 -1006 521
1892 521 486 -1189 -1680 147 804 -316 -1153 -359 -938 -1865 -1141 997 1892 -5 -65 1516 1932 938 513
1911 513 1153 855 -583 -883 845 1293 217 74 1392 1354 217 97 1001 1159 323 198 1810 2220
$$ packed form
1787b250J791J724q81j089Q27J334j329j507J050L51j397j757J012K013L39o77
1803d46O19M77j160p47K080J125j562j188J144J056k89n83Q72J56j679j855J399
1820e81J034p96n0J597J08r75KK180J078k135j928O11J390q85m70J270K31j650
1838C1o62J059P11j332p17P44Q68o05m02J502J011j305m04Q18Q8j683j076Q82
1856d72p8j056l96K253L49j557n40J030J256j245q60Q41L16p35L01J798p8k024
1874h97j384J057J135j619n07Q81j67q86R57K074N99j485r98J363q9j317K77J527
1892E21l5j675m91J827O57j120q37P94n79r27P24K138Q95j897o0J581M16r94m25
1911E13O40k98j438l00J728M48j076j43J318l8j137j20R04J58q36j25J612M10
$$ plain form
1929 2220 1104 1195 2218 1651 -30 -152 599 14 -1096 -503 913 1383 -31 400 1464 1163 -77
1946 -77 -64 1228 332 -841 -740 794 687 -367 -807 17 -313 -1876 -1900 -184 -642 -1544 -1002 214 378
1965 378 -262 101 654 -151 -1594 -1599 -344 -961 -1590 -956 -271 -627 -1589 -852 152 -335 -1479 -1262 20
1984 20 -306 -1250 -57 1005 676 -685 -217 452 -354 -1453 -1207 -47 -701 -1193 -497 545 793 -117
2002 -117 545 1436 452 -504 82 1500 901 -268 543 1597 1152 -225 408 1021 -82 -1115 -217 1210
2020 1210 721 179 551 1736 1501 383 800 1057 636 -589 -39 679 304 -232 72 866 173 -961
2038 -961 -246 730 -466 -971 -183 828 673 -89 687 1267 119 -913 -652 -10 -949 -2027 -1067 -178
2056 -178 -711 -1621 -452 684 -485 -1486 -340 143 -539 -1443 -477 281 -245 -918 -137 -244 -825 -1880
$$ packed form
1929B220j116R1J023n67j681j22P51n85j110N93J416M70j414M31J064l01j240
1946g7J3J292q96j173J01J534j07j054m40Q24l30j563k4J716m58r02N42J216J64
1965C78o40L63N53q05j443nJ255o17o29O34O85l56r62P37J004m87j144K17J282
1984B0l26r44J193J062l29j361M68O69q06j099K46J160o54m92O96J042K48r10
2002a17O62Q91r84r56N86J418n99j169Q11J054m45j377O33O13j103j033Q98J427
2020A210m89n42L72J185k35j118M17K57m21j225N50P18l75n36L04P94o93j134
2038i61P15R76j196n05P88J011j55p62P76N80j148j032K61O42r39j078R60Q89
2056a78n33r10J169J136j169j001J146M83o82r04R66P58n26o73P81j07n81j055
$$ plain form
2074 -1880 -873 -241 -1195 -1511 -632 485 -24 -615 273 835 -240 -992 -160 365 -306 -1116 -222 708 -145
2093 -145 -613 357 910 -557 -820 -441 817 -205 -229 990 1703 545 260 1113 1229 492 -451 121 614
2112 614 -249 -292 517 956 308 274 686 1121 140 -108 1072 744 358 -142 814 970 139 -293 557 671
2132 671 -913 -1221 -391 328 -39 -409 467 864 17 -237 1025 590 -724 -1213 -138 536 -285 -531 485
2151 485 590 -740 -1342 -283 79 -1018 -1163 -66 -25 -574 -157 931 1039 -556 -1013 -299 -238 -1063 -732
2170 -732 -113 -43 -981 -723 509 146 -452 -1110 -176 120 -882 -426 499 806 -187 -189 860 538 -505 -710
2190 -710 147 293 -323 -517 176 480 -241 -196 1260 1198 16 -425 266 242 -44 166 1144 640 -248 228
2210 228 1099 861 -66 -223 319 -96 -345 54 1195 1328 -50 108 729 399 156 155 796 114 -1134 -312
$$ packed form
2074a880J007O32r54l16Q79J117n09n91Q88N62j075p52Q32N25o71q10Q94R30q53
2093a45m68R70N53j467k63L79J258j022k4J219P13j158k85Q53J16p37r43N72M93
2112F14q63m3Q09M39o48l4M12M35r81k48J180l28l86n00R56J56q31m32Q50J14
2132F71j584l08Q30P19l67l70Q76L97q47k54J262m35j314m89J075O74q21k46J016
2151D85J05j330o02J059L62j097j45J097M1n49M17J088J08j595m57P14O1q25L31
2170g32O19P0r38K58J232l63n98o58R34K96j002M56R25L07r93kJ049l22j043k05
2190g10Q57J46o16j94O93L04p21M5J456o2j182m41O91k4k86K10R78n04q88M76
2210B28Q71k38r27j57N42m15k49L99J141J33j378J58O21l30k43jO41o82j248Q22
$$ plain form
2230 -312 1080 970 -64 -276 -17 -123 -506 42 572 200 -745 -527 608 710 -51 -87 585 -327 -1045
2249 -1045 -783 -58 -221 -674 -540 540 315 -528 -223 338 32 -756 -455 286 30 -997 -338 414 -5
2268 -5 -610 -665 -2 -643 -874 -387 56 93 -548 -257 759 495 -220 80 340 -501 -883 -239 567 540 -593
2289 -593 -50 458 -24 -334 133 837 375 -633 -403 652 450 167 802 855 143 -189 104 661 80 -609
2309 -609 -303 443 -22 -64 407 929 543 -417 106 477 292 -342 627 796 171 -308 252 700 -158 -332
2329 -332 -255 -58 -219 -589 68 222 202 -91 328 883 194 -783 -173 151 -281 -637 -112 453 -37 -353 17
2350 17 184 -551 -694 -191 122 -321 -589 -166 567 158 -469 123 77 -671 -1016 -354 20 -973 -900 -191 21
2371 21 -255 -242 191 141 -350 -672 212 269 -32 -207 -127 395 -155 -191 171 154 -588 -540 192 520 -291 -419 125
$$ packed form
2230c12J392j10j034k12K59j06l83N48N30l72r45K18J135J02p61l6O72r12p18
2249a045K62P25j63m53J34J080k25q43L05N61l06p88L01P41k56j027O59P52m19
2268eo05n5O63o41k31M87M43L7o41K91J016k64p15L00K60q41l82O44Q06k7j133
2289e93N43N08m82l10M67P04m62j008K30J055k02k83O35N3p12l32K93N57n81o89
2309f09L06P46m65m2M71N22l86r60N23L71j85o34R69J69o25m79N60M48q58j74
2329c32P7J97j61l70O57J54k0k93M19N55o89r77O10L24m32l56N25N65m90l16L70
2350A7J67p35j43N03L13m43k68M23P33m09o27N92m6p48l45O62L74r93P3P09K12
2371B1k76J3M33n0m91l22Q84N7l01j75Q0N22n50l6L62j7p42M8P32L28q11j28N44
$$ plain form
2394 125 287 -35 -133 334 452 -170 -509 45 662 49 -126 467 452 -21 -274 385 1019 -542 -399 272
2414 272 199 326 -134 545 382 -313 -316 507 747 -168 -424 284 127 -145 131 503 433 164 -162 513 349
2435 349 -642 -119 362 116 -530 -431 566 485 -596 -355 65 -135 -353 -276 -21 135 -379 -525 329 93 -398
2456 -398 -338 14 150 -212 -174 -112 81 -218 -90 214 175 -554 -434 -177 -30 -67 43 259 45 -299 -12 680
2478 680 184 -326 -402 298 140 -468 347 214 90 -423 101 320 431 -222 -187 294 59 -296 150 699 413
2499 413 48 -42 494 239 -112 -65 383 99 -554 559 623 560 -407 138 490 498 -17 -191 325 9 -512 177
2521 177 521 122 -256 73 361 -129 -116 -237 154 -122 -459 298 605 39 -525 -83 439 -169 -386 -34
2541 -34 72 -16 -691 -187 328 117 -602 -66 -59 -161 -486 -109 266 -496 -622 -424 364 9 -378 -167 34
$$ packed form
2394A25J62l22r8M67J18o22l39N54O17o13j75N93j5m73k53O59O34j561J43O71
2414B72p3J27m60O79j63o95lQ23K40r15k56P08j57k72K76L72p0k69l26O75j64
2435C49r91N23M81k46o46R9R97q1j081K41M20k00k18P7K55J56n14j46Q54k36m91
2456c98O0L52J36l62L8O2J93k99J28L04l9p29J20K57J47l7J10K16k14l44K87O92
2478F80m96n10p6P00j58o08Q15j33j24n13N24K19J11o53L5M81k35l55M46N49k86
2499D13l65r0N36k55l51M7M48k84o53J113O4o3r67N45L52Qn15j74N16l16n21O89
2521A77L44l99l78L29K88m90J3j21L91k76l37P57L07n66n64M42N22o08k17L52
2541c4J06q8o75N04N15k11p19N36Pj02l25L77L75p62j26J98P88l55l87K11K01
$$ plain form
2562 34 -306 -579 -21 571 321 -128 -142 155 30 -263 272 277 -199 -410 27 560 -200 -277 102 206 157 -266
2584 -266 108 365 -99 -379 215 608 124 72 -53 318 42 -99 114 -95 -515 -133 -25 468 2 -302
2604 -302 212 347 -3 -435 388 201 -140 -342 -9 355 289 132 414 261 -367 -343 -23 321 -121 -511 -23
2625 -23 376 55 -333 265 293 -484 -359 -10 379 -17 -200 89 160 -463 -497 360 335 -402 -463 139 -24 -257
2647 -257 -61 214 1 -194 -455 27 208 -160 -336 368 260 -166 -346 255 340 -221 -362 -13 250 -466
2667 -466 -201 184 162 -296 -493 114 240 -273 -436 274 292 -216 -522 87 252 -105 153 145 100 -218 -247 176
2689 176 267 -161 -277 181 411 -197 -112 153 266 -137 8 351 248 -238 -154 371 221 -57 -200 361 235
2710 235 -433 -198 251 305 -572 -221 265 283 -382 -233 39 -194 -278 -150 418 510 -215 -73 -60 -7 -249 -146
$$ packed form
2562C4l40k73N58N92k50m49j4K97j25k93N35Nm76k11M37N33p60p7L79J04m9m23
2584b66L74K57m64k80N94L93m84n2j25L71k76j41K13k09m20L82J08M93m66l04
2604c02N14J35l50m32Q23j87l41k02L33L64o6j57K82j53o28K4L20L44m42l90M88
2625b3L99l21l88N98K8p77J25L49L89l96j83K89P1o23l4Q57k5p37o1O02j63k33
2647b57J96K75k13j95k61M82J81l68j76P04j08m26j80O01Q5n61j41L49K63p16
2667d66K65L85k2m58j97O07J26n13j63P10J8n08l06O09J65l57K58qm5l18k9M23
2689A76R1m28j16M58K30o08Q5K65J13m03J45L43j03m86Q4N25j50k78j43N61j26
2710B35o68K35M49N4q77L51M86J8o65J49K72k33q4J28N68R2p25J42J3N3k42J03
$$ plain form
2732 -146 564 -187 -519 30 44 286 -208 -52 -113 -200 -153 61 513 -57 -402 -259 36 -27 -225 -86 274 10
2754 10 -358 -122 414 -30 -179 -271 183 -37 -107 -138 455 149 -446 128 414 239 -282 -343 176 -260 -277 -43
2776 -43 383 -42 -360 -400 420 256 -354 -5 -136 175 -313 -356 372 89 -203 -103 50 295 -184 -14 188
2797 188 -93 -224 221 525 58 -32 -69 52 -134 -349 -13 459 29 -536 -276 189 -21 -487 -273 -1 296
2818 296 -112 174 355 -103 -299 65 580 289 -138 -2 33 -103 -200 -167 124 217 -475 -35 180 29 -78
2839 -78 144 -10 -105 -26 44 14 -141 -420 -6 -90 -186 -113 30 208 -60 -171 -66 378 229 -289 281 456 337
2862 337 -220 147 368 50 -375 -69 194 -131 -165 112 53 167 298 -37 274 409 -141 124 172 -315 -242
2883 -242 232 -78 -235 -161 176 -8 -70 -281 -120 82 -261 -85 172 91 -327 -224 68 624 30 -339 15
$$ packed form
2732a46P10p51l32N49J4K42m94J56o1q7M7K14M52n70l45J43K95o3j98J39L60k64
2754A0l68K36N36m44j49r2M54k20p0l1N93l06n95N74K86j75n21o1N19m36j7K34
2776d3M26m25l18m0Q20j64o10L49j31L11m88m3P28k83k92J00J53K45m79J70K02
2797A88k81j31M45L04m67r0l7J21j86k15L36M72m30n65K60M65k10m66K14K72K97
2818B96m08K86J81m58j96L64N15k91m27J36L5j36r7L3K91R3o92M40K15j51j07
2839g8K22j54r5P9P0l0j55k79M14q4r6P3J43J78k68j11J05M44j49n18N70J75j19
2862C37n57L67K21l18m25L06K63l25l4K77n9J14J31l35L11J35n50K65M8m87P3
2883b42M74l10j57P4L37j84o2k11J61K02l43J76K57q1m18J03K92N56n94l69L54
$$ plain form
2904 15 98 -69 -58 70 187 301 -343 -15 359 -234 -289 65 288 61 95 31 205 -93 -279 298 310 -244
2926 -244 -221 63 -31 154 -37 100 -192 -88 -193 304 471 254 258 12 -317 -212 -130 164 120 -302 -57 256
2948 256 212 32 -10 211 331 84 12 528 217 76 -91 199 195 -419 -359 -47 -15 -311 -71 359 150 -49
2970 -49 -58 -92 0 46 -91 58 -11 -2 -90 177 52 -159 -191 -141 -180 -267 -222 93 -199 -307 -132 311 92 -194 39
2995 39 -229 22 -62 -190 36 13 -212 -119 100 38 -53 -146 -109 113 -139 298 39 90 304 -237 441 201 -29
3018 -29 138 90 217 83 138 -241 -42 -126 -30 -130 -57 -228 10 226 33 -234 138 502 189 -237 300 353
3040 353 288 -179 242 2 37 -211 -15 -123 123 -235 -5 149 309 -79 162 276 157 -132 75 273 187
3061 187 -60 -299 -7 164 -160 5 122 -193 -338 -121 391 198 -14 -55 -439 102 149 -57 96 -140 -513
$$ packed form
2904A5Q3j67J1J28J17J14o44L28L74n93n5L54K23k27L4o4J74k98j86N77J2n54
2926b44K3K84r4J85j91J37k92J04j05M97J67k17Mk46l29J05Q2K94m4m22K45L13
2948B56m4j80m2K21J20k47p2N16l11j41j67K90mo14O0L12L2k96K40M30k09j99
2970d9rl4R2M6j37J49o9Rq8K67j25k11l2N0l9q7M5L15k92j08J75M43k19k86K33
2995C9k68K51q4j28K26k3k25R3K19o2r1r3L7K22k52M37k59N1K14n41O78k40k30
3018b9J67m8J27j34N5l79J99q4R6j00P3j71K38K16j93k67L72L64l13m26N37N3
3040C53o5m67M21k40L5k48J96j08K46l58K30J54J60l88K41J14j19k89K07J98q6
3061A87k47k39K92J71l24J65J17l15j45K17N12j93k12m1l84N41M7k06J53k36l73
$$ plain form
3082 -513 -147 308 -76 -189 -105 125 -219 -305 -82 194 149 -208 -26 121 209 224 255 10 -148 -148 -91 44 -296
3105 -296 -193 -111 -43 0 65 543 119 -220 -58 370 264 144 -86 -11 129 119 -393 281 99 -225 -171 223
3127 223 341 184 -77 17 332 18 204 213 198 -1 -380 -225 297 237 188 -4 -289 -279 -373 59 641 50 -138
3150 -138 45 -96 -40 161 227 289 -113 101 51 177 -275 -275 -12 -341 -7 13 102 264 -209 -88 201 329 220
3173 220 194 25 -312 -184 219 112 220 -372 -240 100 -144 -249 -491 -47 159 -156 18 140 57 -49 -159
3194 -159 -124 -12 60 -15 184 149 -278 -302 119 -139 -106 -343 42 58 -122 -34 57 195 -241 148 89 -6 -123 119
3218 119 185 -34 53 36 262 -133 148 259 249 82 -197 31 -61 -80 -84 84 340 326 -230 -241 146 89 -152 -200
3242 -200 232 24 132 13 371 110 -250 95 302 165 -132 77 286 -123 105 -408 219 69 -158 -214
$$ packed form
3082e13L66M55l84j13Q4K30l44q6K23K76m5l57J82J47Q8J5L1k45j58%N7J35l40
3105b96J03Q2O8M3O5M78m24l39J62M28j06j20k30P5J40j0n12O74j82l24N4L94
3127B23J18j57k61R4L15l14J86Rj5j99l79J55N22o0m9j92k85J0r4M32N82n91j88
3150a38J83j41N6K01O6O2m02K14n0J26m52%K63l29L34K0Q9J62m73J21K89J28j09
3173B20k6j69l37J28M03j07J08n92J32L40k44j05k42M44K06l15J74J22q3j06j10
3194a59L5J12P2p5J99l5m27k4M21k58L3k37L85J6j80Q8R1J38m36L89n9r5j17K42
3218A19O6k19Q7j7K26l95K81J11j0j67k79K28r2j9mJ68K56j4n56j1L87n7k41m8
3242b00M32k08J08j19L58k61l60L45K07j37k97K09K09m09K28n13O27j50k27n6
$$ plain form
3262 -214 -169 -71 -56 33 316 148 134 -14 101 -24 -402 -116 142 -166 -146 346 20 183 -172 -212 333 76
3284 76 -277 146 -7 -141 -45 -77 285 -14 -42 -178 -277 -7 -25 -108 -477 -152 -205 -128 158 328 -339 68 112
3307 112 7 -108 337 267 -7 -111 64 246 71 -57 -72 162 -5 138 -50 -104 -100 -158 193 602 245 -74
3329 -74 27 145 314 214 35 11 -126 -59 443 146 100 34 233 168 -240 395 23 383 40 -217 399 343
3351 343 434 321 19 -67 -25 -124 123 -26 -157 76 130 222 163 -182 165 11 -57 -212 291 4 -244 -404 1
3374 1 194 37 -190 -341 -269 -138 -188 -152 237 -67 -237 -91 184 -121 221 -70 83 -366 -156 214 129 -133
3396 -133 -233 77 47 -36 262 -147 105 -219 -114 20 -64 -20 -84 -96 119 -162 -435 193 -6 -200 -218 -56
3418 -56 197 53 -67 197 -154 166 32 541 150 54 245 266 422 93 132 21 75 -262 229 438 286 -336
$$ packed form
3262b14M5R8J5Q9K83j68j4j48J15j25l78K86K58l08K0M92l26J63l55m0N45k57
3284G6l53M23j53j34R6l2L62k99k8j36r9K70j8q3l69L25n3P7K86J70o67M07M4
3307A12j05j15M45p0k74j04J75J82j75j28j5K34j67J43j88n4Mn8L51M09l57l19
3329g4J01J18J69j00j79k4j37O7N02k97m6o6J99o5m08O35l72L60l43k57O16n6
3351C43R1j13l02q6M2r9K47j49j31K33N4R2n9l45L47j54o8j55N03k87k48j60M05
3374AJ93j57k27j51P2J31n0L6L89l04j70J46K75l05L42k91J53m49K10L70q5k62
3396a33j00L10l0q3K98m09K52l24J05J34q4M4o4j2K15k81k73O28j99j94j8J62
3418e6K53j44j20K64l51L20j34N09l91r6J91K1J56l29L9j11N4l37M91K09j52o22
$$ plain form
3440 -336 65 76 114 169 170 272 464 -78 -118 582 351 -243 11 138 194 383 66 -148 -106 51 -258 147 35
3463 35 -53 -52 50 49 -268 9 78 -242 -163 -161 -26 -134 16 -337 -326 -154 -241 -97 -233 -152 -551 144 12 -20 -67
3488 -67 -197 -136 301 -337 -174 115 -125 -114 -425 -393 158 181 -8 119 -186 -107 -265 -66 -91 -157 -95 -172 87
3511 87 23 -170 -185 281 -197 -71 406 6 67 -69 325 326 -70 98 276 -273 38 108 235 159 383 -124 70
3534 70 379 -48 169 174 61 -12 118 27 59 -46 -58 111 -230 -54 185 -29 -167 -342 -174 -200 -179 -388 -108
3557 -108 198 -124 -57 104 21 81 61 -277 -23 20 -85 2 51 -71 -464 -328 -143 -328 -303 -270 -184 -159 -255 -114
3581 -114 -83 31 -78 217 85 46 -94 -110 -98 182 42 -29 -7 217 9 8 -110 91 123 -284 113 -109 74
3604 74 271 129 -147 -82 -93 373 103 127 -140 74 19 -98 434 376 219 -29 171 79 609 68 79 -100 108
$$ packed form
3440c36M01J1L8N5JJ02J92n42m0P00k31n94K54J27N6J89l17k14M2J57l09M05j12
3463C5q8JJ02jl17K77O9l20P9KJ35j08J50l53J1J72q7J44j36Q1l99O95j32l2m7
3488f7j30O1M37o38J63K89k40J1l11L2N51K3j89J27l05P9j58J99k5o6O2p7K59
3511H7o4j93j5M66m78J26M77m00O1j36L94Jl96J68J78n49L11P0J27p6K24n07J94
3534G0L09m27K17Nj13p3J30r1L2j05j2J69l41J76K39k14j38j75J68k6K1k09K80
3557a08L06l22O7J61q3O0k0l38K54M3j05Q7M9j22l93J36J85j85K5L3Q6K5r6J41
3581a14L1J14j09K95j32l9j40j6J2K80j40p1K2K24k08jj18K01L2m07L97k22J83
3604G4J97j42k76O5j1M66k70K4k67K14n5j17N32n8j57k48K00r2N30n41J1j79K08
$$ plain form
3627 108 111 141 408 161 152 -237 281 251 64 80 -126 -80 -21 195 300 -150 168 37 -184 137 134 -62 72 -200
3651 -200 -304 163 6 -35 -162 95 -10 -1 -186 219 -174 -538 -48 60 237 -36 -130 132 -3 -66 -132 -287
3673 -287 408 13 -60 -113 40 350 199 -233 138 -62 -132 -195 -34 382 -229 296 -180 154 148 125 -72 167
3695 167 270 187 300 27 228 315 -111 -209 -275 104 -102 -406 -329 190 286 308 247 -51 -44 127 86 73 431 -70
3719 -70 -269 125 123 -1 -26 231 -36 -131 209 -134 -65 118 -128 22 20 -67 153 98 -34 62 -260 239 393 -157
3743 -157 -399 20 -111 338 12 84 187 -168 -269 50 -94 -169 194 -156 -26 198 193 -31 269 -3 -50 -9
3765 -9 9 -193 145 -228 -15 -301 -113 -227 -219 -121 75 10 23 15 124 52 5 -28 -52 28 -10 -145 -27 142 93 78
3791 78 55 -113 -28 -178 -33 14 -7 -202 -30 -39 293 -235 -37 -46 -123 -166 -24 -42 114 20 -136 -162 277 218 -169
$$ packed form
3627A08LL0K67k47rl89N18l0j87J6k06M6N9K16J05m50L18j31k21L21lj96J34k72
3651b00j04M67j57m1j27K57j05Rj85M05l93l64M90J08J77k73r4K62j35o3o6j55
3673b87O95l95p3n3J53L10j51m32L71k00p0o3J61M16o11N25m76L34ok3j97K39
3695A67J03q3J13k73K01Q7m26r8o6L79k06l04P7N19R6K2o1k98PJ71m1j3L58n01
3719g0j99L94kj24k5K57k67r5L40l43O9J83k46J50kq7K20n5j32R6l22M99J54n50
3743a57k42M19j31M49l26P2J03l55j01L19j44p5L63l50J30K24nk24L00k72m7M1
3765iJ8k02L38l73K13k86J88j14QR8J96o5J3qJ09p2m7l3k4Q0l8j35J18J69m9j5
3791G8k3j68Q5j50J45M7k1j95J72rL32n28J98rp7m3J42j8J56r4j56k6M39n9l87
$$ plain form
3816 -169 83 1 -57 -94 -32 -72 -258 -248 -103 -7 55 -165 14 -1 -173 189 228 -168 -223 -93 166 -62 -120 177
3840 177 -28 -179 -320 -11 -113 -65 -208 53 14 -226 82 14 118 -155 -23 116 34 230 -54 -82 -196 -18
3862 -18 -70 75 -83 -108 -43 -204 -7 -169 -113 275 176 -26 -90 -304 -184 5 126 286 -37 -41 68 -24 15 37
3886 37 -130 -282 -268 18 -80 58 342 -57 -361 -324 -159 -85 -157 271 42 199 334 -237 -129 -52 210 -21
3908 -21 226 -27 38 10 180 -7 26 -140 280 119 175 23 99 -277 114 254 59 34 -129 178 262 -230 33
3931 33 144 -62 -171 -128 153 86 73 136 230 192 -37 -96 237 54 -129 148 -32 103 -168 113 -184 -30 -14
3954 -14 -73 -52 296 33 -106 375 -225 -140 -210 -119 53 81 -405 44 155 -102 -7 -15 -22 -145 197 296 97 103 5
3979 5 241 39 -162 -156 -209 268 175 -62 1 194 166 -209 -111 -77 -14 -40 46 4 -74 -113 -119 40 137 122 113 173 48 -63
$$ packed form
3816a69K52q2n8l7O2m0j86J0J45R6O2k20J79j5j72L62L9l96n5J30K59k28n8K97
3840A77k05j51j41L09j02M8j43K61l9k40L08o8J04k73J32J39q2J96k84k8j14J78
3862a8n2J45j58k5O5j61J97j62N6L88r9k02o4k14J20J89J21J60l23mJ09r2L9K2
3886C7j67j52J4K86r8J38K84l99l04L7J65P4p2M28k29J57J35n71J08P7K62k31
3908b1K47k53O5k8J70j87L3j66M20j61N6j52P6l76L91J40j95k5j63L07Q4m92K63
3931C3J11k06j09M3K81o7j3O3R4l8k29n9L33j83j83K77j80J35k71K81k97J54J6
3954a4n9K1L48k63j39M81o00Q5p0R1J72K8m86M49J11k57R5qpj23L42R9j99Or8
3979EK36k02k01On3M77r3k37O3J93k8l75R8L4O3k6Q6m2p8l9oJ59R7j5rO0j25j11
$$ plain form
4007 -63 -81 -181 -74 -31 -11 135 201 -34 453 292 72 120 -151 118 3 -146 130 385 119 80 77 -86 2
4030 2 -239 186 265 31 -32 154 -110 -87 272 -104 205 -251 -193 144 -360 -42 37 47 -87 -60 199 -18 -183
4053 -183 -407 15 225 -68 31 -33 -151 -154 6 -166 -152 -109 6 -48 142 -6 0 159 -97 -28 -270 42 -86
4076 -86 48 -240 -47 15 42 121 238 304 118 -136 -41 -35 55 -27 -114 -68 -75 110 -80 -219 43 -280 20 209 -94
4101 -94 -148 230 -122 -62 -36 351 27 -140 -295 -161 289 -169 119 94 190 159 -96 -113 11 -50 18 32 49 68
4125 68 103 242 229 -183 -29 154 243 134 -253 -63 -210 4 -77 -19 92 -214 -11 262 193 -112 -167 33 -65
4148 -65 -241 12 11 -32 98 -86 124 97 -82 -2 -127 -183 175 -86 -102 109 143 127 -84 -4 -60 -30 -249 60
4172 60 -252 20 -246 -148 -51 160 -14 -117 -27 144 -253 -48 89 28 222 149 32 -118 187 -101 282 -87
$$ packed form
4007f3j8j00J07M3K0J46O6k35M87j61k20M8k71K69j15j49K76K55k66l9lj63Q8
4030Bk41M25P9k34o3J86k64K3L59l76L09m56N8L37n04L18P9J0j34K7K59k17j65
4053a83k24M22K10k93R9o4j18lJ60j72J4M3J15n4J90j48OJ59k56O9k42L12j28
4076h6J34k88J93O2K7P9J17O6j86k54R5OR0q2q7M6pJ85j90j39K62l23L00J89l03
4101i4n4L78l52O0K6L87l24j67j55J34M50m58K88k5R6l1k55j7J24o1O8J4J7J9
4125F8L5J39j3m12J54J83Q9j09l87J90j47K14q1N8J11l06K03K73o9l05n5K00r8
4148f5j76K53jm3J30j84K10k7j79Q0j25n6L58k61j6K11L4j6k11Q0n6L0k19L09
4172F0l12K72k66R8R7K11j74j03R0J71l97K05J37o1J94p3j17j50L05k88L83l69
$$ plain form
4194 -87 82 25 16 125 300 165 136 -314 215 -398 59 -28 -221 -380 -310 135 -131 215 129 -224 151 191 -234
4217 -234 119 -169 47 -131 -228 172 -128 -147 158 -239 -174 340 18 -223 93 185 -255 105 -113 45 108 25
4239 25 128 37 171 -39 -8 102 116 124 -335 -132 23 -42 79 115 -242 67 262 108 191 -55 67 6 129
4262 129 -49 -15 26 -164 243 260 106 -20 94 36 -109 47 -189 7 -237 91 -6 98 -20 -111 119 146
4284 146 -62 -125 -190 224 118 176 51 310 207 103 72 15 4 -91 -155 25 108 -222 90 -191 -207 -59 43
4307 43 154 111 20 -130 -71 -122 -211 -25 276 -159 3 -188 69 -281 -12 217 320 339 136 -45 -40 103 179
4330 179 -83 -202 -190 -56 142 210 -4 393 -247 186 56 171 153 62 51 28 29 -134 112 91 -104 253 66
4353 66 -94 54 -180 -451 57 -98 -60 -14 131 -19 17 -59 302 -73 -140 -210 147 264 -224 -17 65 196 -197
$$ packed form
4194h7J69n7rJ09J75j35k9m50N29o13M57q7j93j59P0M45k66L46q6l53L75M0m25
4217b34L53k88K16j78r7M00l00j9L05l97O5N14l22k41L16R2m40L60k18J58O3q3
4239B5J03r1J34k10L1J10J4Qm59K03J55o5J21L6l57L09J95j54Q3k46J22o1J23
4262A29j78L4M1j90M07J7j54j26J14n8j45J56k36J96k44L28r7J04j18r1K30K7
4284A46k08o3o5M14j06N8j25K59j03j04l1n7j1r5o4J80Q3l30L12k81j6J48J02
4307D3J11m3r1j50N9n1q9J86L01m35J62j91K57l50K69K29J03J9k03j81NJ43P6
4330A79k62j19J2J34J98O8k14L97o40M33j30J15j8r1j1k3Jj63K46k1j95L57j87
4353F6j60J48k34k71N08j55L8M6J45j50L6p6L61l75o7p0L57J17m88K07Q2J31l93
$$ plain form
4376 -197 103 -246 -197 80 112 177 -286 32 283 200 -68 -83 -3 -129 -46 93 91 181 -25 -310 -92 76 -161
4399 -161 -37 -305 -94 433 69 -67 234 66 203 -128 -67 -186 -95 -148 -128 -284 48 364 101 46 -50 -156
4421 -156 -150 137 54 -247 -327 -352 -284 103 43 -402 -11 -111 -112 389 42 82 139 154 128 -97 123 -57 -30 230 24
4446 24 -51 86 112 -35 43 122 118 189 52 118 -14 229 -107 -90 -293 -100 64 -187 -27 -151 57 -104 93
4469 93 209 171 60 275 -120 98 19 -203 -261 269 35 10 -74 41 -31 89 -140 231 -60 -123 89 -22 -20
4492 -20 -174 66 -45 99 203 137 -24 -247 -295 -222 317 1 5 182 5 -18 -39 164 50 122 28 57 88 -7
4516 -7 -354 219 -32 43 -3 360 180 10 94 61 184 380 16 -54 -36 -48 92 85 226 -190 176 -74 -53 105
4540 105 -186 -274 5 -105 127 -44 133 -69 33 -402 -58 -196 -60 249 40 20 14 12 -87 200 151 30 -160
$$ packed form
4376a97L00l49M9K77L2O5m63L18K51q3k68j5Q0j26Q3J39kR0k06k85K18J68k37
4399a61J24k68K11N27l64j36L01j68J37l31O1j19R1n3K0j56L32L16k63n5r6j06
4421a56OK87q3l01q0k5O8L87o0m45L91j00jN01l47M0N7J5k6k25K20j80K7K60k06
4446B4p5J37K6j47P8P9mP1j37O6j32K43l36J7k03J93J64k51J60j24K08j61J97
4469I3J16l8j11K15l95K18p9k22n8N30k34k5q4J15p2J20k29L71k91o3K12j11K
4492b0j54K40j11J44J04o6j61k23m8P3N39l16MJ77j77k3k1K03j14P2r4K9L1r5
4516gl47N73k51P5m6L63j80j70Q4l3J23J96l64p0J8j2J40pJ41m16L66k50K1J58
4540A05k91q8K79j10K32j71J77k02J02m35L44j38J36L09k09k0okr9K87m9j21j90
$$ plain form
4563 -160 -297 -259 96 262 65 -144 67 -38 -254 90 -241 -104 40 -156 224 40 -414 -8 74 192 122
4584 122 58 21 377 125 133 -6 258 88 59 33 241 -1 -136 -7 33 105 -230 -178 15 -50 -188 -85 8 38
4608 38 -234 -180 -11 -182 324 146 -118 -187 127 -179 65 -86 101 193 -60 98 -227 245 -49 -59 -150 -135
4630 -135 32 351 238 306 8 -21 -231 196 -211 -185 -35 -194 -164 60 364 102 -21 -157 -5 69 30 88
4652 88 144 -103 -98 -212 213 -82 -53 82 -192 168 67 -96 49 4 -89 -119 57 -100 134 -80 65 140 -64
4675 -64 -25 -395 82 -143 113 -69 -50 132 -214 82 196 58 -5 -105 -60 -163 -28 -374 -61 271 -93 -196
4697 -196 -23 -61 -161 -194 156 173 -141 271 18 76 91 82 165 -234 -66 320 16 -30 67 178 55 -55 -49 6
4721 6 -96 -96 20 68 205 96 27 164 184 -49 -107 26 150 24 131 -109 125 -49 267 -329 26 -62 77
$$ packed form
4563a60j37L8L55J66j97k09K11j05k16L44l31J37J44j96L80j84m54M06Q2J18p0
4584A22o4l7L56k52Qj39K64j70k9k6K08k42j35J29M0P2l35N2J93o5j38J03R3L0
4608C8k72N4J69j71N06j78k64o9L14l06K44j51J87R2k53J58l25M72k94j0r1J5
4630a35J67L19j13O8k98k9k10M27m07K6J50j59L0K24L04k62j23j36J52P4l9N8
4652H8N6k47Nj14M25k95K9J35k74L60j01j63J45m5r3l0J76j57K34k14J45P5k04
4675f4L9l70M77k25K56j82J9J82l46K96J14j38o3j00M5j03J35l46L13L32l64j03
4697a96J73l8j00l3L50J7l14M12k53N8J5rQ3l99J68L86l04m6R7J11j23j10ON5
4721Fj02%J16M8J37j09o9J37K0k33n8J33J24j26J07k40K34j74L16n96L55q8J39
$$ plain form
4744 77 99 -93 -108 -461 55 131 39 -2 29 -218 -114 -256 -117 103 -107 -307 99 176 -69 -361 -152 -268 105
4767 105 -7 86 -14 -372 111 76 276 -106 136 -127 -59 -62 -19 48 34 229 191 28 68 -60 -146 -105 18 102
4791 102 -478 104 -96 -251 143 -34 -84 -155 -343 137 -102 -48 53 22 237 77 -156 -161 227 67 71 -57 -196
4814 -196 323 198 15 157 -82 15 -236 -174 -62 22 -40 175 3 -153 27 333 -49 172 139 -20 -240 246
4836 246 0 -183 90 -248 -37 -44 257 -73 236 -201 223 131 -105 -94 142 259 -30 35 69 102 62 25 -203
4859 -203 202 -202 -296 -190 331 24 -150 118 -99 115 36 217 -17 -239 -4 -416 -22 -238 201 -42 246
4880 246 53 26 37 23 139 66 82 -132 -90 -214 316 -176 56 -167 -264 -17 124 -75 -16 76 110 -24 71 -86
4904 -86 274 46 -131 77 35 -199 161 273 61 114 243 -304 -85 26 297 -327 24 277 30 9 102 -71
$$ packed form
4744G7K2j92j5l53N16P6r2m1L1k47J04j42J39K20k10k00M06P7k45k92K09j16L73
4767A05j12R3j00l58M83l5K00l82K42k63O8lM3O7j4J95l8j63M0j28q6M1J23Q4
4791A02n80N82k00j55L94j77n0p1j88M80k39N4J01l1K15j60k33nL88j60Mj28j39
4814a96N19j25j83J42k39R7k51O2J12Q4o2K15j72j56J80L06l82K21l3j59k20M86
4836B46k46j83K73l38K11pL01l30L09m37M24r2k36J1K36J17k89O5L4L3m0l7k28
4859b03M05m04r4J06N21l07j74K68k17K14p9J81k34k22K35m12L94k16M39k43K88
4880B46j93k7J1j4J16p3J6k14M2j24N30m92K32k23r7K47J41j99N9R2L4j34R5j57
4904h6L60k28j77K08m2k34L60J12k12N3J29n47K19J11K71o24L51K53k47k1R3j73
$$ plain form
4926 -71 -101 -212 217 314 88 -80 26 125 -211 14 -81 130 -68 151 -150 -12 170 51 -109 -101 -200 248 287
4949 287 -10 117 -255 431 194 115 -181 -99 23 14 -96 -157 -284 95 89 58 203 147 -25 15 -395 87 86 132
4973 132 -115 -255 -20 24 141 51 282 -93 109 -240 52 54 127 -41 -259 -368 -57 -99 -60 -154 14 -158 156
4996 156 216 -164 -237 101 247 -305 193 4 -212 19 -85 -57 -79 201 -5 -113 -163 179 -95 237 142 -30
5018 -30 71 27 105 14 -191 265 -91 158 -146 130 182 -9 -163 -230 -84 -121 250 -338 294 -100 -154 -7 -91
5041 -91 -69 112 -218 -125 -152 -185 -20 137 -197 -52 -206 -31 -178 -103 -88 -106 -70 264 -169 160 86 -34 107
5064 107 -93 86 88 -183 201 -341 -53 -178 -91 -162 25 66 -93 235 -238 -5 -29 -80 214 -85 -123 9 482
5087 482 65 34 -150 219 9 109 -143 108 30 79 120 -55 -57 -6 119 -215 -65 -122 91 -131 -72 -271 -177
$$ packed form
4926g1l0j11M29R7k26j68J06R9l36K25r5K11j98K19l01J38J82j19j60Qr9M48L9
4949B87k97J27l72O86k37p9k96Q2J22rj10o1j27L79ol1J45n6j72M0m10M82jM6
4973A32k47j40K35M4J17r0K31l75K02l49K92KP3j68k18j09L11m2L9r4J68j72L14
4996A56O0l80p3L38J46n52M98j89k16K31j04K8k2K80k06j08n0L42k74L32r5j72
5018c0J01m4P8r1k05M56l56K49l04K76N2j91j54o7J46l7L71n88O32l94n4J47q4
5041i1K2J81l30R3k7l3J65J57l34J45j54J75j47P5J5j8L6L34m33L29p4j20J41
5064A07k00J79Kk71L84n42K88j25Q7p1J87M1j59L28m73K33k4n1K94k99l8J32M73
5087D82m17l1j84L69k10J00k52K51p8M9M1j75kN1J25l34J50n7K13k22N9j99R4
$$ plain form
5110 -177 172 69 -24 1 -51 -243 -84 61 -197 46 245 61 -340 -19 -23 -27 -24 -147 -168 43 179 345 180
5133 180 -5 108 -68 -14 159 182 13 141 103 80 84 -194 -225 -216 -117 -201 232 -36 -34 100 -21 -198 -53 14 -285
5158 -285 17 -157 -47 -172 -36 23 -213 241 45 40 -117 86 73 25 136 23 166 30 120 145 -34 35 -228
5181 -228 -129 207 102 131 -238 -19 -85 86 -193 -91 48 167 376 -43 179 -85 40 -76 136 289 -39
5202 -39 104 -25 68 8 -12 66 -27 77 -255 -24 -20 -29 -89 -22 -48 -491 269 -185 174 27 135 -123 -202 -59 192
5227 192 86 20 296 -55 172 1 161 10 15 -11 105 24 -129 56 260 -444 159 -35 -101 -128 -109 38 -26
5250 -26 240 44 -26 186 104 38 -48 -9 -121 -37 188 129 54 -13 49 27 28 -75 -25 207 -59 -181 -147 55 93 -40
5276 -40 -13 -89 97 -189 -75 -140 272 88 -52 171 -147 25 169 -37 15 -89 -331 85 -278 -32 11 -173
$$ packed form
5110a77L49j03r3K5n2j92J59J45k58K43J99j84m01L21mmLj23k1K11J36J66j65
5133A80j85J13j76N4J73K3j69J28l8k3Mk78l1RR9q4M33k68KJ34j21j77J45O7k99
5158b85L02j74J10j25J36N9k36M54j96nj57K03j3m8J11j13J43j36R0K5j79O9k63
5181b28R9L36j05K9l69K19o6J71k79J02J39J19K09m19K22k64J25j16K12J53l28
5202c9J43j29R3o0k0P8r3J04l32K31Mro0O7k6m43P60m54L59j47J08k58p9J43K51
5227A92j06o6K76l51K27j71J60j51Nk6J16q1j53J85K04p04O03j94o6k7J9J47o4
5250b6K66j96p0K12q2o6q6L9j12Q4K25n9p5o7O2k2Jj03N0K32k66j22L4K02L8j33
5276d0K7p6J86k86J14o5M12j84j40K23l18J72J44k06N2j04k42M16l63K46M3j84
$$ plain form
5298 -173 67 84 63 105 128 -168 183 -393 149 260 207 -180 414 -10 -89 -153 66 -36 -26 144 -278 75 226
5321 226 -74 137 -422 -49 32 55 -103 167 7 -199 -25 81 -38 293 -32 28 -3 -223 187 -52 -105 35
5343 35 -39 139 48 21 17 -355 165 -12 -139 167 -28 -27 -47 -36 -88 -327 8 -10 50 73 -184 12 -89 -40 25
5368 25 -146 47 -83 -205 186 67 164 -95 -219 -178 -153 -229 -307 211 -105 73 23 -163 -44 -72 96 246 -32
5391 -32 -188 35 135 -156 224 -363 -413 -46 -17 21 162 4 -315 -150 -66 -38 -333 118 173 169 20 -65 297
5414 297 97 -78 -70 -16 251 152 11 336 -14 -262 -146 -189 140 89 -73 301 -172 298 -169 -105 -196 193 -227
5437 -227 99 -64 -136 -144 -116 -303 -10 39 -204 -84 94 -25 284 -126 -300 -10 -301 300 -22 29 -36 -10 104
5460 104 69 -125 310 73 156 -178 28 -130 -3 -253 -247 -80 40 -278 -84 170 158 71 1 406 -137 -60 2
$$ packed form
5298a73K40J7k1M2K3k96L51n76N42J11n3l87N94m24p9o4K19j02J0J70m22L53J51
5321B26l00K11n59L73Q1K3j58K70j60k06J74J06j19L31l25O0l1k20M10k39n3J40
5343C5p4J78r1k7ml72N20j77j27L06j95Jk0J1n2k39L35j8O0K3k57J96j01M9O5
5368B5j71J93j30j22L91j19R7k59j24M1K5p6p8N18l16J78n0j86J19k8J68J50k78
5391c2j56K23J00k91L80n87n0L67K9L8J41j58l19J65Q4K8k95M51N5mj49q5L62
5414B97k00j75QN4K67r9j41L25l50k48J16m3L29n1j62L74m73M70m67O4r1L89m20
5437b27L26j63p2qK8j87K93M9k43J20J78j19L09m10j74K90k91O01l22N1o5K6J14
5460A04l5j94M35k37Q3l34K06j58J27k50OJ67J20l18J94K54j2q7p0M05n43P7O2
$$ plain form
5483 2 258 -168 -114 -121 66 -227 183 0 -11 216 -43 176 53 -265 -15 450 -63 91 293 179 24 -178
$$ packed form
5483BK56m26N4pJ87k93M10j83j1K27k59K19j23l18K50M65n13J54K02j14j55k02
$$ [...]
8191f3
##END NTUPLES=NMR FID
##END=
