##TITLE=1H_SAV-32-singlet-brf19(2H)
 CDCl3, 8 sc, 
 19.11.2020
##JCAMPDX= 6.0         $$ Bruker NMR JCAMP-DX V2.0
##DATA TYPE= NMR FID
##DATA CLASS= NTUPLES
##ORIGIN= UXNMR, Bruker Analytische Messtechnik GmbH
##OWNER= root
$$ XWIN-NMR		Version 3.5
$$ Thu Nov 19 10:40:34 2020 Russian Standard Time (UT+4h)  she@DPX200
##.OBSERVE FREQUENCY= 200.1315066352
##.OBSERVE NUCLEUS= ^1H
##.DELAY= (6, 6)
##.ACQUISITION MODE= SIMULTANEOUS
##.ACQUISITION SCHEME= undefined
##.AVERAGES= 8
##.DIGITISER RES= 18
##SPECTROMETER/DATA SYSTEM= spect
##.PULSE SEQUENCE= zg30
##.SOLVENT NAME= CDCl3
##.SHIFT REFERENCE= (INTERNAL, CDCl3, 0, 15.7039)
##AUDIT TRAIL= $$ (NUMBER, WHEN, WHO, WHERE, WHAT)
$$ ##TITLE= Audit trail, XWIN-NMR		Version 3.5
$$ ##JCAMPDX= 5.01
$$ ##ORIGIN= Bruker BioSpin GmbH
$$ ##OWNER= she
$$ F:/spectra/data/she/nmr/H-F/1/audita.txt
$$ ##AUDIT TRAIL=  $$ (NUMBER, WHEN, WHO, WHERE, WHAT)
(   1,<2020-11-19 10:36:24.31 +0400>,<she>,<DPX200>,
      <created by zg, POWCHK disabled, PULCHK disabled
       configuration hash MD5:
       00 E9 B6 7A A2 85 ED C7 34 08 36 98 17 FE 4E 26
       data hash MD5: 16K
       9A A3 CF 48 9E 06 3F 14 44 7F 37 05 94 6A 67 3E>)
$$ ##END=
$$ 
$$ hash MD5
$$ B2 85 A1 22 71 33 B7 98 40 40 3A 01 9E 99 0F 25
##$RELAX= 
##$RELAX= 
##$RELAX= 
##$RELAX= 
##$RELAX= 
##$RELAX= 
$$ Bruker specific parameters
$$ --------------------------
##$DU= <F:/spectra>
##$EXPNO= 1
##$NAME= <H-F>
##$PROCNO= 1
##$TYPE= <nmr>
##$USER= <she>
##$AMP= (0..31)
100 100 100 100 100 100 100 100 100 100 100 100 100 100 100 100 100 100 
100 100 100 100 100 100 100 100 100 100 100 100 100 100 
##$AQSEQ= 0
##$AQ_mod= 1
##$AUNM= <au_zg>
##$AUTOPOS= <>
##$BF1= 200.13
##$BF2= 200.13
##$BF3= 200.13
##$BF4= 200.13
##$BF5= 200.13
##$BF6= 200.13
##$BF7= 200.13
##$BF8= 200.13
##$BYTORDA= 1
##$CFDGTYP= 0
##$CFRGTYP= 5
##$CHEMSTR= <none>
##$CNST= (0..31)
1 1 145 1 1 1 1 1 1 1 1 1 1 1 1 1 1 1 1 1 1 1 1 1 1 1 1 1 1 1 1 1 
##$CPDPRG= <>
##$CPDPRG1= <>
##$CPDPRG2= <>
##$CPDPRG3= <>
##$CPDPRG4= <mlev>
##$CPDPRG5= <mlev>
##$CPDPRG6= <mlev>
##$CPDPRG7= <mlev>
##$CPDPRG8= <mlev>
##$CPDPRGB= <>
##$CPDPRGT= <>
##$D= (0..31)
0 1.2 0 0 0 0 0 0 0 0.06 0 0.03 0 0 0 0 0.0002 0 0 0 0 0 0 0 0 0 0 0 0 
0 0 0 
##$DATE= 1605767783
##$DBL= (0..7)
120 120 120 120 120 120 120 120 
##$DBP= (0..7)
150 150 150 150 150 150 150 150 
##$DBP07= 0
##$DBPNAM0= <>
##$DBPNAM1= <>
##$DBPNAM2= <>
##$DBPNAM3= <>
##$DBPNAM4= <>
##$DBPNAM5= <>
##$DBPNAM6= <>
##$DBPNAM7= <>
##$DBPOAL= (0..7)
0.5 0.5 0.5 0.5 0.5 0.5 0.5 0.5 
##$DBPOFFS= (0..7)
0 0 0 0 0 0 0 0 
##$DE= 6
##$DECBNUC= <off>
##$DECIM= 32
##$DECNUC= <off>
##$DECSTAT= 4
##$DIGMOD= 1
##$DIGTYP= 9
##$DL= (0..7)
0 120 120 120 120 120 120 120 
##$DP= (0..7)
150 150 150 150 150 150 150 150 
##$DP07= 0
##$DPNAME0= <>
##$DPNAME1= <>
##$DPNAME2= <>
##$DPNAME3= <>
##$DPNAME4= <>
##$DPNAME5= <>
##$DPNAME6= <>
##$DPNAME7= <>
##$DPOAL= (0..7)
0.5 0.5 0.5 0.5 0.5 0.5 0.5 0.5 
##$DPOFFS= (0..7)
0 0 0 0 0 0 0 0 
##$DQDMODE= 0
##$DR= 18
##$DS= 0
$$ [...]
##$SUBNAM2= <"">
##$SUBNAM3= <"">
##$SUBNAM4= <"">
##$SUBNAM5= <"">
##$SUBNAM6= <"">
##$SUBNAM7= <"">
##$SUBNAM8= <"">
##$SUBNAM9= <"">
##$SW= 16.9725356469052
##$SWIBOX= (0..15)
0 0 2 0 0 0 0 0 0 0 0 0 0 0 0 0 
##$SW_h= 3396.73913043478
##$TD= 16384
##$TD0= 1
##$TE= 0
##$TE2= 300
##$TE3= 300
##$TEG= 300
##$TL= (0..7)
0 120 120 120 120 120 120 120 
##$TP= (0..7)
150 150 150 150 150 150 150 150 
##$TP07= 0
##$TPNAME0= <>
##$TPNAME1= <>
##$TPNAME2= <>
##$TPNAME3= <>
##$TPNAME4= <>
##$TPNAME5= <>
##$TPNAME6= <>
##$TPNAME7= <>
##$TPOAL= (0..7)
0.5 0.5 0.5 0.5 0.5 0.5 0.5 0.5 
##$TPOFFS= (0..7)
0 0 0 0 0 0 0 0 
##$TUNHIN= 0
##$TUNHOUT= 0
##$TUNXOUT= 0
##$USERA1= <user>
##$USERA2= <user>
##$USERA3= <user>
##$USERA4= <user>
##$USERA5= <user>
##$V9= 5
##$VALIST= <valist>
##$VCLIST= <CCCCCCCCCCCCCCC>
##$VD= 0
##$VDLIST= <DDDDDDDDDDDDDDD>
##$VPLIST= <PPPPPPPPPPPPPPP>
##$VTLIST= <TTTTTTTTTTTTTTT>
##$WBST= 1024
##$WBSW= 4
##$XGAIN= (0..3)
0 0 0 0 
##$XL= 0
##$YL= 0
##$YMAX_a= 885356
##$YMIN_a= -713595
##$ZGOPTNS= <>
##$ZL1= 120
##$ZL2= 120
##$ZL3= 120
##$ZL4= 120
##$ABSF1= 10
##$ABSF2= 0
##$ABSG= 5
##$ABSL= 3
##$ALPHA= 0
##$AQORDER= 0
##$ASSFAC= 0
##$ASSFACI= 0
##$ASSFACX= 0
##$ASSWID= 0
##$AUNMP= <proc_1d>
##$AZFE= 0.1
##$AZFW= 0.1
##$BCFW= 1
##$BC_mod= 2
##$BYTORDP= 1
##$COROFFS= 0
##$CY= 11.3945322036743
##$DATMOD= 1
##$DC= 2
##$DFILT= <>
##$DTYPP= 0
##$F1P= 15.9154993809931
##$F2P= -4.1035820241983
##$FCOR= 0.5
##$FTSIZE= 0
##$FT_mod= 4
##$GAMMA= 1
##$GB= 0.15
##$INTBC= 1
##$INTSCL= 1
##$ISEN= 128
##$LB= 0.24
##$LEV0= 0
##$LPBIN= 0
##$MAXI= 10000
##$MC2= 0
##$MEAN= 0
##$ME_mod= 0
##$MI= 1.114404
##$NCOEF= 0
##$NC_proc= 0
##$NLEV= 6
##$NOISF1= 3.799351
##$NOISF2= 2.8
##$NSP= 1
##$NTH_PI= 0
##$NZP= 0
##$OFFSET= 15.70392
##$PC= 1
##$PHC0= -11049.88
##$PHC1= 15.2009
##$PH_mod= 1
##$PKNL= yes
##$PPARMOD= 0
##$PSCAL= 0
##$PSIGN= 0
##$REVERSE= no
##$SF= 200.130013532006
##$SI= 16384
##$SIGF1= 3
##$SIGF2= 2
##$SINO= 400
##$SIOLD= 16384
##$SREGLST= <1H.CDCl3>
##$SSB= 0
##$STSI= 0
##$STSR= 0
##$SW_p= 3612.71676300578
##$SYMM= 0
##$S_DEV= 0
##$TDeff= 0
##$TDoff= 0
##$TI= <>
##$TILT= no
##$TM1= 0
##$TM2= 0
##$TOPLEV= 0
##$USERP1= <user>
##$USERP2= <user>
##$USERP3= <user>
##$USERP4= <user>
##$USERP5= <user>
##$WDW= 1
##$XDIM= 8192
##$YMAX_p= 0
##$YMIN_p= 0
$$ End of Bruker specific parameters
$$ ---------------------------------
##NTUPLES= NMR FID
##VAR_NAME=  TIME,          FID/REAL,        FID/IMAG
##SYMBOL=    X,             R,               I
##VAR_TYPE=  INDEPENDENT,   DEPENDENT,       DEPENDENT
##VAR_FORM=  AFFN,          ASDF,            ASDF
##VAR_DIM=   8192,          8192,            8192
##UNITS=     SECONDS,       ARBITRARY UNITS, ARBITRARY UNITS
##FACTOR=    0.0002944,     1,               1
##FIRST=     0,             0,               0
##LAST=      2.4114304,     0,               0
##MIN=       0,             -713595,         0
##MAX=       2.4114304,     885356,          0
$$ Real data points
##PAGE= N=1
##DATA TABLE= (X++(R..R)), XYDATA
$$ [...]
2219c453O483J24q315P784k918m663Q027m343j766O305n065k08M986m185J130
2234g7L299l917O91O15m359L090Rk290N789k130j116M842n240l05L091n181K802
2251c87J154k755L513j731l63J973j822J951k52j093J365k150k07j71j569L253
2267G09j374P14L555l354J038J186m318J316J228l286K369J499l023K683L26l134
2283a866L887q00k873N212l999k339N601p327J925N903p522N891K450p455P210
2298C898l371m858P274o218J92O616p362L458L742p408N355J437o081N720j08
2313B286o069N385k122m503O994l283r84P437n835Q72N031r128L901K459p844
2328e403P621j405m449P952n190m96N677o218K936K132n708M153j202l971M573
$$ plain form
2219 -3453 3030 3154 -5161 2623 -295 -4958 3069 -1274 -3040 3265 -1800 -2008 2978 -1207 -77
2234 -77 3222 -695 -4 611 -3748 -658 -649 -2939 2850 720 -396 4446 -794 -1099 1992 -3189 -387
2251 -387 767 -1988 1525 -206 -569 1404 -418 1533 1281 188 1553 -597 -804 -975 -2544 709
2267 709 -665 49 3604 250 1288 2474 -1844 -528 700 -2586 -217 1282 -1741 942 1268 -1866
2283 -1866 2021 1221 -1652 3560 -439 -2778 2823 -4504 -2579 3324 -4198 1693 4143 -3312 3898
2298 3898 527 -4331 2943 -3275 -3083 3533 -3829 -371 3371 -4037 1318 2755 -3326 2394 2286
2313 2286 -3783 1602 -520 -5023 1971 -1312 -2296 5141 -694 178 5209 -3919 -18 2441 -5403
2328 -5403 2218 813 -3636 4316 -874 -1370 4307 -1911 1025 3157 -2551 1602 400 -3571 1002
2343A002j679r90L938o07r15J642j607j442M25r21l11J702n56M03N98q10J409
2360A281j337L37J310k091P29J7k322J886j864L24L035k096K448K47k534K763
2376B133l434j094L095l727K846J405l586L973p44k836M414k215j730L965l258
2391g93j560L627l467o42N110l365Q96M398n447K569J777p263M959r33m178P632
2407C320m275r77O884p667K824M237q111O088K80o931P265l465m072P405l772
2422i67n40O224m982P87L171o018J667K068m933L715O07l193M811j629k807N022
2438C003l302r63L965m661J197K014m812L367L42k471L735r68j29K124l233l21
2454a113Q90j730O13O86M22K75Q50m47n91J156n88q49O90m6m14j027P4N58m64
$$ plain form
2343 1002 -677 -1667 2271 1664 749 2391 784 -658 -233 -1154 -1465 237 -319 84 682 -128 1281
2360 1281 -56 281 1591 -500 229 246 -2076 -190 -2054 -1730 1305 -791 1657 1904 -630 2133
2376 2133 -1301 -2395 700 -3027 -181 1224 -2362 1611 867 -1969 2445 230 -1500 2465 -793
2391 -793 -2353 1274 -2193 -2835 2275 -1090 -194 4204 -1243 1326 3103 -4160 799 -134 -4312 3320
2407 3320 -955 -1932 4952 -2715 109 4346 -3765 2323 2603 -4328 2937 -528 -4600 2805 -967
2422 -967 -1507 4717 -265 522 3693 -2325 -658 1410 -3523 192 799 -2394 2417 788 -2019 3003
2438 3003 -299 -1262 2703 -1958 -761 1253 -3559 -192 150 -2321 1414 446 317 2441 -792 -1113
2454 -1113 -223 -1953 -1340 -654 -232 43 893 446 -145 1011 423 -426 264 218 -196 -1223 -1149 -591 -1055
2473a055J706K23KJ683j931m81J77k029J503j110l47M190l127P54L096n428L359
2490A185J136n157N039j546l462N424m456j66M779m944K892L744o073L326N03
2505B224o036M263q03l662O382j951j887M765m139K84K927m986K911J778n963
2520c893M751l12m945O440k214k145O332l699j329L789m826N46J956l994L299
2535b44J253l044L640k20k938L357j686k094L898k667q93K938l015J047J626k740
2551a782L141N18k537L451k249k094K991l273Q2L404k478J276J613j781J422j444
2567B60o86J659j803O77R3j512J864o16q63K419j200M91J077k376J716j130k970
2584b900L112j310r67M063k212k07L098l993N62K079l258K518l63k693L996k583
$$ plain form
2473 -1055 651 874 876 2559 628 147 324 -1705 -202 -1312 -1659 2531 -596 158 3254 -2174 1185
2490 1185 2321 -2836 2203 657 -2805 2619 -1837 -2003 2776 -2168 724 4468 -1605 1721 2224
2505 2224 -3812 451 -352 -4014 2368 417 -1470 3295 -844 -560 2367 -2619 292 2070 -3893
2520 -3893 858 546 -4399 2041 -173 -2318 4014 315 -1014 2775 -2051 -1505 451 -3543 -244
2535 -244 1009 -2035 1605 1385 -1553 1804 118 -1976 1922 -745 -1638 1300 -1715 -668 958 -1782
2551 -1782 1359 1877 -660 2791 542 -1552 1439 -1834 -1752 1652 -826 450 2063 282 1704 260
2567 260 -426 1233 -570 107 200 -1312 552 -64 -927 1492 292 783 1860 -516 1200 70 -2900
2584 -2900 212 -1098 -2065 1998 -214 -421 2677 -1316 -754 1325 -1933 585 222 -2471 1525 -1058
2600a058j265M583l544R84L933n273J786K099n607L162Q14m025M867r48j909M592
2616C191l455o84L542m770J430L065n173L032J583m868L718Q04l290M442j385
2631A182j925L459l918m29L118m143K212K871m152L539R14m495L598r23l097L856
2647A667k060r48L230l212Q42J969k958K636O02k800K835j628j917K199k017j53
2663a713K177j296J567O43j190O35j199m21J068j943Q69R00j345J294k57q68J809
2680G30q50M15R48j751N21k50j952J751J14j334L002p48q36K611k879l10K379
2697A561l233J633J000l301L882j070k358L966k052o85L485l210M48J789l786
2712a931J645J377l390L392K40k402L820j580k688L459k463j504L590l141O60
$$ plain form
2600 -1058 -2323 2260 -1284 -300 3633 -1640 146 2245 -3362 -200 614 -3411 1456 508 -1401 3191
2616 3191 -264 -948 2594 -2176 -746 2319 -2854 178 1761 -3107 611 1415 -1875 2567 1182
2631 1182 -743 2716 -1202 -1631 1487 -2656 -444 2427 -1725 1814 2728 -1767 1831 908 -2189 1667
2647 1667 -393 -1341 1889 -1323 -481 1488 -1470 1166 1768 -1032 1803 175 -1742 457 -1560 -1713
2663 -1713 464 -832 735 1378 188 823 -376 -797 271 -1672 -803 97 -1248 46 -211 -1079 730
2680 730 -120 295 1243 -508 13 -237 -2189 -438 -324 -1658 1344 596 -240 2371 -508 -818 1561
2697 1561 -1672 -39 961 -2340 1542 472 -1886 2080 28 -657 2828 -382 66 1855 -1931
2712 -1931 -286 1091 -2299 1093 1333 -1069 2751 1171 -1517 1942 -521 -2025 1565 -1576 -916
2727i16K736l836K708J046l543L823j043k965M172k827j815L653l198J053K833
2742A881k892J809Q99l033K182r26j779K511j426q13K836j854l56K214j987N66
2758a68J475j868R31L04k025J122n84p60K276j558J082J482k024R66j45j898J711
2775C19r36Q1J037j116J296l75q18J445q23K7J545j554R3J27j367R09p4j99J435
2794A052m47n6J063j454l61Q41j510k04K175j998N67J882k589J448M00k360K972
2811A421j176j386K713l232L86K345l517K496J399l154L282p20k535K564j999
2826a113r09K737j885Q70J659k216O81J468k615J641R09k569K123k14k526K546
2842E87q79r39L074k259N56K145l449K206k36l109L338j175j104K777j654k80
$$ plain form
2727 -916 1820 -2016 692 1738 -1805 2018 975 -1990 2182 -645 -2460 1193 -2005 -952 1881
2742 1881 -1011 798 1697 -1336 846 -80 -1859 652 -774 -1587 1249 -605 -961 1253 -734 -168
2758 -168 1307 -561 370 674 -1351 -229 -813 -1573 703 -855 227 1709 -315 651 506 -1392 319
2775 319 -617 -536 501 -615 681 306 -512 933 110 137 1682 128 221 348 -1019 -110 -184 -383 1052
2794 1052 605 549 1612 158 -203 638 -872 -1076 1099 -899 -332 1550 -1039 409 809 -1551 1421
2811 1421 245 -1141 1572 -1660 -1274 1071 -2446 50 1449 -1705 1577 857 -1678 886 -1113
2826 -1113 -2022 715 -1170 -300 1359 -857 -176 1292 -1323 318 1227 -1342 781 567 -1959 587
2842 587 -292 -1231 1843 -416 140 2285 -1164 1042 806 -2303 1035 -140 -1244 1533 -121 -401
2858d01J772j689N99N81j142Q45q7r34N98l28p71J370j67l63J561o17q64L72r59
2877f24K29L92q35J404n20j74J394k166J205P28k064J545m68j009J686j809QJ694
2895F16k184K307k48j623L019k312r24K153j951j4J605j656J427L38j480J101
2911A74N1j096J551o94r49K183j743j336L016j963j14K509k226J178J325l220
2927a354J890j64j816K702j529lK735l190P25J741k578R57R30k041J951m30j672
2944a146J482n22p41J828o12p54K666k526k10J767k941R22J518k215K262j55j935
2961a312K659j685m02J641k214J546N78k351K230p98r23J938j774N84J422j662
2977e23Q56m19n93P45j032K57J146n19K20L55n09k16K18k60L68j35k86L62j79
$$ plain form
2858 -401 1371 -318 281 862 -280 565 478 -456 142 -186 -957 413 246 -117 1444 827 -37 335 -624
2877 -624 -395 -3 -838 566 46 -128 1266 -900 305 1033 -1031 514 46 -963 723 -1086 -1078 616
2895 616 -1568 739 491 -1132 1887 -425 -1349 804 -1147 -1161 444 -1212 215 553 -927 174
2911 174 225 -871 680 -14 -963 1220 -523 -1859 1157 -806 -920 1589 -637 541 1866 -1354
2927 -1354 536 372 -1444 1258 -271 -274 2461 -729 -4 1737 -841 116 1046 -995 956 526 -1146
2944 -1146 336 -186 -927 901 289 -465 2201 -325 -535 1232 -1709 -787 731 -1484 778 623 -1312
2961 -1312 1347 -338 -740 901 -1313 233 811 -1540 690 -108 -1031 907 -867 -283 1139 -523
2977 -523 333 -86 -679 66 -966 -709 437 -82 138 493 -16 -232 -14 -274 94 -41 -327 35 -144
2996a44j23O71q13K99J384j590P99M19j548R47n58o38J758r16j17J333j404O01
3014C60K01j520J434K13j408J385m89q69J177p48p7J401j174n8J464j766N77N11
3032F14k390J704Q21k344K480j73j998K569j784n04J989k575J421O43j956K320
3048H37j157j400K962j630m32K158j962L38P46j681J047K1o01J019J31p20J107
3065G83r95n52J319o32m06J083q53L17L96r31Q66k86l66J305r30k6R19j642M48
3084a83Q57j456R31P46q54Q70o28m99P80q77J12L66o78O04K47q22P70r6j94M50
3104D46k56k84R71j304J25Q19j413P59P22j254J821p81j208J835j578L6R51j357
3122i50R44O00j531J304o39q23J944j329L07R82k044Q48J085k321J572M96j489
$$ plain form
2996 -144 -267 404 -409 -110 1274 -316 483 902 -646 301 -257 -895 863 -53 -170 1163 -241 360
3014 360 561 -959 475 688 -720 665 176 -693 484 -264 -341 1060 -114 -172 1292 -474 103 614
3032 614 -1776 -72 749 -1595 885 712 -1286 1283 -501 -1005 984 -1591 -170 473 -1483 837
3048 837 -320 -1720 1242 -388 -820 1338 -624 -286 460 -1221 -174 -153 -754 265 396 -324 783
3065 783 -212 -764 555 -77 -483 600 -253 64 460 -471 395 109 -257 1048 118 92 1011 -631 -183
3084 -183 674 -782 149 895 41 911 283 -216 564 -313 -201 165 -513 91 338 -484 286 190 -4 446
3104 446 190 -94 877 -427 -302 517 -896 -137 585 -669 1152 371 -837 998 -580 -544 407 -950
3122 -950 -6 594 -937 367 -272 -1095 849 -480 -173 809 -1235 -387 698 -1623 -51 445 -1044
3139a044J800n45m55Q98j202r6J271j298N17R50j461R90M58j409R98n2m18J188
3157A090r83j35Q84j458N24O42j242J232K92j416J533m74j374J384n15n53J566
3174I97j263N64O6o46L89L1q27J385p57m93J162j431J61Q72q20L55N11p67Q83
3193C72l14p21J085q86q9J093j245O01N84j093M19M35q68J096m94l68J181j232
3211d44Q3P66j484J440L10j449J543m66p36J181j150j84J179j240P73O83j497
3228f92J158l03p88Q42q0o24J412q44l64J113j312J83R89j030J153J40j471J283
3246G65o80q37J607r19m22J573j166K80N19j494J245J08j181J427r95j56P26j217
3264h17K97J041j105L97N42q15M82J29j000R84k56o14J373j269O8J305j555N56
$$ plain form
3139 -1044 756 211 -244 654 -548 -644 627 -671 -154 796 -665 325 783 -626 372 320 -98 1090
3157 1090 107 -28 856 -602 -78 564 -678 554 846 -570 963 489 -885 499 -16 -569 997
3174 997 -266 298 364 -282 107 138 -689 696 -61 -554 608 -823 -662 210 -610 -255 256 -511 372
3193 372 58 -663 422 -464 -553 540 -705 -104 480 -613 -194 241 -627 469 -25 -393 788 -444
3211 -444 -361 405 -1079 361 671 -778 765 299 -437 744 -406 -590 589 -651 122 805 -692
3228 -692 466 163 -625 217 137 -487 925 81 -283 830 -482 -299 690 -340 813 953 -518 765
3246 765 85 -752 855 -64 -486 1087 -79 201 720 -774 471 579 -602 825 -170 -326 400 -817
3264 -817 -520 521 -584 -187 355 -460 22 151 -849 135 -121 -735 638 -631 -563 742 -813 -257
3282b57Q88j792J275J78r60J216o19m65R66j083P51P47j371J177k52p45R44m57
3300A41n91J400j032M63L47r35N53j77n32R37j71r34J154l56r18R74k13n29Q82
3319D63n66Q3P38r12M81n4r46J031q15J04J165j298M61K93j074P94L88r28J100
3338E08n18l98P86r12j84J324j084J75J046j281K29P51j219M87L03p63J253n27
3356b4k85Q43r86K85P25j385J134mj198J492o09q84J606j250M42P97j164R65j54
3375C46p27Q45l81n26J119n31o7O98r42J49M78l90J6L25m42M38l8o46O92m03l36
3396c23J067p25l13J304j609P11K07o70N44j83k90Q86j319N40P47j518Q20M95
3414C71j455J240j41r91J114l66l72N71m11M10K95j051P68L35j210J021K29q30
$$ plain form
3282 -257 631 -1161 114 292 -668 548 -71 -536 430 -653 98 845 -526 651 399 -346 598 141
3300 141 -450 950 -82 381 728 -207 346 169 -363 574 403 -531 623 267 -651 323 110 -419 463
3319 463 -103 -20 718 -194 287 233 -713 318 -497 -393 772 -526 -65 228 -846 -52 336 -592 508
3338 508 -10 -408 378 -534 -718 606 -478 -303 743 -538 -309 442 -777 -290 13 -750 503 -24
3356 -24 -309 534 -452 -167 558 -827 307 303 -895 597 -12 -896 710 -540 -98 699 -465 500 346
3375 346 -381 464 83 -443 676 145 78 776 -166 -17 461 71 87 412 -30 408 370 -276 416 13 -323
3396 -323 744 19 -294 1010 -599 112 319 -351 193 10 -280 606 -713 -173 574 -944 -124 371
3414 371 -1084 156 15 -976 138 -228 -600 -29 -440 -30 265 -786 -18 317 -893 128 357 -473
3432d73P82k40q13J347p71k94R39r70J107k67j135J671r35o74J678j438N10R02
3450I26j648R64L30j129J023m49l35R13q39L21L61o03Q0K87k65R2K06m60L75K00
3470C50o31L98L2m19R13q00p7Q79o83k30P60j465J442j21q77R70l83m38Q28j004
3490e56L93N63j195Q44K24q23P05m90j32Q87n54k14N52p37K48J46o13O23K07p95
3510g17Q90K44j155J248r76J92J100j248Q13K22j251J238p06n03J601j374K25
3527a57R89j051O81k81n67P40l53M8N91o84J95K98o69M16L47o35M44J85n48k5
3547c6J98o87M81K53n11O98l04l73M49j004Q80J15q36Q95Ro31R80o75k71P20p50
3568d00K58K79o05O96j00p04O28k45l88J096o43k98R12n26k45N11p06J94M71n90
$$ plain form
3432 -473 309 69 -744 603 -168 -462 477 -493 614 347 -788 883 -52 -726 952 -486 24 926
3450 926 -722 242 572 -557 466 17 -318 595 -244 77 438 -165 -85 202 -63 29 235 -225 150 350
3470 350 -281 117 149 -270 643 -157 -234 645 -38 -268 492 -973 469 348 -529 441 58 -380 448 -556
3490 -556 -163 400 -795 49 273 -550 155 -335 -467 420 -134 -348 204 -533 -285 -139 -752 -129 78 -717
3510 -717 173 417 -738 510 -466 -274 826 -422 391 613 -638 600 -106 -609 992 -382 -157
3527 -157 832 -219 462 181 -386 354 1 49 640 -44 151 449 -220 196 543 -92 352 537 -11 -36
3547 -36 162 -525 -44 209 -302 396 92 -281 168 -836 44 159 -677 218 227 -404 576 -99 -370 350 -400
3568 -400 -142 137 -468 228 128 -576 52 -193 -581 515 -128 -426 486 -40 -285 226 -480 -286 185 -405
3588d05O50l04l12Q95p06k25J233q49O0M03r86O27j88l87J016p42K27P98j153
3607c48L59M51q26O16k83q1O56m36l4L38l15q1K06m18K81M56p26M13j02n53P01
3628B74j77n05Q34k28m36N94o71J88K12n79L90K63m36N55m21l96O77m26j22P06
3648B96n72K37Q0n45K66J23l09Q21n78k53J027r76J81O05q55M52M96q78O73k78
3668A3m84Q79m40j93P63n47L23K06r39P13k1q45J022P2p80Q33n35J23K65o92M31
3689A67j00m11O24n5m07N00l95l64N89m59J91J70j5j23K64n64M87r3l04P07m22
3710a3n4K05k71p5M45n09Q2L56l99K99m6m38N97l83K51J25n95K62J57l75M35k75
3732b19j50O42n48l4P65r96O17K07o74L99km94N64K29n45L85k97K4P73q49K99
$$ plain form
3588 -405 245 -59 -371 524 -182 -407 826 -23 37 440 -546 81 -107 -494 522 -220 7 805 -348
3607 -348 11 462 -364 252 -31 -112 544 108 74 412 97 16 222 -196 85 541 -185 228 126 -427 274
3628 274 97 -408 426 198 -238 356 -315 -127 85 -494 -104 159 -277 278 -143 -539 138 -288 -410 296
3648 296 -276 -39 41 -504 -238 -115 -424 397 -181 -434 593 -383 -202 403 -452 0 496 -382 291 13
3668 13 -471 408 -32 -225 538 -9 314 520 -419 294 273 -572 450 522 -258 575 40 163 428 -264 167
3689 167 67 -344 280 225 -182 318 -77 -441 148 -311 -120 50 35 -88 176 -388 99 6 -298 409 -13
3710 -13 -67 138 -133 -208 237 -272 -190 166 -233 66 20 -418 179 -204 47 172 -423 -161 -4 -379 56 -219
3732 -219 -369 273 -275 -309 456 -540 77 284 -390 9 7 -487 77 306 -239 146 -151 -127 646 -203 96
3753I6K53m46L88m5l30O21n15Q9O31p89J76K01o23M02J97m21K71j52k54O39o20
3774b31q7O61o29L71Q1m34J70Q3k57n5J54r1M43n52O2M36l68j86M78k88k5N15
3796B51n46o4M68n55N74j52j94Q62q57J11K51o66O18R9m41N81J0m98N10m34QL38
3818B74o91O48O0p19O39l8m53P46l83m76P39Kl13L5m75M20J30n92Q31j17j66O09
3840G10q57NQ34j175M42L20k88M96o17j85R68r50M16M81j112O93Qq60O74k9l44
3861c70K98J35j41K26k67o9K61n18J07M33m81k7M10m21L81K62p71O24n0l16N92
3882B98n74j96O97n79M6N80n12M42j65n66J026m56n33N90j47J5K74n98N33K80
3902D55o38L45K05l69O26m68m82P32n71j49O47l54J4L03p38P98l82m50P14m94
$$ plain form
3753 96 349 -97 291 246 -84 537 22 111 742 -47 129 330 -293 109 306 -115 156 4 -250 389 -231
3774 -231 -318 343 -286 85 166 -268 -98 -15 -272 -327 -173 -264 179 -373 -311 125 -243 -429 49 -239 -264 251
3796 251 -295 -359 109 -446 128 -24 -218 644 -213 -102 149 -517 101 200 -241 340 350 -148 362 -72 -64 274
3818 274 -417 231 291 -428 211 173 -280 466 83 -393 346 348 35 70 -405 15 145 -447 384 267 101 710
3840 710 -147 -142 692 -483 -41 279 -9 487 -130 -315 653 -297 119 600 -512 181 189 -671 3 -26 -370
3861 -370 -72 63 -78 148 -119 -188 73 -445 -338 95 -386 -413 -3 -424 -43 219 -552 72 22 -294 298
3882 298 -276 -472 225 -354 -308 272 -240 202 37 -529 497 41 -492 98 -49 -34 240 -358 175 455
3902 455 -183 162 367 -2 624 156 -326 406 -165 -314 333 -21 -7 296 -442 356 -26 -476 238 -256
3922b56L85J75m55M45j70l25L56k11L06pp04L30N2l84O29m72j38O52m27j29M75
3943A27P0k36p9ml4q6J34K03j64j00M08m03j19M79j54n11R41q53l1Q28r78N60
3965bo4j75P88k73m91O32n14q3N84p93L44N28n22M6L12n47N00l15o9P09o54j20
3987a79P23p23J8O67p73M86M94q16O42k17o89P64o49j1P69p88M09K30k92K98l39
4008B4m72M97k01J06k68PL48k44o0K65lJ90j68l97K81j11n2J22MJ24l18L85j6
4031D3l6K9j10K38L79m51l00J43M7J62j21K64k05J39O2m68K31J17j21P8j32j60
4053a72L82R2n00M85k08j30O56o53K88r0k83J94J24m32K97K49n20P49k91p08P26
4074B55j24o32P10m46K01K71p45R51k88n34Q40n69l72P52k52k70L04l88P8M52
$$ plain form
3922 -256 129 304 -151 294 124 -201 155 -56 250 243 -461 -131 -79 -463 166 -306 -444 208 -219 -348 127
3943 127 197 -39 -118 -122 -156 -242 -108 95 -69 -169 239 -164 -283 196 42 -469 472 -381 -412 416 -562 -2
3965 -2 -66 -241 547 274 -217 415 -99 -182 402 -391 -47 481 -41 5 317 -230 270 -45 -114 595 -59 -179
3987 -179 544 -179 -161 506 -267 219 713 -103 539 322 -367 397 -252 -263 506 -282 127 357 65 363 24
4008 24 -448 49 -152 -46 -314 -307 41 -203 -263 2 -1 189 21 -376 -95 -206 -258 -136 -132 -8 -326 59 43
4031 43 7 36 -74 164 543 92 -208 -65 -18 144 23 287 82 221 283 -185 46 163 42 120 -12 -172
4053 -172 210 302 -198 287 79 -51 605 -48 240 150 -133 61 185 -247 50 299 -221 528 237 -471 255
4074 255 131 -501 209 -237 -36 235 -510 441 153 -381 459 -110 -482 270 18 -252 52 -336 -258 194
4094A94l31J43K57n71Q8J60l84M12m2j77L31j99k04O42m43p9O66n58n5K56l55
4115b49R5L04n35O00k31j4K78L7k69J52k89K34J66l90L37j19J09L9l7j0k72L44
4137B80j3j71n8J5o9Pj0KK14j05k26M06k16K7l7n25K37K82j75J01K58l63M45m18
4161a12k01N86p65M48J86m58J96K21n42O99j12m90N35Mo33O68l06j87M15n73K13
4182b08M46m43K30N36o76R4M98j036L97L00n87N60Q0o71Q12p2o1K40o79K62L13
4203C35o28L65K27q33P02K26m74O19om43K39k23k6l0l77L67K0k07M21L28p02L89
4225B89l04R5J70k78k02jO0q5L34j82R6j8n7j00P9mJ34Q9l34l3J10j07o4N41o82
4250d54M33K06o30M08m1l63K36K12m62N01o1j00M09m71Q7M18k97r7N17n79k16
$$ plain form
4094 194 -137 6 263 -308 -220 -60 -444 -32 -74 -251 80 -119 -323 319 -124 -203 463 -95 -150 106 -249
4115 -249 -154 150 -385 215 -16 -30 248 285 16 168 -121 113 279 -111 226 107 216 255 218 208 -64 280
4137 280 267 96 38 53 -16 -9 -19 -17 197 92 -134 272 56 83 46 -479 -242 40 -135 -34 224 -139 306 -112
4161 -112 -313 273 -492 -44 142 -316 -120 101 -441 258 146 -344 191 195 -438 230 -76 -263 152 -421 -208
4182 -208 238 -205 25 561 -115 -21 477 -559 -162 138 -449 111 191 -480 332 260 199 439 -240 22 335
4203 335 -293 72 299 -534 168 394 -80 539 533 90 329 106 80 50 -327 40 60 -147 274 602 -100 289
4225 289 -15 80 250 -28 -230 -231 -171 -256 78 -104 -8 -26 -83 -183 -104 -108 26 115 -219 -252 -142 -249 -313 228 -454
4250 -454 -21 185 -445 -37 -78 -441 -205 7 -455 46 -15 -115 294 -177 -90 328 31 -66 451 -128 -344
4271c44O45l32n8M07m92O39Ko48L78l07j06N32k70l3O14o23OO63q61K88L71p00
4293b29M80J32p35M16j49j56N80m32O5N49m36k27N27q29L86J89o24M88K10m81
4313b76J39M85l70J62l57o7L61m47j7N35l30j54M74l67P9R7l8l01N40m81K19J33
4335A9n25P46J60n19M13k67l47N82m53J51M17n23n0L82Q4q0L43l34m2M7k88Q7
4357CK52k9k2j17J47J71l3o79Q56M0p83M52j91k16L68m41K7M85o89K57M76l63
4379b9K01J97q02N27j6q20O32J2j69P58m79j00N00p39J30M30p38O09n6q03Q41
4400H6J60m82N47j38n41R19j012K14O69o32j16K63j56J70J39J83k5j26k56m7L23
4421A42n48M92m3n01P50k21l65Q19l73p9L20l96K26J5m74J24M26o27O87k32k49
$$ plain form
4271 -344 301 -31 -89 318 -174 465 467 -181 197 -110 -216 316 46 13 627 4 10 673 -188 100 471 -229
4293 -229 251 383 -352 64 -85 -241 339 -93 -28 521 85 -142 385 -444 -58 131 -493 -5 205 -276
4313 -276 -137 348 -22 140 -217 -284 77 -370 -387 148 -182 -336 138 -229 -150 -53 -91 -392 148 -333 -114 19
4335 19 -506 240 400 -119 294 27 -320 262 -191 -40 377 -146 -196 186 270 190 533 199 157 204 -84 3
4357 3 255 226 204 87 234 405 372 -307 549 589 -194 258 67 -149 219 -222 -195 290 -399 -142 334 -29
4379 -29 172 369 -433 94 78 -742 -110 -98 -267 491 12 -88 412 -327 -197 233 -505 104 48 -755 86
4400 86 246 -236 311 173 -368 551 -461 -247 422 -210 -326 -63 -219 -49 90 273 248 122 -134 -181 142
4421 142 -406 86 43 -458 292 71 -294 525 152 73 393 -3 223 238 -236 -112 314 -313 374 142 -107
4442a07L99J11n62L10r1m9K0k22L62Q6k72j31K94j83M6M09n02n4K49o68R1L86
4464g8l94M71L76p64M71j10k93N72o31l29Q88j55l54M84k56q0N95p78N39L34j199
4485f91N45J49n34P98p5k53L71k46J73K28m03l48M25k85K74J75m37Q6N99n86J69
4506A34K23m33M40Q4n15M07m26m07J104l97mL22q96M25K62o72M79j18m45L99J13
4527G9l37N88k75P4K20j62k70K73l29k34O96o83K22J40j90L33r5l57M32j36j10
4548a21K34n9l81K69J92p32P05n4j14M39L4n94L67m17L6R5j91M7M13k17K72L70
4570E93o89M37j97k99M77m19j91L26Qj70O76m59k50N54k49n1Q9k11l5N81o35K96
4592A82Mn56Q30k34k29L00l10k24O34o68J26L93o21K00L83n45L49K11p36P53m98
$$ plain form
4442 -107 292 403 -159 151 60 11 31 -191 171 257 -15 -146 148 -35 11 420 -82 -136 113 -555 -464 -78
4464 -78 -472 -1 375 -389 82 -28 -321 251 -380 -709 179 24 -330 154 -102 -182 413 -365 174 508 -691
4485 -691 -146 3 -531 267 192 -61 310 64 237 465 62 -286 139 -146 128 303 -134 -48 551 -35 134
4506 134 357 -76 364 448 -67 340 -86 -493 611 214 210 532 -364 61 323 -349 130 12 -433 -34 79
4527 79 -258 330 55 129 349 187 -83 190 -139 -373 323 -360 -138 2 -188 145 50 -307 125 -11 -121
4548 -121 113 54 -327 -58 134 -598 107 53 -61 378 412 -182 185 -232 -196 -101 -292 -245 168 -49 223 593
4570 593 -96 341 144 -155 322 -97 -288 38 46 -124 552 93 -157 397 148 97 186 -25 -60 521 -114 182
4592 182 186 -370 460 226 -3 297 -13 -237 397 -271 -145 248 -373 -173 210 -335 14 225 -511 242 -256
4613b56j24L90k44k79O68k06j39M09j69k54M98o06R1L40q14L93L60m71M84J64
4633B35m31O25m65k53O23n32l36O10j59r5L69j71o4N49k81k5K29n27J43J77n76
4654c55L58J84j43R7R6k60K60k63k84P20n30o9K59kJ54Qn22L97M35n66O6L14p42
4677c88L61K02o56Q15j35m97P90k96l87M27l52j53M12q02M61L54o42L56M09p64
4697d85M58M54o91M91k84k40M32l73k60O80m12J66N22p66L95M03q72L59K17m64
4717b70K89L9l66L82J13o9L03j16m51L60m52P9M08l43k0M60k11J68J73o12K79
4738A43J56n06M29j90j52J75j45OM37l49p6K56l36J44K50o50L78K92o55K36J99
4759D2p6J98J31l96L68l34l34J94K2k92P32l23n13R83n73J15J14q1JJ53l22J02
$$ plain form
4613 -256 -380 10 -234 -513 155 -51 -190 219 50 -204 294 -312 -221 119 -695 -302 58 -413 71 235
4633 235 -196 429 -36 -289 334 -198 -534 76 -83 -178 191 20 -44 505 224 199 428 -99 44 221 -355
4654 -355 3 187 44 141 237 -23 237 -26 -310 410 -120 -189 70 68 222 230 -292 105 540 -26 40 354 -388
4677 -388 -27 175 -481 334 199 -298 492 196 -191 236 -116 -269 143 -659 -198 156 -486 -130 279 -485
4697 -485 -27 427 -264 227 -57 -297 135 -238 -498 182 -230 -64 458 -308 87 490 -382 -23 194 -270
4717 -270 19 58 -308 74 187 118 421 305 -146 214 -238 -159 249 -94 -114 346 135 303 476 -136 143
4738 143 299 -207 222 32 -120 55 -90 -84 353 4 -72 184 -152 -8 242 -408 -30 262 -393 -157 42
4759 42 -34 164 295 -101 267 -67 -401 -207 -185 -477 255 -68 -581 402 -171 -56 58 -23 -22 131 -191 -89
4781h9J68l89M48P8m73P09k48k39M67m78l78P47n68n3O43p15M50K02o83N76J00
4802B75n70L12m5l24K06K24j03K78l48J9K80m32J85L92l97J17qr2J02J55n62Q13
4824D77k94l22L45k57k59O81o10k02M79l96J17P34q57M37L3l51L04k9m94M48l2
4845d8l69P06k16l40O35l10j04K78n72P3J07l8R2Q2l66L98K17n36L63N54q95N61
4867B72L0o11N22j67j67L41p1k50M06j77n7L23m76K73J99o45k1N75n51M55P1l62
4889h8M36k31j46K02q8k44L55n83L71K23k92LK35L6l64N07n16N9L55m85J68M42
4911C55o51L00O4m20R39p32L6P0l06J66J73m69K70O11p30M46qm91M49j41j99N91
4933C23k89l27J08J44J98M0l31J2L39l06M33j05l02Q6n2P0J40J55o03M96j99k6
$$ plain form
4781 -89 79 -310 138 216 -257 452 204 -35 432 -46 -424 323 -245 -298 345 -370 80 282 -401 175 275
4802 275 -295 17 -28 -352 -146 78 -25 253 -95 -76 204 -228 -43 349 -48 69 61 -31 71 226 -336 477
4824 477 183 -139 206 -51 -310 371 -239 -441 38 -358 -241 493 -364 73 106 -245 59 30 -464 -16 -48
4845 -48 -417 289 73 -267 368 58 -46 232 -340 -267 -160 -198 -106 -24 -390 8 225 -311 52 606 -289 272
4867 272 302 -309 213 46 -121 220 149 -101 305 128 71 394 -82 191 390 -255 -276 299 -252 203 274 -88
4889 -88 348 117 -29 173 85 -159 196 -387 -16 207 -85 -82 153 189 -175 332 -184 -125 230 -255 -87 355
4911 355 -296 4 68 -352 587 -145 -109 -39 -345 -179 -6 -475 -205 406 -324 122 114 -377 72 -69 -268 323
4933 323 34 -293 -185 -41 157 197 -134 -122 217 -89 344 239 -63 23 -29 41 181 336 -267 229 30 4
4955DJ65j2k71J82l38L19K45m59m9N45m39K92Nl33J96K78n40J94J31l51L69l21
4977a88J83N89n10k53M53m96L99j43j61J48K41o95M09K40m12J25P0JJ43j79m09
4998d45O26k66l51N14l19k10P70n47lL04l90K95J38k52J2J92k77M93k94j29N74
5019D35m17j99K94k31K4L09l89P5L64k83K02J36l63j5J73l24L68k1l78K76k0k38
5041b22N34l56K18J81m37j70O80p56K94O5j30k3K17j65L28m00k69L98Pp8J94k90
5063a80l33Q72m72j67P10n79J74K26o75L88j17j91L74J6j12K84k67j27N41m18
5083e3j47M30l52m2M22o52N57J39n66K52K84m72J83K59j66m0o4j72M19k8m30L27
5105H8R2k44J29l1j53Q6j13J24J39l00J21K63m78L78R4l12J60Q3k21R2k01J03
$$ plain form
4955 4 169 157 -114 68 -270 49 294 -165 -214 331 -108 184 189 -144 52 330 -210 -16 115 -236 133 -188
4977 -188 -5 584 74 -179 274 -222 177 34 -127 21 262 -433 -24 216 -196 -71 -1 0 143 -36 -445
4998 -445 181 -85 -436 78 -241 -451 319 -228 -231 73 -317 -22 116 -136 -124 68 -209 284 -10 -139 435
5019 435 18 -181 113 -118 -94 215 -174 -99 265 -18 184 320 -43 -58 115 -209 159 138 -240 36 16 -222
5041 -222 312 -44 174 355 -82 -252 428 -328 -34 31 -99 -122 95 -70 258 -142 -411 -13 -6 -84 110 -180
5063 -180 -513 359 -113 -280 430 -149 25 251 -424 -36 -153 -344 30 46 -66 218 -49 -176 365 -53
5083 -53 -200 230 -122 -164 258 -394 163 302 -264 -12 272 -200 -17 242 76 36 -28 -200 219 191 -239 88
5105 88 180 -64 65 34 -119 -33 -146 -22 117 -183 -62 201 -277 101 195 -117 43 126 -95 -3 -204 -101
5127a01K46m19J03N09n89K09L3o9J52k2j77L0K69n86K57K66l21L93j37j71K75
5148A50k02k44M49n36M58N2n02Q8M87m60K42J06k78M15k30k16M64l55q4M53l2
5169B25k10L67k51j49L65m06J65Q8j80j67K02l15N79k19k89M44J17o22L80l42
5189b18K84K78m28j94M23j79k37O31n34kM97k74m52N52k82R0L3q5L20k96k37M87
5211A77k67l8K83l26P1N9k13J1K01l05L68pl87L14kl49N02l07l66Q80l33j03M63
5234C26l98J23L4L9k86k0M7L11J44p54N77N8k19Q2J89l44K43k7j69L20l30j11
5256a65K51Q9k65L03j46q1K48l70K15j81n9M7J49k51M39j0m84M53j87M5J41m10
5278b29n9N53l19j19J47%K1ql18M75P3m70M01l23J28J54l71P0N29m92j29K85l4
$$ plain form
5127 -101 145 -274 -171 338 -251 -42 -9 -78 74 52 -125 -95 174 -412 -155 111 -210 183 46 -125 150
5148 150 -52 -296 153 -383 75 127 -375 -287 200 -260 -18 88 -190 225 -5 -221 243 -112 -196 257 225
5169 225 15 382 131 -18 347 -59 106 194 14 -153 49 -266 313 94 -195 249 366 -256 124 -218
5189 -218 66 344 -84 -278 145 -34 -271 360 -174 -176 321 47 -405 147 -135 -45 -12 -97 223 -73 -310 177
5211 177 -90 -128 155 -171 -100 -41 -254 -243 -42 -347 21 14 -373 -59 -61 -410 92 -215 -581 299 -34 -137 326
5234 326 -72 51 85 124 -162 -182 -135 176 320 -434 143 201 -18 64 253 -91 152 125 -44 276 -54 -165
5256 -165 86 175 -90 213 67 -14 234 -136 79 -102 -161 -114 35 -216 223 213 -271 182 -5 40 181 -229
5278 -229 -288 265 -54 -173 -26 -26 -5 -13 -331 144 217 -253 148 -175 -47 107 -264 -194 335 -157 -286 -1 -35
5301c5J16j19j95O37m09j65M50j48m30K37J64n49O41l15j33L55k47j4M37l33J14
5322E9K13l73L20k9k72J22J68l29L42j54l79O26n23PK90j15J92o5k83J59P4m0
5344A0kj55M8K41l41N9J7J46j31J58r5r8J54Jk37L37k76p2M55m85J58n2j6J17
5368e9K51n03M43k7l43M40k33k21O18l50k00L67j06j24M03k70n5k2l34L25r8K51
5390A53q8J20k03J23K86l83l6R7pk6L8o4J75j70j35K62k34L1K75l17R7R9r9N8
5414E2k8k12K67J68k59K32k80k1L21k51J09p7k08J12j8j41L40k07R3k08K81j58
5436i3J10k6j8L1k8J9j01P0K0J73n5k18M2PK6L71o57L58J99m64K89R3k47K16J81
5461B98o75N34j1k21P0k91L9L17j99M6K1J74j1m0j34J58m9O2P0k48K83kMk74J74
$$ plain form
5301 -35 81 -38 -233 404 -5 -170 280 132 -298 -61 103 -446 195 -120 -253 102 -145 -159 278 -55 59
5322 59 272 -101 219 190 -82 40 208 -121 221 67 -312 314 -209 -202 88 -27 165 100 -183 -24 50 10
5344 10 8 -147 -99 142 -199 -140 -123 23 -108 50 -45 -143 11 12 -225 112 -164 -236 219 -266 -108 -160 -176 -59
5368 -59 192 -311 132 105 -238 202 -31 -252 366 16 -184 183 77 -47 356 86 31 9 -325 0 -98 153
5390 153 65 185 -18 105 391 8 -28 69 62 36 74 10 185 15 -120 142 -92 -61 214 -103 -6 93 -6 52
5414 52 24 -188 79 247 -12 220 -60 -81 240 -11 98 21 -187 -75 -93 -234 106 -101 -8 -216 65 -93
5436 -93 17 -9 -27 4 -24 -5 -106 -36 -16 157 102 -116 -74 -67 -41 330 -327 31 230 -234 55 148 -99 117 298
5461 298 -377 157 146 -75 -5 -296 -257 60 -139 -93 -72 102 91 51 -83 75 26 88 158 -90 193 191 195 -79 95
5486I5lk08J90j92J51J80n6k70M66m64P4J14k65M93j26l80K64jm02L97j49J49
5508E7j08o0J83j82l6K20J53l78J57J25j10j99L66j99K56l15J48p5L0j52J87L5
5530A03j52J42k53J01K02j74m2J2J24k31K04J31j56J48j96L51k02k05L52m16J53
5551dJ83j75O2K34l87L43j21m05L45j36P7j5J81l82K89j5n5l4J85k81K61n0j22
5574b2J2o4J3K42m40L43K19m31M2K19n7q4j37Pj14L76k13J79l00QK82j90J59J71
5598B20l79QK67j86K32j62j18Q7r9P2k1k4J48j6n8J58l1j20J28o7q6R1j4m3n8
5623g1m9j11K68M3j16K93l45K4M14k97J10n6j03J6O4q2K05J8k31N3R3R6P0n26
5647b20J96J77q8j30R5k1L1j2j28LJ35j24M9m8j39K67q3nm2J22j24K48k04k09
$$ plain form
5486 95 92 -116 74 -118 33 213 157 -113 353 -111 -37 77 -188 305 179 -201 63 62 -340 57 -92 57
5508 57 -51 -111 72 -110 -146 74 227 -151 6 131 21 -178 188 -11 245 -70 78 3 33 -119 68 103
5530 103 -49 93 -160 -59 143 -31 -73 -61 63 -168 36 167 11 159 -37 314 112 -93 259 -157 -4
5551 -4 179 4 66 300 -87 256 135 -270 75 -61 16 1 182 -200 89 74 19 -15 170 -111 150 100 -22
5574 -22 -10 -74 -61 181 -259 84 303 -128 -86 133 76 -8 -145 -138 -252 124 -89 90 -210 -202 80 -110 49 220
5598 220 -159 -151 116 -70 162 0 -118 -31 -130 -58 -79 -103 45 29 -29 129 98 -22 106 39 -47 44 30 -13 -71
5623 -71 -120 -231 37 80 -36 257 -88 -64 350 53 163 107 4 20 84 2 207 225 -6 47 140 236 306 -220
5647 -220 -24 153 65 -65 30 9 40 28 -100 -97 38 -86 -37 -85 -224 43 -40 -45 -87 35 -89 159 -45 -254
5671b54K74j4r0K09l56k4K50r9J7L0P9J70k08J3L9J7M0j03M6j73M64k76m3J58
5695A66k64K0J16o5K03q6J95j54K03m04P0q1J00l6J33j74J49k09MJ73k01PJ35
5718@N3j15L41l21k04K77k1j27J11Mj9M2l6P2n9j85K65O3m38L85mj48q9M0Q4j07
5744a36j59J68J47k42L86m24L52l46o8O23k48l4j5Q5j32K2o2J47k71K98l31J1
5766b29J74q5K81J47j02j69J52J5l42L80k68J42K8j54k7n4L17k21m8M3J05K7l12
5789b00K27k6O2J21k42q2j17M20k59P6L2P3k4j24J35O6l0J12l17R8K5r6k0J24
5813C4j36L03j89j07K06l95K78R2l38K84j37J85j37J26j42K03j95o8P3K29k86
5834a17K48j09j39R3k06L75o7N4J05k70K1J63k04J75j2p3N0J3j71R5j90P7K17
$$ plain form
5671 -254 20 6 -84 125 -231 -255 -5 -104 -87 -57 22 192 -16 -3 36 53 93 -10 36 -137 327 51 8 166
5695 166 -98 -78 38 -27 176 90 285 131 334 -70 0 -81 19 -17 116 -58 91 -118 -114 59 -142 -135 0
5718 0 53 -62 279 -42 -246 31 10 -117 -6 -2 -21 21 -15 57 -2 -187 78 141 -297 88 84 -64 -153 -113 -29 -136
5744 -136 -295 -127 20 -222 164 -260 92 -254 -322 301 53 19 4 89 -43 -21 -83 64 -207 91 -240 -229
5766 -229 -55 -140 141 288 186 17 169 184 -158 222 -46 96 124 -30 -57 -111 206 -15 -63 -20 85 112 -200
5789 -200 27 1 63 184 -58 -140 -257 163 -96 -20 12 85 61 -63 72 138 108 220 -97 1 26 -70 -90 34
5813 34 -102 201 12 -95 111 -284 -6 86 -252 32 -105 80 -57 69 -73 130 -65 -133 -60 169 -117
5834 -117 131 22 -117 -24 -230 145 78 132 237 -33 -12 151 -53 122 110 37 87 100 -71 24 -166 -89 128
5857A28k31K06J9N9m6J44l08J27N4j71p9l61P87n77L65k15r1L56l35K36l39K87
5879A5J38m6K5j50j8j2LP7K74k15k43q9J19K4j56R1J75J10m28L45j37j4R0j44
5903a66K57l9K14l70J00o6%N7p7O3J35n2J83m22K05n1J69J4k24J20o1RN1J24k41
5928f8K56L6l07J10k4k5M8K01k03k06J05Q5l04K92j55J07j15L43j92Q9j14o3J45
5951D1j56P1N7O4k90M08k86K31k1j55m9k5J04k71P0L48j06k6k26L96k01Kj42J38
5975b4k06K63j65l5L79q3j47M3l2k9J70j19K92p2k07j09J89J48k56Oj18K06k00
5998a06J43%J6N7M4J21l53K52M8k13j46L89k75J55k93K25j4J47j72Q1j8k23J21
6021a4l2K34o2j33l7O4k09K55l79M57j67PJ13j54R8J31l97N22m03Q5J98k18O8
$$ plain form
5857 128 -103 103 122 181 135 279 -29 98 152 -19 -98 -459 328 -249 116 -99 -190 166 -169 67 -272 15
5879 15 153 107 132 -18 -36 -48 -45 32 306 91 -152 -241 -122 -98 -254 -163 12 122 -306 39 -98 -112 -22 -166
5903 -166 91 52 266 -104 -4 -70 -70 -13 -90 -27 108 56 239 -183 22 -29 140 154 -70 50 -11 -2 49 173 -68
5928 -68 188 224 -83 27 3 -22 26 227 24 -182 -77 8 -296 -4 -159 -52 -167 176 -16 73 -41 -104 41
5951 41 -115 -44 13 77 -213 195 -91 140 119 -36 -85 -110 -6 -277 -207 141 35 9 -217 179 -22 -20 -162 -24
5975 -24 -230 33 -132 -167 212 129 -18 25 -7 -36 134 15 307 235 28 -81 108 256 0 6 -112 94 -106
5998 -106 37 37 53 110 154 275 -78 174 222 9 -137 252 -23 132 -161 64 50 197 25 106 88 -135 -14
6021 -14 -46 188 126 -7 -44 20 -189 66 -313 144 -23 -16 97 -57 41 172 -225 297 -106 -21 177 -41 27
6044B7j58L41k58j75j5J42p7P1m6r5J21K36J24l53j03L7R5o7J11j15P7K30j07
6067D3lJ76j44p6L3j57m9J59j30J40Q4%n4j23K00N0p2M9O0j24j99K07jL8K3r4
6093C6n4J01m0r9L5M2j07J19J00j86K40m08J29k5O5L6k0Kn6n0K84k63J02L0j90
6118a77k2L51k93n5J28O7j32N6j87M27j83J01j73J71J39p8j94j6J00n8j14M49
6140C07n5n49N17j29m4J03j6k63j78J67K40K9k17K79pl30L4N55n51P2K06l21K42
6163I1K2l79R5KK03J35k26J75J52m71L70j19j05k2O7o8Q6Q0l00K4Q9K55k20k03
6187b67M8J78J16n2P7j59J06J21q6j41P5JM3k92L08o3o3K72k53k6J31j76J07m5
6211d0J89K5k28K59k23Q1K93k73j73K68j77j34J22j37Q8L05l18j19K0K81N3M8
$$ plain form
6044 27 -131 210 -48 -223 -238 -96 -173 -102 -148 -243 -122 114 238 -115 -218 -181 -86 -153 -42 -157 -80 150 43
6067 43 40 216 72 -4 29 -128 -177 -18 -148 -8 76 76 22 -101 99 149 77 126 186 62 -137 70 69 107 130 36
6093 36 -18 83 43 -56 -21 21 -86 33 133 -53 187 -221 -92 -117 -52 -16 -36 -34 -90 -140 144 -119 -17 13 -177
6118 -177 -199 152 -141 -196 -68 -1 -133 -77 -264 163 -20 81 -92 79 218 140 -54 -70 30 -28 -142 307
6140 307 252 -297 220 91 47 150 134 -129 -307 -140 100 129 -88 191 184 -146 -112 443 -108 -36 170 -151 91
6163 91 113 -266 -171 -169 34 169 -57 118 270 -201 169 50 -55 -77 -10 -78 8 88 -212 -188 -99 156 -64 -267
6187 -267 -219 -41 75 23 100 -59 47 168 82 -59 16 17 60 -232 76 13 -50 222 -31 -57 74 -102 5 -40
6211 -40 149 174 -54 205 -18 63 356 83 -90 178 1 -133 -11 -148 -60 245 -73 -192 -172 109 162 210
6233B10l68L12J6k21J94K33k19L4l24K74J16l10J2j00J87j40K04j39J92k48p2
6254a57R7K90k71R7r4Q8k2j19R3j27J8K8K55k5j88n0MJ57j37l1L00m85J6L74o3
6279D8n0o1j09K59J11r9o2N5k28J53k9J14K34k72M7k5j08J38k34j42L54Q9j40
6302D3q0N3l1J36L0r5l6p9k1K90p3l1k24Q4J04j49L13m06J00j18K25l4o3k19M35
6327A54k49r9J63j24J01K33k04K07j06j2j43K8J12r8j78R3Q9k6J59k37K45R2j77
6350B3KJ6P8n9nP2k30L42k48q0J70q7j60L06j35L4K9j24J09J00l2j9J67j40K92
6375D21k82n48M50J38J3r4k24K23N2l00J08J29m44N49J1k61L13m36K24j69K18
6396I1J2k27J45m3p5J31k32J52L4j04N3q7J27J1J10p6N7k00J51M3q2J12l7Q0r3
$$ plain form
6233 210 -158 154 170 -51 143 376 157 191 -133 141 257 -53 -41 -141 46 -94 110 -29 163 -85 -157
6254 -157 -60 230 -41 56 -38 50 28 -91 2 -125 -107 -79 176 151 -37 -87 -83 74 -63 -94 206 -279 -263 111 48
6279 48 -2 -63 -172 87 198 99 37 92 -136 17 -12 102 336 64 111 86 -22 116 -118 -260 94 183 43
6302 43 -37 16 -15 121 151 56 20 -59 -80 210 137 106 -118 -34 70 -79 234 -172 -72 -190 35 1 -62 -281 154
6327 154 -95 -194 -31 -155 -54 179 -25 182 76 64 -79 -51 61 -37 -215 -122 -33 -59 100 -137 108 200 23
6350 23 25 41 119 60 55 127 -103 239 -9 -89 81 -6 -166 140 5 39 68 -56 53 153 121 102 269 129 421
6375 421 139 -409 41 179 192 98 -126 97 149 -151 -43 86 -358 191 202 -59 254 -182 42 -127 91
6396 91 103 -124 21 -22 -97 34 -198 -46 -12 -116 -63 -150 -23 -12 98 22 79 -121 30 73 -9 103 66 146 53
6421E3j59j17J90K3j22J78j59J38L3j95l04M98M1J00k68oj24J09j91L13kl5O5
6444E9k4K18k59J34n9Q9j28o9J02r2R7k9j37J32K87l95K59j03p2J6L0j14L29o07
6468c36J95K59M9l16L30l16K27m8j97K70j8n0k27J71j97L63j83j44L57k48J07
6489D8j4j08j0Qj41R4l6M9J19J52k89O3j18RJ10j41M5P6k4J37K08k84K15Nnj33
6515C5J14R6q3q8l68K08K20m5p6Q2q8J13R4j26Q4j44j51L88o12J36L00o3j56L78
6539B48k45l2k08K32J19j31J99j78l5j4J29P1k79L83k85j12K83l05P8Q3n9%K36
6562A78l43J17O1j62J24Rj16K27k14Q0K69l64K8J93J67k58K6q4N2j05n6N04k70
6585F3p6J72k49J64j46R2J45j55m6Q3J3q1j55K67N4l3K89o20L04k35J96J45k49
$$ plain form
6421 53 -106 -223 -33 -10 -132 46 -113 25 58 -137 -441 57 98 198 -70 -76 -200 -91 -282 31 29 -6 59
6444 59 35 253 -6 128 69 158 30 -39 63 -29 68 39 -98 34 321 -74 185 82 10 26 56 -58 271 -336
6468 -336 -141 118 167 -149 181 -135 92 44 -153 117 99 49 -178 -7 -204 159 -24 -168 189 -59 48
6489 48 34 -74 -84 -76 -217 -123 -159 -110 9 161 -128 -65 -183 -174 -64 -205 -160 -84 -108 29 237 -47 168 173 168 35
6515 35 149 245 162 74 -294 -86 134 89 13 95 7 120 214 88 172 28 -123 265 -347 -211 89 26 -130 248
6539 248 3 -29 -237 -5 114 -17 182 4 -31 -45 84 155 -124 259 -26 -138 145 -160 -82 1 -58 -58 178
6562 178 -165 -48 13 -149 -25 -16 -132 95 -119 -39 230 -134 -106 87 254 -4 22 -62 -10 -115 -171 333 63
6585 63 -13 159 -90 74 -72 20 165 10 -36 47 60 -21 -176 91 145 112 401 -219 85 -150 46 191 -58
6608e8n7J70j76K10R1r3r6Q3k5j81M38n9m03K02j28p4q3K07J24j66jL7R0j82J52
6633B2J38l24O5M30j93j09j76J69j2k46K42l4m6J69J64m34K41k94j74M42J87R
6655B36k39j37J77J96l54J66j80J18K29k8l40k4K00r3j30j06R1O2J68m5K74k81
6677d0j0K76j84j69K96N0k26K34p3j26O1k27K01K03j91R3m30K68J87k51J51M5
6699A38l08K62p4o5j2j50J36km7j82L21j3j39kL44j61r7J96j93ro5j37J81r7K14
6724C9jj95N4L38k45J47p1j10m0N0P6J54j39l30K48K69j79N9k45N6L37r0k84K84
6748A82l30J06J82JJ60k43n9J58l4j88J30k23J88p0L9j21q7K74Pk6J2j43J72q7
6772@k9J62k00K72N4j95J50l29p9M24m64K82K35m53NJ78N3j3j65J57N5j27q3J17
$$ plain form
6608 -58 -115 55 -121 89 180 87 -9 74 49 -132 306 247 -156 46 -82 -156 -239 -32 92 -74 -75 -38 52 -130 22
6633 22 160 -164 -99 331 138 29 -147 22 10 -236 6 -28 -74 95 259 -175 66 -228 -402 40 227 236
6655 236 -3 -140 37 233 -121 45 -135 -17 212 184 -156 -180 20 -73 -203 -309 -218 -156 12 -33 241 -40
6677 -40 -50 226 42 -127 169 219 -7 227 154 28 89 -138 63 266 75 168 -262 6 193 -58 93 138
6699 138 -170 92 18 -47 -59 -209 -73 -75 -122 -304 17 4 -135 -137 207 46 -51 145 -48 -57 -122 -259 -78 -175 39
6724 39 38 -157 -103 235 -10 137 66 -44 -84 -34 42 196 57 -273 -25 244 65 124 -121 -65 272 182 -102 182
6748 182 -148 -42 140 141 301 58 -1 157 123 -65 65 -158 30 -40 -1 -122 -209 65 72 46 58 -85 87 0
6772 0 -29 133 -67 205 259 64 214 -115 -194 230 -234 48 283 -170 -165 13 66 53 -112 45 100 -27 -110 7
6796Go6k19K60M2K38l55j55qK52p5M7J7r5J58J44r1J34p5k57J18p0%J23L3n31
6821d24M50l0R4K94m69J10J85k24J9J19l03N9J93J19r3J0o6L8r5k20j8J88J26
6844F2o1K02n7k25j29K52J08j27Q1J66o27K42K14n3j80J88k11J21K00l74o2K27
6866d3j57J6K60m74M74j04j11JK48k36L10m57K06j10j09M58k20k9L52o2k17J80
6888A76j55J6o8M2l0J6P2K4J35l05K09l8l40N63ml98K40Q3j41p4j19l25N83k81
6912a19Q4P1k31M47k59M8j49J68k99K87P3rj34J54k32J99j99pJ09j36O4K14k01
6935e7n8N5J18N1P6j22P7j8k08K43k25K0k6K57l37M5L44m91J87k0q2L68j47j42
6959i2K39K4m3Q6m59L13J32n38M35N1j65R3p3j82J82J3KL18l23J52j32l15M4J09
$$ plain form
6796 7 -59 -278 -18 24 262 -93 -248 -256 -4 -79 -32 -15 -110 48 192 101 235 160 -97 21 -49 -49 74 107 -424
6821 -424 26 -4 90 384 -85 25 210 -14 5 124 -179 -120 73 192 99 109 43 81 -14 -234 -252 -64 62
6844 62 1 203 146 -79 -208 44 152 25 106 272 -355 -113 101 48 -132 56 -155 -34 166 -208 -270 -43
6866 -43 -200 -184 76 -398 76 -28 -139 -138 110 -126 184 -273 -67 -177 -286 172 -48 -77 275 213 -4 176
6888 176 21 37 -31 11 -19 -3 69 93 228 -77 132 94 -246 317 313 -85 155 238 97 23 -96 -421 162 -119
6912 -119 -35 36 -195 252 -7 41 -108 60 -239 48 121 112 -22 132 -100 99 -100 -107 2 -134 -70 144 -57
6935 -57 -115 -60 58 109 185 63 140 122 -86 157 -68 -48 -74 183 -154 -109 235 -256 -69 -89 -171 197 50 -92
6959 -92 147 171 128 214 -245 68 200 -338 97 148 -17 76 3 -179 3 16 18 336 13 165 33 -282 -238 -129
6983a29j21K82j5q3J91j20J33l23J27KJ55lj90K57k56P8j3j63Q9J26n4q8J85k24
7007a57k4M45k27J17M9l10K18k16j15J81J4l4J67J5l84L98j93o5J95N8q7J79k41
7030a7k2L17l70M05k59j95J09l6K48q1k68K77k21J0J48R6l05J6J22J05Ql42K65
7053A0J00k1k49J54k6p5R7P3kJ40k06J38j78r9L38k6l80J47o3K79j0j56M5J55
7077A85L8j45k3j18l5J65O1m7Q3j09L9K8Q1k35J06j35Q5J73l58J53Pk16K35P8
7101I6l6K24n12k01N20k41K21j44K32q1%l5m6m1n5J33K6k8j51p9J62J60J0o1J48
7126B21j99k3K39k96j34J33J03k93K99l13L12K64l25K23j85J53Pq0L5L8r4j81
7148i6J07k46L81j80l5r1M42j74l17L5L4J09K08m02J53r4k3L13l8k54P8M2j1J02
$$ plain form
6983 -129 -250 32 17 -66 125 5 138 -185 -58 -56 99 96 -94 163 -93 -15 -28 -191 -102 24 -30 -118 67 -157
7007 -157 -181 264 37 154 203 -107 111 -105 -220 -39 -25 -59 108 123 -261 137 -56 -121 74 132 45 224 -17
7030 -17 -39 278 -92 313 54 -141 -32 -68 180 99 -169 108 -113 -103 45 141 -164 -148 -26 79 87 -255 10
7053 10 110 89 -160 -6 -32 -107 -10 63 61 201 -5 133 -45 -144 194 168 -212 -65 -128 151 141 -15 30 185
7077 185 223 78 55 -63 -98 67 128 81 164 55 94 122 203 -32 74 -61 24 197 -161 -8 -1 -217 18 96
7101 96 60 284 -228 -429 91 -150 71 -73 159 78 78 43 -3 -44 -99 34 60 32 -119 -198 -36 124 134 73 221
7126 221 22 -1 238 -58 -192 -59 44 -249 50 -263 49 313 -12 211 26 179 186 106 141 179 85 -96
7148 -96 11 -235 146 -34 -69 -160 282 108 -209 -174 -140 -31 177 -225 -72 -166 -189 124 86 -168 -90 -48 -59 43
7172D3k17J62j05j1Q0K17l81K05m6K75m9o3j04p4J07J3K04k63O0J63j24J32j16
7195A08j96M30k97Rj11J23k6nk10K46J72q2j65K42j48j71k0J60n5O5j4l50K05
7218i0p1J88r7j2J65J9k07J66O7k62N5m1J14J48l39J69O5k45J95J98l97K22n2
7241d2N6L6j26rK69k90J50K59k33n3o9J87l3k7K5m2j2K7%K2j77J78Q3k29J52j79
7267g7k40N13J14j42j32K6j87K51J59l00p4J61j83K25k01Q3J02J06l06p4O05l67
7289F2l69J95m5K74r3J3r1R3k81K79l61N05K40l92p7k87L90l36L11r7q1j10M28
7312A70o71R13l95n72K96K29J09k10j54M46qj25o7k46j11J47M92r85M76K32O8
7333C4K21k10m95M39N08r09L5Q71m41K67l34n39N34Q9m23O61J25l72k24M54K5
$$ plain form
7172 43 -174 -12 -117 -128 -48 169 -212 -7 -53 222 173 110 6 -68 39 52 256 -7 53 216 92 224 108
7195 108 -88 342 45 54 -57 66 40 35 -175 71 243 161 -4 238 90 -81 -101 59 4 69 55 -295 -90
7218 -90 -161 27 -70 -82 83 102 -105 61 128 -134 -79 -120 -6 142 -197 -28 37 -208 -13 185 -212 10 -42
7241 -42 14 50 -76 -85 184 -106 44 303 70 17 -52 135 102 75 100 58 46 73 73 95 -82 96 179 -50 102 -77
7267 -77 -317 196 310 168 36 62 -125 126 285 -15 -89 72 -111 114 -87 -4 98 204 -102 -176 429 62
7289 62 -307 -112 -157 117 24 37 -54 39 -242 37 -324 181 421 29 -48 -335 55 -281 30 -67 -148 -258 170
7312 170 -501 412 17 -555 -259 -30 79 -131 -285 161 153 28 -39 -285 -396 -249 243 -742 -266 -34 34
7333 34 255 45 -450 -11 497 -412 -377 494 53 320 -14 -553 -19 70 -353 308 433 61 -163 291 316
7354C16K75l47m10J83J72l84J1L25k09m5M4j70N34j20j78j02K92o9m6j23Q3n2
7376b0m0R1l33K92%k53M97k89J40j66J13mp1L3P6J30r9j72J15n8j10J77j73J01
7400b3J92l16k7Q5J07J26j22j82L27k04P1oK33l64J16M7p7J73J1k50o3J00J62
7423A16l03K00P7J07k94J30K96j78k03j6J50N2oP4j21Mm03L38K11k19N3j27J14
7446E2j45K1k01M25J0j79j6K11l28L33j71J61O0j59l73L78N0j86j41j3J09M82
7468C80j91j99P9k36R3L3l33J96J85j83J10j01J17J56J22k44n3j2K3J15j79O1
7490f1L7K39k14j37K56r1j73J50p3J3K39k88J12L7N3j58j2R7J22m5o5nRm8L7K16
7516B47j29l53L01k71J29O9r4O1P2l41M51j83j01J19q5J26j4j03L5p0J78j90K82
$$ plain form
7354 316 591 244 -166 17 189 -195 -184 141 -68 -113 -69 -239 295 175 -3 -105 187 118 72 -51 32 -20
7376 -20 -60 31 -302 -10 -10 -263 234 -55 85 -81 32 28 -43 -10 66 196 97 -75 40 -18 -128 49 -124 -23
7400 -23 169 -147 -174 -89 18 144 22 -160 167 -37 34 28 261 -103 13 60 -17 156 167 -83 -146 -46 116
7423 116 -187 13 90 197 -97 33 329 151 -52 -68 82 134 128 202 81 85 -318 20 231 12 65 -62 52
7446 52 -93 -72 -273 152 162 -17 -33 178 -150 183 12 173 233 74 -299 79 129 -57 -198 -211 -102 380
7468 380 189 -10 69 -167 -74 -41 -374 -178 7 -176 -66 -167 -50 106 228 -16 -69 -81 -58 57 -122 -61
7490 -61 -24 215 1 -136 120 29 -144 6 -67 -54 185 -103 9 46 99 -59 -71 26 148 103 38 33 42 -6 31 247
7516 247 118 -235 66 -205 -76 -7 -101 -40 32 -309 142 -41 -142 -23 -108 18 4 -99 -64 -134 44 -146 136
7539A36n6J88k00j34L6m3p0q8J0K90k4m4l13K46L7p7L82k60k64K12O9Q3k45KJ28
7564Aq5K59k33l1KJ54j50R0l9N7r3K14k1lj69J30j20K67k64j52N4J56O4k3j34
7589f9LP1P4Ko6k98K86n1o6l5O4J59Jj0K6k88K48Q7k91K46k96J54k13J53o1L23
7615A53j09l37L31j55K4k7J84l5J87k91K18k16j59K83J4r6K9j37M15k64k16K04
7637@J08k73J03J41k63J03K5L7J55j34j96N4L37j69J77k52J78j87mj1l6jP5j9
7661e2K03m0M3j82J40j60o4M2N1l3M7J19Q2j78l8N4k49L57l5j20n0k4J11J52j16
7686F0p2j39Q6J76k14K23o9O0o7p2K5j6K44k97p5J78J29j96L10l65p7J25OK94
7710B57l61K58j60J75j25J18l1j51O2L5m5K13l07K33r0J9j35j0nL4K35k75K20
$$ plain form
7539 136 80 268 68 -66 -30 -73 -143 -231 -221 69 45 1 -312 -66 -29 -106 276 16 -248 -36 33 116 -129 -127 1
7564 1 -84 175 -58 -89 -87 67 -83 7 -32 25 -68 146 125 122 -47 83 -37 230 -34 -186 -132 24 88 65 -69
7589 -69 -66 5 79 81 15 -283 3 -48 -114 -149 -85 74 75 65 91 -197 51 138 -153 93 -203 -49 -262 -109 -170 153
7615 153 44 -293 38 -117 -93 -120 64 29 216 -75 143 -73 -232 51 65 -31 -2 -139 276 12 -204 0
7637 0 108 -165 -62 79 -184 -81 -56 -19 136 2 -194 -140 197 28 205 -47 131 -56 -60 -71 -107 -108 -33 -52
7661 -52 151 111 154 -28 112 -48 -112 -70 -19 -52 -5 114 196 18 -20 34 -215 142 107 -13 -63 -87 24 176 60
7686 60 -12 -151 -65 111 -103 120 51 111 44 -28 -3 -19 225 -72 -147 31 160 -36 274 -91 -168 -43 -37 257
7710 257 -104 154 -6 169 44 162 131 -20 42 77 32 245 -62 171 81 100 -35 -45 -50 -16 219 -56 164
7733A64m8l17K70k9K12j62r9J25k10l6L07j19q8q7L47l79L9K35k61K00n9j61L88
7756B32l80J49P8N7l6j17J3K8L2k29J84M9p0N3j02J05j05K13njk27r5K81j32J77
7781A52j62m6P2R9r4O3k72J90K79k12M9r7O3r5L2J25J49q4j93j64K99l3k62K00
7805E8k89K15Q2j24j44O6J34m2oJ15k08J55P6k24J02J51k49j07R6K24j77l2J05
7828b3m1M0N6l40K97j95N3J51Ok17J42J2L9J53q3j27l7K22k58L47j78m26M83N1
7852A27r6j29N7K02k53J02J51j74J74k23J54l26L09J59l97M31j29J19k91J68j77
7873d2L24k91K5L5K3J68k12J22j06Q8j63K21r3j74J22k67O3J58J26j04qq3r3M0
7897a21jQ7L3P5j53j14L32k08J1Qn9K65j72J37j8m7j25j22q6K34L1j32Q9J35j54
$$ plain form
7733 164 116 -201 69 40 252 90 -9 116 -94 -130 177 58 -30 -117 230 -149 -110 125 -136 64 5 -156 232
7756 232 -148 1 79 136 100 -17 -4 24 56 -173 11 60 -10 43 -59 46 -59 154 149 148 -79 -174 107 -25 152
7781 152 -10 -56 16 115 21 84 -188 2 281 69 118 21 84 -11 21 146 295 211 18 -146 153 120 -142 58
7805 58 -231 -16 66 -58 -202 -136 -2 -44 -50 65 -143 12 88 -136 -34 117 -132 -239 -143 81 -96 -128 -23
7828 -23 -64 -24 32 -308 -11 -206 -153 -2 4 -213 -71 -59 -20 133 50 -77 -114 108 -150 197 19 -407 76 127
7852 127 31 -98 -41 161 -92 10 161 -13 161 -62 92 -234 75 234 -163 268 139 258 -33 135 -42
7873 -42 282 -9 16 51 74 242 30 152 46 134 -29 192 99 -75 47 -220 -157 1 127 23 15 -68 -161 -121
7897 -121 -122 -35 -2 73 -80 -194 138 -70 -59 -51 -110 155 -17 120 102 55 -70 -192 -278 -44 -13 -145 -56 79 -75
7922g5L8J14j95J93l0J37k90k6k4J76k1K02N6m52L04L4p1K1j35RJ64P1k51j5J89
7947A23j52J20RJ28l00J73j33J02j8K8J72j74O4N2k15ON3k3k32J13q2J13K36k82
7971a19J54J72k36j3jN9m9K88j99j9m8k42M08l11K21k55J5l1K77k3k57J21J90
7994A02k9L0J8j74P7L5r0k6L01k00j06N0R5O0l58Q3L42n05M81j70l7n1Q3j15j1
8019a15N4K32l39K19n2j10K70k14L3J01l57K66J12N3l66K50RKK5j75l8J63K03
8042B26l49J40J30l49K3J13j01jo3J13N7J50j85L64l84K16N6j22p9J25J03l92
8064b09M60m87L08j2j65N2J06j9k6j38K34o4j65L50m03K89J66l51K14j90L1J14
8086I5o2J6k9J19l6j84J51k33R9K24k64J33J13q8J8j39P7o0K79l03J47K5q1J64
$$ plain form
7922 -75 -37 77 -118 75 45 182 -108 -134 -158 18 -3 199 255 -197 107 141 70 91 -44 -35 129 200 -51 -66 123
7947 123 -29 91 100 228 -72 101 -32 70 52 80 252 78 142 194 -21 -15 38 15 -217 -104 -186 -73 163 -119
7971 -119 35 207 -29 -42 -43 16 -33 255 56 37 -11 -253 155 -156 65 -190 -175 -206 71 48 -209 -88 102
7994 102 73 103 121 -53 24 59 -31 -57 244 44 -62 -12 83 143 -215 -132 210 -295 186 16 -21 -72 11 -104 -115
8019 -115 -61 171 -168 51 -1 -111 159 -55 -22 79 -278 -12 100 153 -213 37 46 48 73 -102 -140 23 226
8042 226 -123 17 147 -202 -179 -66 -167 -168 -231 -118 -61 89 -96 268 -116 100 156 34 -45 80 183 -209
8064 -209 251 -236 72 60 -105 -53 53 34 8 -130 104 40 -125 225 -178 111 277 -74 140 -50 -19 95
8086 95 33 49 20 139 103 -81 70 -163 -64 160 -104 29 142 54 72 -67 10 -50 229 -74 73 98 17 181
8110A81l15J26k40J57J19J35j57M7k51K60j31J9P1Kk83P7J14p4m2L40K6m07K12
8133a4J71j77M3k44J14J74m2K5p1j05J63J52j80Q3j32J84m0j37J37k72K86j78
8155f0J51j19K31K5l74M2J38R1k12l0K74j56kJ1J87j03K07l5k20K0j03j20L77
8178B20l38L64j35o3j99K02k1j00J21p7Jl5J56
$$ plain form
8110 181 -134 -8 -248 -91 28 163 6 53 -198 62 -69 -50 21 23 -260 -183 -69 -143 -185 155 181 -226 -14
8133 -14 157 -20 23 -221 -107 67 25 50 -21 -126 37 189 9 92 -40 144 104 -33 104 -168 118 -60
8155 -60 91 -28 203 228 -146 -104 34 125 -87 -117 157 1 -1 10 197 94 301 266 46 66 -37 -157 220
8178 220 -118 246 111 48 -151 51 30 -70 51 -26 -25 -60 96
8191I6
$$ Imaginary data points
##PAGE= N=2
##DATA TABLE= (X++(I..I)), XYDATA
0@%%%%%%qJ6j6K4l2M0m8O4q8J04j28J60j92K32k80L36m00M72n55O47p52Q72j007
29e39J158j324J507j710J934k185K462k765L096l457L856m293M769n290N858o476
45c399P152p892Q701r586J0556j1627J2809j4115J5570j7198J9031k1113K3502
58A2391k6276K9536l3432L8187m4136N1815o2135P6783r9250J38122k22711O84620
70E43514l45308r11801J598951j239296m5150R44211r73931M01579L79313o57339
80c05257M97039j69796j81564L10765k14438J7741J92072j82883k0578J34074
90G7175j29455r4275K81306k18879K2546L03686l86486K04021J13820m53612M39508
101A59355j74339k52822N35984l71919k948L57408l99996J52817Q4845j80845
$$ plain form
0 0 0 0 0 0 0 0 -8 8 -8 16 -16 24 -24 40 -48 56 -72 88 -104 128 -152 184 -216 256 -299 348 -404 468 -539
29 -539 619 -705 802 -908 1026 -1159 1303 -1462 1634 -1823 2033 -2260 2509 -2781 3077 -3399
45 -3399 3753 -4139 4562 -5024 5532 -6095 6714 -7401 8169 -9029 10002 -11111 12391
58 12391 -13885 15651 -17781 20406 -23730 28085 -34050 42733 -56517 81605 -141106 543514
70 543514 198206 -713595 885356 -353940 -399090 545121 -428810 -27231 352082 -305257
80 -305257 191782 21986 -159578 151187 -63251 -45510 146562 -36321 -56899 77175
90 77175 -52280 -146555 134751 -84128 -61582 242104 -144382 59639 173459 -280153 159355
101 159355 -14984 -267806 268178 -103741 -106689 250719 -149277 3540 88385 -92460
111i2460J46550o6748O4065n8776q8516J83919k11917N3844J87439j85221J30800
122F2979L3471j19810M2722m7738K60l5826N0275M1730p4771J12251p8328n144
134a7929P9857j58835J77066n8705j11333K55222k77595O6198J77043l62599L18879
145H7269n245k57822M18259k59867p9065L07758l83867J32793J47243k77984K47942
156G7414k2089j32087J84982j23890k1072J01426r7667K8980O4867r7116M437
167c1815Q9894j50438M8887J54937k25577J67661R6529l08500K85317q5148k59173
178b17426L76740k45186n1270L44645l43422J43951J51271l34115K50767l4315
188D1640j76478K57322j42157l0558J41602j74585M4516O5407r4189Q4248N4235
$$ plain form
111 -92460 54090 -12658 51407 -7369 -95885 88034 -123883 -70039 117400 -67821 62979
122 62979 96450 -23360 19362 -28376 -28116 -63942 -13667 28063 -46708 65543 -12785 -17929
134 -17929 61928 -96907 80159 21454 -89879 165343 -112252 -46054 130989 -231610 87269
145 87269 82024 -175798 242461 -17406 -96471 211287 -172580 -39787 107456 -170528 77414
156 77414 55325 -76762 108220 -15670 -36742 64684 -32983 -4003 60864 -36252 -31815
167 -31815 58079 -92359 -43472 111465 -114112 53549 150078 -158422 126895 41747 -217426
178 -217426 159314 -85872 -137142 207503 -135919 8032 159303 -174812 75955 41640
188 41640 -134838 122484 -19673 -50231 91371 -83214 -38698 26709 -67480 16768 71003
199G1003p0628K8909K9880j25200K8831O4420j23952J16608M3091j25631J43945
210H1276o8210p4434J36831j25487M5460O6408j28425J10641m8764o3384J15916
221D7828r5679M4816N8163p8737Q1840m3221k8242L8655q1915N3441j2320k7607
233d2978R5884o7431K3973M9328j01465N8092P979o9301P5774n969n6072M3073
245A0887r062o2579N9646K9731o3438J00226j0101j03561J09953r7109n6460J52566
257F0699j37853O3476J20139j87349J38239P41j72576J94220r4569p2883J93945
268A06229j64996K2056J23066j84761J00593N7631j48362J44105K450j24593J31177
279F4595m6940j10867J32050n3940o6592J53119p3586l2392J28687j29763J5071
$$ plain form
199 71003 375 29284 59164 -66036 -37205 27215 -96737 19871 62962 -62669 81276
210 81276 13066 -61368 75463 -50024 -4564 61844 -66581 44060 -4704 -68088 47828
221 47828 -47851 -3035 55128 -23609 58231 15010 -13232 25423 -56492 -3051 -15371 -42978
233 -42978 52906 -14525 9448 58776 -42689 15403 23382 -45919 29855 23886 -32186 10887
245 10887 1825 -60754 -1108 28623 -34815 65411 55310 -48251 61702 -35407 -91867 60699
257 60699 -77154 -13678 106461 -80888 57351 58092 -114484 79736 -14833 -87716 106229
268 106229 -58767 -36711 86355 -98406 2187 59818 -88544 55561 58011 -66582 64595
279 64595 17655 -93212 38838 -15102 -81694 71425 -2161 -34553 94134 -35629 -20558
290b0558Q7903j43998J00067L0009j31559J40456n7910q9182J50190r5064n225
301c4871J23992j05019K7781M1236r9032L7580K541l9013N6685k147q763L4492
313C5462k5578j9555K0610k3114o418L4687k1872R12J6847l6160J8365m178q567
326a8559N2698l2946J7053K8834q2263L6235q024n8371P8338k6138P306N6037
338E0200o7315M8794k0551o2752R7851p5938m320J03359j21622M7066N4511j22325
350g3042R5365K869p4966J10268n6360l1163Q1434r8141J4437O2319r2443O2439
362C016M8755q8789P0212Q027r6047P7535j5321o5730J05718m5020l8588R9035
374F2803j01760K570R5476j19254P3740P1411j39359R9111k145j38546J25134
$$ plain form
290 -20558 67345 -76653 23414 53423 -78136 62320 4410 -84772 65418 -29646 -34871
301 -34871 89121 -15898 11883 53119 -45913 -8333 -5792 -44805 11880 9733 970 35462
313 35462 9884 -9671 10939 -12175 -18593 16094 -5778 -4866 11981 -24179 -5814 -9992 -18559
326 -18559 34139 1193 18246 47080 -35183 1052 -6972 -65343 12995 -13143 -5837 50200
338 50200 -17115 31679 11128 -51624 46227 -29711 -34031 69328 -52294 -5228 49283 -73042
350 -73042 22323 25192 -49774 60494 4134 -27029 54405 -43736 -29299 33020 -59423 3016
362 3016 51771 -37018 33194 41221 -54826 22709 7388 -58342 47376 2356 -36232 62803
374 62803 -38957 -36387 59089 -60165 13575 84986 -54373 44738 42593 -95953 29181
385B9181l7131o9246J48661p1807k0432J06353j22026K3208O5014j23348Q4196
396A2623K9735j10619J10664k2832q8889J19019n7503m0854J12917p8232j825
407a5796P0504r4336K5495L0782p3249O1069J3684m1052N9838j9207l5217L2463
419A4978k9515j1670L1100j0110L757J2579j1668l238k942K48J1378L311O583
432A4791Q43j3183o929j1228m160R678K729K0230O713j3286J7724j9231k5563
445b0872L1216k2316p172M5309l4805L250L4227n5418K1170K8230n3113N1668
457B1374P490n8585O3746l3169n4841Q3870n0475j3539R5401p8451J6746N9941
469E9508j09819N2413K5299r1889R7056j8481o1327J04257p2598k4740R3947q9002
$$ plain form
385 29181 -7950 -77196 71465 -342 -20774 85579 -36447 -13239 51775 -71573 12623
396 12623 42358 -68261 42403 19571 -69318 49701 -7802 -48656 64261 -13971 -15796
407 -15796 54708 -39628 -14133 16649 -56600 4469 18153 -22899 36939 17732 -17485 14978
419 14978 -14537 -26207 4893 -5217 -1460 11119 -549 -3787 -6729 -6481 4897 8208 14791
432 14791 15634 2451 -4478 -15706 -19866 -10188 -7459 12771 19484 6198 23922 4691 -20872
445 -20872 10344 -11972 -19144 26165 -8640 -5390 28837 -26581 -5411 22819 -30294 21374
457 21374 28864 -29721 34025 856 -53985 29885 -20590 -34129 61272 -17179 -433 59508
469 59508 -50311 2102 27401 -64488 32568 14087 -47240 57017 -15581 -40321 53626 -35376
481c5376K5742O6114r2155M8967J9739q8226O0484p60n4110P6804j5328l3559
493b1664P1096n0855l0682O7046o7397M191P0029p6248L8253L8593r2973O3437
505A2826L647o6542Q8637k9882k9685P1566p2249l390M5369o1652L9049K7348
517B5042l5646M1511j0644l3506K2040j8499j0444K4859o643J437K0846j9699
529F54o577K0899k4971L187K4513k3534J4714N723k8284J4534r954n169J4227
542c8o618K4178q535o825J6529l7530J5433K704l0445N3867k3070j4842M9972
555C4780o0208J4905L3823o1266N3148J0973m9829M8019k6050k7725L9669l0522
567b0283P357L7999k8392J0224J9985m3122R539K1160n1541L4626L1518o5455
$$ plain form
481 -35376 -9634 56480 -35675 13292 33031 -55195 5289 4529 -49581 27223 11895 -21664
493 -21664 49432 -1423 -32105 34941 -32456 -28265 41764 -34484 3769 42362 -50611 12826
505 12826 16473 -50069 38568 8686 -20999 50567 -21682 -25072 20297 -41355 -2306 25042
517 25042 -10604 30907 20263 -13243 8797 -9702 -20146 4713 -1930 -493 20353 654
529 654 -5923 14976 -9995 -6808 17705 -5829 8885 14608 -13676 858 -9096 -14265 -38
542 -38 -6656 17522 8987 2162 18691 -18839 -3406 -702 -31147 22720 -350 -15192 34780
555 34780 -25428 -10523 23300 -37966 15182 26155 -23674 24345 -1705 -29430 10239 -20283
567 -20283 -12926 25073 -3319 6905 26890 -16232 -6693 14467 -37074 -2448 29070 -36385
579c6385N5448R906p3132P6367k7471m7290R2582o4471n986P0008r3006M1113
591b317K9234q3301Q4348o314n5320Q1619m5369k9133N5264n4844P949M3281m2323
604a7226K4604J8624m5896K8320J500m2993N3006n423m0454O2278l4615l3402
616c1677O1342n4485N628N4045n6314L5378J1910m9507M2721k9746j4812M4303
628A8786l7569J8975K0555l2917K1781j0086j2403J4453q025J2066m041M2N850
641G467k1772Q336l687k016K0656r729J4234q9j9371J0915j9236K127J2119q027
655h073J9602r836M874L080k9336L1102j6651j0153M6859m5101J8354K1166o2263
668c6376N0749j3360l5557P4165m6541r15N4722p5134K3735K5922o3394N0019
$$ plain form
579 -36385 19063 28969 -44163 32204 4733 -42557 50025 -14446 -20432 49576 -43430 -2317
591 -2317 26917 -56384 27964 21650 -33670 47949 2580 -26553 28711 -26133 -18184 25097 -17226
604 -17226 7378 26002 -19894 8426 9926 -33067 19939 14516 -25938 36340 1725 -31677
616 -31677 29665 -24820 -19192 34853 -21461 13917 25827 -23680 19041 -10705 -25517 18786
628 18786 -18783 192 20747 -12170 9611 -475 -12878 1575 -6450 5616 1575 1617 7467
641 7467 -14305 -5969 -9656 -11672 8984 -745 13489 13400 -5971 4944 -14292 -12165 -46 -8073
655 -8073 11529 1693 6567 9647 -19689 11413 -5238 -15391 31468 -13633 4721 25887 -36376
668 -36376 14373 1013 -34544 39621 -6920 -7835 46887 -28247 -4512 21410 -41984 8035
680H035R157l9327M7941j2912l4264L6535j8891k1011M6119k1047j4222M7269
692C3382m7530n974M5991o0967L1271L6938o1561N6689q333n4747O2057m4875
704a7659j1950O1072n5932K7112L0567n9791L6776o47l9083L9179n818j5436K5931
717A4321q335j5566J1448n620j2086K0653k681n546K3235k3715j113J3876l4025
730b5154K4126O392k0673L7391j9225q203K0690l4646J8867M165j7679L5144k1865
743f70j667J7044l4604J9725L40j2307L1392j8297O788R071l2056K1088r797j6295
757b0245L4028j5062j515K2693k1223l357J1208j3623j703J7921p955n280J9599
770A5486k2980k283K0442l1225K4180J1856l2870M0421k1946k5929M5802m5436
$$ plain form
680 8035 17192 -22135 25806 12894 -21370 15165 -3726 -24737 21382 335 -13887 33382
692 33382 -14148 -20122 25869 -35098 -3827 33111 -28450 28239 19906 -34841 27216 -17659
704 -17659 -29609 31463 -24469 2643 33210 -26581 10195 9548 -29535 9644 3826 -11610 14321
717 14321 5986 -9580 1868 -3752 -15838 4815 2134 -3412 19823 -3892 -5005 8871 -25154
730 -25154 -1028 5364 -15309 22082 2857 -5346 15344 -19302 -435 3730 -13949 21195 -670
743 -670 -2337 14707 -19897 -172 168 -12139 19253 956 7744 16815 -15241 5847 -3950 -20245
757 -20245 13783 -1279 -2794 19899 -1324 -4681 6527 -7096 -8799 9122 1167 -4113 15486
770 15486 -7494 -9777 10665 -20560 3620 15476 -17394 23027 1081 -24848 20954 -24482
782b4482R341M3988n2446L5704J2868n3993M3125j3936l1027N0015k1602r180
794a1625L7382l2818l732K4425l2050Q776K7623k9124J6926J8127m1917K2980
806D973L000l8304M2346r867j8152M4900l5547M67K7235m8243L0647R516l6965
819b3994M8696j8053k5016M0731l5705l144L2209k6106J3789J5037k1070N946
831C320k738j2327P397K484M16J0915j289p556O705j1604p359J6565j1464M442
845b093J6693j7888O366O32j6192J3726n602K179J4498j4946R858k924j8656J5867
859A518r456j229J8960j1673Q492J08j5473J2683j3119k736K2258j6772P020J6776
873A7357k7201P082R576k5013J6783J0573j9009K1336k962k0420K2937j8771p428
$$ plain form
782 -24482 -15141 28847 -23599 12105 24973 -29020 14105 169 -30858 19157 -2445 -11625
794 -11625 25757 -7061 -10793 13632 -18418 -9642 17981 -11143 5783 23910 -18007 4973
806 4973 7973 -30331 12015 2148 -16004 28896 -6651 -6184 21051 -27192 3455 12971 -23994
819 -23994 24702 6649 -18367 22364 -13341 -16485 15724 -10382 3407 18444 -2626 3320
831 3320 582 -11745 -4348 -1864 -1448 9467 8178 622 7327 -4277 -11636 4929 -6535 -2093
845 -2093 14600 -3288 3078 3710 -12482 1244 -4358 -2179 12319 -2627 7231 4307 -14349 1518
859 1518 -7938 -9167 9793 -1880 6612 6720 -8753 3930 -9189 -11925 10333 -6439 581 17357
873 17357 -9844 -2762 6814 -18199 -1416 9157 -9852 11484 8522 -11898 11039 -7732 -15160
886a5160L2210k9240J1274K8482m5733K3293J2524m8829M1654R07l5533M8287
898B4136j9148k2192L8387l3558P68L1195l2560J9211J3460l5481K3727m015k7616
911b3686L3555q130j4234L3316j9657j0065K3344k8421N333K1026k6324K0878
923F935P721k9124K5773j0968k1679L3587j7594m998L0450k4966L071J2959k6428
936a5261J3670K438j1623K0811q855j135J1414k2301Q499M776j7515K1026p83
949E161j1328J9262j4757q014J5836j4942M701J4100j2855Q599R42j6283R508
962g0l069n824J4941m312J076P685j5319K884L704j3101J4461K720r718J8196
976A4254j1321j2618J8381j7684K36K2351k0828J2391J2141l0615J8712p00k5327
$$ plain form
886 -15160 17050 -12190 -916 27566 -18167 5126 17650 -31179 10475 11382 -24151 24136
898 24136 4988 -17204 21183 -12375 -11607 19588 -12972 6239 19699 -15782 7945 3930 -23686
911 -23686 9869 1739 -12495 20821 1164 -8901 14443 -13978 -8645 12381 -13943 6935
923 6935 14656 -14468 11305 337 -21342 12245 -5349 -10347 20103 -4863 -1792 11167 -15261
936 -15261 -1591 847 -10776 10035 1180 45 11459 -10842 -2343 2433 -15082 5944 5161
949 5161 -6167 13095 -1662 -9676 6160 -8782 -4081 10019 -2836 5763 6705 -9578 -70
962 -70 -3139 -8963 5978 1666 2742 10427 -4892 -2008 1696 -11405 3056 5776 -3942 14254
976 14254 2933 -9685 8696 -8988 -8752 13599 -7229 5162 17303 -13312 5400 4700 -20627
989b0627L0403q683j0179L0190k4709j941J8885k9844J4231Q819k1125K8278p656
1002F042j8255K7048k2404p111K7499k4340Q152K2713l0042J0856J0823l0619
1014a9638J8890M594j7946K6909p744j3921K2488k1141l041J9406k1500J4860
1026B216J1330k3173J7592m329j6642J8448j0567N23J7226j6407O485N679j8467
1039a0086J0151J905j0960J5954N67j1639J0310l590j1892R501j672k594J2129
1052H084o479P53M287j3778P781k945p354K0527j1154j770J7559k3684N551P685
1066E063k1098K1024m38j2168K2143j4958m203J2105j9546J0902O801j2911J5465
1079H181m827q321J0411j3611J888J2707j2394Q582P708j7440Q751R96j8497J8816
$$ plain form
989 -20627 9776 1093 -9086 21104 -3605 -5546 13339 -16505 -2274 6545 -14580 13698 6042
1002 6042 -12213 14835 -7569 -14680 12819 -11521 -3369 19344 -10698 158 10981 -19638
1014 -19638 -748 3846 -14100 12809 5065 -8856 13632 -7509 -10550 8856 -12644 2216
1026 2216 13546 -9627 7965 3636 -13006 5442 -5125 -4602 12624 -3783 2702 8381 -10086
1039 -10086 65 1970 -8990 6964 7531 -4108 6202 2612 -9280 221 -1451 -4045 8084
1052 8084 1605 2358 6645 -7133 648 -2297 -9651 10876 -278 -2048 15511 -8173 -2622 5063
1066 5063 -16035 4989 4551 -7617 14526 -432 -4635 7470 -12076 -1174 5627 -7284 8181
1079 8181 3354 -4967 5444 -8167 -6279 6428 -5966 2616 10324 -7116 1635 2631 -15866 2950
1093B950J933j5595K4661j0208j4917K2504k2875K87K3388k4007J5897J0684k5759
1106a1057K0384r538j5688K5155j5660K259J9054k0113R736L140k1000J5904r46
1119A630j1415J8540k222j0673J3131p599j2588J6547o420o775K0843j2479k179
1132a659J2981k2316R379O425j9160K4985n668j2535K3760k3284j406J7627k2844
1145a3715J5721O366j5429J8397j3389o059J4795j8462R719J0475j5264J3590
1157F745r28j4432J0741m182o180J2320l622j007Q093j0546k19O710j4295J0172
1171f30P748j5537J7835k826j7788J9897j3913n903K1555j7925J0322R002k1783
1184i946J7929q537j4451K4888j5703R18K1398k1571N314Q832j9995R535M289
$$ plain form
1093 2950 4883 -10712 13949 3741 -11176 11328 -11547 -11260 12128 -11879 4018 14702 -11057
1106 -11057 9327 -211 -15899 9256 -6404 -4145 14909 -5204 4532 7672 -13328 2576 1630
1119 1630 -9785 8755 6533 -4140 8991 1392 -11196 5351 -1069 -7844 12999 520 -1659
1132 -1659 11322 -10994 -1615 4810 -14350 10635 4967 -7568 16192 -7092 -8498 9129 -13715
1145 -13715 2006 8372 -7057 11340 -2049 -8108 6687 -11775 -2056 8419 -6845 6745
1157 6745 5817 -8615 2126 -2056 -8236 4084 462 -545 7548 -2998 -3217 3493 -10802 -630
1171 -630 7118 -8419 9416 6590 -11198 8699 -5214 -11117 10438 -7487 2835 11837 -9946
1184 -9946 7983 -554 -15005 9883 -5820 -4902 16496 -5075 239 9071 -10924 -1389 2900
1197B900r278J2271L14r031Q547o299p982J3019o799k051J7504j5155J008J1319
1211A0287k1597J1332M535j4965K1175r437o068J7765k3970Q386J0385k2380K3255
1224H703k945j5326K1904j6518l878J5085j7267J0680O685j3108J2575m863j0014
1237h287J0400n676l501J2407l797l795R905r423m449R948j1805N166J1187j5167
1251f887J3940p93j8114K0254j3036o682K4605j9942P152J3663k5135J5338j576
1264B787j5805K2035j0070k989J7291j7880L545P102j5778J0299M246r101J0335
1277F017j002r066O949m572n456J1718m776j764J3060j4168P89Q872j8141J0982
1291e58O185j4356J8083n640r738J4777j6050K668J0119j5291J5322n6j2433J5769
$$ plain form
1197 2900 -6378 5893 6207 -2824 5723 -576 -8558 4461 -2338 -4389 13115 -2040 -1032 10287
1211 10287 -11310 22 4557 -10408 10767 1330 -4738 13027 -10943 -2557 7828 -14552 8703
1224 8703 5758 -9568 12336 -4182 -8060 7025 -10242 438 7123 -5985 6590 1727 -8287
1237 -8287 2113 -3563 -7064 5343 1546 -2249 7656 -1767 -6216 3732 -8073 -2907 8280 -6887
1251 -6887 7053 6260 -11854 8400 -4636 -11318 13287 -6655 497 14160 -10975 4363 2787
1264 2787 -13018 9017 -1053 -4042 13249 -4631 -1086 6016 -9762 537 4783 -4318 6017
1277 6017 5015 -4051 2898 -1674 -7130 4588 -188 -1952 11108 -3060 -2271 6601 -11540 -558
1291 -558 5627 -8729 9354 3714 -6024 8753 -7297 -4629 5490 -9801 5521 5465 -6968 8801
1305H801j1118n982J4069j1813L549J0768j1302M543K935j1354N343K085p435
1318f911J0173R67q091J0246o582q298J2438r831K642J2102j4007J0503Mj5985
1332a0630J7041j0675m691K1617j8561N927J2594k3841J3591J765j6380K0641
1344H398p043n908J5717j4995J256Q414j4019R398M154j0250J0737k107r183R423
1358C992n735m583J2436p206o2J1390j4891L122P271j7284J2507M732j4552J7879
1372I016n033j1637J4793j2941p78J2603j2554R473M086j3705J1618n327r907
1385a0293J5377o868l819J4809r923l654J0291j1744M89J0630j0295O694N865
1398G559j3031R249l518j0352J5475p716k463J5860j4220K607O936j5961J0663
$$ plain form
1305 8801 -2317 -8299 5770 -6043 -2494 8274 -3028 1515 4450 -6904 -1561 524 -6911
1318 -6911 3262 4229 -3862 6384 -198 -8496 3942 -5889 -3247 8855 -5152 5351 5355 -10630
1332 -10630 6411 -4264 -8955 12662 -5899 28 12622 -11219 2372 4137 -12243 8398
1344 8398 1355 -4553 11164 -3831 -2575 5839 -8180 1218 5372 -4878 5859 3752 -5431 3992
1358 3992 -1743 -6326 6110 -1096 -1158 10232 -4659 -1537 5734 -11550 957 5689 -8863 9016
1372 9016 3983 -7654 7139 -5802 -6580 6023 -6531 2942 7028 -6677 4941 -386 -10293
1385 -10293 5084 -1784 -5603 9206 -717 -4371 5920 -5824 -5335 5295 -5000 1694 7559
1398 7559 -5472 3777 259 -10093 5382 -2334 -4797 11063 -3157 -550 6386 -9575 1088
1411A088O79p958J4519p799j634Q635j4674N622N205j1057J1405P94o907P448
1425E366o265k373M054n529N989J667m259Q558o082o416J0067q494j962J2340
1439F661p905P70Q783j2761L247M059j1184J0731K65o404J2396r265m853J2069
1453F609j4287L058J1679j3468R534L916j5200J2078l983j0224J6280p613l030
1466d651J5661j5737L01J2825j8951P742J0499j5567J2892J622j4727J3339o311
1479a063p496J4089r489L414R712j5370R304J790j5051J4183l026p480J6550j0350
1493b83l279J2063j4916L398Q829j2460J0752K863j2214J0808l835r574J0972
1506C124m852j363R380o835J836K910q924M805m41l982R362m098k870P747q008
$$ plain form
1411 1088 1767 -6191 8328 529 -1105 7530 -7144 -1522 3683 -7374 4031 4825 -2082 5366
1425 5366 -899 -3272 782 -4747 1242 2909 -1350 7208 1126 -5290 4777 -3717 -5679 6661
1439 6661 -1244 -474 8309 -4452 -1205 2854 -8330 2401 2666 -3738 8658 -607 -5460 6609
1453 6609 -7678 -4620 7059 -6409 3125 7041 -8159 3919 -64 -10288 5992 -1621 -4651
1466 -4651 11010 -4727 -4426 8399 -10552 -2810 7689 -7878 5014 6636 -8091 5248 -1063
1479 -1063 -8559 5530 -3959 -545 9167 -6203 3101 4891 -10160 4023 997 -6483 10067 -283
1493 -283 -3562 8501 -6415 -3017 5812 -6648 4104 6967 -5247 5561 1726 -7848 3124
1506 3124 -1728 -3091 6289 -546 1290 4200 -4724 81 -360 -4342 5020 922 -1948 5799 -2209
1521b209j914O149o102L307N208o502M161j19o240M767k952j020P733n977J413
1536b97N469r363L867Q61o523R214l066k340Q644j0176K410M221j1523J1112P80
1551C290r109J3911o662o328R858j0705J590Q802r874Q164L315j0211Q297m266
1565G2p571J2008m953m383J3150q154l247R632j1945K558R151j2421R693L622
1579G212j3484J1846n585r069J6267j0319j003J5274j4776L609O671j5177R359
1592H25J638r264J2539l700n885R277q502k252R486p952K397P760q406K124L375
1607C460j0042O002J353p146J0931l336m213R415j0234J43Q335j1288O902M569
1621D851q997Q059m125l624O304o445M097L097n028O128l981l321M801n629K493
$$ plain form
1521 -2209 -4123 2026 -4076 -769 4439 -2063 2098 1979 -4261 506 -2446 -3466 4267 -1710 -297
1536 -297 5172 -4191 -324 537 -5986 3228 162 -2178 6466 -3710 -1300 2921 -8602 2510 3290
1551 3290 -5819 8092 1430 -4898 4960 -5745 -4155 4647 -5227 2937 6252 -3959 4338 72
1565 72 -7499 4509 -444 -4827 8323 169 -3078 6554 -5391 -2833 6318 -6103 3590 7212
1579 7212 -6272 5574 -11 -9080 7187 -3132 -4135 11139 -3637 -28 6643 -8534 825
1592 825 2463 -6801 5738 2038 -3847 5430 -3072 -5324 4162 -3790 -1393 6367 -2039 85 3460
1607 3460 -6582 -580 773 -6373 4558 1222 -2991 6424 -3810 -3667 4668 -6620 282 4851
1621 4851 -4146 3913 -212 -3836 2468 -3977 120 3217 -1811 4317 336 -2985 1816 -3813 -1320
1636a320K780k303M980k337k410K948m384q30M531j917o81N747m257l057O268
1651C758o074o62P797o354L210K852q743P704n104m490J2391j0591L220J1055
1665I969j6259P988M368j5681J2339r29q442J2918o304l423R158j0085J154P954
1679D725r504N179O819j2352N574M165j3827R566K217r678J3323m194o179J1217
1693G051j2231J816Q538j4443J2732K200j3898J5286o023r461J4498q070j291
1706c296R906q014J232L323p258L356Q15l053N439O45m130M986k301o454P008
1721B204k661l672R281n484l18N446q683M836P7n176R591n085j327P191j0233
1736d013K352K990o502O970q13m56L783o060L467j793n594Q020m125o47P469o782
$$ plain form
1636 -1320 1460 -843 4137 1800 -610 2338 -2046 -2876 1655 -262 -943 4804 547 -2510 3758
1651 3758 -2316 -2978 4819 -1535 1675 4527 -4216 3488 -1616 -6106 6285 -4306 -1086 9969
1665 9969 -6290 1698 6066 -9615 2724 1795 -6647 6271 -33 -3456 5702 -4383 -3229 4725
1679 4725 -4779 400 7219 -5133 441 4606 -9221 345 2562 -7116 6207 2013 -4166 7051
1693 7051 -5180 -3364 5174 -9269 3463 5663 -8235 7051 1028 -8433 6065 -2005 -3296
1706 -3296 6610 -1404 -172 3151 -4107 -751 64 -2989 2450 3095 -1035 3951 1650 -4804 2204
1721 2204 -457 -4129 5152 -332 -650 4796 -3887 949 1026 -4150 5441 356 -971 6220 -4013
1736 -4013 -1661 1329 -5173 1797 984 528 4311 -1749 1718 -75 -5669 2351 -1774 -2421 5048 -1734
1752a734J460K937o956L922J360l816N677j216m296M596l132m428Q036l514j636
1767b740R665p871n92O697j1950N752L896j0588J2881k568q535J3583j0243k879
1781e492J3176j3072M788Q923j3449P307J603j1493R616q28o284J0848l601m561
1795b519R172q303l155R851r479J598J0284j1463N274N039j3041R750q35q131
1809e958J2849p572k569J0278j2528K998O385j0386Q867J945p080P206l622m219
1823c406L870l319K84L541j170P48J131k512l30J482k179J256K465l000J707l7
1839E31l715K659r27j78L429k083K854r61l383L307m740J126L227m182N536n14
1855A986m036O179o841P54O057q100O194K115q818P850l503n572R557m854q94
$$ plain form
1752 -1734 -274 2663 -4293 -371 989 -2827 2850 1634 -2662 1934 -1198 -5626 2410 -1104 -2740
1767 -2740 6925 -946 -1538 5159 -6791 -1039 2857 -7731 5150 2582 -5953 7630 -2613 -5492
1781 -5492 7684 -5388 -600 8323 -5126 2181 3784 -7709 1907 1079 -5205 5643 2042 -2519
1795 -2519 6653 -1650 -4805 5046 -4433 -2835 7449 -4014 1260 6299 -6742 3008 2173 -5958
1809 -5958 6891 -681 -3250 7028 -5500 -2502 3883 -6503 2364 4309 -2771 4435 813 -3406
1823 -3406 464 -2855 -2571 970 -200 548 1679 -833 -1163 319 -1860 -604 1861 -1139 568 531
1839 531 -3184 -525 -1452 -1630 1799 -284 2570 1609 -1774 1533 -3207 -2081 1146 -3036 2500 1986
1855 1986 -2050 4129 -2712 -1958 4099 -4001 2193 4308 -4510 3340 -163 -5735 3822 -1032 -1926
1870a926Q656p098O46M568r607L359L815q177P621K382q162Q563k709p324J0706
1885E313o956k062J1323j1265K670O580j3423Q455K815j1084J3113k202p465J0484
1899F296p480l765Q080q073K585O575o865L651K804p783M623J254p306P436M87
1914B519p017P606k977n883Q935n693l41Q799q214L863K755j0002P320j735o826
1929f891J0427l158k592P432n606n48L011l918J656R82r26J505k183P39N25k482
1945b027K471J034q69J755n65j263k86k259O66L97m88L588q96j511M015l590k519
1962b347M822m336J240L640n914L726M43o243P353l036k013R273p883p4P397j1321
1978e273K346N813q950O497L178p238O790q26o247O527l481k272O869o192JO848
$$ plain form
1870 -1926 6730 -368 278 4846 -4761 -1402 2413 -5764 1857 4239 -3923 4640 1931 -5393 5313
1885 5313 -1643 -3705 7618 -3647 -977 5603 -7820 635 3450 -7634 5479 3277 -4188 6296
1899 6296 -1184 -4949 3131 -4942 -2357 4218 -2647 1004 3808 -3975 648 1902 -5404 2032 2519
1914 2519 -4498 3108 131 -5752 3183 -2510 -2851 5948 -2266 1597 4352 -5650 1670 -65 -6891
1929 -6891 3536 378 -2214 5218 -388 -936 2075 -1843 -187 795 -131 1374 -809 -70 455 -2027
1945 -2027 444 1478 609 2364 1799 536 250 -2009 -1343 -946 -1434 2154 1258 -253 3762 172 -2347
1962 -2347 2475 -1861 -621 3019 -2895 831 1274 -4969 2384 -652 -2665 6608 -1275 -1349 6048 -5273
1978 -5273 -2927 2886 -6064 433 3611 -3627 3163 2337 -3910 2617 -864 -3136 3733 -2459 -2458 4390
1994D390q859K014P061r459O417M153j0386Q435j389r410R879n111k900J1133
2008E968q254J973Q134j2434N093M165j0966Q723K18p853R368l715m734P984n224
2023a554O78N763o320L157K346p825L759O37n563O488p10k630O233l294k382L094
2039A877l146L08J320j980K620p94k204K160q92J24J589l24P12l3j332n11k413
2056b919J291N30j835M065O32k267L090k227j961L246m034Q31L457m532L250N63
2072A180n059N801r47m341Q297l438l674O343o600j403O247o058K553N760o607
2087a946M515J663p899O365j739o386R284m204l303Q900p447O1P450r051M746
2102A009M709r309O875j052q061Q735m394l961J0673n884p02Q091q565O85N070
$$ plain form
1994 4390 -4469 -2455 4606 -4853 1564 5717 -4669 3766 2377 -7033 2846 -2265 -5165 5968
2008 5968 -2286 -313 7821 -4613 480 4645 -6321 2402 2620 -5233 4135 420 -4314 3670 -1554
2023 -1554 -876 4887 -1433 1724 4070 -3755 4 641 -4922 1566 856 -1774 4459 1165 -1217 1877
2039 1877 -1269 -961 359 -1621 999 205 -1999 161 -731 -607 982 658 1370 1337 5 -506 -2919
2056 -2919 -1628 -1098 -2933 1132 1764 -503 2587 360 -1601 1645 -2389 -1558 1899 -2633 617 1180
2072 1180 -3879 1922 975 -3366 4931 1493 -2181 4162 -2438 -3841 2406 -3652 -1099 4661 -1946
2087 -1946 2569 4232 -3667 2698 959 -5427 3857 -347 -3650 5250 -2197 -2136 5314 -3737 1009
2102 1009 5718 -3591 3284 2232 -5829 2906 -1488 -5449 5224 -660 -1362 6729 -1836 -1151 3919
2117C919q482L527L744o605M866M92n273N947k246k494O444m072m58L760o125
2132c056J183K198n203N016J104k869M995k555j764L193m317J48K463k531J531
2147d64P50r24N31j41J002j052J252J254k421O69R1l185Q95J351j394L091R66
2164B271j708J942j119l058K604j770j670M537k968J6M103n216K197K916n425
2179b348N232n14n062O262n325k271O826p304L240O499p963N245K405q785N290
2194A427n79o179O805j063m100O853l575j788N519n342J138N292p112L185K444
2209B925r092O705j9o621J0100l097l167Q847q258J29N734r929N027L155p730
2224e291P313M5o040O869j942l881O032k207k230L791l230j437K928l132J769
$$ plain form
2117 3919 -4563 -1036 2708 -3897 969 1461 -3812 2135 -111 -2605 3839 -233 -691 3069 -3056
2132 -3056 -1873 325 -4878 138 1242 -1627 3368 813 -951 2242 -2075 -1927 536 -1995 -464
2147 -464 286 -638 -107 -248 754 -298 954 2208 -213 456 547 -2638 -1743 -392 -1786 1305 2271
2164 2271 563 2505 1386 -1672 932 -838 -2508 2029 -939 -923 3180 -2036 161 3077 -2348
2179 -2348 2884 2370 -2692 3570 -1755 -4026 2800 -4504 -1264 5235 -2728 2517 4922 -3863 1427
2194 1427 848 -5331 1474 411 -3689 3164 -411 -2199 3320 -2022 -884 4408 -2704 481 2925
2209 2925 -6167 538 519 -6102 3998 901 -2266 6581 -1677 -1548 4186 -5743 -716 2439 -5291
2224 -5291 2022 2067 -3973 2896 954 -2927 3105 898 -1332 2459 -771 -2208 720 -2412 -643
2239f43K740k854L156R36m840M118l144l130N408l442K38L986l543J938R15k921
2255a082L189j755mJ462k946J182o92j376K039j446K324J197j937K879k586k212
2271a764K829l756K13L468k727J115K729l317J175J847l404K056J414m726L572
2286G24j64n285O005k207k703Q604n770R1O281q959K953K686p938O867p34m482
2302d031Q353m822j621O980o806J066N248o840K546L037p155L323K483n819N880
2317A822J133m671O265k530n058O967o407q57O869p316L708M341p566N821k42
2332B279n514O951m077j533N307o305J536K817m821L412J564k689L557m27l067
2347a010J416p90k053J374L20l86J588q6l4M91j070M79j19j370K012j612l40J207
$$ plain form
2239 -643 2097 -757 2399 3335 -1505 2613 -531 -3661 1747 -1695 -1457 2529 -1014 924 1839 -1082
2255 -1082 2107 352 348 1810 -1136 46 -646 -2022 17 -1429 895 2092 155 3034 448 -1764
2271 -1764 1065 -2691 -2478 990 -1737 -622 2107 -1210 -35 1812 -1592 464 1878 -2848 724
2286 724 560 -4725 1280 -927 -3630 4974 -796 -705 5576 -3383 -430 2256 -5682 1185 451 -4031
2302 -4031 4322 -500 -2121 4859 -1947 -881 4367 -2473 73 3110 -4045 -722 1761 -4058 1822
2317 1822 2955 -1716 4549 2019 -3039 3928 -2479 -3336 3533 -3783 -75 4266 -3300 2521 2279
2332 2279 -3235 3716 -361 -1894 3413 -2892 -1356 1461 -3360 52 1616 -1073 2484 2057 -1010
2347 -1010 406 -384 -2437 -1063 -743 -1129 459 373 339 830 -240 239 120 -1250 762 -850 -1190 17
2365A7k250J725L28q20K897r26l59J364l843J591j48l113M428j535k63M089m011
2382h29J436K075m810L231O03l833L553r12l599M197n70k870N461j399k449M845
2398D130m356k063M637n957J972M396o179N562O55n755P208m323l024P658p044
2413b483R86M930q267M960J622o750P372l69m551O587l289l463N069m746j007
2428c399M793l358J354L355m121K236J488n126L852k27l838M587k426j837M399
2443A732l850J149L476l339K421L39k843K084j929j666K073o05L67J616k18l2
2459G75K35k65j039K66M49r44L80L55q58K65K57O20K69O26M69j334P84j388j439
2478a517R65r20R25J135j529L521j407k493M259l931m61L704m909K214K451n744
$$ plain form
2365 17 -2233 -508 -180 -1000 1897 971 612 1976 -1867 -276 -424 -3537 891 -644 -907 3182 -829
2382 -829 607 2682 -2128 1103 1706 -2127 1426 514 -3085 1112 542 -2328 3133 1734 -715 4130
2398 4130 -226 -2289 2348 -3609 -1637 2759 -3420 2142 2797 -2958 4250 -73 -3097 4561 -2483
2413 -2483 -1497 3433 -4834 126 1748 -5002 2370 2001 -2550 4037 748 -2715 2354 -2392 -3399
2428 -3399 1394 -1964 -610 2745 -1376 860 2348 -2778 1074 847 -2991 1596 -830 -2667 1732
2443 1732 -2118 -969 2507 -832 1589 1928 -915 1169 -760 -2426 -353 -958 -591 1025 807 775
2459 775 1010 745 -294 -28 421 -523 -143 212 -646 -381 -124 496 765 1391 1860 526 1310 -78 -1517
2478 -1517 -552 -1472 -547 588 -941 2580 1173 -1320 2939 -992 -1453 2251 -2658 -444 2007 -3737
2494c737M492j53l263N817l183j215N342n912k66L609n420K231L280m521M385
2509A486J251m905M168j809k969M568l412m09M843n735J683M061o201M705J586
2524B911n281N210p87n119M639k697j882M459k942R84L760l637J443J483m202
2539a658K305L64l349L153N9k859L220j222j112L192k224N40K462l997J502L88
2555G64l738K988k70j682M445j775r84K425k646J78L75j508J453p13k52J641j597
2572h96Q06J154j894K051j47j601J597k483L9J202k596K688J047k546L758p94
2588A385k827L429k552j657L546k946N80K504l538K699K53l356M779j349k715
2603a765M943l734j548M089m520O87M527m013K542J997m636L720r91l964M628
$$ plain form
2494 -3737 755 602 -2661 3156 -27 -1242 4100 -1812 -2078 1531 -3889 -1658 1622 -2899 1486
2509 1486 2737 -2168 2000 191 -2778 1790 -1622 -2031 2812 -2923 -1240 2821 -3380 1325 2911
2524 2911 -2370 2840 2053 -3066 1573 -1124 -3006 1453 -1489 -505 3255 -382 1061 2544 -1658
2539 -1658 647 1011 -2338 815 874 -1985 1235 13 -1099 2093 -131 409 2871 -1126 376 764
2555 764 -2974 14 -256 -1938 2507 732 -252 2173 -473 -295 80 -1428 25 -688 -940 701 -896
2572 -896 -90 1064 -830 1221 1074 -527 1070 -1413 -1374 -172 -2768 -80 967 -1579 2179 1385
2588 1385 -1442 1987 -565 -2222 1324 -1622 -1042 1462 -2076 623 876 -2480 2299 950 -1765
2603 -1765 3178 -556 -2104 1985 -2535 -1848 2679 -1334 1208 3205 -1431 2289 1298 -2666 1962
2618A962k606j546N111m013q1M607n122J597L139m466K541R89m494L038j035k543
2634b922M441k301l00M551l924N60K715m968J374J970m175L317K53k746L456j440
2650a39j409L293k447M08K132l339J289L16k805K392N4j306L058r95l03J499k048
2667c50M34n82j263J537k42n7J257r79R9J015j261J104k1o88P69j235m99R88j501
2686a475J149J591j841K222K54k748K255j532j843L368k165k88L376l340J133
2701A16J980l750L134K61l344L644j737k224L193k578l26L494k866J390K226l645
2717a032J724O11l716K646L3l129M375j448j837L890k999j01L197l716J313K394
2733B205m875L063L0l995M783j569j442M374k642k64K109l259Q22R76k284K162
$$ plain form
2618 1962 -644 -2190 2921 -1092 -1173 3434 -1688 -91 3048 -1418 1123 2112 -2382 656 -379 -2922
2634 -2922 1519 -782 -1082 3469 -455 105 2820 -2148 -774 1196 -2979 338 591 -2155 1301 -139
2650 -139 -1548 1745 -702 -294 1838 -1501 -212 104 -2701 -309 -255 -1561 1497 502 199 1698 -350
2667 -350 84 -498 -1761 -224 -466 -523 734 -245 -146 869 -392 712 691 3 772 -463 -962 26 -1475
2686 -1475 -326 1265 -576 1646 1900 -848 1407 -125 -1968 1400 -765 -1053 2323 -1017 116
2701 116 2096 -1654 1480 1741 -1603 2041 304 -1920 1273 -1305 -1631 1863 -1003 387 2613 -1032
2717 -1032 692 1303 -2413 233 266 -2863 1512 64 -1773 2117 -882 -983 2214 -1502 -189 2205
2733 2205 -2670 393 423 -3572 1211 -358 -1800 2574 -68 -332 1777 -1482 -660 316 -1968 194
2749A94K84j533K118l14j739K103o73j089K171j412p29J425j754M41J030j064
2765e41J845k91q88K095k573j5R85k013J205P45j095J639r34q4R57j745J327k36
2783C83j125J434j143o35J061j029O09Q25m58J052r4j280O81p94j112J809p68
2800e84q01K480j178o34K189k181M8K145k738J415Q75l133K894j406j493L803
2816A701k569L71L330l726R38J267l599K420J17k150L099q34j410K500j522o08
2832f75K107j749j12K325l139P53J569k877K011J061k327K839o99j704K807k700
2848e10o00K266l167K247J363k900K592l48j980K289j474l65J337j160J78M35
2864B03r54O83K56r59R74O29r31M00p5j408O89n61m3J300p29P04K40j096J634
$$ plain form
2749 194 478 -1055 1063 749 -990 1113 440 -649 1522 110 -619 806 -948 -507 523 -541
2765 -541 1304 1013 125 2220 -353 -368 617 -1396 -191 554 -541 1098 164 80 1037 -708 619 383
2783 383 -742 692 -451 -1086 -25 -1054 -445 380 -78 974 880 -400 281 -513 -1625 184 -584
2800 -584 -1385 1095 -83 -717 1472 -709 -661 1484 -1254 161 1036 -2097 797 -609 -2102 1701
2816 1701 -868 -497 2833 -893 45 1312 -2287 133 250 -1900 1199 365 -1045 1455 -67 -675
2832 -675 1432 -317 -429 1896 -1243 -490 1079 -1798 213 1274 -1053 1786 1087 -617 2190 -510
2848 -510 -1110 1156 -2011 236 1599 -1301 1291 943 -1037 1252 -222 -587 750 -410 -232 203
2864 203 -751 -68 188 -771 203 832 -99 301 226 -1182 -493 -1054 -1097 203 -526 178 418 -678 956
2883I56j456q12K439j990J88J514k421J727l01r88K389j431K86J501k866J892
2899F27j02k651K616m99j126K630j270P7P90j488M61Q59j770J163L51j772J510
2916D06L27k196K621n86j746K904j306r85J925k748N83J867k526J941M63j908
2932i64K702j594j202K584k230m21J969j595O31R06k102J132R05j792J399O90
2948A018j626J666j285j587K598j767o18L002k299Q93J464k909J823k32j946K454
2964F49j261j5J808k715J359J280k157J749j32r85J466j399l03R30j091Q69j64
2981a12j04J332m23p92P57m97k69J34q9N34j83l86L48M2n46R41m02k55J502j528
3001Dl14J132j512K08Q03j100J271K16j322J707j309j75J042j861R97R46j650
$$ plain form
2883 956 -500 -1312 1127 -863 -675 839 -1582 145 -156 -1144 1245 -186 100 1601 -1265 627
2899 627 525 -2126 490 -9 -1135 1495 225 302 1092 -396 65 924 -846 317 668 -1104 406
2916 406 733 -1463 1158 572 -1174 1730 424 -561 1364 -1384 -801 1066 -1460 481 944 -964
2932 -964 1738 144 -1058 1526 -704 -1125 844 -751 -120 786 -1316 -184 721 -1071 328 1018
2948 1018 -608 1058 -227 -1814 784 -983 -1601 1401 -898 -5 1459 -1450 373 141 -1805 649
2964 649 -612 -627 1181 -1534 -175 1105 -1052 697 565 -420 1046 -353 -656 274 -817 52 -112
2981 -112 -216 1116 693 -99 658 161 -108 26 -63 471 288 -98 250 292 -254 687 285 30 1532 4
3001 4 -310 822 -690 -482 321 -779 492 708 -614 1093 -216 -391 651 -1210 -213 733 -917
3018i17O64N01j160R22m9p17J655o78r46J324j278o33K049j814P58J852k490J359
3036D02P47k622J904m07j504K407j337l17J883k383J583M36k291K482j97k119
3052a333K306q96j120J487j266N27J174j051M49L88r66O61j36r65J218o8r75R60
3070C94l45k66N83n26O18K96r74R72o06o18J280j323j85J409j054L92R01j232
3088b84O58j81o83L93j65j16O94p82L95J57p14N90K63r44P09J03n80Q11p00m17
3108g93J102r11M05P80j210Q71M52j985J654p9j484J916p91m50J470j517L03Q28
3126E61j327J554l99j119K187j794m52K014k024N40J617j582O45M59j764J198
3142C14r3r97J680j105j53J547j641K86J050j568N38O48q23O06M1r13R82n55k51
$$ plain form
3018 -917 -253 248 -912 10 -39 -756 899 221 -725 599 -679 -1312 737 -1077 -319 1533 -957 402
3036 402 1149 -1473 431 24 -1480 927 -410 -727 1156 -1227 356 792 -1499 983 786 -1333
3052 -1333 973 77 -1043 444 -822 -295 879 -172 277 665 -301 360 224 -741 477 409 -566 394
3070 394 49 -217 366 -160 458 754 -220 752 146 -472 808 -515 -700 709 -345 47 948 -284
3088 -284 374 193 -490 -97 -262 -378 316 -466 -71 86 -628 -38 225 -719 -10 93 -487 324 -376 -793
3108 -793 309 -602 -197 583 -627 244 696 -1289 365 286 -1198 718 -73 -523 947 -570 -267 561
3126 561 -766 788 389 -730 1457 -337 -789 1225 -799 -259 1358 -224 421 880 -884 314
3142 314 221 -776 904 -201 -354 1193 -448 -162 888 -680 -142 506 -317 289 330 -583 399 -156 -407
3161d07J122r68K04J279k066N45Q48j861J403L82j404J313k89p05R08o39L35L96
3179C96p46O40J77j239R94n08p23J117k81K67N66r54M84K95j339Q89O4n97R29
3198D31m01r33J810j274n7J043q54O86K13j256J300q80n46J586j170K24J246j407
3216b39N07P00j589J242k38r16J232o81k46J052j227L8J162j393P53O40j252Q27
3234C72k04j035R67k09m80J101n68oO68j194N80M01j835J541J70j135J477o39
3252b8o89J293j025j25J104j098R57j19j049J441j120l45J233l35j70N70n69j31
3270b05L00o76L85L28o34J174j27j168J339q45n09J462j301K79J266j685N95P01
3288F79j485J517q78m8J104j356N81O98j685J132N1r18J168j80o63Q81r27M59
$$ plain form
3161 -407 715 -253 -49 1230 -836 -291 557 -1304 99 481 -923 390 101 -604 304 -335 0 396
3179 396 -350 290 467 -772 222 -286 -1009 108 -173 94 660 -294 190 485 -854 35 99 -498 431
3198 431 30 -903 907 -367 -424 619 -235 451 664 -592 708 -172 -718 868 -302 -78 1168 -239
3216 -239 268 968 -621 621 383 -533 699 18 -228 824 -403 -365 797 -596 157 797 -455 372
3234 372 168 -867 100 -109 -589 512 -56 -62 606 -588 -8 393 -1442 99 269 -866 611 -28
3252 -28 -717 576 -449 -574 530 -568 389 270 -779 662 -458 -803 430 95 -75 495 -74 -205
3270 -205 95 -581 -196 132 -502 672 545 -623 716 -129 -638 824 -477 -198 1068 -617 -22 679
3288 679 -806 711 -167 -215 889 -467 114 812 -873 259 310 -608 560 380 -283 598 -329 130
3306A30K44p37O06L29q57O18j6r83N69L38o97J017k63p16Q15p65p1O35p15O06
3326H7m3p93J168p72l93J222j175J13J109j106L85L69j046R37k11p32J438o69
3344a12l11R82p09k30Q28r12J77R67r86K45O26n78M69q6n01J048j125K31Q61j437
3364e53P26N26j526J537k59n75J268j421K39P93j427Q80O1q96R86j34m95Q29n49
3383A0l76L73o5k24N81l23J95k25k81L01P2n56J030o28n95J126n62n14J042p11
3403c30K64M66j216J228p56l26J446j257L3J147j167K95M86r05P13K18q38N25
3421B6k8j05L71m83nN58o62j41R95o12K31M41j159R15P3r80J246m58k10O82j406
3442g11J055O40j791J517o30n94J466r96l45Q95j319Q27N59q46Q95o47k38M83
$$ plain form
3306 130 374 -363 243 572 -285 333 317 -666 -97 241 -456 561 298 -418 397 -368 -439 196 -519 87
3326 87 44 -749 419 -353 -746 476 -699 -586 523 -583 -198 171 -875 62 -149 -881 557 -112
3344 -112 -423 559 -150 -380 448 -464 -287 680 -306 -61 565 -13 456 370 -131 917 -208 23 884 -553
3364 -553 173 699 -827 710 451 -124 1144 -277 -38 755 -672 208 269 -627 359 225 -270 559 10
3383 10 -366 7 -58 -282 299 -24 171 -54 -335 -34 38 -518 512 -116 -711 415 -147 -661 381 -330
3403 -330 -66 400 -816 412 -344 -670 776 -481 -448 699 -468 -173 313 -592 121 339 -499 26
3421 26 -2 -107 264 -219 -224 334 -328 -469 526 -86 145 586 -573 342 415 -565 681 223 13 695 -711
3442 -711 344 984 -807 710 80 -514 952 -44 -389 506 -813 14 573 -273 622 -25 -263 220
3460B20m04k17P66o92K77K70l73k79L27l20J77M28m61O67m16o09J234j038m13
3479h56J120p12J78O67j165O39K70p43J155p63J23N16o90P9P27j110O15J98o49
3498d01P20k0n12N84j90n44O15l71J13O82j182P27N42j223Q77j77o89J361q92
3517B0k98Q41j105P77O8j010J356n24o61J194p85m39J033q64P15L02j113P21l27
3536i9k52N64o16K52N59n09L51K27q71k4M47n12M69L21p36M11O9m68N81q30K39
3557d27O77p43K90O90j339Q72L5r09J040p1l15O59p93N38o0q09Q48J07q81R99
3577D08j8o75P22l90n62R20m16j27P26j64m94M54o96N67J75r58J339o78l74J035
3597G94j104k0Q64j081R06k43n45J066p88k05Q73j002J26P37q12M45K19o06K94
$$ plain form
3460 220 -184 -401 365 -327 -50 220 -153 -432 -105 -425 -248 180 -281 386 -30 -639 595 -443 -856
3479 -856 264 -448 -270 397 -768 -129 141 -602 553 -210 -87 429 -261 -182 545 -565 50 248 -401
3498 -401 319 299 -213 371 181 -363 252 -119 -6 676 -506 221 763 -460 417 240 -449 912 20
3517 20 -278 563 -542 235 303 -707 649 125 -536 658 -127 -566 467 -397 318 620 -493 228 -99
3536 -99 -351 213 -403 -151 408 -101 250 477 -394 -418 29 -483 -14 307 -429 -18 51 -417 164 -666 -427
3557 -427 250 -493 -203 487 -852 20 55 -854 186 115 -200 459 -334 204 144 -665 183 290 -591 408
3577 408 390 -285 437 47 -515 405 -11 -138 588 424 -70 384 -312 255 430 -528 811 133 -241 794
3597 794 -310 -330 534 -547 359 116 -429 637 -151 -356 517 -485 -359 378 -434 11 230 -376 -82
3616h2J29m14L74k96Q1M77p19K94ll6L00L19o73L70J91r67N73J0j23M13l29j75
3638b86N28p27M60J43n88N96J79p12P34m52Q5L41p81M61J19j11M86j6o35N60k40
3659A44p42J431p88l38O41n23R1N30p78O27q3p02J225q04j86R22r27K76L23n70
3679b31L89L39o01N94k36n81P53o59J45P66r30K77J58p88M29M62p21L82K3J8j59
3700a71k27m5M97n29J44J88k30L68j63m19P14l74m12Q70m26MO42o10J23K81l63
3721a38K04r7k95R27l46n87N01m76L41L58q68P89K98p81O11l79j63O66p66L29
3741A28N00r86L88O23p70K23N8m01N64p4k98K96q14L73M06p29P60K2p18O34j0
3762A75q17J115q31K4P80r56N26K99r22Q71Oo08O85o65J17J90j19j75L86m50L93
$$ plain form
3616 -82 47 -367 7 -289 -208 269 -450 -156 -159 -195 105 424 -249 121 312 -655 -82 -72 -195 218 -111 -286
3638 -286 242 -485 -25 118 -470 126 305 -407 327 -125 -40 301 -480 -19 100 -11 475 459 -176 384 144
3659 144 -598 833 45 -293 348 -175 -84 446 -332 295 212 -490 735 -69 -255 667 -260 16 339 -231
3679 -231 158 497 -104 490 254 -327 426 -233 -88 678 -252 25 183 -605 -176 286 -435 -53 -30 -12 -171
3700 -171 -398 -443 54 -475 -331 -143 -373 -5 -168 -587 127 -247 -659 211 -215 -211 431 -179 -56 225 -138
3721 -138 66 -31 -326 601 255 -332 169 -307 34 392 -476 313 611 -170 441 62 -101 565 -201 128
3741 128 628 -358 30 653 -117 106 164 -237 327 253 -45 251 -563 -190 216 -513 247 269 -449 185 175
3762 175 -642 473 -358 -334 446 -510 16 315 -607 264 270 -338 347 -318 -201 -11 -130 -305 81 -369 24
3783B4K4k16K74j70n13L89l4k64M92j97J15J87n31L15N01o85K97M72p96N81j21
3804A44n77P05k37K4N24o28M6M41n07J32K37k81K51k65m7O26m75K89P7o73N06
3825C12L30p76M49k38l28M66l61N7L66o95N61J15p85O42k43m55P49m63P5N84p98
3846d36M90j01n46P61k24m30R11o20j32K39n45M26O29q14M44J63j90l8j22n0K02
3867A7j55L58M5k50j55L45m26K22L59n56K70K23p13N81j63j41N54n16p4O27p16
3888b64M87K75q12O15p4o88L65N26o83K68rQ5L15m12J96J76k98K67j76l72N70
3909C57l43n95P83m4l20L33k97k5K42o84M13J09j33M46m77J93M39q44N36j90K28
3930A27k18l78m5N36o50M95K73m43N16k73k05N03o09M70p8k22J73J7l42L73M9
$$ plain form
3783 24 48 -168 106 -64 -577 -188 -222 -486 6 -191 -76 111 -420 -105 396 -289 8 480 -316 265 144
3804 144 -433 272 35 59 583 -45 1 442 -65 67 304 23 274 9 -38 588 113 402 479 -194 312
3825 312 642 -134 315 77 -251 215 -146 -89 277 -418 143 258 -527 115 -128 -583 166 -297 -222 362 -436
3846 -436 54 -47 -593 168 -56 -486 425 -195 -327 -88 -633 -207 422 -392 52 215 25 -13 -135 -185 17
3867 17 -138 220 265 15 -140 205 -221 1 360 -196 74 297 -416 165 2 -139 415 -101 -175 452 -264
3888 -264 223 498 -314 301 227 -461 -96 430 -253 15 6 91 406 -6 190 366 68 335 159 -213 357
3909 357 14 -581 202 158 -162 171 -126 -151 91 -593 -180 -71 -204 242 -235 -42 397 -447 89 -101 127
3930 127 -91 -469 -514 22 -628 -133 140 -303 213 -60 -265 238 -371 99 21 -201 -28 -11 -353 20 69
3951F9j14L19j15k79M09om99M40j97l97N59k08K03N97j026N69J07q41O85l82k31
3972c38R18o68r9O68k45l71L39k91K5L86o95L26J64m24L01%k46O04l28k46P43
3993E23j079K47M02n94O06Km01P00n17k77P79p04L56K35o29K34K19l98J17K00
4013B1j4p8j84K25J88j27q3q3J82l13L16j57j20K91o3Q1J18k64k0J30j05J37j22
4036d4q1K58j50L04l20R8K51k71L5j0k18L52j72j0L63o11N84J52p53K84Ll95L65
4059A4o3l06N69k52j29M58n56K03K83l26l51P88q42O96j9r47Q89m23L5N80o46
4080c45L43L40r32P08j9n84N47k51l49R74n20LL63l08r1N79p19R2K56l52K52L93
4102C80n43M93r8k80K56K1m97M06k2n16O33l60J12M67n95M80j20r3N4m7k51J76
$$ plain form
3951 69 -45 274 159 -120 289 283 -216 224 27 -370 189 -19 184 781 -245 324 431 -410 275 -107 -338
3972 -338 580 -88 -187 481 236 -135 204 -87 -62 324 -371 -45 119 -305 -4 -4 -250 354 26 -220 523
3993 523 -556 -309 93 -501 105 107 -294 406 -111 -388 391 -313 43 278 -351 -117 102 -296 -179 21
4013 21 7 -71 -255 -30 158 31 -52 -135 47 -266 50 -107 -227 64 1 82 200 -64 -84 46 -59 78 -44
4036 -44 -125 133 -17 287 -33 65 316 45 80 70 -148 204 32 22 385 -226 358 510 -243 41 44 -351 14
4059 14 -49 -355 214 -38 -167 291 -265 -62 221 -105 -456 332 -510 186 167 -780 109 -314 -279 301 -345
4080 -345 -2 338 -594 114 95 -489 58 -193 -542 432 -88 -85 278 -30 -121 458 -261 -169 87 -265 -13 380
4102 380 -163 330 232 -48 208 229 -268 138 116 -400 233 -127 -15 452 -143 337 217 124 178 131 -120 56
4124E6l10QL54r9M2K42l71J89r2O8P2k35K20l41J45j13N3O0k75L08K05j95j4O0
4148C7k68r8L10k99J73J89k65K20J13n02L43J91n70M99k93l75Q70m34k37O52n67
4169c11L35K06k40n7J98m03M72k08l85O57k22j23M69k16J51K44p76j25Q55q84
4189c63K51N10o92M73L31o33R26m69o81P87l50n95P61o82K38N85q03N35M9k88
4209a10K65K26q59K97L1k43M60n9j41K59l70M0M03k52nO9k63J40J52m91J01M79
4231A29j96K77l08kL05l45K62j99j76J03K76k65k52P63n50O2N53m46k96M74l65
4252a96r0K90j41J22K96k64K81L35k92j10Q0n11L85j71k42N67j58l20M03j03o0
4273A01K29k41l2M47n95J61K37q70P79k19MK65k03m93P19m10k98P86p54J28O30
$$ plain form
4124 56 -254 -246 108 9 51 293 -78 111 19 87 159 -76 144 -197 -52 -165 -112 -52 -327 -19 186 -9 -23 37
4148 37 -231 -329 -19 -318 -145 44 -221 -1 112 -390 -47 144 -426 73 -220 -595 275 -159 -396 256 -311
4169 -311 24 230 -10 -67 131 -272 200 -8 -393 264 42 -81 388 172 323 567 -209 -334 521 -363
4189 -363 -112 398 -294 179 510 -123 803 334 -347 440 90 -505 256 -426 -188 397 -406 129 178 -110
4209 -110 155 381 -478 -181 -150 -393 67 8 -133 126 -244 -204 199 -53 -58 11 -252 -112 40 -451 -350 129
4231 129 -67 210 -98 -100 205 -140 122 -77 -253 -150 126 -139 -391 372 -178 -116 437 -9 -305 169 -196
4252 -196 -286 4 -137 -15 281 17 298 633 341 231 311 -200 185 14 -228 339 181 -139 264 161 101
4273 101 330 89 57 504 -91 70 307 -563 216 -3 1 266 63 -430 289 -121 -419 367 -387 -259 371
4294C71q75L30M53p03O87j1q80P05j28n44R01q21L27M81q91O55K35m72O2M19o24
4315c23J76k05j71N85j22q8J27J98j93K49j57lJ6k60k14N93l94L55p8l40N03R7
4337C51n04L37J74n46K64j30k89O00l39k38P28k40k45L10o9l04J36l01L60n7m8
4358e0r7M16j06K1L2k54MK31m84j17N47p43Q10k48l76R78o53l33Q06o82q9N75
4380A88o10K91M65q88N80K26l74N02k86n99N16l30k06P57o03K32M97r16N83M21
4400D46q59O84p8n55N45j59k63P77m29m36N43R9j72L31l96j10M26p12O1M93j77
4421E9l6K24k96K75nl61O08k66o01L51j90N8N64q94L52M30p10M13L27o57L73p9
4443f1m21L95m2r3M7N26k44j15QqL85l92l67M56L4n12L67n7l37O94k35O2L92n16
$$ plain form
4294 371 -504 -174 279 -424 263 252 -628 77 -51 -595 306 -515 -188 293 -598 57 292 -180 -118 301 -323
4315 -323 -147 -352 -523 62 -60 -148 -21 177 -16 233 76 73 89 -171 -385 208 -186 169 91 -249 254 351
4337 351 -153 184 358 -188 76 -54 -343 257 -82 -320 408 168 -77 233 164 -140 -4 -305 55 -2 -50
4358 -50 -147 269 163 184 216 -38 -34 197 -287 -404 143 -600 210 -38 -414 564 -89 -422 384 -298 -387 188
4380 188 -422 -131 334 -554 26 252 -122 380 94 -505 11 -319 -525 232 -371 -139 358 -558 25 446
4400 446 -413 271 193 -362 183 24 -239 538 109 -327 216 315 143 474 78 -32 394 -318 -257 236 59
4421 59 23 247 -49 226 221 -140 468 202 -399 -48 -238 -180 384 -510 -158 272 -438 -25 302 -355 18 -61
4443 -61 -482 -87 -129 -222 -175 351 107 -8 0 -8 377 -15 -382 74 108 -404 -37 -94 -431 263 28 90 482 -34
4467c4l55N74m44K23J94n58L68L97o51P22l54l10P30o79N6O26n44k09M70l73K81
4488A30M20o41M96q5m88L02k65m1K98j29k72O14k34j62J077j176K4L90m34j85
4508c61M23l15K53J33j30L99j86n21P54m82m29P45q93QP25n26J51K85l05M78m4
4529A62k96R6mj9L1m51J50N72k85k15M67k68pN17n33P8J06m51L79q8P0J08J82
4552C01k92L33K18n59K35L0m85L84k02l22N57N9l13M61l80J13J68r5K5O9m59K44
4574I0N6m99M28K06l52K14j68j99N47n80j44L78r2j79M75l96J28J96n34N41K67
4595C83n73j51M86q58P35J12o63Q79l48l11N12m46J04L77o33N4L93n40N51o1l87
4616c85M55o7k31M23K13q58M34j70j60P04k34k48O00k18r3R3m95M63j06n64O01
$$ plain form
4467 -34 -389 185 -259 -36 158 -400 -32 365 -286 436 82 -228 502 -177 -121 505 -39 -248 222 -151 130
4488 130 550 -91 405 320 -168 134 -131 -172 126 -3 -275 339 105 -57 1020 -156 -132 258 -176 -361
4508 -361 62 -253 0 133 3 402 216 -305 449 -33 -462 283 -610 -602 123 -403 -252 33 -272 206 162
4529 162 -134 -38 -42 -61 -30 -481 -331 241 -44 -259 208 -60 -67 450 -83 -5 101 -350 29 -59 11 119 301
4552 301 9 342 560 1 236 266 -219 165 -37 -359 198 257 -56 405 25 138 306 211 236 305 -154 90
4574 90 146 -353 75 281 -71 143 -25 -224 323 -257 -401 -23 -115 -294 181 -215 -87 109 -425 116 383
4595 383 -190 -341 145 -713 22 134 -529 350 2 -309 203 -243 -139 238 -395 -341 52 -488 63 2 -385
4616 -385 70 3 -228 195 408 -450 -16 -186 -346 358 124 -124 476 258 165 258 -237 226 120 -444 157
4637A57j35k62N31k12j19K93mm6J03l02k75O82m56j63K53j85J16K18j38j8P3k33
4659a22Q2j55m8L50M5l96L71j12k27N73l13l17L10l19k6N01m76Q8M21o05K23L47
$$ plain form
4637 157 22 -240 291 79 -40 253 249 203 306 4 -271 411 -45 -208 45 -140 -24 194 56 38 111 -122
4659 -122 -40 -195 -243 107 152 -244 127 15 -212 361 48 -269 41 -278 -304 197 -279 -191 230 -375 -152 195
$$ [...]
8191b04
##END NTUPLES=NMR FID
##END=
