##TITLE=1H_SAV-32-singlet-bat9
 CDCl3, 8 sc, 
 30.10.2020
##JCAMPDX= 6.0         $$ Bruker NMR JCAMP-DX V2.0
##DATA TYPE= NMR FID
##DATA CLASS= NTUPLES
##ORIGIN= UXNMR, Bruker Analytische Messtechnik GmbH
##OWNER= root
$$ XWIN-NMR		Version 3.5
$$ Fri Oct 30 10:21:21 2020 Russian Standard Time (UT+4h)  she@DPX200
##.OBSERVE FREQUENCY= 200.1315066352
##.OBSERVE NUCLEUS= ^1H
##.DELAY= (6, 6)
##.ACQUISITION MODE= SIMULTANEOUS
##.ACQUISITION SCHEME= undefined
##.AVERAGES= 8
##.DIGITISER RES= 18
##SPECTROMETER/DATA SYSTEM= spect
##.PULSE SEQUENCE= zg30
##.SOLVENT NAME= CDCl3
##.SHIFT REFERENCE= (INTERNAL, CDCl3, 0, 15.7039)
##AUDIT TRAIL= $$ (NUMBER, WHEN, WHO, WHERE, WHAT)
$$ ##TITLE= Audit trail, XWIN-NMR		Version 3.5
$$ ##JCAMPDX= 5.01
$$ ##ORIGIN= Bruker BioSpin GmbH
$$ ##OWNER= she
$$ F:/spectra/data/she/nmr/H-F/1/audita.txt
$$ ##AUDIT TRAIL=  $$ (NUMBER, WHEN, WHO, WHERE, WHAT)
(   1,<2020-10-30 10:20:18.59 +0400>,<she>,<DPX200>,
      <created by zg, POWCHK disabled, PULCHK disabled
       configuration hash MD5:
       00 E9 B6 7A A2 85 ED C7 34 08 36 98 17 FE 4E 26
       data hash MD5: 16K
       19 9E 7E 89 6A 73 82 BD 27 00 E4 CE 7F 5B 2F 4F>)
$$ ##END=
$$ 
$$ hash MD5
$$ 22 BC 78 6A BC 06 BE EA 51 3E D1 08 7D 9C B7 8C
##$RELAX= 
##$RELAX= 
##$RELAX= 
##$RELAX= 
##$RELAX= 
##$RELAX= 
$$ Bruker specific parameters
$$ --------------------------
##$DU= <F:/spectra>
##$EXPNO= 1
##$NAME= <H-F>
##$PROCNO= 1
##$TYPE= <nmr>
##$USER= <she>
##$AMP= (0..31)
100 100 100 100 100 100 100 100 100 100 100 100 100 100 100 100 100 100 
100 100 100 100 100 100 100 100 100 100 100 100 100 100 
##$AQSEQ= 0
##$AQ_mod= 1
##$AUNM= <au_zg>
##$AUTOPOS= <>
##$BF1= 200.13
##$BF2= 200.13
##$BF3= 200.13
##$BF4= 200.13
##$BF5= 200.13
##$BF6= 200.13
##$BF7= 200.13
##$BF8= 200.13
##$BYTORDA= 1
##$CFDGTYP= 0
##$CFRGTYP= 5
##$CHEMSTR= <none>
##$CNST= (0..31)
1 1 145 1 1 1 1 1 1 1 1 1 1 1 1 1 1 1 1 1 1 1 1 1 1 1 1 1 1 1 1 1 
##$CPDPRG= <>
##$CPDPRG1= <>
##$CPDPRG2= <>
##$CPDPRG3= <>
##$CPDPRG4= <mlev>
##$CPDPRG5= <mlev>
##$CPDPRG6= <mlev>
##$CPDPRG7= <mlev>
##$CPDPRG8= <mlev>
##$CPDPRGB= <>
##$CPDPRGT= <>
##$D= (0..31)
0 1.2 0 0 0 0 0 0 0 0.06 0 0.03 0 0 0 0 0.0002 0 0 0 0 0 0 0 0 0 0 0 0 
0 0 0 
##$DATE= 1604038817
##$DBL= (0..7)
120 120 120 120 120 120 120 120 
##$DBP= (0..7)
150 150 150 150 150 150 150 150 
##$DBP07= 0
##$DBPNAM0= <>
##$DBPNAM1= <>
##$DBPNAM2= <>
##$DBPNAM3= <>
##$DBPNAM4= <>
##$DBPNAM5= <>
##$DBPNAM6= <>
##$DBPNAM7= <>
##$DBPOAL= (0..7)
0.5 0.5 0.5 0.5 0.5 0.5 0.5 0.5 
##$DBPOFFS= (0..7)
0 0 0 0 0 0 0 0 
##$DE= 6
##$DECBNUC= <off>
##$DECIM= 32
##$DECNUC= <off>
##$DECSTAT= 4
##$DIGMOD= 1
##$DIGTYP= 9
##$DL= (0..7)
0 120 120 120 120 120 120 120 
##$DP= (0..7)
150 150 150 150 150 150 150 150 
##$DP07= 0
##$DPNAME0= <>
##$DPNAME1= <>
##$DPNAME2= <>
##$DPNAME3= <>
##$DPNAME4= <>
##$DPNAME5= <>
##$DPNAME6= <>
##$DPNAME7= <>
##$DPOAL= (0..7)
0.5 0.5 0.5 0.5 0.5 0.5 0.5 0.5 
##$DPOFFS= (0..7)
0 0 0 0 0 0 0 0 
##$DQDMODE= 0
##$DR= 18
##$DS= 0
$$ [...]
##$SUBNAM2= <"">
##$SUBNAM3= <"">
##$SUBNAM4= <"">
##$SUBNAM5= <"">
##$SUBNAM6= <"">
##$SUBNAM7= <"">
##$SUBNAM8= <"">
##$SUBNAM9= <"">
##$SW= 16.880792210976
##$SWIBOX= (0..15)
0 0 2 0 0 0 0 0 0 0 0 0 0 0 0 0 
##$SW_h= 3378.37837837838
##$TD= 16384
##$TD0= 1
##$TE= 0
##$TE2= 300
##$TE3= 300
##$TEG= 300
##$TL= (0..7)
0 120 120 120 120 120 120 120 
##$TP= (0..7)
150 150 150 150 150 150 150 150 
##$TP07= 0
##$TPNAME0= <>
##$TPNAME1= <>
##$TPNAME2= <>
##$TPNAME3= <>
##$TPNAME4= <>
##$TPNAME5= <>
##$TPNAME6= <>
##$TPNAME7= <>
##$TPOAL= (0..7)
0.5 0.5 0.5 0.5 0.5 0.5 0.5 0.5 
##$TPOFFS= (0..7)
0 0 0 0 0 0 0 0 
##$TUNHIN= 0
##$TUNHOUT= 0
##$TUNXOUT= 0
##$USERA1= <user>
##$USERA2= <user>
##$USERA3= <user>
##$USERA4= <user>
##$USERA5= <user>
##$V9= 5
##$VALIST= <valist>
##$VCLIST= <CCCCCCCCCCCCCCC>
##$VD= 0
##$VDLIST= <DDDDDDDDDDDDDDD>
##$VPLIST= <PPPPPPPPPPPPPPP>
##$VTLIST= <TTTTTTTTTTTTTTT>
##$WBST= 1024
##$WBSW= 4
##$XGAIN= (0..3)
0 0 0 0 
##$XL= 0
##$YL= 0
##$YMAX_a= 239723
##$YMIN_a= -216653
##$ZGOPTNS= <>
##$ZL1= 120
##$ZL2= 120
##$ZL3= 120
##$ZL4= 120
##$ABSF1= 10
##$ABSF2= 0
##$ABSG= 5
##$ABSL= 3
##$ALPHA= 0
##$AQORDER= 0
##$ASSFAC= 0
##$ASSFACI= 0
##$ASSFACX= 0
##$ASSWID= 0
##$AUNMP= <proc_1d>
##$AZFE= 0.1
##$AZFW= 0.1
##$BCFW= 1
##$BC_mod= 2
##$BYTORDP= 1
##$COROFFS= 0
##$CY= 11.3945322036743
##$DATMOD= 1
##$DC= 2
##$DFILT= <>
##$DTYPP= 0
##$F1P= 15.9154993809931
##$F2P= -4.1035820241983
##$FCOR= 0.5
##$FTSIZE= 0
##$FT_mod= 4
##$GAMMA= 1
##$GB= 0.15
##$INTBC= 1
##$INTSCL= 1
##$ISEN= 128
##$LB= 0.24
##$LEV0= 0
##$LPBIN= 0
##$MAXI= 10000
##$MC2= 0
##$MEAN= 0
##$ME_mod= 0
##$MI= 1.114404
##$NCOEF= 0
##$NC_proc= 0
##$NLEV= 6
##$NOISF1= 3.799351
##$NOISF2= 2.8
##$NSP= 1
##$NTH_PI= 0
##$NZP= 0
##$OFFSET= 15.70392
##$PC= 1
##$PHC0= -10694.59
##$PHC1= 19.00088
##$PH_mod= 1
##$PKNL= yes
##$PPARMOD= 0
##$PSCAL= 0
##$PSIGN= 0
##$REVERSE= no
##$SF= 200.130013532006
##$SI= 16384
##$SIGF1= 3
##$SIGF2= 2
##$SINO= 400
##$SIOLD= 16384
##$SREGLST= <1H.CDCl3>
##$SSB= 0
##$STSI= 0
##$STSR= 0
##$SW_p= 3612.71676300578
##$SYMM= 0
##$S_DEV= 0
##$TDeff= 0
##$TDoff= 0
##$TI= <>
##$TILT= no
##$TM1= 0
##$TM2= 0
##$TOPLEV= 0
##$USERP1= <user>
##$USERP2= <user>
##$USERP3= <user>
##$USERP4= <user>
##$USERP5= <user>
##$WDW= 1
##$XDIM= 8192
##$YMAX_p= 0
##$YMIN_p= 0
$$ End of Bruker specific parameters
$$ ---------------------------------
##NTUPLES= NMR FID
##VAR_NAME=  TIME,          FID/REAL,        FID/IMAG
##SYMBOL=    X,             R,               I
##VAR_TYPE=  INDEPENDENT,   DEPENDENT,       DEPENDENT
##VAR_FORM=  AFFN,          ASDF,            ASDF
##VAR_DIM=   8192,          8192,            8192
##UNITS=     SECONDS,       ARBITRARY UNITS, ARBITRARY UNITS
##FACTOR=    0.000296,      1,               1
##FIRST=     0,             0,               0
##LAST=      2.424536,      0,               0
##MIN=       0,             -216653,         0
##MAX=       2.424536,      239723,          0
$$ Real data points
##PAGE= N=1
##DATA TABLE= (X++(R..R)), XYDATA
$$ plain form
0 0 0 0 0 0 0 0 0 0 0 0 0 0 0 -8 8 -8 8 -14 16 -16 24 -24 32 -40 48 -56 64 -72 84 -97 112 -128 147 -166 189
35 189 -213 241 -270 303 -341 380 -423 470 -522 578 -640 707 -780 860 -949 1044 -1149 1266
53 1266 -1394 1537 -1697 1876 -2077 2306 -2572 2879 -3246 3683 -4221 4896 -5769 6935 -8535
68 -8535 10695 -22895 239723 -73310 -92211 155379 -101624 65311 -9676 -116238 123282
79 123282 -21351 -66576 78962 -29210 19409 -1533 -33157 62973 -18531 -30448 62143
90 62143 -16424 -30817 39775 13955 -26091 5372 19913 18949 -19382 -26215 63005 16691 -63884
103 -63884 26977 39303 -12145 -33201 -4017 65465 -24967 -50730 49925 7746 -8033 -16821
115 -16821 -4168 63427 -46014 -42905 57490 -25007 -24102 5590 8362 23250 -43535 13751
$$ packed form
0@%%%%%%%%%%%%%qJ6j6J6k2L0l2M0m8N6p2Q8j04J20j36J56j81K09k40K75l13L55
35A89m02M54n11N73o44P21q03Q93r92J100j218J347j487J640j809J993k193K415
53A266k660K931l234L573l953M383m878N451o125O929p904R117j0665J2704j5470
68h535J9230l3590K62618l13033j8901K47590k57003J66935p4987j06562K39520
79A23282j44633m5225J45538j08172M8619k0942l1624R6130q1504j1917R2591
90F2143p8567j4393P0592k5820m0046L1463J4541r64l8331o833Q9220m6314q0575
103f3884R0861J2326n1448k1056K9184O9482r0432k5763J00655m2179j5779q788
115a6821J2653O7595j09441L109J00395q2497R05K9692K772J4888o6785N7286
$$ plain form
127 13751 30870 -58534 9837 12108 -19142 5245 -27653 29478 3479 -62105 37060 14315
139 14315 -33786 3535 -4435 33120 -20662 -55996 59274 892 -58708 27138 16291 3386
151 3386 -9137 -23874 47985 -465 -59291 36174 26024 -33463 5523 10926 12755 234 -31241
164 -31241 36151 23177 -48949 30878 28694 -34368 16706 -1543 3018 21172 -42992 33838
176 33838 38602 -62062 30157 34225 -34733 8986 -8949 18192 15162 -53776 35870 32400 -50435
189 -50435 5720 16073 5739 -6070 -25512 38431 7028 -50228 7695 15122 -11142 -17849
201 -17849 3555 33413 -19343 -25739 21833 -4370 -20396 -6404 9437 9378 -27793 -4045 24342
214 24342 -19450 -17843 19262 8868 -16322 -12433 15018 8150 -29233 -7963 32641 -6506 -28894
$$ packed form
127A3751J7119q9404O8371K271l1250K4387l2898N7131k5999o5584R9165k2745
139A4315m8101L7321p970L7555n3782l5334J15270n8382n9600Q5846j0847j2905
151C386j2523j4737P1859m8450n8826R5465j0150n9487L8986N403J829j2521l1475
164c1241O7392j2974p2126P9827k184o3062N1074j8249M561J8154o4164P6830
176C3838M764j00664R2219M068o8958M3719j7935K7141l030o8938Q9646l470q2835
189e0435N6155J0353j0334j1809j9442O3943l1403n7256N7923P427k6264o707
201a7849K1404K9858n2756o396M7572k6203j6026J3992J5841n9l7171K3748K8387
214B4342m3792J607L7105j0394k5190L889K7451o868l7383K1270M0604l9147k2388
$$ plain form
227 -28894 16810 19382 -8370 -15939 5076 30914 -18684 -28024 36770 8981 -22310 3137 13764
240 13764 15425 -24155 -5365 42223 -12995 -10425 23038 -1333 2453 -19674 2027 33191 -30395
253 -30395 5298 41858 -19874 -2472 5158 -130 11557 -33040 12609 37864 -41350 -1455
265 -1455 32440 -13705 -4875 -7438 9524 19111 -41584 -2459 39574 -29142 -17307 20533 -753
278 -753 -2773 -18156 1008 28675 -30600 -16838 33295 -15178 -19792 8371 1885 3801 -19748
291 -19748 -2453 24328 -24927 -12234 25577 -3463 -10344 -3157 9456 4179 -30331 5242 26938
304 26938 -15844 -7116 15961 12919 -8667 -22143 20927 15419 -29398 4996 25143 -1078 -12057
317 -12057 -2413 23589 1463 -23821 18762 21100 -14191 -5667 10305 11021 -12169 -11449 25960
$$ packed form
227b8894M5704K572k7752p569K1015K5838m9598r340O4794k7789l1291K5447J0627
240A3764J661l9580J8790M7588n5218K570L3463k4371L786k2127K1701L1164o3586
253c0395L5693L6560o1732J7402P630n288J1687m4597M5649K5255p9214L9895
265a455L3895m6145Q830k563J6962R587o0695L9125M2033o8716J1835L7840k1286
278g53k020j5383J9164K7667n9275J3762N0133m8473m614K8163o486J916k3549
291a9748J7295K6781m9255J2693L7811k9040o881P187J2613n277l4510L5573K1696
304B6938m2782Q728K3077l042k1586j3476M3070n508m4817L4394K0147k6221j0979
317a2057R644K6002k2126k5284M2583K338l5291Q524J5972P16k3190P20L7409
$$ plain form
330 25960 5859 -18981 11656 14733 -7137 -12423 4434 16336 -15100 -12947 23224 1105 -16824
343 -16824 1494 10199 5296 -20583 -4685 28714 -15630 -23623 20526 3095 -14462 -10211 2507
356 2507 18884 -21788 -17434 33447 -8692 -26090 12498 783 -2311 -10390 -9474 27129 -14182
369 -14182 -27287 29967 -2447 -20022 13116 1350 6630 -8981 -17626 26886 -9590 -27323
381 -27323 30756 8090 -13122 6035 2571 11292 -12739 -17017 31687 1565 -24159 17578 14044
394 14044 -6654 -7579 4815 21434 -7590 -16143 21034 9305 -16572 -1787 15834 6183 -16445
407 -16445 177 21646 -6001 -12383 12381 9446 -7701 -12323 8637 11596 -19386 -2827 21199
420 21199 -7066 -13439 2542 8079 -1087 -18846 8124 18667 -23342 -11173 14169 -2997 -12197
$$ packed form
330B5960k0101k4840L0637L077k1870n286J6857J1902l1436K153L6171k2119j7929
343a6824J8318Q705m903k5879J5898L3399m4344p993M4149j7431j7557M251J2718
356B507J6377m0672M354N0881m2139j7398L8588j1715l094q079R16L6603m1311
369a4182j3105N7254l2414j7575L3138j1766N280j5611q645M4512l6476j7733
381b7323N8079k2666k1212J9157l464Q721k4031m278M8704l0122k5724M1737l534
394A4044k0698r25J2394J6619k9024q553L7177j1729k5877J4785J7621r651k2628
407a6445J6622K1469k7647o382K4764k935j7147m622K0960K959l0982J6559K4026
420B1199k8265o373J5981N537r166j7759K6970J0543m2009J2169K5342j7166r200
$$ plain form
433 -12197 -7260 15496 8651 -25530 1902 17167 -16013 -12888 3292 9900 -3763 -19757 14431
446 14431 12168 -23508 1739 13373 -3467 -5958 -5723 14196 1091 -23407 15814 13963 -18825
459 -18825 4371 9558 3311 -2242 -13265 20765 8123 -28905 15509 18552 -15174 796 4616
472 4616 11817 1252 -21936 20105 16778 -24527 6405 16501 -3488 -5350 -6612 14659 4392
485 4392 -20989 13521 16852 -15246 -3499 8923 1633 -9636 -7668 13647 3596 -17434 3982
498 3982 13078 -9443 -13452 6067 11475 -12013 -12299 14653 2900 -19150 -4870 10766 1786
511 1786 -16094 -2163 19370 -8578 -18426 9281 5694 -9607 -9474 5332 12662 -15306 -8687
524 -8687 20209 -3637 -13722 6243 6709 -1060 -11953 3193 17458 -12526 -9087 17863 1809
$$ packed form
433a2197M937K2756o845l4181K7432J5265l3180L125J6180O608j3663j5994L4188
446A4431k263l5676K5247J1634j6840k491K35J9919j3105k4498L9221j851l2788
459a8825K3196N187o247n553j1023L4030j2642l7028M4414L043l3726J5970L820
472D616P201j0565k3188M2041l327m1305L0932J0096j9989j862j262K1271j0267
485D392k5381L4510L331l2098J1747J2422p290j1269J968K1315j0051k1030K1416
498C982R096k2521m009J9519N408k3488k86K6952j1753k2050J4280J5636q980
511A786j7880J3931K1533k7948r848K7707l587j5301J33J4806P330k7968O619
524h687K8896k3846j0085J9965M66p769j0893J5146J4265k9984L439K6950j6054
$$ plain form
537 1809 -10184 -596 12054 7557 -15503 2031 20549 -8872 -10353 12021 9921 -3468 -10047
550 -10047 10629 13117 -16710 -778 19714 -1660 -6823 1074 8488 817 -17775 7092 18091
563 18091 -14210 -2841 15320 175 -8700 -7337 8622 5593 -19712 1419 19011 -11200 -10581
576 -10581 9226 4094 -6439 -11490 4288 10579 -17030 -7778 17898 -4785 -13790 3411 4775
589 4775 -2254 -12717 1604 14692 -13181 -10417 13236 -215 -10948 -3231 9922 5014 -16555
602 -16555 924 15468 -8416 -9947 8826 10972 -6294 -10863 11847 6410 -13899 -73 13611
615 13611 4772 -8513 49 15371 -3218 -13284 9476 10603 -6710 -4458 11016 7886 -9398
628 -9398 -2709 14151 1854 -12867 3892 13606 -5645 -9022 7260 9300 -7007 -10561 11930
$$ packed form
537A809j1993R588J2650m497k3060J7534J8518k9421j481K2374k100j3389o579
550a0047K0676K488k9827J5932K0492k1374n163P897P414p671j8592K4867J0999
563A8091l2301J1369J8161j5145q875J363J5959l029k5305K1131J7592l0211O19
576a0581J9807n132j0533n051J5778O291k7609R252K5676k2683r005J7201J364
589D775p029j0463J4321J3088k7873K764K3653j3451j0733P717J3153m908k1569
602a6555J7479J4544k3884j531J8773K146j7266m569K2710n437k0309J3826J3684
615A3611q839j3285Q562J5322j8589j0066K2760J127j7313K252J5474l130j7284
628i398O689J6860j2297j4721J6759R714j9251l377J6282K040j6307l554K2491
$$ plain form
641 11930 8400 -15458 -1013 12100 -2110 -10831 -2998 12123 -2767 -16029 9134 8122 -11251
654 -11251 -6056 3414 6503 -11307 -9768 16491 -3089 -15461 5661 3271 -4165 -9652 -725 15149
668 15149 -10842 -12178 16574 -1131 -13608 590 5157 3510 -10051 -3086 17423 -5411 -15332
681 -15332 11536 7053 -8708 -2521 6795 8150 -7504 -8121 15012 3122 -14408 7559 12390
694 12390 -3456 -5117 3802 10336 -5012 -9723 13625 6970 -11053 1758 10947 1317 -8865
707 -8865 862 13507 -4436 -10887 8598 7891 -6336 -6882 8453 8026 -13649 -3309 13476 -2560
721 -2560 -9029 866 7669 -1010 -14747 4354 11387 -12164 -5484 8821 445 -9094 -7361 8612
735 8612 2931 -14518 2987 9865 -8834 -9065 1763 6027 -5340 -9477 10448 6505 -13362 -2303
$$ packed form
641A1930l530k3858J4445J3113j4210q721P833J5121j4890j3262K5163j012j9373
654a1251N195R470L089j7810J539K6259j9580j2372K1122k390p436n487Q927J5874
668A5149k5991j336K8752j7705j2477J4198M567j647j3561O965K0509k2834r921
681a5332K6868m483j5761O187R316J355j5654o17K3133j1890j7530K1967M831
694A2390j5846j661Q919O534j5348m711K3348o655j8023J2811R189r630j0182
707h865R727J2645j7943o451J9485p07j4227n46J5335m27k1675J0340J6785j6036
721b560o469R895O803q679j3737J9101P033k3551O680J4305q376r539J733J5973
735H612n681j7449J7505O878j8699k31J0828M264j1367m137J9925l943j9867J1059
$$ plain form
749 -2303 9567 -1795 -10611 62 11317 -2447 -11427 8206 9713 -9446 -4196 8248 3508
762 3508 -6343 -4861 11496 6176 -13169 4487 13455 -6972 -5029 5594 7356 -849 -9700 10921
776 10921 9539 -14433 2323 12015 -1958 -3670 -347 9149 607 -13817 8075 11065 -9817
789 -9817 -2388 7958 2251 -8209 -5851 9518 2340 -11568 2208 10429 -4003 -11304 3623
802 3623 7450 -9629 -7723 8455 3678 -9776 -3800 8362 -523 -12465 -174 8666 -5165
815 -5165 -9109 4578 6009 -6678 -7524 4986 5858 -10159 -5441 12642 -1010 -12174 4200 6196
829 6196 -3149 -6688 2713 11225 -6422 -8552 12255 2440 -9136 1360 7373 4234 -7834 -783
843 -783 14150 -3887 -9635 9245 6652 -4228 -3334 7013 7988 -8410 -3316 11929 209 -8356
$$ packed form
749b303J1870j1362q816J0673J1255j3764q980J9633J507j9159N250J2444m740
762C508r851J482J6357n320j9345J7656Q968k0427J943J0623J762q205q851K0621
776A0921j382k3972J6756R692j3973j712L323R496q542j4424K1892K990k0882
789i817P429J0346n707j0460K358J5369p178j3908J3776Q221j4432p301J4927
802C623L827j7079J906J6178m777j3454N976J2162q885j1942J2291Q840j3831
815e165l944J3687J431j2687q46J2510Q72j6017M718J8083j3652j1164J6374J996
829F196r345l539R401Q512j7647k130K0807r815j1576J0496O013l139j2068P051
843g83J4933j8037n748J8880k593j0880Q94J0347R75j6398N094J5245j1720q565
$$ plain form
857 -8356 2926 9370 -817 -8708 4948 9246 -8783 -4737 9105 2741 -6622 -3226 6940 2134
871 2134 -12188 301 11220 -5991 -7517 5275 4265 -5410 -8945 4546 6348 -12581 -3623
884 -3623 11102 -3364 -8514 1295 4417 -2540 -9891 1967 8237 -7774 -6485 8096 2313 -8674
898 -8674 -3680 7772 1180 -9804 1507 9740 -4592 -7901 4723 6844 -5319 -5678 9358 5559
912 5559 -9306 -917 8317 1073 -6228 692 11418 -671 -9311 7094 6764 -6501 -2118 6801
926 6801 6389 -4861 -3653 10791 1330 -10074 3954 8088 -3064 -5442 4110 8446 -5131 -6562
940 -6562 8549 3280 -9016 -1895 7526 1406 -8530 -499 9081 -3830 -9914 4359 6086 -6451
954 -6451 -5492 5439 3449 -9291 -4680 8284 -697 -9255 1968 5833 -4123 -8301 1613 6582
$$ packed form
857h356J1282O444j0187p891J3656M298j8029M046J3842o364r363L396J0166m806
871B134j4322J2489J0919j7211j526J2792j010r675l535J3491J802j8929Q958
884c623J4725j4466n150R809L122o957p351J1858O270j6011J289J4581n783j0987
898h674M994J1452o592j0984J1311Q233j4332l309J2624K121j2163l59J5036l799
912E559j4865Q389R234p244p301O920J0726j2089q640J6405l30j3265M383Q919
926F801m12j1250J208J4444r461j1404J4028M134j1152k378R552M336j3577j431
940f562J5111n269j2296P121R421o120r936Q031R580j2911o084J4273J727j2537
954f451R59J0931j990j2740M611J2964q981q558J1223L865r956m178R914M969
$$ plain form
968 6582 -6403 -6597 8779 2374 -9764 -2099 5834 395 -8262 -391 10700 -2507 -9326 6058
982 6058 5871 -6502 -4239 5998 5501 -5689 -2768 9671 2306 -8312 2356 8195 -2268 -5188
996 -5188 4986 7797 -3965 -4255 8136 4266 -7768 -432 9401 771 -6974 2591 8226 -2904
1010 -2904 -7184 4310 7712 -4524 -5762 7785 4663 -8924 -2505 7584 157 -7179 261 7381
1024 7381 -2009 -8527 2902 5081 -6290 -5247 5883 2198 -7379 -2930 5664 -460 -9780 424
1038 424 8263 -5185 -7286 4984 3297 -6064 -5796 4931 5358 -8736 -3030 8840 -1527 -7995
1052 -7995 272 6566 -445 -8247 4565 8168 -6552 -3674 6142 1672 -4539 -2131 7454 3191
1066 3191 -7329 2546 8129 -3310 -5268 4694 5982 -3503 -4169 7990 5686 -7466 -857 8788
$$ packed form
968F582j2985j94J5376o405j2138P665P933n439q657P871J1091j3207o819J5384
982F058j87j2373K263J0237m97j1190K921J2439p365j0618J0668N839j0463k920
996e188J0174K811j1762k90J2391l870j2034P336R833q630p745R565N635j1130
1010b904m280J1494L402j2236j238J3547l122j3587O419J0089p427p336P440P120
1024G381r390o518J1429K179j1371J043J1130l685r577M449Q594o124r320J0204
1038D24P839j3448k101J2270j687r361K68J0727M27j4094N706J1870j0367o468
1052g995Q267O294p011p802J2812L603j4720K878R816m470o211K408R585m263
1066C191j0520R875N583j1439j958R962J288r485o66J2159k304j3152O609R645
$$ plain form
1080 8788 -779 -6244 2372 7091 99 -6867 2905 8209 -6277 -4795 7991 2197 -5866 -2022
1094 -2022 5197 1248 -7962 606 7860 -3350 -6127 2834 3973 -5813 -6243 5725 2484 -7619
1108 -7619 -1275 5828 -405 -8257 -1058 7190 -4825 -7692 4893 3663 -4985 -4490 3330 4266 -8281
1123 -8281 -4379 9069 -435 -7153 2932 5067 -1711 -5688 1553 7073 -4492 -5278 8640 2444
1137 2444 -6705 439 5508 1440 -5437 734 9708 -2208 -6458 6518 4531 -4501 -1964 5700
1151 5700 5094 -5077 -2179 8816 272 -6801 2678 6629 -1048 -4923 3533 6818 -5047 -4703 6738
1166 6738 2145 -6486 -874 5939 635 -6733 4 6549 -3833 -6577 4039 4021 -4644 -4858 4122
1181 4122 2602 -7990 -2688 6932 -721 -6988 783 5054 -3331 -7301 2715 4721 -5618 -3694
$$ packed form
1080H788r567n465Q616M719o992o966R772N304j4486J482J2786n794q063L844
1094b022P219l949r210Q568P254j1210k777Q961J139r786m30J1968l241j0103
1108g619O344P103o233p852P199Q248j2015k867J2585j230q648M95P820R36j2547
1123h281L902J3448r504o718J0085K135o778l977P241N520j1565p86J3918o196
1137B444r149P144N069m068o877O171Q974j1916m250J2976j987r032K537P664
1151E700o06j0171K898J0995q544p073R479L951p677l875Q456L285j1865L44J1441
1166F738m593q631N612O813n304p368O737O545j0382k744J0616j8q665k14Q980
1181D122j520j0592N302R620p653o267P771M271q385l970J0016K006j0339J924
$$ plain form
1195 -3694 5338 2608 -6186 -2955 6377 -83 -7525 2419 6186 -2734 -4603 2448 4806 -3960 -5181
1210 -5181 6364 3699 -6021 -145 6710 623 -5593 907 7214 -950 -5852 5428 5846 -5093
1224 -5093 -2269 5697 2952 -3950 -1243 7045 1934 -6824 1863 6395 -2806 -3832 3457 5598 -2811
1239 -2811 -4909 6066 3225 -7281 -346 5728 -318 -5397 56 6248 -2317 -7402 3388 3593
1253 3593 -5662 -3618 4094 2343 -5679 -3372 5791 -626 -7973 1164 4890 -3205 -5367 2013 3847
1268 3847 -4698 -5116 5197 2102 -6502 -1318 5172 -432 -6289 459 6499 -2123 -5329 4312 4502
1283 4502 -4618 -3763 4976 3250 -5019 -620 7203 573 -5338 1382 5849 -1599 -4992 3860 6123
1298 6123 -3394 -2652 6302 3071 -4972 -917 5794 1152 -5231 1980 7088 -2068 -4687 3787 3652
$$ packed form
1195c694R032k730q794L231R332o460p442R944L767q920j869P051K358q766j221
1210e181J1545k665r720N876O855o087o216O500O307q164m902J1280M18j0939
1224e093K824P966k745o902K707Q288n111q758Q687M532r201j026P289K141q409
1239b811k098J0975k841j0506O935O074o046n079N453O192q565n085J0790K05
1253C593r255K044P712j751q022K307R163o417p347R137L726q095k162P380J834
1268C847q545m18J0313l095q604N184O490n604n857O748O040q622l206R641J90
1283D502r120Q55Q739j726q269M399P823o630n911O720M467p448l393Q852K263
1298F123r517P42Q954l231q043M055O711m642o383P211N108r156k619Q474j35
$$ plain form
1313 3652 -3479 -3519 4901 3823 -6169 -1636 6292 -1048 -5526 809 4600 -1593 -6117 2696 4058
1328 4058 -5822 -3419 4437 1190 -4863 -2853 5196 -72 -8055 641 4943 -3796 -4565 2570 3563
1343 3563 -3911 -4808 4198 1876 -6519 -1296 5348 -462 -5276 321 5129 -1836 -5577 3130 5234
1358 5234 -4571 -2569 5918 1413 -4453 -947 4911 1732 -4880 1334 6911 -2553 -4265 3999 3800
1373 3800 -2767 -2428 5223 3997 -5084 -689 6555 263 -5632 2158 5215 -1602 -3752 2772 4214
1388 4214 -2716 -3953 4773 2864 -6012 -461 5471 -940 -4729 481 4190 -1648 -5821 2790 4108
1403 4108 -5068 -3589 4335 668 -5278 -1725 4703 -5 -6295 92 4673 -3574 -5580 3131 3228
1418 3228 -4306 -2902 3304 2167 -5361 -2542 4896 107 -5364 1164 4709 -1783 -4189 2395 4022
$$ packed form
1313C652p131m0Q420j078r992M533P928p340m478O335L791o193m524Q813J362
1328D058r880K403P856l247o053K010Q049n268p983Q696M302q739p69P135R93
1343C563p474q97R006k322q395N223O644n810m814N597M808o965l741Q707K104
1358E234r805K002Q487m505n866L506N858l179o612O214N577r464j712Q264j99
1373C800o567L39P651j226r081M395P244o292n895P790L057o817k150O524J442
1388D214o930j237Q726j909q876N551N932o411l789N210L709n838m173Q611J318
1403D108r176J479P924l667n946L553O428m708o290O387M581q247k006Q711R7
1418C228p534J404O206j137p528K819P438m789n471O528L545o492k406O584J627
$$ plain form
1433 4022 -3838 -2948 5501 1868 -4505 304 4989 450 -4160 1173 5899 -1753 -4271 4992 3949
1448 3949 -3794 -1787 4062 3264 -3749 -1784 7173 528 -5668 2574 4431 -1641 -2390 2000 4867
1463 4867 -2402 -4528 5126 1769 -5707 230 4417 -448 -3789 281 4289 -2314 -5544 3352 3009
1478 3009 -4948 -2454 3873 1160 -4653 -2575 4384 -346 -6812 975 4879 -2987 -4519 2283 2942
1493 2942 -3923 -3537 3325 1774 -4319 -1733 4477 47 -5575 1212 4785 -2411 -3179 2974 2848 -3189
1509 -3189 -3160 4842 2684 -5271 822 5510 -667 -3296 952 5089 -705 -5045 4108 5076 -3768 -1373
1525 -1373 4369 1817 -3223 -1627 5244 1472 -4814 2334 5063 -2309 -2826 2247 3152 -2035 -3371
1540 -3371 4924 2159 -5485 98 4072 -1195 -3721 472 4814 -1540 -5320 3145 2946 -5178 -2587
$$ packed form
1433D022p860Q90Q449l633o373M809M685m539m610N333M726p652k518R263j043
1448C949p743K007N849p98p013J965Q957o645o196Q242J857o072p49M390K867
1463D867p269k126R654l357p476N937M187m865l341M070M008o603l230Q896l43
1478C009p957K494O327k713n813K078O959m730o466P787L904p866j532O802O59
1493B942o865L86O862j551o093K586O210m430n622O787L573p196p68O153j26o037
1509c189K9Q002k158p955O093M688o177k629M248M137n794m340R153R68q844K395
1525a373N742k552n040J596O871l772o286P148K729p372n17N073R05n187j336
1540c371Q295k765p644N583L974n267k526M193M342o354l780Q465j99q124K591
$$ plain form
1555 -2587 3413 1354 -4217 -2187 4415 -193 -6411 806 4058 -3005 -3788 1847 2310 -2889 -3801 3210
1571 3210 1760 -5291 -649 4423 -783 -3778 780 3689 -1718 -4306 2897 3441 -3606 -2252 4331
1586 4331 2159 -4586 -444 5436 -17 -3577 1389 4427 -712 -4266 3067 4700 -3678 -1031 4923
1601 4923 1327 -2347 -930 3970 1447 -4698 1887 5192 -2366 -2358 2934 2574 -2532 -2850 3975 2524
1617 2524 -4685 -334 4762 -830 -4658 1027 3475 -1972 -4131 2112 3483 -3868 -3294 3768 632
1632 632 -4563 -1221 3644 96 -5124 361 3823 -3339 -3973 2230 1458 -2424 -2874 2862 1834 -5410
1648 -5410 -924 4121 -1155 -3177 566 3926 -1009 -4798 2868 3605 -4079 -1640 4344 1383 -3313
1663 -3313 -331 4167 484 -4071 1246 4846 -1251 -3322 3774 3179 -3000 -1233 3769 2200 -2704
$$ packed form
1555b587O000k059n571K030O602m608o218P217L252p063p83N635M63n199r12P011
1571C210j450p051M642N072n206k995M558K909n407k588P203N44p047J354O583
1586D331k172o745M142N880n453l560M966L038n139l554P333J633q378K647N954
1601D923l596l674J417M900k523o145O585L305p558QN292l60n106l18O825j451
1617B524p209M351N096n592l828N685K448n447k159O243J371p351N74P062l136
1632F32n195L342M865l548n220N485L462p162o34O203p72l882m50N736j028p244
1648e410M486N045n276k022L743L360m935l789P666P37p684K439N984k961m696
1663c313K982M498l683m555N317L600o097k071P096n95o179J767N002j569m904
$$ plain form
1678 -2704 -905 5252 512 -4465 1854 3979 -1812 -2402 2410 3024 -2571 -2833 4363 2175 -4655 -340
1694 -340 4490 -903 -3987 1032 2796 -1638 -3712 1467 3165 -3566 -2574 4017 292 -4401 -942
1709 -942 2583 -121 -4401 -222 4165 -2756 -4322 2889 1305 -3234 -1973 2397 1608 -4123 -1421
1724 -1421 4456 -1082 -4020 1318 3364 -1076 -3027 1966 3136 -3425 -2117 3849 1452 -3386 24
1739 24 4248 350 -3615 1217 4301 -1518 -2988 3219 3101 -2668 -1178 3659 2040 -3038 -756 5015
1755 5015 366 -4090 2328 3477 -1795 -2114 1920 3230 -2408 -2470 4351 1534 -4246 297 3428 -274
1771 -274 -3212 150 3661 -1555 -4304 2185 2283 -3715 -2205 3231 581 -3551 -902 2516 -148 -4477
1787 -4477 -80 4037 -2900 -3556 3151 1458 -3466 -2198 2035 1643 -3968 -1466 4130 -949 -3906
$$ packed form
1678b704J799O157m740m977O319K125n791n90M812O14n595k62P196k188o830M315
1694c40M830n393l084N019J764m434k074N179J698o731R92O591l725m693L459
1709i42L525k704m280M179M387o921j566P211j584m539J261M370p89n731K702
1724a421N877n538k938N338K046m440j951M993J170o561J308N966k397m838L410
1739B4M224l898l965M832L084n819j470O207j18n769J490M837j619n078K282N771
1755E015m649m456O418J149n272l19M034J310n638o2O821k817n780M543L131l702
1771b74k938L362L511n216k749O489R8n998J510N436k650m132K649L418k664m329
1787d477M397M117o937o56O707j693m924J268M233l92n611K502N596n079k957
$$ plain form
1802 -3906 1168 2777 -1797 -3146 1894 3257 -2252 -2300 3804 1474 -4055 -127 3709 -511 -2508
1817 -2508 1336 3536 -460 -3145 2694 3614 -3009 -1137 3992 1133 -2258 -473 3861 1057 -3716
1832 -3716 2003 4008 -1930 -2126 2528 2076 -2359 -2247 3371 1493 -4057 -125 3819 -624 -3682 662
1848 662 3067 -1561 -3506 1884 2401 -3685 -2159 2866 478 -3466 -1097 2956 -139 -4476 273
1863 273 2944 -2745 -3168 1859 1578 -2273 -2240 2438 1310 -4099 -734 3493 -783 -3270 1189 2581
1879 2581 -1339 -2933 1701 2788 -2716 -1893 3694 1422 -3319 37 3732 179 -2971 1158 3623
1894 3623 -544 -2722 2552 3213 -2574 -946 3567 880 -2214 -208 3046 826 -3354 1274 4220
1909 4220 -1935 -1865 3111 1792 -2190 -1837 2423 2017 -3997 -405 4426 -890 -3232 1100 2270 -1340
$$ packed form
1802c906N074J609m574j349N040J363n509m8O104k330n529L928L836m220j997
1817b508L844K200l996k685N839R20o623J872N129k859l391J785M334k804m773
1832c716N719K005n938j96M654m52m435J12N618j878n550L932L944m443l058M344
1848F62K405m628j945N390N17o086J526N025k388l944K369M053l095m337M749
1863B73K671n689m23N027k81l851L3M678j128n409L365M227m276k487M459J392
1879B581l920j594M634J087n504Q23N587k272m741L356L695l553l150M129K465
1894C623m167k178N274O61n787J628M513k687l094K006L254k220m180M628K946
1909D220o155P0M976j319l982L53M260m06o014L592M831n316k342M332J170l610
$$ plain form
1925 -1340 -3286 1708 2454 -3361 -2441 3023 622 -3467 -871 2439 -135 -3674 293 3024 -2246
1940 -2246 -3211 1528 1045 -2734 -1768 2584 1302 -3874 -548 3426 -1334 -3119 890 2907 -1235 -3340
1956 -3340 2268 2836 -3080 -1467 3234 1087 -2293 -660 3363 689 -3309 928 3605 -1276 -1835
1971 -1835 2283 2245 -1294 -1187 3014 1337 -2724 246 3531 -10 -2687 1603 3173 -1655 -2180 2455
1987 2455 2169 -2078 -1657 2976 1631 -3616 -747 3467 -974 -2887 748 2370 -771 -3246 1285
2002 1285 2581 -3314 -1825 2909 -393 -2761 -415 1869 -84 -3453 199 3175 -2256 -2680 2492
2017 2492 728 -2869 -1701 2058 1257 -3666 -700 3484 -820 -3112 1183 2416 -1297 -2676 1533
2032 1533 2589 -2593 -1972 3064 1076 -2334 140 2913 423 -2636 1085 3238 -1481 -2154 2230
$$ packed form
1925a340j946M994P46n815R20N464k401m089K596L310k574l539L967K731n270
1940b246r65M739m83l779R66M352j282n176L326L974m760j785M009K017m142k105
1956c340N608N68n916J613M701k147l380J633M023k674l998M237K677m881n59
1971a835M118l8l539J07M201j677m061K970L285l541k677M290J570m828n25M635
1987B455k86m247M21M633j345n247K869M214m441j913L635J622l141k475M531
2002A285J296n895J489M734l302k368K346K284j953l369L652K976n431m24N172
2017B492j764l597J168L759q01m923K966M184m304k292M295J233l713j379M209
2032A533J056n182O21N036j988l410K474K773k490l059L721K153m719o73M384
$$ plain form
2047 2230 2020 -1747 -976 3067 1554 -2811 376 3490 -518 -2672 1323 2891 -1207 -2258 2324
2062 2324 2331 -2272 -1289 2956 1016 -3091 -73 2764 -791 -3060 402 2500 -1164 -2681 2060 1959
2078 1959 -3055 -1530 2160 2 -2811 -791 1977 -312 -3783 286 2789 -2449 -2558 2114 905
2093 905 -2531 -1561 1858 921 -3492 -1004 3380 -695 -2772 1602 2181 -1400 -2135 991 2502 -2301
2109 -2301 -2061 3100 899 -2880 528 2790 -179 -1982 964 3038 -901 -2657 2570 2297 -2500
2124 -2500 -858 2807 1163 -1792 79 3274 402 -2736 1399 3211 -1432 -1865 2121 1944 -1749
2139 -1749 -1486 2434 1159 -2618 -326 2979 -194 -3291 875 2112 -1638 -2269 1710 1654 -2508 -1475
2155 -1475 2408 275 -3036 -578 2138 -497 -3233 501 2306 -2064 -2337 1754 1257 -2398 -1455 2338
$$ packed form
2047B230k10l767P71M043j513m365L187L114m008k154L995J568m098j051M582
2062B324Pm603R83M245j940m107L018K837l555k269L462K098l664j517M741j01
2078A959n014J525L690k158k813K020K768k289l471M069K503n238j09M672j209
2093I05l436R70L419r37m413K488M384m075k077M374N79l581p35L126J511m803
2109b301K40N161k201l779L408K262k969j803K946K074l939j756N227k73m797
2124b500J642L665j644k955J871L195k872l138M135J812m643m33L986j77l693
2139a749K63L920j275l777K292L305l173l097M166J237l750o31L979n6m162J033
2155a475L883k133l311K458K716k635k736L734J805m370k73M091m97l655R43L793
$$ plain form
2171 2338 596 -3147 -529 2534 -791 -2576 740 1975 -1044 -2184 1675 1962 -2153 -1622 2884
2186 2884 706 -2862 250 2643 -198 -2032 732 2828 -813 -1945 2690 2107 -2307 -645 2462
2201 2462 676 -1904 -318 3359 268 -2628 1615 2897 -1534 -1369 1894 1560 -1590 -1368 2621 1317
2217 1317 -3071 -147 3117 -821 -2754 1241 1872 -1255 -2246 1232 1839 -2918 -1690 2594 25 -2480
2233 -2480 -302 1767 -628 -3018 184 2407 -1810 -2470 1763 1074 -2210 -1312 2178 275 -2653 -699
2249 -699 2242 -657 -2753 796 2110 -1417 -1751 1780 1819 -2139 -1137 2432 623 -2108 -3 2467
2265 2467 30 -2155 940 2545 -1350 -1692 2484 1910 -1599 -571 2258 935 -2215 -355 2919
2280 2919 -94 -2176 1551 2403 -1430 -1548 1503 1634 -2208 -1435 2645 639 -2696 -90 2367 -399
$$ packed form
2171B338j742l743K618L063l325j785L316J235l019j140L859K87m115N31M506
2186B884k178l568L112K393k841j834K764K096l641j132M635n83m414J662L107
2201B462j786k580J586L677l091k896M243J282m431J65L263l34l150K22L989j304
2217A317m388K924L264l938j933L995O31l127r91L478O07m757J228M284k569k505
2233b480K178K069k395k390L202K223m217o60M233o89l284Q98L490j903k928J954
2249f99K941k899k096L549J314l527l34L531L9l958J002L569j809k731K105K470
2265B467k437k185L095J605l895l42M176n74l509J028K829j323l150J860L274
2280B919l013k082L727Q52l833j18L051J31l842P73M080k006l335K606K457k766
$$ plain form
2296 -399 -2279 856 2023 -1167 -2084 1371 1676 -2614 -1365 2309 -243 -2319 10 2052 -233 -2575
2312 -2575 312 2332 -2210 -2314 1955 714 -2279 -1298 1633 558 -2602 -866 2853 -855 -2696
2327 -2696 897 1645 -1345 -1892 1487 1692 -1665 -1184 2713 814 -2366 526 2530 -248 -1988 961
2343 961 2329 -914 -1530 2392 1953 -1595 -295 2454 1068 -2056 48 2722 -322 -1976 1442 2210
2359 2210 -713 -1300 1873 1768 -1979 -917 2377 319 -2162 12 1967 -472 -2067 766 1877
2374 1877 -1550 -1780 1396 1149 -2349 -1204 1946 -312 -2243 -443 1902 -412 -2477 400 2376
2389 2376 -2278 -2184 1584 707 -2435 -1038 1708 850 -2628 -612 2567 -759 -2445 1266 1387 -1266
2405 -1266 -1419 995 1690 -1937 -1452 2904 651 -2309 779 1883 -482 -1316 514 2313 -944 -1622
$$ packed form
2296c99j880L135J167l190r17L455L05m290J249L674k552k076K329K042k285k342
2312b575K887K020m542j04M269j241k993R81K931j075l160J736L719l708j841
2327b696L593P48k990n47L379K05l357M81L897j899l180K892K004k778j740K949
2343I61J368l243o16L922m39l548J300K749j386l124K104K674l044j654L418P68
2359B210k923n87L173j05l747J062L294k058k481K174J955k439j595K833J111
2374A877l427k30L176k47l498J145L150k258j931J800K345k314k065K877J976
2389B376m654R4L768q77l142J397K746q58l478K016L179l326j686L711J21k653
2405a266j53K414O95l627M85M356k253k960L088J104k365q34J830J799l257o78
$$ plain form
2421 -1622 2561 1390 -1837 -133 2327 940 -1797 251 3126 -156 -2623 1355 2331 -1132 -1252
2436 -1252 1609 1500 -1384 -803 1998 596 -2219 -425 2088 -550 -2376 1161 1493 -1554 -1354 1809
2452 1809 974 -1966 -1118 1846 -166 -2775 -181 1709 -736 -2096 552 1803 -1546 -2182 1578 859
2468 859 -2427 -992 1677 558 -2355 -348 2358 -719 -2150 985 1127 -1291 -1570 1178 1528 -1948
2484 -1948 -1084 2399 119 -2080 1014 2308 -230 -1648 777 2296 -1163 -1451 2391 1447 -1655 -364
2500 -364 2125 756 -1632 26 2595 -84 -2212 1347 2145 -1394 -1041 1272 1236 -1218 -766 2067
2516 2067 635 -2140 39 1916 -791 -1997 748 1614 -1583 -1291 1308 1326 -1776 -1045 1980 49
2532 49 -2460 -98 1497 -1081 -2147 177 1595 -1380 -2061 1790 1018 -1912 -665 1513 32 -2047
$$ packed form
2421a622M183j171l227J704K460j387k737K048K875l282k467L978R76l463j20
2436a252K861j09k884N81K801j402k815J794K513k638j826L537L32l047K00L163
2452A809q35k940Q48K964k012k609K594J890k445j360K648J251l349o36L760p19
2468H59l286J435K669j119k913K007K706l077j431L135J42k418k79K748L50l476
2484a948Q64L483k280k199L094J294k538j418K425J519l459k88L842r44l102J291
2500c64K489j369k388J658K569k679k128L559P98l539L53K313l6k454M52K833
2516B067j432k775K179J877k707j206K745Q66l197K92K599J8l102P31L025j931
2532D9k509K362J595k578j066K324J418k975o81L851p72k930J247K178j481k079
$$ plain form
2548 -2047 44 2075 -259 -1883 1008 1461 -1404 -1239 1313 964 -1558 -950 2165 248 -1951 373
2564 373 2132 -302 -1577 1093 1997 -980 -1082 2077 1476 -1544 -355 1915 501 -1495 184 2394
2580 2394 -206 -1627 1437 1821 -1107 -1242 1496 1206 -1649 -617 1928 508 -1855 325 2080 -716
2596 -716 -1871 746 1509 -1392 -1645 1448 909 -2113 -1067 2032 -7 -2245 71 1541 -798 -2165
2612 -2165 678 1575 -1775 -1678 1626 813 -1936 -766 1535 139 -2101 -212 1856 -586 -1957 1101
2628 1101 1320 -1067 -981 1247 1442 -1547 -807 2030 247 -1947 397 2178 -511 -1550 970 1749
2644 1749 -752 -1157 1886 1166 -1567 -331 2095 745 -1550 372 2226 -135 -1682 868 2229
2659 2229 -1254 -1152 1464 879 -1479 -733 1709 259 -1854 398 1907 -817 -1727 600 1441 -1150
$$ packed form
2548b047K091K031k334j624K891M53k865J65K552l49k522O08L115j917k199K324
2564C73J759k434j275K670R04k977j02L159o01l020J189K270j414j996J679K210
2580B394k600j421L064L84k928j35K738k90k855J032K545j420k363K180J755k796
2596g16j155K617P63k901k53L093n39l022J046L099k039k238K316J470k339j367
2612b165K843Q97l350R7L304q13k749J170K301j396k240J889K068k442j371L058
2628A101K19k387Q6K228J95k989P40K837j783k194K344J781k689j039K520P79
2644A749k501m05L043p20k733J236K426j350k295J922J854k361j547K550J361
2659B229l483J02K616n85k358P46K442j450k113K252J509k724r10K327Q41k591
$$ plain form
2675 -1150 -1690 1197 740 -1947 -620 1500 -143 -2021 -188 1417 -707 -2086 820 1276 -1277 -1603
2691 -1603 1477 764 -1657 -713 1424 159 -2218 -252 1704 -936 -1997 980 1269 -1290 -1156 1322
2707 1322 1068 -1329 -869 2206 311 -2081 471 1738 -685 -1456 994 1871 -879 -1111 2024 1140
2723 1140 -1500 8 1998 28 -1197 264 2044 -170 -1641 1342 1570 -1028 -888 1659 838 -1405
2739 -1405 -285 1666 472 -1817 175 1699 -344 -1556 893 1426 -1392 -1238 1192 651 -2152 -744
2755 -744 1360 -113 -1876 19 1393 -1025 -2002 676 951 -1431 -1253 1369 415 -1784 -470 1543
2771 1543 -93 -1965 18 1665 -573 -1683 1000 1283 -1215 -1062 1413 707 -1254 -418 1989 272
2787 272 -1488 378 1924 -456 -1189 1268 1745 -718 -1086 1761 932 -1426 16 1952 339 -1341
$$ packed form
2675a150n40K887m57k687J327K120j643j878J833J605k124j379K906M56k553l26
2691a603L080p13k421R44K137j265k377J966J956k640j061K977K89k559J34K478
2707A322k54k397M60L075j895k392K552J267k423p71K450Q77k750k32L135q84
2723A140k640J508J990j970j225J461J780k214j471K983K28k598J40K547q21k243
2739a405J120J951j194k289J992J524k043j212K449N33k818J54K430n41k803J408
2755g44K104j473j763J895J374k418r77K678K75k382J78K622r54k199J314K013
2771A543j636j872J983J647k238j110K683K83k498J53K475p06j961Q36K407j717
2787B72j760J866J546k380p33K457M77k463l68K847q29k358J442J936j613j680
$$ plain form
2803 -1341 342 1919 -258 -1476 1191 1453 -1108 -630 1357 514 -1286 -454 1600 97 -1646 481
2819 481 1536 -809 -1528 959 1040 -1263 -1355 1096 475 -1978 -628 1384 -121 -1756 138 1419 -956
2836 -956 -1526 401 1120 -1541 -1499 1317 781 -1832 -561 1243 -349 -1694 17 1405 -613 -1650
2852 -1650 795 1397 -1452 -1054 1848 296 -1371 -520 1790 396 -1527 638 1941 -585 -1145 1170
2868 1170 1419 -746 -889 1712 1176 -1259 -53 1777 28 -1321 512 1907 -310 -1603 1108 1418
2884 1418 -937 -489 1660 893 -1282 -597 1664 92 -1898 478 1359 -759 -1472 940 1293 -1428
2900 -1428 -1214 1527 541 -1472 -557 1459 -230 -1779 -154 1142 -843 -1583 516 1121 -1317 -1163
2916 -1163 942 348 -1578 -538 1329 -94 -1670 256 1457 -473 -1680 1069 1517 -1513 -678 1383
$$ packed form
2803a341J683J577k177j218K667K62k561M78J987q43j800Q32K054j503j743K127
2819D81J055k345p19K487Q1k303r2K451o21k453J350K012j505j635J894J281k375
2836i56n70J927P19k661M2K816n36k613J271J804j592j345J711J388k018j037
2852a650K445O02k849L98K902j552j667Q51K310j394j923K165J303k526n60K315
2868A170K49k165j43K601n36k435J206J830j749j349J833J395k217j293K711L10
2884A418k355M48K149p67k175O85K261j572j990K376Q81k118p13K412L53k721
2900a428K14K741r86k013R15K016j689j549J625J296j985p40K099O05k438J54
2916a163K105n94j926J040J867j423j576J926J201j930j207K749M48l030Q35K061
$$ plain form
2932 1383 413 -1426 -580 1510 271 -1602 400 1860 -386 -961 929 1407 -800 -802 1525 982 -1569
2949 -1569 -220 1744 128 -1000 444 1675 -330 -1217 1156 1403 -1125 -607 1585 663 -1316 -51
2965 -51 1676 15 -1441 136 1362 -788 -1518 764 1321 -1264 -1335 1333 556 -1776 -478 1180 -27
2982 -27 -1858 -97 1042 -598 -1879 772 727 -1060 -779 1065 404 -1768 -61 1674 -357 -1690
2998 -1690 281 1388 -289 -1387 821 1207 -1355 -860 1683 597 -1407 -370 1417 535 -1425 473
3014 473 1890 -582 -730 1323 1168 -752 -831 1419 752 -1269 151 1880 -3 -978 441 1515 -124
3031 -124 -1293 1352 1094 -1298 -572 1437 591 -1143 -419 1542 122 -1538 332 1251 -840 -1241 808
3048 808 929 -1393 -1154 986 432 -1519 -501 1089 -148 -1739 215 1220 -847 -1415 511 780
$$ packed form
2932A383r70j839Q46K090j239j873K002J460k246n75J890M78k207kK327n43k551
2949a569J349J964j616j128J444J231k005q87K373K47k528N18K192r22j979J265
2965e1J727j661j456J577J226k150p30K282N57k585p1K668p77k332J298J658j207
2982b7j831J761J139j640j281K651m5j787K81J844o61k172J707J735k031j333
2998a690J971J107j677j098K208L86k562M95K543j086k004J037J787q82j960J898
3014D73J417k472j48K053j55j920p9K250o67k021J420J729j883r75J419J074j639
3031a24j169K645k58k392P26K009q46j734P24J961j420j660J870R19k091m01K049
3048H08J21k322K39K140n54j951J018J590j237j591J954J005k067n68J926K69
$$ plain form
3064 780 -1270 -991 1050 282 -1668 -263 1187 -339 -1791 341 1366 -679 -1413 762 1010 -1232
3080 -1232 -931 1352 626 -1394 -134 1485 188 -1354 294 1517 -641 -1103 1159 1073 -475 -579
3096 -579 1538 747 -1025 -124 1668 97 -1131 626 1511 -432 -1064 1034 1116 -1240 -605 1494 395
3113 395 -1252 -233 1527 -62 -1394 359 1548 -764 -1202 768 939 -1324 -965 1144 254 -1687
3129 -1687 -571 1068 -330 -1686 268 912 -954 -1494 668 797 -1161 -1009 1057 451 -1671 -397
3145 -397 1171 -420 -1534 145 1086 -623 -1179 735 844 -936 -628 1046 404 -1110 -66 1546
3161 1546 270 -1405 592 1466 -634 -783 1068 1150 -681 -286 1230 912 -1272 -209 1614 88
3177 88 -1271 762 1293 -181 -778 1034 1131 -1101 -701 1160 424 -1501 -323 1416 26 -1340 200
$$ packed form
3064G80k050K79K041p68j950J405J450j526j452K132J025k045p34K175K48k242
3080a232L01K283p26k020J260J619j297j542J648J223k158m62K262q6j548j04
3096e79K117p91j772R01J792j571j228J757Q85j943o32K098Q2k356O35K099j099
3113C95j647J019J760j589j332J753J189k312m38J970J71k263L59K109q90j941
3129a687J116J639j398j356J954O44j866n40K162J29j958J52K066o06k122J274
3145c97J568j591j114J679R41j709n56J914J09j780L08J674o42j514J044J612
3161A546j276j675J997Q74k100j49J851Q2j831L95J516l18k184J063J823j526
3177H8j359K033N31j474n97J812R7k232M00J861p36j925J178J739j390j366J540
$$ plain form
3194 200 1070 -593 -1452 936 992 -1022 -603 1077 286 -1120 -520 1125 -226 -1330 363 874 -1064
3211 -1064 -1237 828 613 -1346 -809 999 307 -1361 -379 1279 -166 -1411 147 1189 -702 -1241
3227 -1241 751 1144 -1170 -689 1369 659 -1237 91 1422 103 -1147 505 1629 -430 -837 1087
3243 1087 965 -587 -588 1468 643 -1188 -42 1537 95 -999 653 1241 -334 -853 1038 951 -1186
3260 -1186 -469 1214 692 -1333 -17 1419 -325 -1432 343 1324 -516 -1064 757 673 -982 -519 1205
3277 1205 168 -1614 -416 845 -405 -1459 132 963 -691 -864 490 500 -1149 -676 932 171
3293 171 -1270 -244 951 -314 -1319 275 1286 -346 -931 718 634 -891 -646 1035 332 -1142
3309 -1142 70 1346 172 -1221 430 1174 -408 -1013 1356 833 -550 -469 1180 642 -1083 42
$$ packed form
3194B00Q70j663q59K388N6k014M19J680p91j406O00J645j351j104J693N11j938
3211a064j73K065k15j959N37J808o92j668R82J658j445j245J558J042j891n39
3227a241J992L93k314M81K058p10j896J328J331j319j250J652J124k059m07J924
3243A087j22j552jK056q25j831J146J579j442j094J652N88j575n19J891q7k137
3260a186P17J683n22k025J316J436j744j107J775R81j840n48J821q4j655M63J724
3277A205j037j782J198J261j250j054J591Q31j654j73J354J0j649M73J608p61
3293A71j441J026J195j265j005J594J011j632n85J649q4j525K45J681p03j474
3309a142J212J276j174j393J651P44j582o05K369n23j383Q1J649n38j725J125
$$ plain form
3325 42 1547 192 -1030 724 963 -509 -884 723 995 -862 -572 1535 250 -1102 181 1170 -35
3342 -35 -1394 469 1133 -976 -1080 897 536 -1031 -856 840 322 -1646 -199 1105 -412 -1270 89
3359 89 803 -567 -1087 607 835 -1248 -821 934 77 -1373 -214 1048 -275 -1226 166 988 -531
3376 -531 -922 963 759 -800 -615 1359 576 -1087 19 1113 67 -906 278 1135 -322 -491 1254
3393 1254 1140 -942 -374 1225 613 -990 161 1457 16 -1032 1007 1012 -459 -562 865 943 -782
3410 -782 -303 1357 266 -1242 -36 1260 -27 -1054 452 1069 -546 -811 994 353 -1070 -731
3426 -731 707 132 -1555 83 1289 -669 -1415 439 821 -666 -931 503 554 -1328 -528 830 -196
3443 -196 -1202 -295 1113 -365 -1342 195 1139 -624 -1089 701 712 -914 -476 1155 270 -1001 -235
$$ packed form
3325D2J505j355j222J754K39j472l75J607K72j857K90K107j285j352J283R89j205
3342c5j359J863O64k109j04J977l61j567J75J696n18j968J447J304j517q58J359
3359H9P14j370n20J694K28k083M27J755q57j450J159J262j323r51J392Q22j519
3376e31l91J885k04j559J85J974p83j663J106J094j046r73J184Q57j457j69J745
3393A254j14k082N68J599o12j603J151J296j441j048K039Nj471j03J427P8j725
3410g82M79J660j091j508J206J296j287j027J506O17j615k65J805o41j423L39
3426g31J438n75j687J638J206j958p46J854L82j487k65J434N1j882Q00J358j026
3443a96j006R07J408j478r77J537R44j763m65J790J1j626M38J631q85j271P66
$$ plain form
3460 -235 1017 -244 -949 506 1071 -462 -499 1017 1033 -915 -281 1202 210 -815 21 1452 -324
3477 -324 -1063 804 1051 -675 -572 697 782 -848 -497 1305 313 -1047 108 1152 -50 -640 141
3494 141 1121 -740 -914 764 368 -849 -491 728 64 -1320 -142 1022 -490 -1239 428 1046 -763
3511 -763 -1201 619 667 -924 -633 957 253 -1269 -201 1053 -128 -1112 165 1140 -768 -808 864
3528 864 544 -819 -328 1131 182 -946 -18 1055 -9 -1016 804 1187 -479 -733 1201 565 -959
3545 -959 -170 1360 482 -855 158 1397 35 -980 632 1073 -471 -747 718 665 -797 -424 1100
3562 1100 25 -1051 200 858 -503 -957 339 812 -593 -717 820 251 -1110 -569 921 380 -1219
3579 -1219 -232 1209 -394 -1196 316 588 -483 -916 605 740 -1199 -416 991 65 -1162 -57 843
$$ packed form
3460b35J252j261p05J455N65j533l7J516J6j948O34J483r92j025Q36J431j776
3477c24p39J867K47j726J03J269Q5j630L51J802r92j360J155J044j202n90P81
3494A41R80j861j74J678l96j217L58J219o64j384J178J164j512p49J667O18j809
3511g63m38J820M8j591K91J590p04j522J068J254j181r84J277R75j908m0J672
3528H64l20j363M91J459r49j128R28J073j064j007J820L83j666k54J934o36j524
3545i59P89J530q78j337J013J239j362j015J612M41j544k76J465n3j462L73J524
3562A100j075j076J251O58j361m54J296M73j405j24J537n69j361N41J490n41j599
3579a219R87J441j603q02J512K72j071m33J521J35j939P83J407r26j227J105R00
$$ plain form
3596 843 -449 -1099 216 722 -654 -978 728 640 -827 -304 1013 233 -772 267 1131 196 -1026
3613 -1026 687 1089 -775 -552 1023 640 -806 -402 1093 212 -841 114 1040 4 -712 551 1136
3630 1136 -550 -606 944 813 -883 -331 964 111 -1185 132 1053 -184 -981 293 963 -729 -682
3647 -682 742 493 -1039 -561 1028 110 -1302 -19 871 -441 -1305 214 699 -886 -946 464 460 -1064
3665 -1064 -606 865 164 -1138 -18 983 -477 -1068 519 800 -536 -712 672 394 -816 -278 783
3682 783 211 -939 23 863 -67 -989 410 1152 -438 -405 653 399 -677 -462 1029 341 -1052 3
3700 3 1106 -35 -1009 427 988 -665 -606 728 703 -698 -416 1007 301 -742 -13 930 2 -1151
3718 -1151 496 847 -827 -1025 774 695 -988 -290 772 53 -933 -135 815 -220 -947 344 629 -819
$$ packed form
3596H43j292o50J315N06j376l24J706q8j467N23J317p80j005J039Q64r35j222
3613a026J713M02j864K23J575l83j446M04J495q81j053R55R26j036p16J263N85
3630A136j686n6J550j31j696N52J295q53j296J317R21j237p97J274O70j692M7
3647f82J424k49j532M78J589r18j412J283Q90j312q64J519M85j585o0J410mj524
3665a064M58J471p01j302J120J001j460n91J587K81j336j76J384k78j210N38J061
3682G83n72j150R62Q40r30r22J399P42j590L3J058k54j076K15J491o88j393J055
3700CJ103j141r74J436N61j653N9J334k5j401K82J423p06j043P29R43r28j153
3718a151J647L51j674j98J799p9j683O98J062p19r86P98R50j035p27J291K85j448
$$ plain form
3736 -819 -630 560 307 -1062 -584 801 -1 -1023 154 1116 -299 -1138 228 934 -684 -682 698 357
3754 357 -723 -398 944 -16 -710 201 985 -259 -797 412 835 -406 -654 895 901 -998 -467 1104
3772 1104 252 -887 260 1121 -16 -712 669 913 -508 -518 818 475 -842 -365 1168 278 -878
3789 -878 195 786 -424 -781 494 670 -528 -1025 865 196 -1021 -496 796 -128 -1339 -292 973
3806 973 -345 -952 312 713 -863 -727 589 416 -1115 -290 614 35 -958 -89 677 -169 -728 267
3824 267 724 -714 -846 647 463 -829 -28 1032 288 -902 88 793 -374 -629 590 790 -707
3841 -707 -712 854 755 -542 -211 1036 85 -724 239 929 -157 -698 396 1016 -620 -639 524 439 -601
3860 -601 -318 840 51 -784 -13 897 -668 -494 429 566 -551 -930 538 413 -976 -363 897 -68
$$ packed form
3736h19J89J190k53j369M78J385q02j022J177R62j415q39J366P06j618KJ380l41
3754C57j080L25J342r60o94R11P84j244n38J209M23j241k48J549Oj899N31J571
3772A104q52j139J147Q61j137o96J381K44j421j0J336l43j317M77J533q90j156
3789h78J073N91j210l57J275J76j198m97J890o69j217N25J292r24j211J047J265
3806I73j318o07J264M01j576J36J316j73j531Q25R04n79r93Q69P66q46n59R95
3824B67M57j438j32J493j84j292Q01J060p44j190R90P05j167k55J219K00j497
3841g07nJ566r9j297L31J247r51q09R63O90j086n41J094O20j636j9J163q5j040
3860f01K83J158p89q35P71R10j565J74R23J37j117l79J468j25j389O13J260r65
$$ plain form
3878 -68 -975 -109 795 -374 -1058 294 555 -661 -742 495 314 -728 -465 599 -106 -816 160 552 -304
3897 -304 -737 462 804 -754 -817 650 312 -782 -312 910 155 -902 293 1100 -257 -806 476
3914 476 625 -634 -662 655 685 -538 95 789 133 -775 93 893 -126 -801 570 958 -390 -188 627
3933 627 320 -677 -211 891 294 -1075 177 869 -390 -857 513 886 -849 -665 709 454 -923
3950 -923 -254 650 45 -1122 -264 723 -183 -1076 354 611 -920 -479 697 351 -783 -484 834 39
3968 39 -1130 152 492 -442 -659 294 628 -442 -483 810 206 -909 -248 786 -110 -665 219 780 -194
3987 -194 -744 346 759 -416 -477 604 620 -788 -82 907 239 -588 303 1035 -77 -726 436 947 -692
4006 -692 -465 522 504 -468 -241 522 224 -799 224 889 -531 -696 313 594 -553 -597 576 372 -1141
$$ packed form
3878f8r07Q66R04j169o84J352K61j216q1J237j81j042K63J064p05p10R76L92q56
3897c04m33J199L42j558o3J467l38j094M70J222p55j057J195Q07j357n49J282
3914D76J49j259k8J317L0j223O33O94o56r08Q68Q00j019o75J371L88j348K02Q15
3933F27l07r97M66J102n97j369J252O92j259m67J370L73j735J84J374k55j377
3950i23O69R04o05j167Q58R87r06q93J430K57j531M41J176l46j134K99J318p95
3968C9j169J282L40r34k17R53L34j070m1J293o04j115O61J034q96n55Q84N61r74
3987a94n50J090M13j175o1J081J6j408P06R89o68q27Q91P32j112o49J162N11j639
4006f92K27R87j8r72K27P63k98j023J023O65j420j65J009K81j147m4J173k04j513
$$ plain form
4025 -1141 -370 646 -60 -701 -1 767 -299 -745 582 514 -766 -823 397 485 -866 -154 422 -136 -1071
4044 -1071 -30 468 -354 -789 351 743 -340 -674 751 414 -900 -368 838 56 -825 84 698 -70
4062 -70 -488 524 894 -430 -385 777 635 -435 -27 1022 312 -613 145 756 -133 -514 559 420 -475
4081 -475 -120 702 357 -840 -323 810 -37 -764 71 646 -206 -564 560 290 -347 -453 352 354 -594 -335
4101 -335 690 -142 -939 263 616 -283 -790 547 512 -689 -557 435 274 -946 -461 591 163 -812
4119 -812 40 508 -380 -492 506 357 -554 -494 312 379 -595 -368 587 -21 -590 105 887 -153 -542 439
4139 439 538 -482 -442 725 408 -712 -76 699 118 -557 175 740 -356 -716 844 475 -413 -639 615
4158 615 272 -748 -39 867 34 -823 102 449 -271 -657 473 657 -516 -478 680 -2 -694 -248 315
$$ packed form
4025a141P71J016p06o41P00P68j066m46J327o8j280n7J220Q8j351P12N76n58r35
4044a071J041M98q22m35J140L92j083l34J425l37j314N32J206p82q81R09O14p68
4062g0m18J012L70j324M5J162j42j070M08J049p10r25P58O11q89l81J073j39q95
4081d75L55Q22l45j197N17J133q47p27Q35N75q52l58J124k70o37j06Q05Kr48K59
4101c35J025q32p97J202L53q99n07J337l5j201J32R92j61j220M85J052m28r75
4119h12Q52M68q88j12R98j49r11O0Q06O7r74K27R55o08n69O95P82j040l89R81
4139D39R9j020M0J167l17j120O36P75n81o75P32N65j096l60J560l69q88k26J254
4158F15l43j020P09R06q33q57R25L47p20l86J130J84j173L8J158o82o92M46N63
$$ plain form
4177 315 -31 -924 154 747 -428 -441 366 288 -651 -533 444 249 -869 -206 554 -16 -809 109 859 -488
4197 -488 -428 281 684 -356 -603 753 315 -424 -67 708 180 -815 205 725 -93 -417 524 347 -355
4216 -355 -301 746 379 -487 -164 613 89 -603 249 813 50 -361 385 376 -442 -270 696 367 -388 13 595
4237 595 -54 -616 -19 726 -44 -795 510 504 -582 -611 430 157 -547 -333 620 -188 -876 -46 635 -371
4257 -371 -637 248 500 -645 -541 575 195 -529 -324 491 -97 -611 88 718 -460 -410 391 445 -389 -388
4277 -388 534 416 -608 -146 661 50 -596 269 752 40 -673 737 852 -581 -283 820 426 -579
4295 -579 -94 897 356 -637 310 914 -370 -355 367 647 -115 -261 757 324 -587 -29 585 137 -577 215
4315 215 743 -375 -661 405 472 -474 -474 576 393 -652 -270 696 42 -870 176 240 -181 -742 39 420
$$ packed form
4177C15l46q93J078N93j175j3Q07p8r39J18R77j95j118O63P60n70p93R18P50j347
4197d88O0P09M03j040k47J356m38p39L57P75n28r95J020N20q18l24R41j77p02
4216c55N4J047l67q66L23P77n24o92Q52N64p63m11P46rq18J72R66l29p55M01N82
4237E95o49n62N97P45p70p51J305oj086k9J041k73p04K14R53q08o88Q30O81j006
4257c71k66Q85K52j145J04J116l80p24K05Q15n88n14O99O30j178N0Q01N4q34J
4277c88R22j18j024M62Q07o11o46Q65M83p12p13J410J15j433K98J103l94j005
4295e79M85R91n41r93R47O04j284J5P22K80p62j46J018m33r11N58O14m48p14P92
4315B15N28j118k86J066O7r46%J050j83j045L82R66o54r12J046O4m21n61P81L81
$$ plain form
4335 420 -598 -427 395 -27 -607 -60 656 -63 -872 243 482 -255 -584 397 391 -380 -391 504 316 -704
4355 -704 30 689 -76 -599 151 722 -169 -708 458 483 -430 -288 822 281 -606 133 779 91 -296 262
4375 262 695 -330 -442 533 360 -444 -510 644 362 -274 -45 701 74 -665 190 546 -253 -735 324
4394 324 495 -478 -464 482 167 -824 -43 482 -246 -786 0 478 -343 -642 136 365 -751 -494 560 149
4414 149 -789 -227 568 112 -912 120 702 -244 -440 404 261 -221 -325 290 157 -550 -83 723 -60
4433 -60 -558 -54 532 -362 -684 502 365 -507 -382 607 279 -584 -78 646 185 -590 341 592 -292 -445
4453 -445 758 369 -256 -191 491 353 -574 -104 619 -61 -714 119 494 -97 -829 488 418 -585 -286 592
4473 592 235 -637 -365 386 -256 -757 290 428 -420 -728 234 507 -641 -376 535 175 -746 -222 478
$$ packed form
4335D20j018J71Q22m22n80N47P16p19q09J115K39p37l29R81op71j1Q95j88j020
4355g04P34O59p65n23P50N71q91n39J166K5r13J42J110n41q87P39O46o88l87N58
4375B62M33j025j12R75j73q04o6J154k82o36K29P46o27p39Q55L56p99m82J059
4394C24J71r73J4R46l15r91P81N25p28n40P86M78q21k99P78K29j116K57J054m11
4414A49r38N62P95m56j024J032N82r46j96Q44j43m82j04O15j33p07M67Q06p83
4433f0m98N04N86q94l22J186j37q72J25R89l28q63N06P24m61p75R31K51q84j53
4453d45J203l89o25O5O82j38r27M70P23o80o53Q33L75n91p32J317p0j003K99Q78
4473E92l57q72K72P51o42n01J047J38q48l08R62K73j148K65R11l60r21N24P00
$$ plain form
4492 478 52 -662 30 476 42 -672 258 494 -452 -288 321 373 -751 -61 859 -24 -416 240 587 -248
4512 -248 -269 534 342 -427 -395 502 168 -364 -167 833 312 -546 446 266 -87 -401 501 591 -386 -1 487
4533 487 161 -548 -284 532 274 -369 23 572 -159 -819 341 424 -501 -460 390 163 -338 -13 464 -116
4553 -116 -683 316 476 -249 -329 243 208 -426 -509 668 64 -815 147 378 -162 -725 320 335 -400 -602 547
4574 547 503 -221 -298 445 241 -532 -166 552 -161 -498 198 762 -130 -352 408 162 -293 -310 678 195 -588
4595 -588 -50 653 232 -486 429 601 -185 -337 249 759 -501 -58 566 305 -568 -18 672 -144 -508 -115
4615 -115 633 -15 -710 410 406 -358 -306 461 106 -517 -163 236 -114 -650 153 604 -692 -564 361 212
4635 212 -581 -471 328 43 -770 -246 498 189 -524 338 311 -317 -497 348 106 -698 -360 504 292 -553
$$ packed form
4492D78m26p14O92M46m34p14R30K36r46J64O09N2j124O90R20q83l92O56L47q35
4512b48k1Q03j92p69L2Q97l34n32J97J000n21q58R92j80l53l14R02R0r77L85M88
4533D87l26p09K64Q16k58o43L92N49p31o60J160Q3r25M1Q50k27n01L25M77n80
4553a16n67R99J60p25q0N72l5o34q3J177o04q79R62K31n40n63J045J5p35k02J149
4574E47m4p24p7P43k04p73L66P18p13l37O96N64q92k22P60k46m55j7R88m83p83
4595e88N38P03m21p18R15J72p86j52N86N10j260M43O24k61q73N50O90q16l64L93
4615a15P48o48o95J120mp64N2P67l55o23L54L99l50n36Q03M51j296J28R25j49
4635B12p93J10P99k85q13N24P44l09p13Q62k7o28j80Q45k42q04L38Q64k12q45
$$ plain form
4655 -553 124 446 17 -416 262 454 -86 -409 506 431 -548 10 714 302 -156 -189 589 -7 -538 78 589
4676 589 -204 -355 451 343 -438 -267 418 289 -689 -83 479 -90 -457 204 395 -569 -216 264 74 -663
4696 -663 -315 481 55 -587 -76 393 -67 -577 62 382 -238 -255 361 209 -638 -334 256 307 -379 -84 657
4717 657 195 -261 280 355 -259 -623 179 475 -389 -134 376 160 -232 6 615 -121 -447 295 351 -343 -194
4738 -194 563 538 -227 -65 559 576 -217 138 632 -30 -287 273 670 -126 -584 369 262 -346 -225 469 472
4759 472 -431 -243 502 202 -301 117 493 -248 -463 277 299 -357 -241 96 16 -518 -107 550 -277 -466 170
4780 170 450 -181 -418 244 273 -318 -541 311 116 -639 -240 396 -149 -475 9 518 -259 -489 378 160
4800 160 -180 -508 319 75 -585 -322 393 -114 -396 312 443 -212 -148 509 414 -436 -401 497 154 -498 424
$$ packed form
4655e53O77L22m29m33O78J92n40l23R15p5r79N58P04m12m58l3P78n96n31O16N11
4676E89p93j51Q06j08p81J71O85j29r78O06N62n69l67O61J91r64L53M80j90p37
4696f63L48P96m26o42N11M69m60n10O39L20o20j7O16j52q47L04N90N1o86K95P41
4717F57m62m56N41P5o14l64Q02K96q64K55N10k16l92K38O09p36l26P42N6o94J49
4738a94P57k5p65J62O24J7p93L55M94o62k57N60L97p96m58R53j07o08J21O94L
4759D72r03J88P45l00n03M18L76p41k15P40K2o56J16L37q0n34M11O57q27j89O36
4780A70K80o31k37O62K9n91k23Q52j95p55L99O36n45l26M84N09p77k30Q67k18
4800A60l40l28Q27k44o60K63P15n07k82P08J31o55O4O57r5q50L5Q98l43o52R22
$$ plain form
4821 424 497 -94 -350 266 559 -76 -312 421 136 -432 -97 517 308 -339 129 571 -95 -381 299 340 -150
4842 -150 -463 204 337 -481 -132 549 -3 -678 22 285 -199 -655 57 264 -391 -388 -2 210 -376 -278 311
4863 311 169 -491 -205 451 -136 -561 -20 56 -368 -409 107 100 -450 -248 349 84 -414 10 395 -278 -571
4884 -571 344 293 -307 -152 450 457 -323 -430 481 347 -329 156 636 21 -315 270 740 -76 -265 259 170
4905 170 -218 -79 439 104 -558 -132 392 -70 -249 230 556 -235 -252 374 380 -455 -266 529 -147 -825 -187
4926 -187 406 -35 -566 208 399 -571 -385 154 75 -609 -359 313 36 -856 -214 365 34 -299 -21 350
4946 350 -105 -590 392 279 -467 -339 580 -14 -341 115 470 244 -587 240 449 -176 -396 370 736 -291
4966 -291 -5 123 62 -308 43 114 -62 -441 318 469 -142 -256 66 218 -335 -274 105 -34 -387 -35 731
$$ packed form
4821D24P3n91k56O16K93o35k36P33k85n68L35O14k09o47M68M42o66k86O80M1m90
4842a50l13O67J33q18L49O81n52o75P00K63m84m56P12K07o55LL86K12n86R8N89
4863C11j42o60K86O56n87m25N41P6m24m1N16pn50K02N97k65m98M24L85o73k93
4884e71R15n1o00J55O02Pp80j07R11j34o76M85M80o15l36N85M70q16j89N24q9
4905A70l88J39N18l35o62M26N24m62j79M79L26p91j7O26Oq35J89P95o76o78O38
4926a87N93m41n31P74J91r70J86N39p9o84K50O72k77q92O42N79l31l33K78L71
4946C50m55m85R82j13p46J28R19n94l27M56L55k26q31Q27K09o25k20P66L66j027
4966b91K86J28o1l70L51P1j76l79P59J51o11j14L22J52n53O1L79j39l53L52P66
$$ plain form
4987 731 -227 -486 80 190 28 -418 240 164 -345 -326 343 55 -561 183 468 -227 -346 51 510 -415 -355
5008 -355 508 156 -491 -259 248 -101 -426 -89 377 -238 -300 85 615 -319 -457 345 190 -587 -390 426
5028 426 49 -294 137 479 -232 -445 153 571 -33 -69 424 308 -325 -4 514 78 -417 265 275 201 -243
5049 -243 132 517 -191 -166 382 79 -510 -134 198 80 -568 204 425 -41 -560 64 293 -178 -205 415 354
5070 354 -460 -131 436 -46 -645 -242 358 -11 -151 105 204 -304 -434 285 60 -513 -190 556 -25 -651
5090 -651 -122 347 -6 -340 252 333 -493 -273 272 69 -389 -150 221 13 -336 108 542 -138 -269 248
5110 248 71 -252 -210 446 223 -266 -161 500 238 -295 -15 608 -148 -365 267 340 -386 -335 260 185 -449
5131 -449 113 469 183 -170 235 290 -140 -147 166 509 -350 -103 372 302 -353 -196 523 324 -384 -290 235 -385
$$ packed form
4987G31r58k59N66J10j62m46O58p6n09J9O69k88o16P44K85o95j19L97M59r25O0
5008c55Q63l52o47K32N07l49l25L37M66o15o2L85N30r34j38Q02j55p77J97Q16
5028D26l77l43M31L42p11k13N98M18o04l6M93j16o33L21N18m36m95O82J0p4m44
5049b43L75L85p08K5N48l03n89L76L32j18o48P72K21m66n19O24K29m71k7O20o1
5070C54q14L29N67m82n99M03O00l69j40K56R9n08j30P19k25n73L23P46n81o26
5090f51N29M69l53l34N92Q1q26K20N45k03m58K39L71k08l49M44M34o80j31N17
5110B48j77l23M2O56k23m89J05O61k62n33K80O23p56k17O32P3p26N1N95p5o34
5131d49N62L56k86l53M05N5m30pL13L43q59K47M75p0o55J57P19j99p08R4N25o20
$$ plain form
5153 -385 -513 344 283 -269 -265 -46 -90 -171 -353 237 47 -289 -183 203 -79 -503 112 224 -322 -309 143 235
5175 235 -556 -124 326 76 -366 43 528 10 -324 174 263 -419 -166 360 411 -143 -17 723 219 -418 120
5196 120 752 131 -353 160 355 -172 -307 402 151 -229 89 438 191 -299 14 387 -102 -303 242 502
5216 502 -267 -290 310 -68 -259 -8 457 91 -405 92 288 -189 -569 184 249 -386 -491 297 -6 -229 34
5237 34 429 22 -627 -62 302 -203 -123 58 100 -207 -263 308 244 -36 -34 296 -237 -237 -77 531 -46 -302 361
5260 361 495 -257 -113 432 283 -75 -226 439 122 -371 124 252 -309 -342 474 456 -242 -266 210 215 -268 -2
5282 -2 536 8 -407 -98 546 68 -300 241 504 -179 -234 241 159 -314 166 365 53 -537 35 334 -201
5303 -201 -348 -36 290 -154 -380 161 -70 -310 -143 286 -142 -509 -141 166 -216 -292 496 283 -91 -464
$$ packed form
5153c85j28Q57o1n52MK19m4q1j82N90j90l36J06L86k82m24O15J12n46J3M52R2
5175B35p91M32M50k50m42M09M85n18l34M98Q9o82K53N26N1n54J26P40n04o37N38
5196A20O32o21m84N13J95n27j35P09k51l80L18L49k47m90L13L73m89k01N45K60
5216E02p69k3O00l78j91K51M65l66m96M97J96m77l80P53O5o35j05P88l03k23K63
5237C4L95m07o49N65L64n05Q0J81M2l07n6N71o4k80KL30n33%J60O08n77k56O63
5260C61J34p52J44N45j49l58j51O65l17m93M95J28n61l3Q16j8o98k4M76Nm83K66
5282bN38n28m15L09O44m78l68N41K63o83n5M75q2m73M80J99l12n90N72K99n35
5303b01j47L12L26m44k26N41k31k40J67M29m28l67L68L07l82p6P88k13l74l73
$$ plain form
5323 -464 271 121 -309 -46 282 150 -402 44 199 -169 -281 -140 322 -250 -140 153 272 -173 -138 414
5343 414 202 -231 198 511 -196 -263 309 230 -410 -186 434 207 -534 11 462 91 -467 69 280 -30 -435
5364 -435 284 264 -394 -169 123 -209 -416 -417 188 244 -586 -29 453 -252 -350 63 -29 -294 -135 328 87 -499
5386 -499 -241 211 55 -133 -156 347 -47 -301 67 111 -296 -364 146 355 -391 -253 622 -96 -432 82 381
5407 381 34 -117 145 342 -406 -12 399 187 -291 -140 321 120 -390 63 339 -301 -94 412 92 -112
5427 -112 -180 186 351 -372 -11 468 -128 -89 376 592 -242 -323 199 321 -450 -428 253 15 -315 -137 210
5448 210 -123 -595 -6 137 -149 -370 86 390 -178 -245 129 388 -526 -463 371 -121 -322 -71 93 -30 -185
5469 -185 224 -126 -91 -235 165 147 -481 -64 188 -4 -222 -11 92 -130 -208 38 221 -188 -94 62 278
$$ packed form
5323d64P35j50m30K63L28j32n52M46J55l68j12J41M62n72J10K93J19m45L5N52
5343D14k12m33M29L13p07o7N72p9o40K24O20k27p41N45M51l71n58N36K11l10m05
5364d35P19k0o58K25K92l32k07jO05N6q30N57M82p05r8M13r2k65J59M63k41n86
5386d99K58M52j56j88k3N03l94k54L68M4m07o8N10K09p46J38Q75p18l36N14K99
5407C81l47j51K62J97p48L94M11k12m78J51M61k01n10M53K76o40K07N06l20k04
5427a12o8L66J65p23L61M79n96L9M65K16q34q1N22J22p71K2O81k38l30J78L47
5448B10l33m72N89J43k86k21M56L04n68o7L74K59r14O3Q34m92k01K51J64j23j55
5469a85M09l50L5j44M00j8o28M17K52j92k18K11J03k22p8K46J83m09R4J56K16
$$ plain form
5490 278 -64 98 414 113 -226 221 513 -165 25 223 392 -29 -358 511 223 -289 -187 522 -154 -357
5510 -357 65 446 -193 -235 285 236 -148 -219 143 -101 -338 208 395 -178 -246 124 216 -251 -48 193 -25 -456
5532 -456 -285 163 246 -289 -244 332 -320 -379 14 222 -110 -398 124 278 -335 -39 294 232 -59 -80 318 28
5554 28 -341 27 132 -37 -3 59 279 -127 -165 429 244 -196 -90 224 -270 -370 172 317 -204 -129 63 365
5576 365 -439 -91 37 127 -309 83 183 -135 -146 235 356 -388 -344 296 195 -247 -94 229 232 -292 -99 581
5598 581 151 -263 -60 232 -270 -422 134 125 -209 -342 342 -174 -423 6 505 -25 -319 -52 335 -157 -335
5619 -335 276 -29 -272 -182 168 110 -418 0 345 -65 -279 39 -1 -5 -126 352 106 -263 -151 374 408 -180
5641 -180 129 308 147 -304 401 310 -286 -292 159 357 -284 -117 205 191 -84 -235 295 94 -472 247 205 -284
$$ packed form
5490B78l42J62L16l01l39M47K92o78J90J98J69m21l29Q69k88n12J02P09o76k03
5510c57M22L81o39m2N20m9l84p1L62k44k37N46J87n73o8L70R2m67K03K41k18m31
5532d56J71M48Q3n35M5N76o52n9L93K08l32k88N22J54o13K96L33o2k91k1L98k90
5554B8l69L68J05j69L4O2K20m06l8N94j85m40J06L14m94j00N42J45n21P5J92L02
5576C65q04L48J28R0m36L92J00l18j1L81J21p44M4O40j01m42J53L23Ln24J93O80
5598E81m30m14K03K92n02j52N56rl34j33O84n16k49M29M99n30k94K67L87m92j78
5619c35O11l05k43R0L50n8n28M18L45m10k14L18m0mj21M78k46l69J12N25L4n88
5641a80L09J79j61m51P05r1n96oM51J98o41J67L22j4k75j51N30k01n66P19m2m89
$$ plain form
5663 -284 -498 120 279 -476 -157 356 200 -434 -24 164 -274 -317 63 -322 -157 -441 206 392 -201 -325
5683 -325 20 34 -136 -132 273 -354 -319 108 8 -211 -214 98 238 -372 3 522 -110 -394 -125 293 198 -319
5705 -319 334 426 -151 -155 287 248 -332 -195 348 -42 -335 -179 166 -27 -288 233 388 -202 -44 338 41
5726 41 -219 -190 175 170 -210 -165 347 -56 -224 -102 433 -126 -315 286 75 -384 -323 197 1 -397 10 252
5748 252 -84 -409 149 363 -82 -205 253 -46 -287 -260 204 25 -370 144 135 95 -288 19 72 -147 -399 89
5770 89 -12 -259 -301 297 66 -156 169 362 -2 -383 245 504 -204 18 268 60 -48 -104 374 27 45
5791 45 201 361 93 -250 236 231 -166 -380 410 299 -136 -145 133 147 -110 -109 291 -85 -108 363 -8 -285 -270
5814 -270 60 -181 -170 -170 219 -1 -247 106 120 21 -247 -233 200 -345 -326 56 87 -130 -220 -20 -147 -339 -126
$$ packed form
5663b84k14O18J59p55L19N13j56o34M10J88m38m3L80l85J65k84O47J86n93j24
5683c25L45J4j70MM05o27L5M27j00k19lL12J40o10L75N19o32k84K69M18r5n17
5705c19O53R2n77mM42l9n80J37N43l90k93J56L45j93k61N21J55n90J58L82k97
5726D1k60K9L65nl80M5N12m03j68J22N35n59j89O01k11m59O1N20j96l98M07K42
5748B52l36l25N58K14m45j23M58k99k41K7M64j79l95N14rm0l83L07N3k19k52M88
5770H9j01k47m2N98k31k22L25J93l64l81O28K59p08K22K50k08j08n6M78l47J8
5791D5J56J60k68l43M86nl97k14P90j11m35rK78J4k57JM00l76k3M71l71k77J5
5814b70L30k41J1%L89k20k46L53J4r9k68J4M33n45J9L82L1k17r0K00j27j92K13
$$ plain form
5837 -126 161 -52 -205 166 100 -23 -267 205 156 -243 -279 119 -94 -197 91 304 -44 -111 332 106 -238
5858 -238 -31 341 183 -464 5 405 65 -228 120 412 38 -243 127 321 147 -60 42 243 -261 87
5878 87 481 58 -293 -101 58 127 -208 -3 191 98 27 411 31 -319 -121 347 -37 -99 -125 92 -145 -582
5900 -582 -21 331 -220 -680 461 74 -225 -186 249 13 -248 93 341 -175 -235 121 273 -182 -282 225
5920 225 185 -234 -89 179 203 -234 -13 388 -11 -155 108 253 -175 -99 372 18 -69 -94 374 101 -131 118
5942 118 85 -87 -235 260 76 -65 -99 291 216 -457 94 103 215 -431 30 471 -134 -150 8 476 -270 -90
5964 -90 52 -68 -146 -143 224 -40 -391 42 4 -128 -273 56 406 -269 -141 62 191 -347 -25 325 -373 -232
5986 -232 82 91 16 -110 -83 16 46 -427 -37 34 -274 -39 164 48 -160 -55 6 -135 -138 169 204 -353 -189 408
$$ packed form
5837a26K87k13j53L71o6j23k44M72m9l99l6L98k13j03K88K13l48o7M43k26l44
5858b38K07L72j58o47M69M00l40k93L48K92l74k81L70J94j74k07J02K01n04L48
5878H7L94m23l51J92J59O9l35K05J94r3p1L84l80l50J98M68l84o2k6K17k37m37
5900e82N61L52n51m60J141l87k99L9M35k36k61L41K48n16o0L56J52m55j00N07
5920B25m0m19J45K68K4m37K21M01l99j44K63J45m28P6M71l54q7k5M68k73k32K49
5942A18l3j72j48M95j84j41l4L90p5o73N51RJ12o46M61M41o05j6J58M68p46J80
5964i0J42j20p8LL67k64l51M33l8j32j45L29L50o75J28K03J29n38L22L50o98J41
5986b32L14Rp5j26K7R9L0m73L90P1l08K35K03j16k08J05O1j41lL07L5n57J64N97
$$ plain form
6010 408 48 20 -66 151 33 -398 -137 299 -202 41 182 182 -141 -72 -22 63 -346 99 472 139 -138 14
6032 14 123 -159 -354 311 198 -325 3 208 -14 -277 -165 253 -71 -240 20 260 -211 -408 171 369
6052 369 -87 -239 52 199 -160 -106 467 39 -390 -99 365 -40 -247 46 -52 -302 -154 35 171 -317 -370
6073 -370 -45 -184 -137 -102 340 46 -328 123 141 -190 -27 265 169 -132 -147 247 90 -91 167 316 -117 -221
6095 -221 177 303 -117 -56 283 156 -467 144 312 4 -105 157 112 -75 -255 150 87 -168 -316 124 187
6116 187 -323 -61 176 90 -96 110 162 -216 -260 -35 173 -159 -189 78 358 -327 -248 318 -5 -288 -86 317
6138 317 -256 -223 115 295 -249 -46 40 102 -347 -95 -1 -73 -205 -210 184 -94 -287 193 141 -99 -141 283 255
6161 255 -267 -67 355 221 -330 115 244 -44 -83 265 256 -213 4 417 320 -377 -38 312 91 -476 -97
$$ packed form
6010D08l60k8q6K17j18m31K61M36n01K43J41%l23O9N0Q5m09M45L73l33k77J52
6032A4J09k82j95O65j13n23L28K05k22k63J12M18l24j69K60K40m71j97N79J98
6052C69m56j52K91J47l59N4N73m28m29K91M64m05k07K93r8k50J48J89J36m88n3
6073c70L25j39M7L5M42k94l74M51J8l31J63K92r6l01j5L94j57j81K58J49m33j04
6095b21L98J26m20O1L39j27o23O11J68l08j09K62m5j87j80M05o3k55j48M40O3
6116A87n10K62K37q6j86K06N2l78m4K25K08l32l0K67K80o85P9N66l23k83K02M03
6138C17n73L3L38J80n44K03Q6O2m49K52R4p2j32nL94k78j93M80n2k40m2M24k8
6161B55n22K00M22j34n51M45J29k88l9L48rm69K17M13r7o97L39L50k21n67L79
$$ plain form
6182 -97 302 46 -183 379 103 -127 83 -30 -63 -111 -117 37 44 -181 128 47 -134 -261 255 109 3 -172 323
6205 323 56 -270 -167 287 55 -91 40 254 -183 -33 94 232 -547 73 116 -13 -167 115 207 -58 -215
6226 -215 -4 138 18 -68 0 445 -102 -207 13 127 -185 -105 355 30 -201 127 136 -123 51 161 39 80
6248 80 -248 364 241 -163 57 294 -87 -208 6 384 32 -199 -126 428 -148 -147 169 -48 -403 -279 58
6269 58 -52 -356 -48 164 -212 -373 81 281 52 -129 163 68 -220 -182 87 175 -169 -21 362 -85 -355
6290 -355 356 21 -269 86 279 131 -467 186 275 81 -28 218 312 -103 -310 280 123 -117 -102 49 77
6311 77 -306 90 416 -17 -403 134 340 71 -55 249 197 -98 -42 256 63 -231 -122 65 -4 -89 -290 115
6333 115 -58 -419 173 45 131 -51 216 0 -317 173 245 -103 -110 215 265 -239 -53 52 75 -73 -141 -8
$$ packed form
6182i7L99k56k29N62k76k30K10j13l3m8oJ54Pk25L09q1j81j27N16j46j06j75M95
6205C23k67l26J03M54k32j46J31K14m37J50J27J38p79O20M3j29j54K82R2k65j57
6226b15K11J42j20q6O8M45n47j05K20J14l12Q0M60l25k31L28Rk59J74J10j22M1
6248H0l28O12j23m04K20K37l81j21K14L78l52k31P3N54n76JL16k17l55J24L37
6269E8j10l04L08K12l76j61M54K00k29j81K92r5k88L8K69Q8l44J48L83m47k70
6290c55P11l35k90L55J93j48n98O53Q9j94j09K46R4m15k07N90j57k40J5J51K8
6311G7l83L96L26m33l86N37K06k69j26L04n2k95N6K98j93k94J09J87o9q5k01M05
6333A15j73l61N92j28Q6j82K67k16l17M90P2l48pL25N0n04J86J05K3j48o8J33
$$ plain form
6355 -8 111 -191 30 172 -231 -292 185 126 -233 -440 -101 139 -38 -171 179 56 -288 -92 239 54 -397
6376 -397 124 222 -122 -229 162 40 12 -75 248 130 155 -10 416 0 -367 112 326 138 26 113 200 -137
6398 -137 21 317 131 -207 74 197 24 -175 -122 183 -377 -229 -69 62 -147 61 197 -10 -243 -132
6418 -132 444 -88 -237 -53 300 -178 -359 107 194 -221 -202 121 -66 -212 64 126 -124 -238 -152 -7 12 -188
6440 -188 19 143 -283 -220 435 17 -287 -40 253 -73 -310 85 168 -192 -150 281 310 186 -28 -12 239 -51
6462 -51 -97 265 138 -389 26 156 -45 -91 193 163 -171 -58 124 67 -71 104 252 0 -417 58 137 -7
6484 -7 -178 106 76 -107 103 139 130 -337 -47 -32 154 -440 97 177 -128 -281 82 223 16 -165 -71 -181 -291
6507 -291 -197 -85 -27 -387 -41 303 55 -199 239 -44 -103 16 46 -45 -228 95 48 1 -579 99 204 22
$$ packed form
6355hJ19l02K21J42m03o1M77n9l59k07L39K40j77j33L50j23l44J96L31j85m51
6376c97N21R8l44j07L91j22k8q7L23j18K5j65M26m16l67M79K14j88j12Q7Q7l37
6398a37J58K96j86l38K81J23j73j99N3L05n60J48J60J31k09K08J36k07k33J11
6418a32N76n32j49J84L53m78j81M66Q7m15J9L23j87j46K76O2k50j14Q6J45J9k00
6440a88K07J24m26O3O55m18l04K47K93l26k37L95Q3l60M2M31K9j24k14J6K51k90
6462e1m6L62j27n27M15J30k01m6K84l0l34J13J82n7j38J75J48k52m17M75P9j44
6484gj71K84l0j83K10L6rm67K90J5J86n94N37Q0l05j53L63J41k07j81R4j10j10
6507b91R4J12N8l60L46L44k48k54M38k83n9J19L0r1j83L23m7m7n80O78J05j82
$$ plain form
6529 22 -252 286 -23 -5 -302 191 176 -214 143 224 -152 -99 75 283 -21 -167 123 205 185 -205 179 163 -224
6552 -224 -142 182 -153 -256 -158 111 -118 -149 113 230 -124 -170 116 220 -20 88 94 -287 -68 66 313 -226
6574 -226 -101 213 8 -87 -158 150 125 -207 -216 203 -65 -239 -170 118 -265 -164 6 284 -194 -169 196 62
6596 62 -131 -59 70 -45 -74 257 318 -49 84 164 120 -323 -27 164 123 -192 28 405 -66 -38 3 441 -88
6619 -88 -202 392 243 -18 -116 93 25 -265 -281 210 25 -93 173 291 -139 -187 184 164 -149 -76 88 25 -85
6642 -85 -30 296 -10 -137 163 172 68 -209 151 52 -283 -339 -33 29 -87 -165 248 -153 -267 113 264 93 -374
6665 -374 224 377 69 -151 -13 -135 -229 142 336 100 -333 147 217 -162 -127 64 115 -161 79 225 58
6686 58 -54 -74 204 46 -63 -3 189 -325 -139 499 -30 -191 -216 92 99 -228 -134 271 39 -261 -82 295
$$ packed form
6529B2k74N38l09J8k97M93j5l90L57Q1l76N3J74K08l04j46K90Q2k0l90L84j6l87
6552b24Q2L24l35j03R8K69k29l1K62J17l54m6K86J04k40J08Ol81K19J34K47n39
6574b26J25L14k05r5p1L08k5l32rM19k68j74O9K88l83J01J70K78m78K5L65j34
6596F2j93P2J29j15k9L31O1l67J33Q0m4m43K96J91m1l15K20L77m71K8M1M38n29
6619h8j14N94j49k61r8K09o8k90j6M91j85j18K66J18m30m8L71k0l13P3J64o3j10
6642h5N5L26l06j27L00Rj04k77L60r9l35n6L06O2j16p8M13m01j14L80J51j71m67
6665c74N98J53l08k20J38j22r4L71J94k36m33M80P0l79L5J91N1k76K40J46j67
6686E8j12k0K78j58j09O0J92n14J86O38n29j61k5L08Pl27R4M05k32l00J79L77
$$ plain form
6708 295 -193 -106 1 -95 7 9 299 15 -304 -73 120 -110 -319 185 180 -263 -336 119 255 -482 173 467
6730 467 117 -366 -131 478 -249 -181 -68 66 69 -224 -8 248 -236 -101 198 28 -110 -85 345 12 -329
6751 -329 -6 133 -11 -135 293 90 -1 -93 199 167 -171 91 143 -127 -132 128 206 -10 -141 203 127 -146 150
6774 150 339 -22 -150 -247 263 -207 -194 -18 252 -161 -205 12 177 -41 3 78 91 -199 5 263 173 -205
6796 -205 54 188 -169 -72 155 8 -132 31 95 56 -357 60 126 -152 -141 -61 256 -444 90 274 167 -45
6818 -45 -523 261 56 -297 124 135 -88 -417 155 325 -287 -124 107 230 -103 219 68 158 -81 223 112
6839 112 -162 -95 -8 176 -107 -232 139 184 -566 18 323 91 -27 92 286 -89 -158 -47 198 -56 -3 146
6861 146 -28 -104 -75 286 20 130 -123 104 51 -339 -127 190 -110 -409 106 43 -77 -167 176 -34 -186 3
$$ packed form
6708B95m88Q7J07r6J02KK90k84l19K31J93k30k09N04nm43p3M55J36p37O55K94
6730D67l50m83K35O09p27O8J13J34Lk93K16K56m84J35K99j70j38K5M30l33l41
6751c29L23J39j44j24M28k03r1r2K92l2l38K62N2k70nK60P8k16j31L44p6k73K96
6774A50J89l61j28r7N10m70J3J76K70m13m4K17J65k18M4P5J3k90K04K58r0l78
6796b05K59J34l57R7K27j47j40J63O4l9m13M17O6k78J1Q0L17p00N34J84j07k12
6818d5m78P84k05l53M21J1k23l29N72J70o12J63K31J23l33L22j51R0k39L04j11
6839A12k74O7Q7J84k83j25L71M5p50N84L05k32j18J19J94l75o9J11K45k54N3J49
6861A46j74p6K9L61k66J10k53K27n3l90K12L17l00k99N15o3j20r0L43k10j52J89
$$ plain form
6883 3 30 -177 -459 -109 -16 -229 -173 -39 79 -69 -35 0 64 -259 18 147 -13 -327 150 103 -32 -163 2
6906 2 -28 -160 -17 481 57 -38 -146 226 15 -232 414 75 11 -143 191 211 -80 -240 63 -295 91 81
6928 81 294 23 -277 78 320 -190 -445 278 -98 -110 -84 -19 83 -353 67 115 -92 -270 355 144 -24 -189
6950 -189 67 148 -291 -61 186 123 -275 -271 133 77 -499 -61 91 -26 -110 308 288 -121 -35 195 -241 -11 209
6973 209 -26 57 -110 -43 73 -96 -168 61 -73 42 208 -29 -41 -28 -235 254 88 -104 6 182 -61 -81
6995 -81 247 284 -201 -93 104 -99 -162 95 164 -133 -152 344 173 -18 105 241 85 -305 -142 206 54 -148
7017 -148 -44 48 58 -142 44 315 -73 -56 233 11 -75 23 75 -50 -143 283 164 48 -254 -88 -73 -192 -349
7040 -349 -23 -54 -313 -186 27 -47 -207 140 166 162 -56 148 170 -294 -148 252 112 109 -138 335 207 -17 81
$$ packed form
6883CK7k07k82L50R3k13N6J34J18j48L4L5O4l23K77J29j60l14M77m7j35j31J65
6906Bl0j32J43M98m24r5j08L72k11k47O46l39o4j54L34K0k91j60L03l58L86j0
6928H1K13k71l00L55K42n10k55P23l76j2K6O5J02m36M20M8k07j78O25k11j68j65
6950a89K56Q1m39K30K47o3l98MM04n6n76M38J52j17q4M18k0m09Q6K30m36K30K20
6973B09k35Q3j67O7J16j69p2K29j34J15J66k37j2J3k07M89j66j92J10J76k43k0
6995h1L28L7m85J08J97k03o3K57O9k97j9M96j71j91J23J36j56l90J63L48j52k02
7017a48J04R2J0k00J86K71l88J7K89k22q6R8N2j25r3M26j19j16l02J66J5j19j57
7040c49L26l1k59J27K13p4j60L47K6mk18K04K2m64J46M00j40lk47M73j28k24R8
$$ plain form
7063 81 221 -22 -159 12 117 -256 -167 265 104 -64 78 45 16 -309 178 303 -20 97 221 199 35 -72
7085 -72 202 -86 -91 128 27 -60 -153 69 279 -215 -341 250 163 28 -251 68 87 -22 -267 48 -33 -81 36
7108 36 155 32 -297 -188 196 -113 -279 39 -151 -56 -258 133 41 -276 -29 326 104 256 208 115 -202 -303
7130 -303 96 75 104 -133 32 10 -314 -45 276 -26 -55 232 143 55 -330 41 188 -140 -37 275 133 -78
7152 -78 173 59 -372 -89 21 -34 -261 111 223 177 -322 -74 -71 -66 -97 -131 162 -87 -83 -288 167 -94 -164 103
7176 103 224 -229 -27 44 255 -199 15 241 17 -143 -167 9 132 -122 106 133 -94 -293 225 25 -11
7197 -11 -87 270 -45 -145 -61 61 -241 -204 226 247 -29 -153 16 -40 -1 3 232 -25 -101 -48 147 -46 -48 108
7221 108 117 -166 159 367 125 -73 -9 265 110 -164 174 -22 -241 16 112 204 -167 -127 57 56 -227 -98 -70
$$ packed form
7063H1J40k43j37J71J05l73Q9M32j61j68J42l3k9l25M87J25l23J17J24k2j64j07
7085g2K74k88nK19j01q7r3K22K10m94j26N91q7j35k79L19J9j09k45L15q1m8J17
7108C6J19j23l29J09L84l09j66L18j90R5k02L91r2l17K47L55k22J52m8r3l17j01
7130c03L99k1K9k37J65k2l24K69L21l02k9K87q9q8l85L71J47l28J03L12j42k11
7152g8K51j14m31K83J10n5k27L72J12m6m99K48LNl1l4K93k49Mk05M55k61p0K67
7176A03J21m53K02P1K11m54K14K26k24j60k4J76J23k54K28K7k27j99N18k00l6
7197a1p6L57l15j00Q4J22l02L7M30K1k76j24J69n6L9MK29k57p6N3J95j93kJ56
7221A08Rk83L25K08k42j98O4K74j55k74L38j96k19K57R6R2l71M0J84jk83J29K8
$$ plain form
7244 -70 22 -41 366 102 -67 -137 200 170 -89 17 293 61 -101 260 223 -19 -33 109 227 -151 -134 -10 116
7267 116 -192 12 186 214 -182 -90 52 -161 -399 -136 103 -111 99 -14 276 -163 -171 151 81 77 15 228 69
7290 69 -76 -2 16 100 -76 179 80 -65 -68 302 34 59 -102 125 -148 -132 -93 44 -145 -128 -110 94 34 22 94
7315 94 -186 -155 -6 262 138 -141 232 348 16 -168 23 110 -145 -142 202 69 -29 -50 295 -17 -108 228 207
7338 207 -50 -372 185 22 -138 169 193 27 -87 -31 38 84 -20 -24 118 -176 -99 -81 152 180 -39 382 -6
7361 -6 -105 208 305 32 -37 -92 131 154 -24 6 -11 127 114 228 99 -207 40 148 20 -73 160 -127 -108 -131
7385 -131 -40 -64 -237 -36 53 77 -94 137 3 30 -96 -5 -24 -126 -77 -45 -132 -377 -124 14 -136 -354 95
7408 95 84 -37 -248 36 -127 -173 -194 61 162 -271 -150 237 141 -149 -149 -16 -81 -113 264 271 -54 -257 194 100
$$ packed form
7244g0R2o3M07k64j69p0L37l0k59J06K76k32j62L61l7k42j4J42J18l78J7J24J26
7267A16l08K04J74K8l96R2J42k13k38K63K39k14K10j13K90m39qL22p0mo2K13j59
7290F9j45P4J8Q4j76K55r9j45lL70k68K5j61K27k73J6L9J37j89J7J8K04o0j2P2
7315I4k80L1J49K68j24k79L73J16l32j84J91Q7k55LL44j33r8k1L45l12r1L36k1
7338B07k57l22N57j63j60L07K4j66j14N6O9M6j04mJ42k94P7J8K33K8k19M21l88
7361fr9L13R7k73o9n5K23K3j78L0j7J38j3J14j29l06K47J08j28r3K33k87J9k3
7385a31R1k4j73K01Q9K4j71K31j34K7j26R1j9j02M9L2q7k45K53J38j50k18M49
7408I5j1j21k11K84j63m6k1K55J01m33J21L87r6k90%J33o5l2L77Pl25k03M51r4
$$ plain form
7432 100 -85 84 408 151 20 19 306 196 -365 118 97 68 -245 14 -174 -250 -149 161 85 -200 35 59
7454 59 -76 236 114 -44 -121 -192 217 16 -154 -113 -99 265 -76 -336 54 84 -106 311 -128 -38 94 -150
7476 -150 -4 63 18 -141 298 24 -278 244 -156 16 117 133 -153 -160 144 241 160 27 4 -229 -71 301 219
7499 219 133 -263 212 138 -83 -325 101 125 -201 33 93 11 -146 320 224 -73 -136 26 207 -105 -167 227 -169
7522 -169 19 -45 77 -51 -189 157 47 38 -106 -43 102 -41 -47 -183 100 -63 109 116 7 32 -138 71 -24
7545 -24 -255 75 196 -303 -115 -135 110 -190 -222 168 -56 -55 -130 106 -3 -107 67 -74 -68 -65 -100 218 -68 12
7569 12 141 34 -98 -149 151 -130 -176 -20 -71 109 -48 200 -9 -132 -37 166 66 -47 -94 332 6 -190
7591 -190 -78 -165 -237 -186 10 47 -98 -173 407 5 -179 72 -15 -279 28 177 74 -149 -47 139 -149 -105
$$ packed form
7432A00j85J69L24k57j31jK87j10n61M83k1k9l13K59j88p6J01L10p6k85K35K4
7454E9j35L12j22j58p7p1M09k01j70M1J4L64l41k60L90L0j90M17m39R0J32k44
7476a50J46O7m5j59M39k74l02N22m00J72J01J6k86pL04R7q1j33k3k33J58L72q2
7499B19q6l96M75p4k21k42M26K4l26K34O0q2j57M66r6k97o3J62J81l12o2L94l96
7522a69J88o4J22j28j38L46j10rj44O3J45j43oj36K83j63J72Pj09K5j70K09r5
7545b4k31L30J21m99J88k0K45l00l2L90k24Jp5K36j09j04J74j41OLl5L18k86Q0
7569A2J29j07j32n1L00k81m6J56n1J80j57K48k09j23R5K03j00j13m7M26l26j96
7591a90J12q7p2N1J96L7j45p5N80m02j84K51q7k64L07J49j03k23J02J86k88M4
$$ plain form
7613 -105 -121 54 151 -80 -105 244 -42 89 85 20 -171 -186 128 186 -142 10 -118 -79 -384 -55 140 -174 -187
7636 -187 56 122 6 -267 130 -60 -107 -24 76 -73 -101 -16 175 150 -362 14 -35 87 -25 344 215 34
7658 34 21 -37 383 -103 22 207 69 -148 -18 58 -39 -1 -8 -51 65 163 109 -143 -184 296 266 27 -68 -22 199
7683 199 25 -234 310 -175 -178 -58 89 305 -138 -63 225 -39 -231 -83 77 -115 75 -89 24 50 -191
7704 -191 -77 25 -143 128 -70 13 -177 -171 137 2 2 -1 98 -74 -193 178 60 -188 75 141 -113 -53 -75 125
7728 125 -173 -250 -107 183 -197 -152 274 -78 -11 -313 50 224 56 323 273 -354 77 52 54 -257 -277 215 188
7751 188 -113 48 29 -186 -64 -9 -97 -169 -108 201 1 -134 -121 80 210 -60 155 88 -88 -38 36 173 43
7774 43 -85 137 -8 -70 111 13 56 -102 -379 140 -298 -226 286 68 -116 -13 228 171 17 -100 130 -82
$$ packed form
7613a05j6J75R7k31k5L49k86J31mo5j91j5L14N8l28J52j28L9l05L29J95l14j3
7636a87K43O6j16k73L97j90m7Q3J00j49k8Q5J91k5n12L76m9J22j12L69j29j81
7658C4j3n8M20m86J25J85j38k17J30P6r7L8pm3J16R8n4k52m1M80l0k39r5M6K21
7683A99j74k59N44m85lJ20J47K16m43P5K88k64j92J48J60j92J90j64J13K6k41
7704a91J14J02j68K71j98Q3j90OL08j35%lR9j72j19L71j18k48K63O6k54O0k2K00
7728A25k98p7J43K90l80M5M26l52O7l02L63J74j68K67n0o27M31k5Kl11k0M92k7
7751A88l01J61j9k15J22N5q8p2O1L09k00j35J3K01J30k70K15o7j76N0P4J37j30
7774D3j28K22j45o2J81r8M3j58k77N19m38P2N12k18j84J03K41n7j54j17K30k12
$$ plain form
7796 -82 27 288 73 -36 217 245 -72 -167 -40 182 233 12 141 320 13 -266 117 135 12 38 -99 168
7818 168 248 -322 52 271 -241 66 -40 163 -106 -163 106 -163 27 -32 174 -180 -180 116 -121 -64 133 46
7840 46 64 -79 -104 -32 90 32 393 121 -138 16 -70 -201 -237 -40 233 46 -100 -191 295 -59 -142 50 2
7863 2 26 -499 -64 -193 16 -31 124 -328 26 8 83 107 -307 -59 65 -97 -217 184 -247 3 68 186 176
7886 176 -169 -71 308 -225 -136 -36 264 -30 23 70 50 -175 18 186 -70 -203 3 249 127 -226 105 -115
7908 -115 -123 -191 -135 237 -166 -68 138 203 -258 168 -172 -125 -149 -64 110 -211 -150 -77 11 26 8 53 42 -163 235
7933 235 203 -23 -117 18 46 -55 -20 -10 3 -25 49 118 -186 -90 -149 144 1 91 132 -82 -184 -49 159 -7
7957 -7 -34 58 116 242 -156 102 216 107 -8 -74 108 -48 -85 276 182 -320 -80 93 134 -21 -47 9 -26 -155
$$ packed form
7796h2J09K61k15j09K53K8l17r5J27K22N1k21J29J79l07k79L83J8j23K6j37K67
7818A68Q0n70L74K19n12L07j06K03k69n7K69k69J90n9K06l54%K96k37N7J97q7
7840D6J8j43k5P2J22n8L61k72k59J54q6j31l6J97K73j87j46r1M86l54q3J92m8
7863BK4n25M35j29K09m7J55m52L54j8P5K4m14K48J24j62j20M01m31K50O5J18j0
7886A76l45R8L79n33Q9J00L00k94N3M7k0k25J93J68k56j33K06K46j22l53L31k20
7908a15qo8N6L72m03R8K06O5m61M26l40M7k4Q5J74l21O1P3Q8J5j8M5j1k05L98
7933B35l2k26r4J35K8j01L5J0J3k8P4O9l04R6n9K93j43R0M1k14j02J35K08j66
7957gk7R2N8J26l98K58J14j09j15o6J82j56l7L61r4n02K40J73M1j55k6N6l5j29
$$ plain form
7981 -155 -77 57 -200 145 200 56 178 13 107 129 -42 -17 -70 -73 -29 168 31 -303 -74 224 146 -172 19
8004 19 -85 -3 -170 -161 186 -152 -130 46 -38 -254 14 -51 215 -166 -130 149 123 -125 63 -6 -7 98 -27 -132
8028 -132 -174 -3 108 74 10 -19 3 83 -117 114 -53 173 -48 307 39 26 200 156 296 -23 -102 13 -104
8051 -104 -50 -68 181 276 -186 78 4 222 113 281 -10 -173 -14 32 88 -97 -32 173 -62 -225 37 220
8073 220 -221 -109 -47 -85 31 -165 136 -9 -230 -16 59 -269 -73 246 110 -72 7 142 -212 -98 -102 -104 54
8096 54 -29 55 -71 86 -102 34 264 -24 95 251 -37 -168 191 302 -140 -17 -168 162 -16 -51 178
8117 178 132 104 -16 -17 218 65 -6 211 189 -191 90 243 -89 -160 -13 77 -40 -216 90 -25 -126 73 53
8140 53 -272 -234 53 161 -98 -179 168 -68 -146 -123 164 0 33 -84 -11 -63 -180 37 101 -33 117 -84 32
$$ packed form
7981a55P8J34k57L45N5j44J22j65R4K2j71K5n3lM4J97j37l34K29K98p8l18J91
8004A9j04Q2j67RL47l38K2J76q4k16K68o5K66l81L6K79k6k48J88o9jJ05j25j05
8028a32m2J71J11l4o4k9K2Q0k00K31j67K26k21L55k68j3J74m4J40l19p9J15j17
8051a04N4j8K49R5m62K64p4K18j09J68k91j63J59M6N6j85O5K05k35j63K62J83
8073B20m41J12O2l8J16j96L01j45k21K14P5l28J96L19j36j82P9J35l54J14mkJ58
8096E4q3Q4j26J57j88J36K30k88J19J56k88j31L59J11m42J23j51L30j78l5K29
8117A78m6k8j20jK35j53p1K17k2l80K81J53l32p1J47R0j17j76L06j15j01J99k0
8140E3l25L8K87J08k59q1L47k36p8K3K87j64L3j17P3n2j17K17O4j34J50k01J16
$$ plain form
8163 32 -77 -130 -4 -49 -194 124 -54 91 72 -66 290 -159 -94 162 63 -72 -52 89 62 165 -33 54 89
8186 89 0 236 164 5 39
$$ packed form
8163C2j09n3J26m5j45L18j78J45j9j38L56m49O5K56r9j35K0J41k7J03j98Q7L5
8186H9q9K36p2j59L4
8191C9
$$ Imaginary data points
##PAGE= N=2
##DATA TABLE= (X++(I..I)), XYDATA
$$ plain form
0 0 0 0 0 0 0 0 0 0 0 0 -8 8 -8 8 -16 16 -24 24 -32 40 -48 56 -64 72 -88 103 -119 136 -155 178 -203 233
32 233 -264 298 -337 379 -425 475 -530 591 -659 731 -810 894 -989 1092 -1204 1328 -1464
49 -1464 1610 -1773 1955 -2155 2378 -2626 2910 -3235 3607 -4040 4552 -5170 5930 -6893 8154
64 8154 -9879 12393 -16384 23676 -41118 165073 76138 -216653 182026 -44982 -40039 68647
76 68647 -116395 83321 63664 -115977 82807 6928 -26525 29862 -36172 40748 15178
87 15178 -56560 52110 4321 -47008 33066 22811 -35477 -701 21468 4988 -16042 -24880
99 -24880 38468 25329 -73238 5088 49253 -29150 -32875 -3075 46799 -7833 -69708 41739
111 41739 23589 -36380 -5927 -10888 39299 -22172 -69319 57002 1269 -45874 23984 6196
$$ packed form
0@%%%%%%%%%%qJ6j6J6k4L2m0M8n6P2q8J04j20J36j60J91k22K55k91L33l81M36
32B33m97N62o35P16q04R00j005J121j250J390j541J704j883K081k296K532k792
49a464L074l383L728m110M533n004N536o145O842p647Q592r722J1100j2823J5047
64H154j8033K2272k8777M0060o4794K06191q8935k92791L98679k27008M943J08686
76F8647j85042J99716j9657j79641J98784p5879l3453N6387o6034P6920k5570
87A5178p1738J08670m7789n1329Q0074j0255n8288L4776K2169j6480k1030q838
99b4880O3348j3139r8567P8326M4165p8403l725K9800M9874n4632o1875J11447
111D1739j8150n9969L0453m961N0187o1471m7147J26321n5733m7143O9858j7788
$$ plain form
123 6196 13081 -27715 -15702 43577 -46612 -11512 41322 -24296 4784 -6382 6824 25642
135 25642 -53246 21615 45266 -42413 4597 12393 11998 2113 -51351 45532 36396 -64124 24275
148 24275 40476 -12740 -1182 -15869 29804 18995 -57740 23542 49023 -36597 -2359 25962
160 25962 1904 1842 -22369 16969 35241 -46342 4528 44857 -41218 -2911 18553 -15309 19854
173 19854 -24701 1355 50760 -57218 -6310 52798 -45858 -9283 11574 -5407 19296 -43950
185 -43950 5754 47349 -54407 -11713 32809 -8346 -6979 -22530 17392 16697 -53534 1077
197 1077 31446 -12730 -12414 3969 25770 -11221 -35077 21795 7703 -23181 1606 12048 9981
210 9981 -17166 -7901 30285 -7781 -21050 22968 13753 -16029 -8413 16175 12780 -19575 -6787
$$ packed form
123F196O885m0796J2013N9279r0189L5100N2834o5618K9080j1166J3206J8818
135B5642p8888P4861K3651q7679M7010P796l95r885n3464R6883r136j00520Q8399
148B4275J6201n3216J1558j4687M5673j0809p6735Q1282K5481q5620L4238K8321
160B5962k4058o2k4211L9338J8272q1583N0870M0329q6075L8307K1464l3862L5163
173A9854m4555K6056M9405j07978N0908N9108r8656L6575K0857j6981K4703o3246
185d3950M9704M1595j01756M2694M4522m1155J367j5551L9922o95p0231N4611
197A077L0369m4176L16J6383K1801l6991k3856N6872j4092l0884K4787J0442k067
210I981k7147R265L8186l8066j3269M4018r215k9782P616K4588l395l2355J2788
$$ plain form
223 -6787 34440 4622 -29005 16651 27251 -11801 -13220 6535 24955 -7222 -30711 32408
235 32408 21500 -30374 2757 16901 7540 -14341 -13126 38493 -3208 -29560 21996 -1399
247 -1399 -11578 -6686 -6104 31968 -15878 -18281 41324 -19791 -25794 13512 -8492 4686 -18388
260 -18388 -6307 39900 -32115 -23198 40502 -13760 -19360 2677 -1172 14737 -28801 -16604 43779
273 43779 -17308 -31444 27854 3067 -11815 -6648 -3494 25672 -16033 -27233 35637 -742
285 -742 -27829 16885 8951 -541 -7549 -5623 26518 -9803 -18249 31537 4273 -16374 3226
298 3226 7834 7050 -18017 1604 35478 -8912 -13685 19743 8724 -9480 -17065 14922 23311
311 23311 -25052 -2940 30385 -4412 -15824 -94 17209 4874 -25386 9035 23129 -19422
$$ packed form
223f787M1227k9818l3627M5656J0600l9052j419J9755J8420l2177k3489O3119
235C2408j0908n1874L3131J4144r361k1881J215N1619m1701k6352N1556k3395
247a399j0179M892N82L8072m7846k403N9605o1115o003L9306k2004J3178k3074
260a8388J2081M6207p2015Q917O3700n4262n600K2037l849J5909m3538J2197O0383
273D3779o1087j4136N9298k4787j4882N167L154K9166m1705j1200O2870l6379
285g42k7087M4714p934r492p008J926L2141l6321q446M9786k7264k0647J9600
298C226M608p84k5067J9621L3874m4390m773L3428j1019j8204p585L1987Q389
311B3311m8363K2112L3325l4797j1412J5730J7303j2335l0260L4421J4094m2551
$$ plain form
323 -19422 -12678 11205 6274 -10123 -13271 18711 9260 -25173 3050 15059 -13404 -15035 1643
336 1643 11899 -10575 -18034 19148 5141 -23659 -52 9737 -767 -15389 -9014 24486 -6654
349 -6654 -30454 19051 10950 -20055 -4337 5861 14910 -9995 -21637 29554 4513 -32986 14337
362 14337 12556 -7959 -710 -5964 20470 1751 -29637 26792 15133 -26750 14312 10471 -4117
375 -4117 11 -14268 20662 9611 -28484 26551 20606 -23287 4345 6388 2273 -3492 -16678
388 -16678 24556 12426 -29668 11910 19806 -13082 -7887 4031 14438 -4801 -21008 15177
400 15177 12140 -21166 -5591 14554 2798 -16732 -5022 18837 -4508 -19850 8139 7733 -12274
413 -12274 -12190 4956 11276 -15540 -10143 20060 -5050 -19402 4536 7685 -2294 -14435 1533
$$ packed form
323a9422O744K3883m931j6397l148L1982r451l4433K8223J2009k8463j631J6678
336A643J0256k2474p459L7182j4007k8800K3607R789j0504j4622O375L3500l1140
349f654k3800M9505q101l1005J5718J0198R049k4905j1642N1191k5041l7499M7323
362A4337j781k0515P249n254K6434j8719l1388N6429j1659m1883M1062l841j4588
375d117M128j4279L4930j1051l8095N5035n945m3893K7632K043m115n765j3186
388a6678M1234j2130m2094M1578P896l2888N195J1918J0407j9239j6207L6185
400A5177l037l3306J5575K0145j1756j9530J1710K3859k3345j5342K7989m06k0007
413a2274Q4J7146O320k6816N397L0203k5110j4352K3938L149r979j2141J5968
$$ plain form
426 1533 19028 -18278 -17183 19762 2318 -12083 -712 12237 10119 -21552 -4552 23320 -10776
439 -10776 -13742 11689 10943 -26 -13746 9600 20014 -19394 -3438 21287 -3807 -6184 324
452 324 10460 8059 -18927 8858 22863 -18369 -1309 17150 -1636 -1916 -8604 10574 14785
465 14785 -26697 4807 27225 -17962 -6484 10260 2493 1112 -18739 8240 22023 -25924
477 -25924 -5298 20942 -9548 -10320 -2923 7581 7462 -20573 3139 19271 -18512 -11617 10352
490 10352 -1079 -9972 -7103 9399 5153 -18141 -923 14379 -9182 -13918 6527 11412 -9624
503 -9624 -13563 12725 7318 -18171 -3274 14564 3485 -12019 -2076 18534 -2694 -19890 10079
516 10079 11982 -9362 -4653 8008 13241 -7689 -10620 20640 3685 -16468 8424 10627 -2006
$$ packed form
426A533J7495l7306J095L6945j7444j4401J1371J2949k118l1671J7000K7872l4096
439a0776k966K5431p46j0969j3720K3346J0414l9408J5956K4725k5094k377O508
452C24J0136k401k6986K7785J4005m1232J7060J8459j8786k80o688J9178M211
465A4785m1482L1504K2418m5187J1478J6744p767j381j9851K6979J3783m7947
477b5924K0626K6240l0490p72P397J0504j19k8035K3712J6132l7783O895K1969
490A0352j1431q893K869J6502m246k3294J7218J5302k3561m736K0445M885k1036
503i624l939K6288n407k5489J4897J7838j1079j5504R943K0610k1228j7196K9969
516A0079J903k1344M709J2661N233k0930k931L1260j6955k0153K4892K203j2633
$$ plain form
529 -2006 -6676 1727 17243 -5877 -12960 18479 6616 -13069 1183 10663 5404 -12641 -3327
542 -3327 19781 -5266 -15418 12310 8893 -7436 -9278 5337 12491 -14486 -8253 19128 -2876
555 -2876 -14400 839 4270 -725 -14655 1040 19320 -12521 -12375 14503 -2081 -13833 -5512
568 -5512 4922 6506 -15013 -3892 20497 -8022 -16357 10086 4709 -9108 -8368 3499 11554
581 11554 -10961 -10322 18786 1033 -16992 5693 8678 -2212 -7007 1418 15383 -6706 -12873
594 -12873 15857 5717 -10838 760 10784 6222 -11766 -1552 18914 -3896 -11298 10781
606 10781 10741 -5756 -10241 10270 10815 -12070 -1359 15329 3236 -9935 -2415 12485 -1031
619 -1031 -14948 7087 12281 -8258 -7071 8575 6020 -10620 -6427 10892 1659 -14323 167
$$ packed form
529b006m670Q403J5516k3120p083L1439j1863j9685J4252R480n259j8045R314
542c327K3108k5047j0152K7728l417j6329j842J4615P154k6977O233K7381k2004
555b876j1524J5239L431m995j3930J5695J8280l1841J46K6878j6584j1752Q321
568e512J0434J584k1519J1121K4389k8519q335K6443n377j3817P40J1867Q055
581A1554k2515O39K9108j7753j8025K2685K985j0890m795Q425J3965k2089o167
594a2873K8730j0140j6555J1598J0024m562j7988J0214K0466k2810p402K2079
606A0781m0j6497m485K0511N45k2885J0711J6688j2093j3171P520J4900j3516
619a031j3917K2035N194k0539J187J5646k555j6640M193J7319r233j5982J4490
$$ plain form
632 167 12576 -6329 -12311 5514 7299 -8003 -11180 7593 9154 -15668 -6322 12828 -3123
645 -3123 -12590 -1766 10112 369 -16047 5335 11857 -12521 -6678 6187 5339 -6370 -10059 14374
659 14374 3654 -17643 6000 8882 -5104 -4125 727 13794 -3378 -14422 15826 5863 -15395
672 -15395 3554 9504 3050 -4846 -3258 16148 738 -16712 10810 12549 -9719 -2182 8834
685 8834 6199 -5676 -8277 12202 7320 -14511 4097 14500 -6017 -7757 3324 6822 -3931
698 -3931 -10949 9633 8965 -13276 -2078 10206 -1265 -10433 -2154 10302 -3482 -13995 5997
711 5997 8121 -9106 -7929 5443 6734 -12447 -7439 13532 -1656 -12709 1182 6219 -1454
724 -1454 -12157 1300 13393 -9568 -9392 10748 1363 -8836 -4218 7920 6435 -12076 -98
$$ packed form
632A67J2409j8905n982J7825J785j5302l177J8773J561k4822R346J9150j5951
645c123r467J0824J1878r743j6416K1382O522k4378N843J2865q48j1709l689K4433
659A4374j0720k1297K3643K882j3986R79M852J3067j7172j1044L0248r963k1258
672a5395J8949N950o454p896J588J9406j5410j7450K7522J739k2268P537J1016
685H834k635j1875k601K0479m882k1831J8608J0403k0517j740J1081L498j0753
698c931p018K0582o68k2241J1198J2284j1471r168Q279J2456j3784j0513J9992
711E997K124j7227J177J3372J291j9181N008K0971j5188j1053J3891N037p673
724a454j0703J3457J2093k2961J76K0140r385j0199M618J2138j485j8511J1978
$$ plain form
737 -98 13287 -6740 -8857 5542 7778 -1463 -6859 8741 9663 -11703 -3647 12449 886 -8175
751 -8175 2308 12332 843 -10147 6466 11914 -8549 -6129 10105 4129 -5895 -2922 9468
764 9468 7564 -12144 -360 15000 -6088 -9022 6748 5224 -2027 -8796 4743 10902 -13822
777 -13822 -4176 13727 -4146 -7967 -45 4461 1125 -13117 2485 12445 -11099 -7477 8036
790 8036 212 -8852 -5774 7651 3566 -11601 -626 10137 -4703 -11849 2448 8410 -7539
803 -7539 -7939 9514 5518 -9141 -4245 8611 1509 -10844 73 11159 -2219 -8394 5892
816 5892 7943 -5156 -5653 6328 7757 -6339 -5155 12783 3195 -12350 4393 10581 -2792 -4155
830 -4155 3528 10173 -2926 -10091 11093 6607 -10598 1488 8450 2350 -6291 -3225 11845 -1003
$$ packed form
737i8J3385k0027k117J4399K236r241n396J5600R22k1366Q056J6096j1563r061
751h175J0483J0024j1489j0990J6613N448k0463K420J6234n976j0024K973J2390
764I468j904j9708J1784J5360k1088k934J5770j524p251o769J3539O159k4724
777a3822R646J7903j7873l821P922M506l336j4242J5602R960k3544L622J5513
790H036p824r064L078J3425m085j5167J0975J0763j4840p146J4297N962j5949
803g539m00J7453l996j4659M896J2856p102j2353J0917J1086j3378o175J4286
816E892K051j3099m97J1981J429j4096J184J7938r588j5545J6743O188j3373j363
830d155P683O645j3099p165K1184m486j7205J2086O962o100q641L066J5070j2848
$$ plain form
844 -1003 -12283 7867 7633 -6940 -3925 5002 5675 -7733 -6845 10116 853 -10838 1582 7860
858 7860 -2285 -10097 1375 8147 -8261 -8228 8681 2332 -9027 -3576 4951 1510 -10639 -2259
872 -2259 11639 -4138 -10383 5191 4068 -6074 -6823 3642 7884 -8647 -5440 12708 -207
885 -207 -10384 2613 6110 -1408 -6516 1902 10292 -4327 -7018 9296 4992 -7780 -1955 8915
899 8915 3678 -7955 986 11262 -2516 -7616 5565 8048 -3414 -5525 8358 6707 -8948
912 -8948 -2345 9544 1552 -5930 616 9204 494 -10690 4018 8545 -7575 -3893 6996 3931
926 3931 -5201 -5962 7195 2021 -12211 1041 8806 -4343 -6996 2735 5959 -5470 -9354 6029
940 6029 3960 -10199 -3045 7284 820 -8874 -2198 8240 -2474 -10421 3294 7608 -6395 -6222
$$ packed form
844a003j1280K0150k34j4573L015Q927O73j3408Q88J6961r263j1691J2420O278
858G860j0145p812J1472O772j6408L3J6909o349j1359N451Q527l441j2149Q380
872b259J3898j5777o245J5574j123j0142p49J0465M242j6531L207J8148j2915
885b07j0177J2997L497p518n108Q418Q390j4619k691J6314m304j2772N825J0870
899H915n237j1633Q941J0276j3778n100J3181K483j1462k111J3883j651j5655
912h948O603J1889p992p482O546Q588q710j1184J4708M527j6120L682J0889l065
926C931r132p61J3157n174j4232J3252P765j3149k653R731L224j1429l884J5383
940F029k069j4159P154J0329o464r694O676J0438j0714p947J3715M314j4003J73
$$ plain form
954 -6222 5239 4122 -7293 -4515 8613 2114 -8944 1474 7356 -3164 -6687 3307 7976 -3042
968 -3042 -6531 8749 5190 -9026 -1137 8264 1928 -5663 344 10794 463 -9460 5423 8349
982 8349 -5917 -3931 7085 5612 -4432 -3300 8435 3268 -8926 729 8765 -2012 -5764 4158
996 4158 6586 -4324 -6258 5895 4569 -8286 -2809 8261 -14 -8941 112 7091 -3321 -8497
1010 -8497 3157 6419 -5108 -7658 5178 4506 -9400 -4183 7383 613 -8282 -1009 6636 -2103
1024 -2103 -8816 1613 6133 -5251 -5881 6010 3484 -6962 -3168 6205 1121 -7658 310 9195
1038 9195 -2299 -7393 5560 5238 -5281 -3849 5761 6668 -5747 -3623 10312 1003 -7945 1908
1052 1908 7934 1368 -6276 3330 9612 -5331 -5372 7629 3205 -3922 -891 6514 3845 -7047 59
$$ packed form
954f222J1461j117j1415K778J3128o499j1058J0418N882j0520l523R994M669j1018
968c042l489J5280l559j4216P889R401o336p591O007J0450j0331r923J4883K926
982H349j4266J986J1016j473j0044J132J1735n167j2194R655Q036j0777l752R922
996D158K428j0910j934J2153j326j2855N477J1070q275q927R053O979j0412n176
1010h497J1654L262j1527k550J2836o72j3906N217J1566o770q895P273P645q739
1024b103o713J0429M520j1384o30J1891k526j0446L794R373n084q779P968Q885
1038I195j1494n094J2953l22j0519J432R610R07j2415K124J3935r309q948R853
1052A908O026o566p644R606O282j4943m1J3001m424p127L031P405k669j0892P106
$$ plain form
1067 59 8415 -3167 -6502 4496 5800 -3571 -4863 5619 4630 -8280 -3534 8123 -379 -8061
1081 -8061 1106 6168 -1608 -7756 508 7391 -5711 -7643 6809 2392 -7736 -3026 4259 1017
1095 1017 -7714 -1311 7772 -2482 -7492 2287 3913 -4919 -5761 5590 4381 -7193 -1973 6252
1109 6252 -81 -7400 -714 8227 -1590 -7282 5653 6005 -4787 -3522 3980 5003 -4814 -3967 9898
1124 9898 2781 -7767 3157 7051 -1910 -4036 1988 7586 -1727 -5660 7894 4790 -7207 -164
1138 -164 6677 1027 -4099 -367 8141 -952 -8395 4683 5731 -5900 -2761 4857 3880 -5003 -4565
1153 -4565 7045 750 -8759 952 6185 -2487 -6028 1455 5496 -5125 -6940 5443 2730 -7849
1167 -7849 -1896 5170 -267 -6973 -1665 6107 -2292 -7142 3388 4559 -5359 -4679 3456 3600 -6195
$$ packed form
1067E9Q356j1582l335J0998J304r371j292J0482r89j2910M746J1657q502p682
1081h061R167N062p776o148Q264O883j3102j932J4452m417j0128M710P285l242
1095A017q731O403R083j0254n010R779J626q832q42J1351j209j1574N220Q225
1109F252o333p319O686Q941r817n692J2935L52j0792J265P502J023r817Q47J3865
1124I898p117j0548J0924L894q961k126O024N598r313l933J3554l104j1997P043
1138a64O841n650n126L732Q508r093p443J3078J048j1631L139P618r77q883M38
1153d565J1610o295r509R711N233q672l541P483M041j0621j815J2383k713j0579
1167g849N953P066n437o706N308P772q399m850J0530J171r918O80Q135J44r795
$$ plain form
1182 -6195 -3206 7473 720 -7363 1046 6000 -1972 -6319 3124 6553 -4151 -3513 6148 3645 -4847
1197 -4847 -2346 6999 2525 -6398 2122 8144 -1979 -4287 3587 5156 -2580 -4560 5993 5593 -5812
1212 -5812 -1082 7127 532 -5732 521 6732 -275 -6254 3495 5980 -5421 -4123 5762 2190 -4946
1227 -4946 -2251 5017 1541 -7963 -690 6441 -3109 -5642 2674 3780 -3715 -6196 3822 3287 -7901
1242 -7901 -2653 6137 -869 -5812 -616 4922 -1582 -7833 2348 5045 -5452 -3593 4677 2436
1256 2436 -4924 -3264 5512 1337 -7090 1105 7082 -1986 -4802 2839 4985 -3169 -4522 5493 4248
1271 4248 -5474 -827 6344 1022 -5142 1010 7094 -307 -5536 3787 5495 -3828 -3523 5397 4440
1286 4440 -4502 -1080 6910 844 -5943 819 5546 -1223 -4888 3050 5914 -3426 -4564 4915 2338
$$ packed form
1182f195K989J0679o753q083Q409M954p972m347R443L429j0704O38R661k503q492
1197d847K501R345m474q923Q520O022j0123k308P874J569p736j980J0553m00j1405
1212e812M730Q209o595o264O253O211p007n979R749K485j1401J298R885l572p136
1227d946K695P268l476r504P273P131r550k533Q316J106p495k481J0018n35j1188
1242g901N248Q790p006m943N196N538o504o251J0181K697j0497J859Q270k241
1256B436p360J660Q776m175q427Q195N977r068k816P641K146q154j353J0015j245
1271D248r722M647P171n322o164O152O084p401n229R323J708r323L05Q920r57
1286D440q942L422P990o066o787O762M727o769l665P938K864r340j138R479k577
$$ plain form
1301 2338 -6042 -2325 5069 948 -5875 -82 5797 -2593 -6420 2390 3346 -4205 -4092 3315 3275 -5988
1317 -5988 -3541 5852 -888 -6567 844 4286 -1679 -6141 1516 4711 -5167 -4277 4908 1948 -4447
1332 -4447 -2421 4641 1481 -6930 542 6681 -2222 -4166 3243 4197 -2935 -3927 4477 4028 -5007 -843
1348 -843 6865 782 -4685 885 5802 -279 -4698 3453 6547 -3142 -3605 6031 1992 -4566 -291
1363 -291 5104 2015 -4465 -78 6452 -1633 -5692 3681 3888 -3391 -3358 3879 3474 -5287 -2721 5628
1379 5628 -122 -6347 859 5282 -2212 -5026 2076 3366 -3811 -4973 3202 3174 -5875 -2271 5098
1394 5098 -1011 -5918 9 3516 -1492 -5603 1832 4703 -4865 -4301 4560 1736 -4984 -1362 5173
1409 5173 658 -5791 -66 5644 -1884 -5138 3993 4804 -3274 -2575 4239 2564 -3861 -1867 5834
$$ packed form
1301B338q380L717P394m121o823N793N879q390l827Q810R56p551J13P407m0r263
1317e988K447R393o740n679P411L442n965m462P657L195r878Q90R185k960o395
1332d447K026P062l160q411P472O139q903j944P409R54p132r92Q404m49r035M164
1348h43P708o083n467N570M917o081m419Q151L094r689m63R636m039o558M275
1363b91N395l089o480M387O530q085m059R373K07p279L3P237m05q761K566Q349
1379E628n750o225P206M423p494k814P102J290p177j162Q175k8r049L604P369
1394E098o109m907N927L507n008m111P435K871r568N64Q861k824o720L622O535
1409E173m515o449N725N710p528l254R131Q11q078O99O814j675o425J994P701
$$ plain form
1424 5834 1809 -4895 1569 5705 -992 -3881 2569 4755 -2549 -3123 5611 3008 -4701 279 5146
1439 5146 178 -4092 374 5801 -956 -5074 3741 4293 -4580 -2665 3891 2571 -3387 -3004 5406
1454 5406 615 -7099 1004 4731 -2721 -3370 1215 3080 -2511 -6036 3327 2779 -6349 -923 4891
1469 4891 -1081 -4659 -377 3421 -1891 -5891 2293 3965 -4613 -2764 4075 1167 -4470 -2414 4490
1484 4490 1195 -5964 967 5999 -1884 -4396 2758 3884 -2571 -2767 4031 3091 -3596 -1205 4847
1499 4847 1439 -4589 968 5452 -1581 -3371 3518 3464 -2408 -2850 4319 3721 -4503 -79 6106 -431
1515 -431 -4098 731 4354 234 -4757 2697 5782 -4255 -3429 4162 1140 -3882 -2067 3763 1692
1530 1692 -5555 -441 4722 -2877 -4291 1869 2217 -2353 -3736 2843 2255 -5848 -1504 4365 -1091
$$ packed form
1424E834m025o704O464M136o697k889O450K186p304n74Q734k603p709M980M867
1439E146m968m270M466N427o757m118Q815N52q873J915O556j320n958L83Q410
1454E406m791p714Q103L727p452o49M585J865n591l525R363n48r128N426N814
1469D891n972l578M282L798n312m000Q184J672q578J849O839k908n637K056O904
1484D490l295p159O931N032p883k512P154J126o455j96O798r40o687K391O052
1499D847l408o028N557M484p033j790O889n4n872m42P169n98q224M424O185o537
1515d31l667M829L623m120m991P454L085j0037Q26P591l022n022J815N830k071
1530A692p247N114N163p599j414O160L48m570j383O579n88q103M344N869n456
$$ plain form
1545 -1091 -4102 339 3664 -1226 -5914 1722 4053 -4848 -2932 3707 1697 -3662 -2208 4145 1184
1560 1184 -5733 388 5253 -1919 -3390 2775 3345 -2203 -2867 3543 3213 -3808 -762 5602 179 -3830
1576 -3830 1567 4297 -810 -3390 2895 4419 -2908 -2454 4200 2709 -4147 -925 5685 593 -4526
1591 -4526 1323 3835 -878 -3982 1747 5015 -3334 -2958 4776 966 -3748 -1258 2620 1260 -4889
1606 -4889 -81 5276 -3144 -4040 2428 1896 -3144 -3200 2597 2235 -4968 -1697 4239 -749 -5439 423
1622 423 3425 -1924 -4031 1578 3318 -3309 -4076 3520 1670 -4660 -831 3932 672 -4330 -6
1637 -6 4614 -1998 -3867 3417 2748 -2137 -2322 2828 3150 -3885 -1030 5652 149 -3055 1449 3658
1653 3658 -178 -4052 2321 4792 -2956 -1977 4836 1877 -3268 -565 4070 852 -3700 576 4522
$$ packed form
1545a091l011M441L325m890m688P636K331q901J916O639k010n359J454O353k961
1560A184o917O121M865p172j471O165N70n548o64O410l30p021L046O364n423m009
1576c830N397K730n107k580O285J524p327M54O654j491o856L222O610n092n119
1591d526N849K512m713l104N729L268q349L76P734l810m714K490L878j360o149
1606d889M808N357q420q96O468n32n040n6N797l62p203L271N936m988m690N862
1622D23L002n349k107N609J740o627p67P596j850o330L829M763l260n002M324
1637fM620o612j869P284o69m885j85N150L22p035K855O682n503l204M504K209
1653C658l836l874O373K471p748R79O813k959n145K703M635l218m552M276L946
$$ plain form
1668 4522 -953 -4040 2546 3431 -3170 -2287 3261 1598 -3065 -1902 3500 782 -5431 376 4094
1683 4094 -2466 -3501 1832 2432 -2818 -3919 2714 2020 -4929 -1488 4120 -982 -4752 555 2587
1698 2587 -1913 -3483 1079 3145 -2891 -3682 3680 1210 -4512 -825 3323 195 -3556 -365 4863
1713 4863 -992 -4679 3303 2907 -3344 -1272 2955 2344 -2861 -1503 4785 617 -3913 2014 4281
1728 4281 -815 -2771 2001 4093 -2404 -2409 4362 2355 -3272 -329 4218 481 -3704 525 4154 -940
1744 -940 -3378 2597 3130 -3137 -2122 2882 1446 -3124 -1394 3883 473 -4818 721 3288 -2577
1759 -2577 -3099 1414 2328 -2119 -3584 2969 1868 -4994 -1071 3225 -814 -3752 -274 3152 -1323
$$ packed form
1668D522n475l087O586Q85o601Q83N548j663m663J163N402k718o213N807L718
1683D094o560j035N333O00n250j101O633o94o949L441N608n102l770N307K032
1698B587m500j570M562K066o036p91P362k470n722L687M148l128l751L191N228
1713D863n855l687P982l96o251K072M227o11n205J358O288m168m530N927K267
1728D281n096j956M772K092o497nO771k007n627K943M547l737m185M229L629n094
1744i40k438N975N33o267J015N004j436m570J730N277l410n291N539K567n865
1759b577n22M513R14m447j465O553j101o862L923M296m039k938L478L426m475
$$ [...]
8191B20
##END NTUPLES=NMR FID
##END=
