##TITLE=1H_SAV-32-singlet-bat5
 CDCl3, 8 sc, 
 30.10.2020
##JCAMPDX= 6.0         $$ Bruker NMR JCAMP-DX V2.0
##DATA TYPE= NMR FID
##DATA CLASS= NTUPLES
##ORIGIN= UXNMR, Bruker Analytische Messtechnik GmbH
##OWNER= root
$$ XWIN-NMR		Version 3.5
$$ Fri Oct 30 10:15:34 2020 Russian Standard Time (UT+4h)  she@DPX200
##.OBSERVE FREQUENCY= 200.1315066352
##.OBSERVE NUCLEUS= ^1H
##.DELAY= (6, 6)
##.ACQUISITION MODE= SIMULTANEOUS
##.ACQUISITION SCHEME= undefined
##.AVERAGES= 8
##.DIGITISER RES= 18
##SPECTROMETER/DATA SYSTEM= spect
##.PULSE SEQUENCE= zg30
##.SOLVENT NAME= CDCl3
##.SHIFT REFERENCE= (INTERNAL, CDCl3, 0, 15.7039)
##AUDIT TRAIL= $$ (NUMBER, WHEN, WHO, WHERE, WHAT)
$$ ##TITLE= Audit trail, XWIN-NMR		Version 3.5
$$ ##JCAMPDX= 5.01
$$ ##ORIGIN= Bruker BioSpin GmbH
$$ ##OWNER= she
$$ F:/spectra/data/she/nmr/H-F/1/audita.txt
$$ ##AUDIT TRAIL=  $$ (NUMBER, WHEN, WHO, WHERE, WHAT)
(   1,<2020-10-30 10:14:29.51 +0400>,<she>,<DPX200>,
      <created by zg, POWCHK disabled, PULCHK disabled
       configuration hash MD5:
       00 E9 B6 7A A2 85 ED C7 34 08 36 98 17 FE 4E 26
       data hash MD5: 16K
       38 75 A3 32 DD FF 3D 07 B6 D3 48 56 31 A0 72 F6>)
$$ ##END=
$$ 
$$ hash MD5
$$ ED C8 C2 FA 99 34 97 DD 98 78 74 71 82 E2 84 A1
##$RELAX= 
##$RELAX= 
##$RELAX= 
##$RELAX= 
##$RELAX= 
##$RELAX= 
$$ Bruker specific parameters
$$ --------------------------
##$DU= <F:/spectra>
##$EXPNO= 1
##$NAME= <H-F>
##$PROCNO= 1
##$TYPE= <nmr>
##$USER= <she>
##$AMP= (0..31)
100 100 100 100 100 100 100 100 100 100 100 100 100 100 100 100 100 100 
100 100 100 100 100 100 100 100 100 100 100 100 100 100 
##$AQSEQ= 0
##$AQ_mod= 1
##$AUNM= <au_zg>
##$AUTOPOS= <>
##$BF1= 200.13
##$BF2= 200.13
##$BF3= 200.13
##$BF4= 200.13
##$BF5= 200.13
##$BF6= 200.13
##$BF7= 200.13
##$BF8= 200.13
##$BYTORDA= 1
##$CFDGTYP= 0
##$CFRGTYP= 5
##$CHEMSTR= <none>
##$CNST= (0..31)
1 1 145 1 1 1 1 1 1 1 1 1 1 1 1 1 1 1 1 1 1 1 1 1 1 1 1 1 1 1 1 1 
##$CPDPRG= <>
##$CPDPRG1= <>
##$CPDPRG2= <>
##$CPDPRG3= <>
##$CPDPRG4= <mlev>
##$CPDPRG5= <mlev>
##$CPDPRG6= <mlev>
##$CPDPRG7= <mlev>
##$CPDPRG8= <mlev>
##$CPDPRGB= <>
##$CPDPRGT= <>
##$D= (0..31)
0 1.2 0 0 0 0 0 0 0 0.06 0 0.03 0 0 0 0 0.0002 0 0 0 0 0 0 0 0 0 0 0 0 
0 0 0 
##$DATE= 1604038468
##$DBL= (0..7)
120 120 120 120 120 120 120 120 
##$DBP= (0..7)
150 150 150 150 150 150 150 150 
##$DBP07= 0
##$DBPNAM0= <>
##$DBPNAM1= <>
##$DBPNAM2= <>
##$DBPNAM3= <>
##$DBPNAM4= <>
##$DBPNAM5= <>
##$DBPNAM6= <>
##$DBPNAM7= <>
##$DBPOAL= (0..7)
0.5 0.5 0.5 0.5 0.5 0.5 0.5 0.5 
##$DBPOFFS= (0..7)
0 0 0 0 0 0 0 0 
##$DE= 6
##$DECBNUC= <off>
##$DECIM= 32
##$DECNUC= <off>
##$DECSTAT= 4
##$DIGMOD= 1
##$DIGTYP= 9
##$DL= (0..7)
0 120 120 120 120 120 120 120 
##$DP= (0..7)
150 150 150 150 150 150 150 150 
##$DP07= 0
##$DPNAME0= <>
##$DPNAME1= <>
##$DPNAME2= <>
##$DPNAME3= <>
##$DPNAME4= <>
##$DPNAME5= <>
##$DPNAME6= <>
##$DPNAME7= <>
##$DPOAL= (0..7)
0.5 0.5 0.5 0.5 0.5 0.5 0.5 0.5 
##$DPOFFS= (0..7)
0 0 0 0 0 0 0 0 
##$DQDMODE= 0
##$DR= 18
##$DS= 0
$$ [...]
##$SUBNAM2= <"">
##$SUBNAM3= <"">
##$SUBNAM4= <"">
##$SUBNAM5= <"">
##$SUBNAM6= <"">
##$SUBNAM7= <"">
##$SUBNAM8= <"">
##$SUBNAM9= <"">
##$SW= 16.880792210976
##$SWIBOX= (0..15)
0 0 2 0 0 0 0 0 0 0 0 0 0 0 0 0 
##$SW_h= 3378.37837837838
##$TD= 16384
##$TD0= 1
##$TE= 0
##$TE2= 300
##$TE3= 300
##$TEG= 300
##$TL= (0..7)
0 120 120 120 120 120 120 120 
##$TP= (0..7)
150 150 150 150 150 150 150 150 
##$TP07= 0
##$TPNAME0= <>
##$TPNAME1= <>
##$TPNAME2= <>
##$TPNAME3= <>
##$TPNAME4= <>
##$TPNAME5= <>
##$TPNAME6= <>
##$TPNAME7= <>
##$TPOAL= (0..7)
0.5 0.5 0.5 0.5 0.5 0.5 0.5 0.5 
##$TPOFFS= (0..7)
0 0 0 0 0 0 0 0 
##$TUNHIN= 0
##$TUNHOUT= 0
##$TUNXOUT= 0
##$USERA1= <user>
##$USERA2= <user>
##$USERA3= <user>
##$USERA4= <user>
##$USERA5= <user>
##$V9= 5
##$VALIST= <valist>
##$VCLIST= <CCCCCCCCCCCCCCC>
##$VD= 0
##$VDLIST= <DDDDDDDDDDDDDDD>
##$VPLIST= <PPPPPPPPPPPPPPP>
##$VTLIST= <TTTTTTTTTTTTTTT>
##$WBST= 1024
##$WBSW= 4
##$XGAIN= (0..3)
0 0 0 0 
##$XL= 0
##$YL= 0
##$YMAX_a= 299091
##$YMIN_a= -247598
##$ZGOPTNS= <>
##$ZL1= 120
##$ZL2= 120
##$ZL3= 120
##$ZL4= 120
##$ABSF1= 10
##$ABSF2= 0
##$ABSG= 5
##$ABSL= 3
##$ALPHA= 0
##$AQORDER= 0
##$ASSFAC= 0
##$ASSFACI= 0
##$ASSFACX= 0
##$ASSWID= 0
##$AUNMP= <proc_1d>
##$AZFE= 0.1
##$AZFW= 0.1
##$BCFW= 1
##$BC_mod= 2
##$BYTORDP= 1
##$COROFFS= 0
##$CY= 11.3945322036743
##$DATMOD= 1
##$DC= 2
##$DFILT= <>
##$DTYPP= 0
##$F1P= 15.9154993809931
##$F2P= -4.1035820241983
##$FCOR= 0.5
##$FTSIZE= 0
##$FT_mod= 4
##$GAMMA= 1
##$GB= 0.15
##$INTBC= 1
##$INTSCL= 1
##$ISEN= 128
##$LB= 0.24
##$LEV0= 0
##$LPBIN= 0
##$MAXI= 10000
##$MC2= 0
##$MEAN= 0
##$ME_mod= 0
##$MI= 1.114404
##$NCOEF= 0
##$NC_proc= 0
##$NLEV= 6
##$NOISF1= 3.799351
##$NOISF2= 2.8
##$NSP= 1
##$NTH_PI= 0
##$NZP= 0
##$OFFSET= 15.70392
##$PC= 1
##$PHC0= -10700.21
##$PHC1= 25.20088
##$PH_mod= 1
##$PKNL= yes
##$PPARMOD= 0
##$PSCAL= 0
##$PSIGN= 0
##$REVERSE= no
##$SF= 200.130013532006
##$SI= 16384
##$SIGF1= 3
##$SIGF2= 2
##$SINO= 400
##$SIOLD= 16384
##$SREGLST= <1H.CDCl3>
##$SSB= 0
##$STSI= 0
##$STSR= 0
##$SW_p= 3612.71676300578
##$SYMM= 0
##$S_DEV= 0
##$TDeff= 0
##$TDoff= 0
##$TI= <>
##$TILT= no
##$TM1= 0
##$TM2= 0
##$TOPLEV= 0
##$USERP1= <user>
##$USERP2= <user>
##$USERP3= <user>
##$USERP4= <user>
##$USERP5= <user>
##$WDW= 1
##$XDIM= 8192
##$YMAX_p= 0
##$YMIN_p= 0
$$ End of Bruker specific parameters
$$ ---------------------------------
##NTUPLES= NMR FID
##VAR_NAME=  TIME,          FID/REAL,        FID/IMAG
##SYMBOL=    X,             R,               I
##VAR_TYPE=  INDEPENDENT,   DEPENDENT,       DEPENDENT
##VAR_FORM=  AFFN,          ASDF,            ASDF
##VAR_DIM=   8192,          8192,            8192
##UNITS=     SECONDS,       ARBITRARY UNITS, ARBITRARY UNITS
##FACTOR=    0.000296,      1,               1
##FIRST=     0,             0,               0
##LAST=      2.424536,      0,               0
##MIN=       0,             -247598,         0
##MAX=       2.424536,      299091,          0
$$ Real data points
##PAGE= N=1
##DATA TABLE= (X++(R..R)), XYDATA
0 0 0 0 0 0 0 0 0 0 0 0 0 0 6 -8 8 -8 14 -16 16 -24 29 -32 40 -48 56 -68 80 -93 108 -125 142 -165 188 -213
34 -213 241 -273 307 -346 388 -435 486 -540 601 -668 740 -818 904 -998 1100 -1211 1335
51 1335 -1469 1617 -1782 1965 -2166 2394 -2651 2943 -3280 3668 -4127 4677 -5349 6185 -7252
66 -7252 8654 -10502 12709 -23593 299091 -137403 -62598 257385 -217393 61135 64964 -155911
78 -155911 92379 -8830 -28163 76929 -72343 35960 19036 -48451 39700 9763 -12595
89 -12595 19022 8032 -10989 12473 25399 -38203 36529 19462 -43572 55078 -17407 -6831
101 -6831 67471 -66700 20401 42618 -59211 39318 336 -20018 36604 -22712 3949 -599
113 -599 -1459 21651 -25744 21501 9059 -33151 4103 -18159 -2294 -4308 -4806 18756 -19290
126 -19290 23954 -10267 -39663 40963 -37053 -8583 29247 -52963 39958 -13310 -49427 56812
138 56812 -47485 6231 40354 -66811 52373 -6030 -59127 60195 -42868 -10822 47036
149 47036 -51426 32490 20958 -40835 31690 -8596 -15026 20379 -16488 4271 14617 -7021
161 -7021 3346 6898 -2146 8549 12782 -12465 17256 15583 -27556 25448 968 -25672 38319
174 38319 -20390 -3767 46694 -32108 18798 26091 -38059 26588 -4006 -23141 35476 -11561
186 -11561 -4830 19420 -17200 1775 3579 -10469 11028 9960 -6265 -1024 -588 -20919 -3147
199 -3147 1859 -18747 22220 4423 -22179 20874 -19418 -17538 17042 -28360 7543 9875 -28248
212 -28248 17573 -12112 -15467 21199 -21510 6223 12444 -23929 13586 -5588 -13927 14688 -12817
225 -12817 16 8298 -9144 8309 1401 893 8546 -3740 3010 1007 -2906 4238 953 2989
239 2989 4960 1293 -397 5466 6772 1515 13889 4534 -6838 8980 -11123 -7122 15637 -6211
253 -6211 11901 15583 -9782 13095 -3729 -12787 14186 -10235 1242 14558 -12868 7235 4930
266 4930 -13407 9531 -1210 -6980 9312 -6120 -5891 5178 -10474 -5697 5492 -10781 -674
279 -674 8819 -13064 3326 5918 -18358 5686 -2586 -17425 10756 -8240 -8383 10451 -15649
292 -15649 -800 3627 -14882 10939 2007 -7096 12949 -8025 -7832 4315 -10953 -159 7005
305 7005 -1314 7362 4638 -1653 2495 -808 -1833 4471 1664 2268 6503 292 2283 4863 -616
320 -616 7060 5284 1227 9252 -1868 -1555 5249 -7685 3564 7442 -2596 12084 4706 -2269
334 -2269 7728 -7464 -2176 4285 -8958 7509 2221 -9738 8480 -6547 -8572 10879 -7157
347 -7157 -1268 8741 -10689 597 972 -12799 3492 -3127 -8955 7495 -6472 -5139 8572
360 8572 -10295 -4297 5215 -13222 -1124 5035 -10423 5754 2339 -11755 5086 -5269 -7901
373 -7901 12518 -5375 -119 12660 -15507 -1572 5023 -17374 9109 7960 -7282 17816 825
386 825 -6956 11903 -8787 -1473 11051 -8882 7218 9101 -8169 10526 5243 -6684 11735
399 11735 929 -3872 12767 -1888 -1676 9439 -4529 2066 6051 -5140 7128 3181 -5502
412 -5502 6795 -1270 -3729 3993 -4726 -249 3126 -3278 -782 -2341 -2352 -828 -3660 754 2287
427 2287 -2283 -3893 -4564 -6206 -5889 -2961 -2991 871 3808 -3098 -1114 -1903 -5170 -1329 -7510 -1293
443 -1293 3284 -7677 3543 948 -6442 7774 -6530 -4762 10088 -8371 2668 6161 -8945
456 -8945 9329 -1762 -10004 13295 -2362 -2360 12389 -5793 3100 7477 -11414 5863 7453 -5875
470 -5875 9638 1242 -3719 11505 -5784 -1906 14623 -4262 2827 7866 -7152 7289 1427
483 1427 -9676 7790 1698 -1913 6401 -1408 3050 4700 -6589 -2614 3028 -3279 -3486 2699 -2286
498 -2286 -47 3098 -9506 1209 4452 -10695 2300 -581 -6889 6025 -11341 -5877 7366
511 7366 -11328 494 3272 -6500 7018 -5729 -9438 4525 -5826 -2300 1095 -4144 5030 -647
525 -647 -7017 3946 1148 -2616 2275 -296 817 3133 -3737 -915 5491 304 1551 1321 2611
540 2611 7746 -3285 -96 5620 -2385 5862 -358 -1703 13061 -3703 -1446 6353 -6040 8410
554 8410 1918 -5170 14606 -1092 -4607 4385 -6694 2619 597 -4507 7405 2534 -466 -364
568 -364 -2660 1886 -2038 -3393 -2769 2054 3334 -8180 2108 1987 -6731 4246 -7150 -4984 8320
583 8320 -10106 -1539 3065 -10077 4466 -4619 -8037 9477 -5732 -4309 6171 -6085 -1362
596 -1362 -997 -8137 3866 2584 -5331 2301 1018 -2679 2084 -4312 -271 10294 -3122 -1185 6300
611 6300 -6203 3158 2814 -6548 9750 3140 -2168 7134 -1906 3377 3872 -4376 7671 2173 -2389
626 -2389 5722 80 3019 3007 -1845 2992 1636 1915 -442 -1486 4900 -1144 -1541 840 -2286 3763
642 3763 -257 -1633 3726 -2397 -703 -2432 -5294 2016 -2906 -1542 1875 -4089 691 -4557 -4709
657 -4709 4122 -5308 -376 2784 -5637 2904 -3820 -7595 3380 -4523 -544 3694 -5940 4117 253
672 253 -8654 3851 -2069 -4390 6119 -2810 -1105 5576 -4481 53 3833 -3872 2540 3110 -2870
687 -2870 5402 811 -4771 5951 -502 -2402 7559 -627 2350 7439 -2961 2643 3251 -3691 4701
702 4701 306 -1270 7265 -121 30 4988 -2148 -474 2595 -724 903 3725 -251 -550 2390 -3860
718 -3860 -1725 2289 -3613 2472 428 -5592 3464 -4765 -4651 4574 -6207 867 2922 -8318 1856
733 1856 -3269 -5571 3994 -5225 877 2708 -7458 1536 -3263 -6169 3013 -3092 -163 2076 -1888
748 -1888 1808 -1855 -293 683 -3965 1221 171 -1640 2619 722 1072 1317 108 893 -14 1628
764 1628 978 1923 2134 -521 3189 819 -354 4124 103 2566 3090 -1869 3116 -87 -1382 4636
780 4636 59 2259 4064 -1069 877 -368 -1977 1891 2105 224 1981 2060 -3333 -938 843 -4620
796 -4620 2342 1356 -3526 4247 -3154 -3548 3564 -6939 -382 1770 -7243 2599 -2109 -4872 4053
811 4053 -4884 -1423 2048 -6379 917 -925 -5247 2949 -1817 -3406 1739 -2609 -1998 1457 -942
826 -942 -822 1422 -774 -1592 1275 -1206 1108 2541 -1286 2649 1297 -2225 3246 -76 -50 5405
842 5405 -18 1641 3637 -1908 1636 2005 118 3677 1890 1837 2840 -525 528 747 -107 1731
858 1731 2213 1325 617 1072 232 -1356 344 751 -213 884 439 -223 -739 -774 -1519 -1589 -154 -862 -1277
877 -1277 278 -726 -666 -1146 -2373 -563 -2579 -1918 677 -2319 -293 963 -4340 -686 -506 -4350
893 -4350 -214 -123 -1669 1229 -1713 -2065 871 -1335 -1019 1357 -695 245 645 -3082 1018 1980 -2586
910 -2586 2692 2104 -1724 3482 -930 -1176 4273 -939 2530 3764 -1260 4575 -298 -2692 5454 -555
926 -555 48 4462 -1437 4105 1587 -2314 4567 -361 -471 2463 -2145 2786 1396 -2176 2512 -255
942 -255 -1085 545 -3079 439 600 -2423 305 -154 -879 -532 -2536 -1077 953 -1251 -1812 -1112 -959
959 -959 -1878 -3132 -1279 637 -488 -919 -1774 -1438 -310 -2320 -1745 723 779 287 -2169 -595 883
976 883 -2694 -882 43 277 2799 -2073 352 3253 -2659 889 551 -2214 5834 -821 -1681 6157
992 6157 -1544 883 2169 -3269 5030 1220 -2706 6022 -413 623 4016 -4402 4018 4154 -4992
1007 -4992 4444 2259 -2473 4481 -2808 -1084 5359 -4039 -76 3759 -2253 2383 -1065 -3563 3511
1022 3511 -1925 -2189 801 -1081 1690 -2308 -3508 1731 -2423 -1745 -637 -2233 1153 -1989 -3282
1037 -3282 -518 -777 454 -3178 -1214 2885 -3236 -967 -391 -2810 2542 -1860 -2208 3099 -1590 225
1053 225 -614 -2528 3733 -793 -1752 4128 -232 1023 1263 -2845 3142 1130 -2526 3484 1306 766
1069 766 3320 -1885 1628 4122 -3183 1597 3121 -439 4292 -998 -447 5382 -2650 445 3069
1084 3069 -2555 5396 -333 -3441 5934 -2795 -1118 3401 -3518 4151 460 -4766 3764 -2481 -2442
1099 -2442 2056 -3350 2151 1224 -4126 753 -1053 -2044 -925 -2715 296 159 -1496 -1414 -491 -1124 -2800
1116 -2800 -777 -1583 -1411 1512 -2479 -989 2439 -3169 -1096 578 -2550 1168 -467 -1523 2279
1131 2279 -514 -1624 1466 -743 602 2363 -1638 1213 3118 -1909 943 1935 -725 3993 642
1146 642 -660 4533 -1618 167 3410 -2734 3674 2679 -2153 4757 -11 -1593 2643 -1835 1382
1161 1382 2076 -1698 3196 313 -1681 1773 -2732 -229 1822 -2210 791 1054 -1337 194 -1951
1176 -1951 -1942 272 -1386 -100 386 -1795 -298 -1293 -2866 -698 -1251 -1343 893 -652 -983 -1032 -2471 -847
1194 -847 -930 -1997 139 -60 -528 150 -1432 -1177 -349 -233 -825 169 1365 -63 95 630 -586 365
1212 365 741 287 1246 542 628 984 33 979 874 410 2753 1416 553 1628 44 548 1157 170 1582
1231 1582 1479 709 1909 -454 -468 1515 -1375 769 1932 -781 1883 174 -1342 1232 -2186 -168
1247 -168 1604 -2464 1444 85 -2235 1262 -2150 -2204 595 -2421 224 165 -2587 635 -1746 -2075
1263 -2075 272 -2518 -712 645 -1942 -538 -886 -1655 -659 -557 -830 -37 -647 -516 65 -1129 -883
1280 -883 577 -525 644 1443 -52 566 748 -662 -98 400 643 1447 1234 1359 837 392 590 430
1298 430 3 951 1789 1097 1238 1600 -180 569 689 -259 2103 594 601 2470 -941 749 1217 -1897
1316 -1897 1373 249 -880 2129 -1359 -605 660 -2392 794 2 -1490 1631 -2048 -1105 929 -3251
1332 -3251 -296 235 -2441 1014 -707 -2169 601 -2272 -1427 72 -2344 -16 49 -1842 153 -437
1348 -437 -1728 139 -886 -583 705 -594 173 415 -938 77 370 -498 1642 1297 -493 1609 686
1365 686 -685 1256 517 218 2186 671 615 1787 -238 692 1260 -710 2278 1602 -759 3114 658
1382 658 -1440 2455 -908 -302 3216 -1940 1148 1944 -2482 1813 -451 -2014 2971 -1948 -1338 2961
1398 2961 -2863 -17 361 -3051 1822 -625 -2039 1554 -1864 -915 -182 -3008 518 -5 -2263 623
1414 623 -591 -1211 -677 -2055 -718 -483 -936 -312 -381 374 -307 -1862 -647 168 -301 -514 519 1060
1432 1060 -55 83 -125 -137 946 124 -77 2231 849 632 489 -440 1984 1021 -595 2688 1470
1449 1470 153 1680 -979 1016 2422 -1349 1900 1914 -394 2005 -1776 -150 3349 -2543 635
1464 635 2633 -2173 2478 -467 -2708 3131 -1879 -1653 1702 -1714 1670 -86 -3299 1966 -1064
1479 -1064 -2530 573 -1414 458 146 -2805 369 -401 -2401 -702 -1101 -336 982 -1641 -1271 186
1495 186 -1288 -1807 -536 239 303 98 -816 -165 469 -746 -1317 604 945 -60 -84 -648 1214 647 -1898
1514 -1898 1372 1647 130 1869 -737 836 2738 -1765 691 1478 -47 2703 -625 435 3477
1529 3477 -1681 630 1420 -913 2797 42 -552 2817 -670 -334 404 -1220 2363 -441 -1555 1961
1545 1961 -756 -1013 -241 -1775 1029 -34 -1726 824 -425 -1164 -521 -2198 -212 836 -1992 -291
1561 -291 568 -1605 -622 -1662 -1695 946 -1197 -1299 641 -853 -89 -951 -1855 660 -436 -1116 134
1578 134 99 159 -669 -575 281 378 696 -666 746 1621 -775 633 105 -87 2248 -1012 1178 2472 -1275
1597 -1275 1483 511 -1282 2849 -952 105 3167 -947 1877 873 -1459 2459 -408 -995 2339
1612 2339 -131 428 948 -1237 731 121 -1264 456 31 -26 513 -1072 -278 -123 -1590 -732 204 -574
1630 -574 -366 -792 -1078 -99 -1229 -688 -425 -1114 -42 -1045 -2240 143 -889 -1483 -92 -331 -29 -242
1648 -242 -769 156 -672 -387 -71 -549 248 272 221 -115 339 216 -945 918 620 -452 1591 157 -66
1667 -66 1652 -1044 903 1241 -320 2805 109 -224 3039 -1488 -134 2375 -1141 2014 1800 -1053
1683 -1053 2090 -150 -893 2042 -1054 703 2069 -1570 1032 690 -2014 964 36 -1183 1524 -488
1699 -488 -487 1004 -1354 -430 -22 -1684 56 -302 -1381 521 -354 -1518 -5 -848 -1436 -17 -721 -1071
1717 -1071 223 -1141 -922 25 -983 -308 146 -930 494 -318 -1401 471 -433 -825 1152 -266 -278
1734 -278 1193 -359 95 601 -441 863 567 -256 1771 77 -195 1481 -814 571 1313 -40 2012
1751 2012 317 -24 1837 -915 462 1385 -1021 1921 859 -530 1585 -566 -305 1550 -659 751
1767 751 522 -887 1205 -647 -1199 1096 -982 -197 1001 -1131 -221 474 -1640 -866 -604 -1427 -94
1784 -94 -16 -1353 557 -699 -1342 359 -1615 -1068 511 -1132 -395 514 -1563 -151 -333 -803 225
1801 225 -228 -565 840 -398 -619 308 -462 -138 993 -390 231 1482 -486 306 1128 -614 1314
1818 1314 689 -313 1773 -148 171 1884 -937 808 1475 -853 2116 1234 -703 1697 -361 -171
1834 -171 1106 -658 1234 1343 -337 1114 -34 -197 953 -451 -44 459 -289 -156 -366 -621 20
1851 20 -745 -167 268 -326 -256 -395 -1200 -383 -815 -873 -157 -748 -139 -343 -1431 -8 -516 -1570 239 -663
1871 -663 -761 493 -1536 -586 62 -1066 -226 -193 -235 1046 -285 -410 394 -664 -179 42 199 797 394
1890 394 216 309 670 336 -496 1048 839 195 1027 30 583 927 -1041 1073 1496 -217 1775 3
1908 3 -237 1904 -1225 -99 1342 -718 925 329 -1109 1814 -251 -1128 1413 -796 -308 827 -1812
1925 -1812 255 825 -1529 260 -202 -629 197 -1374 -353 349 -2057 -611 -861 -1057 547 -1467 -542
1942 -542 909 -1156 -504 -787 -1086 977 -1387 -634 646 -1257 180 -701 -961 1642 -596 -399 1119
1959 1119 -721 633 -398 -1241 1944 22 -476 1533 255 1021 842 -694 1106 924 81 496 353
1976 353 829 663 -384 568 1040 727 -68 645 1387 65 -160 350 -276 602 -31 -720 1293 363 -368
1995 -368 135 -817 278 554 -2016 783 329 -1718 411 -1001 -1059 1604 -2104 -671 1646 -1644 20
2012 20 -401 -1956 1202 -1286 -1971 1388 -1449 -487 570 -1997 712 461 -1945 782 -341 -504 446
2029 446 -1584 350 792 -958 188 796 57 509 -450 -283 949 -21 190 727 535 746 -164 175
2047 175 909 453 131 334 577 819 315 304 666 677 446 -171 340 1170 110 99 253 39 -124 -575 -274
2068 -274 584 -164 128 42 -279 886 -883 -578 224 -437 61 -854 -632 499 -1224 -977 567 -1202
2086 -1202 102 57 -1549 443 -469 -1674 56 -950 -353 541 -1141 333 812 -1764 288 -124 -1488
2103 -1488 835 -686 -1096 1099 -830 -506 1033 -629 857 1008 -1049 1332 175 -751 1258 -265
2119 -265 164 1254 -497 875 1113 -247 1134 447 143 760 137 219 800 87 66 546 138 506 491
2138 491 125 332 501 -495 103 -1 -80 -6 -35 -95 115 -105 -22 -178 -224 -446 -232 -315 -548 -272 -90 -877
2160 -877 -404 -505 -131 -241 -481 38 -786 -553 -432 -838 -444 -384 -575 454 -404 -3 335 -971 -11 -285
2180 -285 -909 670 -434 -360 931 -726 74 789 -699 743 849 -662 1449 -203 -530 1255 -937
2197 -937 628 1526 -668 1313 1198 -244 1416 -245 -144 1119 -544 605 953 -836 845 482
2213 482 -501 1055 175 221 836 -83 -13 78 -336 99 -111 -219 92 -158 -243 -187 -501 -358 -616 -265 -755
2234 -755 -250 -251 -884 -310 -236 -709 -204 -260 -629 63 -751 -571 -196 -1051 -4 -129 -835 436 -159 -496 524
2255 524 -496 104 356 -586 -11 -268 -286 834 -402 356 917 -652 1053 451 -165 1220 -491 465
2273 465 774 -663 1137 635 -271 1483 8 522 1153 -642 269 666 -650 897 73 -382 923
2290 923 -496 -54 774 -692 496 790 -827 488 -214 -983 279 -233 -385 99 -181 -211 36 -640
2308 -640 -617 -170 -750 -540 -363 -962 -174 -87 -712 -245 -24 -771 187 -376 -1068 157 -800 -911 179 -623
2328 -623 20 622 -671 499 651 -990 684 108 -649 897 -312 125 989 -434 782 669 -371
2345 -371 1285 91 -35 1321 -610 243 541 -9 1090 241 399 1012 325 622 439 3 666 3
2363 3 -242 438 -24 199 -69 -78 519 153 -89 151 34 -78 -257 -684 -96 -410 -484 -405 69 -30 -677 -497
2385 -497 -466 -571 -217 -1075 -458 169 -636 -337 40 -440 51 -421 -780 552 -135 -855 85 -758 5 130
2405 130 -807 692 435 -563 715 -438 -229 1078 -1118 159 1254 -616 713 425 54 1583 -320
2422 -320 -9 1184 -108 532 447 -177 1029 111 -386 807 465 746 225 75 769 233 33 -356 -16
2441 -16 672 -180 -56 163 120 355 -708 -400 963 -826 -664 198 -751 172 -454 -1130 674 -389 -541
2460 -541 171 -673 -131 -82 -1419 28 -29 -1001 -139 -738 29 1 -1044 74 314 -183 147 -696 27 646
2480 646 -1029 -578 270 -99 642 -197 259 1114 -608 -130 164 -361 746 -260 -469 1275 146 -3
2498 -3 669 -32 1258 206 -64 1142 122 59 437 -116 711 548 -301 852 535 431 172 -400 573
2517 573 181 -525 132 -121 162 -143 -142 341 -9 -324 -28 -483 306 -196 -881 48 -359 -674 -243 -749 -32
2538 -32 142 -937 -158 -551 -768 -174 -919 -209 382 -779 -249 -11 -475 415 -180 -442 771 -423 -73
2557 -73 -168 -662 468 -140 -262 894 192 157 296 131 552 109 -134 804 167 339 263 -18 817 463 0
2578 0 479 443 278 439 -385 551 292 -111 599 280 182 868 -250 350 603 -514 -72 -93 -282 214 -219
2599 -219 -98 286 -213 -144 -65 -48 22 -338 -326 -436 -320 -133 -856 -163 -263 -590 30 -465 -570 230 -839
2620 -839 -144 32 -1009 127 -264 -462 735 -342 -78 522 -699 97 204 -502 104 -214 -785 404
2638 404 -76 100 641 -164 252 669 -345 345 225 -121 284 378 164 721 241 406 570 -70 645 330
2658 330 88 486 68 47 204 -196 -45 92 209 292 84 359 28 -395 283 -152 -133 -186 -174 -221 -423 -31
2680 -31 -47 -554 -186 -99 -583 -233 -448 -423 -221 -388 6 -60 -376 115 -221 -434 -104 -680 -347 -222 -669 271
2702 271 -288 -252 416 -454 -79 160 -695 89 158 -318 546 -188 -242 819 -179 216 889 -60 693 477 -84
2723 -84 628 15 86 628 143 283 687 142 681 257 267 556 257 195 335 -51 122 -57 63 71 207 299
2745 299 212 -96 -42 -56 61 -346 -320 -53 -167 -108 7 -409 -261 -140 -653 239 -378 -688 14 -490 -684 154
2767 154 -822 109 208 -654 449 -458 -326 471 -936 -139 255 -555 404 79 -730 286 -106 -67 253 -529
2787 -529 737 456 -496 424 -168 1 725 -345 323 515 -54 602 -76 -11 1043 -376 197 584 -264
2806 -264 610 199 -147 754 -11 330 557 -3 301 -135 -243 482 -196 -217 571 -345 0 -203 -368 439
2826 439 -445 -210 21 -557 412 -471 -775 351 -568 -460 -117 -996 -11 -565 -815 655 -614 -527 36
2845 36 -1184 195 -117 -1069 523 -453 -207 233 -846 71 226 -511 850 -74 -344 798 -755 -32
2863 -32 842 -366 594 209 -232 923 -256 152 841 -277 484 46 11 991 -138 -155 590 -453 792
2882 792 143 -363 858 280 -117 504 -252 415 250 -492 957 113 -317 431 -619 326 342 -1094 729
2901 729 -40 -527 305 -615 -107 290 -1230 66 -199 -488 217 -1039 -27 356 -905 -78 -150 -390 406
2920 406 -887 -166 407 -859 262 -563 -569 628 -683 63 572 -534 365 -335 -38 1185 -784 -202
2938 -202 685 -607 605 73 -427 1129 -96 -438 706 -296 579 572 -259 1215 337 -505 433 -142
2956 -142 479 598 -357 679 375 -91 410 -251 468 508 -788 380 218 -395 313 -369 229 383 -694
2975 -694 -79 -85 -28 381 -824 -208 381 -931 -34 -43 -412 244 -715 -566 505 -597 -79 -280 -610 293
2995 293 -417 -629 250 -532 -59 -426 -664 524 -259 -137 518 -398 89 65 -736 720 -117 -151 264 -302
3015 -302 407 386 -546 744 423 -348 706 -115 226 782 -587 523 398 -304 737 65 515 866 -417
3034 -417 156 578 -138 362 69 -97 874 -233 38 142 -322 390 -22 -372 590 -356 -315 -150 -388 148
3054 148 -196 -251 -22 -321 -207 -463 -199 -183 -311 -217 -264 -109 -334 -344 -224 -76 -416 -334 -76 -330 -265 156
3076 156 -565 142 -366 -207 311 -255 -98 105 -647 580 19 -164 506 -157 225 554 -124 16 442 -59
3096 -59 263 186 64 475 -58 161 454 -138 159 347 58 498 27 -71 182 80 273 192 -54 382 195
3117 195 -253 220 136 -140 46 228 -51 219 -92 68 -46 -469 -117 -297 -223 0 -165 -375 -55 -318 -180
3138 -180 -187 -343 -318 9 -237 -323 -268 -63 -264 -238 -405 62 -263 -483 28 -286 -58 -53 -204 15 168 -211 179
3161 179 51 -115 128 -195 178 366 -134 195 296 25 304 334 294 257 301 -130 269 350 119 559 -28 151
3183 151 354 119 262 -15 84 332 29 -93 282 -253 16 185 17 175 33 -249 -70 -172 -310 102
3203 102 -379 -229 27 -176 -123 60 -144 241 -163 -253 14 -390 -363 20 -295 -431 -170 -431 -196 -310 -408
3224 -408 -232 -312 -392 86 -313 -249 144 -163 94 100 -158 242 -124 100 131 47 253 221 -124 413 -14 265 140
3247 140 500 201 416 49 214 470 396 10 212 264 240 312 -73 152 -75 282 116 268 44 -71 15 -171
3269 -171 185 -57 -99 75 89 -223 -103 -28 -347 -158 -277 -210 -269 8 -12 -393 -15 -308 -313 -206 -106 -203 47
3292 47 -479 9 -82 -254 -120 -238 -37 50 -204 -260 178 -210 -71 59 -30 61 -178 22 192 -113 -11 263
3314 263 190 53 183 30 60 434 -119 -51 102 157 335 257 59 481 87 446 236 -57 356 396 268 458
3336 458 424 -2 236 -263 311 272 42 141 -90 133 99 -177 2 479 46 -233 -161 -86 -110 -114 -197 -304 -340 -370
3360 -370 -448 -244 -350 -27 -131 -151 58 -281 -529 -280 -287 -274 -197 -203 -94 14 -452 51 150 -274 39 -212 -44
3383 -44 543 -254 -133 670 129 168 261 -229 294 344 -224 268 201 129 423 -100 496 528 99 530 347 419 217
3406 217 -80 399 400 83 237 56 45 384 -74 -294 170 55 42 -2 54 666 -298 -758 78 311 22 -499
3428 -499 177 185 -291 -182 -331 -15 -139 -448 -508 109 -270 -474 -337 -86 -231 -528 -404 -38 -21 -131 -364
3449 -364 -336 179 -238 -258 -115 -213 56 -83 -93 82 -53 -316 310 56 49 269 76 364 226 -384 279 -50
3471 -50 401 459 -151 146 412 -133 324 -39 250 549 66 64 419 110 372 27 -10 502 47 204 441 146
3493 146 325 43 -245 378 37 -241 -7 -170 -166 -400 -384 259 -172 -117 -175 -190 -14 -144 -306 -54 -86 -113 -301
3516 -301 -253 48 -132 -419 -247 -59 -140 -324 -212 -102 -95 -291 -129 -235 -116 -72 -117 139 -33 101 143 4
3538 4 210 292 -147 23 310 -32 44 -23 294 181 8 -58 163 269 215 205 300 370 60 261 186 7 249 -21
3562 -21 -91 248 -37 -39 253 192 158 250 -205 112 -29 -80 99 -40 -270 -45 -197 -278 -169 -338 -89 -395 -197
3585 -197 -348 -238 -228 -179 -152 -28 -257 -132 -105 27 -342 -313 30 -387 -9 -34 -198 -69 -120 -260 75 -120
3607 -120 -65 168 149 -15 194 50 -20 -28 221 -5 54 452 260 27 191 400 206 249 241 285 104 284 39
3630 39 383 122 167 281 212 166 -87 228 210 198 -88 312 73 -32 105 -97 31 -168 -98 -52 -1 55 103 -91
3654 -91 -125 116 -265 -170 -181 -343 -257 -146 -334 -71 -103 -432 -226 -478 -440 -111 -491 -33 -355 -292 -100 -192 -23
3677 -23 158 -312 12 -211 -101 199 113 209 115 54 65 -256 328 -129 -11 95 25 147 284 -5 407 157
3699 157 -133 96 282 262 143 224 99 84 158 332 68 55 357 276 30 188 -233 75 260 -205 111 -117
3721 -117 -120 210 -317 47 -6 -217 108 -261 -105 421 -46 -97 14 -141 37 -476 -570 -88 -85 -101 -401 -338 -329 -125
3745 -125 -507 -70 -258 -184 31 -249 -243 -8 -238 140 -125 -32 63 128 14 21 -71 474 154 175 220 -120 -54 108
3769 108 232 209 128 447 438 77 305 211 45 304 84 261 466 -18 326 295 -52 272 176 -113 386 56
3791 56 -82 62 -155 370 -76 -26 252 -131 -196 279 -237 -163 -259 -499 260 -208 -303 117 -230 -148 65 -190
3813 -190 91 -340 -204 -16 -247 172 -15 -418 149 -89 -197 76 -441 109 140 -110 -46 19 155 27 -327
3834 -327 -27 57 38 197 205 -70 491 -51 102 530 32 320 -65 128 158 -114 199 398 94 208 209 126 828
3857 828 109 -44 269 -182 94 161 -246 386 -52 -246 414 -180 198 274 -244 434 7 -410 241 -220 -189
3878 -189 69 -604 44 -80 -347 194 -587 110 172 -545 19 -21 -439 120 -367 -319 194 -619 -30 49 -368
3899 -368 177 -629 -218 300 -487 -27 7 -272 357 -149 -216 450 -89 -7 243 -31 372 -182 -284 638 162
3920 162 102 318 -356 526 46 74 483 175 314 448 -62 587 114 -344 235 105 11 397 -299 389 308
3941 308 -259 105 150 -139 306 -233 215 427 -195 -19 -182 20 374 -360 -89 -19 -227 141 -746 -300 153
3962 153 -681 -93 -125 -631 -224 -449 -516 234 -408 -97 -100 -305 33 -290 -556 127 -92 -82 -115 -359 251 153
3984 153 -325 276 21 -190 -48 -274 193 110 -193 502 -91 -84 286 -137 321 280 -80 250 81 295 465
4005 465 -56 195 280 -185 266 16 -10 462 -317 179 104 -249 227 -104 -268 429 -242 97 293 45 19
4026 19 45 -127 222 -256 -115 27 -152 52 -80 -442 11 -207 -254 -189 -172 75 -148 -541 112 -50 -495 306
4048 306 -290 -143 -49 -44 -102 -126 -18 29 -280 225 225 -163 15 -60 4 231 -146 -19 200 -41 133 158 288 404
4072 404 -194 -68 146 214 134 350 211 172 115 165 501 45 63 382 -57 270 334 85 173 -121 155 -10 -20
4095 -20 -1 173 50 47 -53 -156 -98 -414 -197 -175 -148 163 -406 -156 103 -354 -145 12 -129 -170 -209 -341 320
4118 320 -201 -224 181 -235 -255 -117 -229 17 -69 -218 9 4 312 -119 -116 147 47 -12 -101 4 47 205 249 231
4142 231 394 118 275 267 9 69 197 279 -29 91 59 113 27 88 177 112 191 54 272 3 -5 -7 -44 190 -22
4167 -22 -202 10 -155 -51 65 193 -42 136 68 -62 131 -112 -285 55 -106 -261 -236 -359 -270 -135 -213 -153
4189 -153 -231 -286 45 -61 -126 -161 -69 -253 -118 51 -197 15 -232 -96 -138 -132 -67 -50 -192 64 207 -112 -116 85
4213 85 229 54 -76 316 406 88 117 181 339 161 32 227 235 140 136 309 386 -27 282 -83 240 100 414
4236 414 33 325 -60 233 117 275 3 -55 215 145 201 -139 -132 20 -93 -23 159 70 -337 -260 137 -220 56
4259 56 -175 -111 -190 -313 -115 103 29 -22 -200 -181 -66 -352 -64 -197 -117 73 -134 -118 119 -137 -79 72 -172
4282 -172 -158 171 -174 -100 257 -120 84 -113 57 325 70 132 99 316 49 -117 225 596 -41 77 -20 230
4304 230 245 -72 164 82 147 86 136 -59 288 -61 -62 440 46 347 65 -23 18 -58 94 360 236 72 -255
4327 -255 -212 -74 -34 -35 -23 -183 46 -131 -277 131 60 -414 -101 -32 -227 180 -178 99 -9 -96 -41 -21 124
4350 124 252 -152 55 129 -119 -46 -374 20 292 -62 -68 117 264 155 -201 -109 235 -75 248 53 -79 330
4372 330 209 -60 302 -57 227 159 215 255 -187 175 190 -12 248 64 -315 441 160 -8 -112 -288 270
4393 270 11 -172 64 -59 -30 125 -386 126 333 -336 -93 -127 -381 -44 -379 -197 185 -303 -172 -211 -94
4414 -94 59 -349 -387 -116 -264 -48 -17 -243 -237 -241 -387 120 -102 -165 85 -208 118 41 12 -17 86 -165 372 -156
4438 -156 478 1 -160 362 37 160 -17 -43 288 383 -77 233 30 -79 349 46 188 249 55 461 101
4459 101 132 311 -3 401 271 150 79 -32 157 338 -94 14 107 -101 108 60 -174 -207 65 -58 -22 -232
4481 -232 -108 -308 -150 -97 -32 -516 -43 -163 -20 -293 -178 46 -59 -19 42 -252 53 -272 -237 -30 107 -306
4503 -306 170 -188 58 -59 -304 269 -82 127 16 -130 171 -122 163 182 -118 357 217 -4 -40 -1 23
4524 23 183 -144 -49 17 108 311 123 -146 99 -218 207 283 -11 256 196 -16 222 -186 -185 26 -155 192 15
4547 15 -69 42 17 -35 202 -104 87 -328 -96 -7 91 -19 -60 -259 13 -199 -240 -144 -163 -57 -120 -319 133 -128
4571 -128 -155 -149 -26 -75 -116 -125 -291 43 -260 43 -203 -157 86 219 -90 234 -83 102 -53 -114 285 91 41
4594 41 -18 220 265 25 137 10 135 -61 70 305 92 74 164 87 150 117 241 36 184 77 -21 223 -28
4617 -28 187 13 90 54 -30 -274 104 -261 -6 40 -207 -93 -74 32 -263 -291 20 82 -246 -59 40 -402 47
4640 47 -88 13 -266 -158 -184 -15 -63 327 -72 -279 -16 -137 -202 -7 -104 -18 -108 -310 182 61 -105 45
4662 45 -67 63 101 -94 155 74 -59 200 236 -42 225 40 111 67 295 -27 215 389 -23 -25 -15 89 12
4685 12 320 110 -98 81 67 -8 -60 33 -104 258 209 52 -236 -232 -270 23 -30 -212 -38 -125 -353 -156 -12 -282
4709 -282 -240 -201 -16 -86 -88 -110 11 -520 -24 35 -204 27 12 -168 -34 -199 -86 70 -95 7 316 -170 53
4732 53 -187 -54 109 -198 -213 34 163 173 343 84 167 100 -3 231 42 331 74 87 342 248 172 212 150
4755 150 83 296 124 100 268 228 142 58 -76 9 -112 184 101 184 196 -16 -337 30 -155 -12 75 -128 -63 -351
4779 -351 -70 46 -66 2 1 -272 -44 -58 -259 -64 -214 -58 -60 34 48 -344 -242 -71 60 -37 -338 -253 -104
4802 -104 66 -166 107 -6 86 -44 -118 135 99 -165 264 -120 -111 99 82 289 146 -52 136 10 51 388
4824 388 -31 109 167 -60 211 105 -132 102 65 169 -15 146 17 175 -73 370 217 113 -84 -101 82
4845 82 49 7 343 84 -107 7 104 -165 -8 -280 -218 119 -166 69 -402 -130 73 -381 -84 127 -240 -240
4867 -240 -58 14 39 -420 2 -27 -111 98 -240 -219 51 10 158 -31 131 44 9 57 -169 170 -69 59 68 125
4891 125 -7 -83 229 16 178 -31 -150 329 282 99 276 -223 329 98 4 225 57 140 371 -104 -2
4912 -2 102 -133 -83 92 78 269 -193 -133 93 -145 -9 -5 -64 -123 -111 -292 115 216 -182 108 -3 -218 -287 9
4936 9 -13 31 81 -159 -408 140 -249 -336 51 14 39 76 -332 -59 -23 -545 135 -85 -113 190 -44 -137 -91 -278
4960 -278 -69 31 -24 114 -92 -28 183 -64 186 278 36 91 162 169 36 -171 180 197 166 279 -78 -65 137
4983 137 93 88 22 141 23 -30 90 273 -17 -69 -29 -63 56 144 -104 97 -13 -42 -266 -9 400 133 -59
5006 -59 30 -127 -155 -218 -275 -61 68 -293 86 -211 -330 87 -313 -137 55 -134 62 -176 -309 84 -86 -73
5028 -73 10 -50 -261 -136 160 -151 -2 84 -168 15 15 -217 -18 226 -36 308 -59 -14 311 353 -227 178 7
5051 7 326 410 -177 209 147 234 69 212 163 150 -98 301 36 -217 166 4 7 217 163 -72 2 -95 50 -18
5075 -18 218 -154 -96 -134 -234 43 -48 -74 -253 -162 -386 -95 -20 -75 77 -220 -183 -22 -485 -23 127 -191 3
5098 3 -88 -307 -95 -227 -290 290 -176 -52 -110 -178 -82 -181 -24 199 -96 21 124 -87 101 274 -36 138 98
5121 98 256 -3 147 -49 150 87 119 -167 61 8 -83 -17 -81 -111 270 28 256 164 41 164 -59 -62 234 -112
5145 -112 50 166 -115 46 18 -161 -100 -230 -240 -105 -91 -97 -42 -167 -112 -290 -52 -268 -218 -225 -198 8 -79 105
5169 105 -197 -101 -95 -207 -143 -170 39 -221 186 109 44 -164 -3 260 46 -171 -36 236 -99 312 77 46 24
5192 24 -3 -101 150 33 374 -80 18 116 188 91 14 237 -113 286 161 77 -16 49 -76 177 -65 -126 -22 21
5216 21 -125 10 -137 74 103 -65 -271 -12 15 -164 88 -149 -138 13 -212 23 -15 -222 -179 -107 -133 122 -289
5239 -289 -69 -27 -45 12 -196 -236 -175 -173 -82 -25 152 125 -301 124 -202 61 -241 -240 -56 245 -55 97 -4 308
5263 308 -91 -217 47 216 103 -69 -172 22 288 133 187 290 94 -109 -83 82 210 205 -95 83 74 28
5285 28 38 9 179 144 82 211 -20 -30 99 131 173 20 43 15 -182 139 104 -323 -207 6 -155 49 34 -120
5309 -120 186 38 -76 11 -352 40 -195 -252 -102 -289 -171 -115 49 -182 -222 -177 81 -89 -98 -3 -150 221 -48
5332 -48 -13 42 -90 -12 130 -219 195 19 -44 -55 33 177 68 92 55 156 -196 127 17 110 193 135 339 185
5356 185 118 67 115 13 95 -161 191 155 86 88 108 102 312 97 167 166 -99 280 -170 -53 -65 -1 -139 -24 -79 38
5382 38 -391 -194 177 -19 109 -257 -132 16 -279 -184 -128 -110 -84 -100 -173 -68 -51 -166 195 -157 -19 -58 -259
5405 -259 23 -13 -82 -5 78 -6 -26 132 -109 340 -200 -80 37 236 306 -173 -20 182 43 204 -29 154
5427 154 385 135 319 353 168 253 -47 -6 212 73 -88 85 -79 96 154 115 270 -146 91 99 -167 51
5449 51 30 -49 316 -148 166 59 -155 127 -205 -278 -182 120 -235 -143 -476 -17 128 -124 17 -76 -159 -344 -140
5472 -140 -141 -127 -309 -14 -160 0 32 -495 -32 -75 -141 267 193 -240 24 -122 184 -144 -123 123 258 -129 94
5495 94 -152 -25 29 58 127 50 1 71 119 -105 60 93 111 87 141 -14 225 64 38 -121 111 -60 -60 -135 -7
5520 -7 -95 -53 -33 -79 -221 -99 136 -78 201 83 -308 158 65 -108 174 23 -392 227 -249 -75 61 -316
5542 -316 33 -143 -156 -217 -89 -31 76 -209 -21 85 102 0 -52 83 -28 -121 -18 11 -184 -26 61 365 -43
5565 -43 -81 129 -73 56 -75 24 -145 269 40 168 49 -307 152 8 69 -88 -80 56 138 43 26 -62 19 171
5589 171 219 63 81 -145 275 -48 224 -61 -292 92 -222 -76 24 -32 -73 -293 -355 -164 27 -108 -364 -273
5611 -273 -122 -23 -422 16 -67 -324 409 -109 -235 198 -156 86 72 -168 -61 209 -102 -34 -27 3 -2 -134 12
5634 12 112 -160 257 71 95 79 -170 127 100 43 42 54 94 184 22 119 105 -50 165 -47 104 84 -76 81
5658 81 35 39 -107 -217 -147 -50 -89 -71 204 120 -198 -166 -438 58 93 -152 -87 -46 42 -101 -182 86 -88 89 196
5683 196 -246 -76 -66 -149 60 -265 -135 -62 -237 134 152 -58 142 54 -44 24 -288 -183 -175 -4 137 -23 -147
5706 -147 24 -146 108 270 163 146 361 150 182 -1 34 153 -59 171 -20 95 353 65 -1 -22 12 102
5728 102 -36 80 198 -88 174 54 -84 -87 93 37 207 15 179 83 -18 83 -85 -99 325 26 -139 202
5750 202 -270 -26 -39 -23 -93 -44 -70 -67 -174 173 46 -276 -100 -362 97 -71 -315 -85 253 -272 -54 148
5772 148 -117 118 -192 -84 -102 -165 229 144 -349 -36 -49 -228 -17 -36 202 352 10 110 -8 75 339 14
5794 14 12 12 70 142 31 22 150 123 -92 83 -329 219 132 375 106 -236 155 96 173 27 195 210 440 -14 -193
5819 -193 116 -17 88 -105 -127 -196 -165 -250 31 -147 -15 37 -37 115 -165 -54 -205 -330 -153 -115 -250 247
5841 247 -150 -64 17 -23 -166 38 39 17 -104 69 -73 -98 -22 109 -189 77 120 93 -3 167 7 305 -165 18
5865 18 16 -20 227 -31 -8 259 86 128 109 116 253 221 140 -21 -6 -167 164 139 -148 157 -69 -39 105 122 -36
5890 -36 218 -97 -197 -106 -23 -5 -5 81 22 19 7 -162 5 -92 95 -409 -69 153 175 -91 -9 -213 -227 -93 -205
5915 -205 -88 -170 -53 -120 -77 -179 123 -59 -170 -29 -155 -25 -52 -82 -136 6 -42 41 262 -68 233 149 72
5938 72 70 -108 213 -50 27 -6 -10 165 213 94 4 -36 157 -61 10 93 288 -125 -194 157 40 131 153 61 109 356
5964 356 -127 202 -87 148 103 52 203 141 91 184 207 179 -374 -94 -29 -79 10 -80 46 -198 15 -197 -244 -215
5988 -215 -8 -45 -138 26 -38 2 -31 -9 -94 -156 -242 34 -10 -113 -11 54 136 269 -191 285 22 -171 46 147
6012 147 54 22 -93 -40 -151 31 -58 -43 94 6 90 209 85 93 71 235 256 50 238 253 169 33 -62 83 95
6037 95 269 65 213 187 169 68 52 -56 -178 -31 18 -4 282 252 -259 -140 -1 -116 50 126 -146 114 192
6060 192 61 -60 -87 -79 -15 -235 42 23 -52 -82 314 -119 -239 -380 48 74 127 27 -47 8 -146 352 -23 92
6084 92 119 -62 179 -11 46 57 -35 130 -61 -56 -26 204 232 -124 -149 59 -127 290 203 132 244 144 -109 150
6108 150 -31 88 135 -90 293 -119 52 -146 67 -126 -134 30 14 -16 -9 37 -73 -69 99 -12 -19 190 19 -13
6132 -13 -57 -258 -98 -128 -66 57 -153 29 -72 -99 187 76 133 124 128 28 -115 25 -92 -9 -32 -70 -249 23
6156 23 -276 -8 116 -47 182 85 69 19 74 -98 100 -150 144 39 -9 186 83 248 -96 39 -145 -33
6178 -33 144 203 4 66 4 -9 -19 -5 45 196 57 -133 -229 -40 127 162 64 -326 -50 -282 -112 6 0 10 -31
6203 -31 -43 5 -140 -103 -17 -90 -190 -172 -154 33 -314 -75 -29 135 194 -101 -66 74 -96 -211 -166 -134 80 -253
6227 -253 37 15 31 -55 -236 -51 -53 297 13 144 113 84 34 15 27 122 234 -47 22 12 41 -41 -319 265 161
6252 161 94 -27 196 155 38 179 -68 97 86 -73 -12 -229 175 123 -146 121 78 167 74 -159 -132 -50 202
6275 202 150 53 -90 171 8 211 73 -113 -108 23 -66 -178 46 -237 25 -141 -3 -75 -83 -7 -122 -34 101
6298 101 -154 -142 17 -50 -255 -38 -278 172 -129 -190 73 41 159 -129 -64 8 201 -125 70 24 -98 -266
6320 -266 127 -8 64 -103 -193 -88 -127 261 48 112 32 -188 220 107 134 181 129 204 162 -262 95 34 160 124
6344 124 42 6 84 110 -35 -106 -53 10 -202 37 79 -237 -96 84 108 -157 -16 -170 -41 32 -217 -166 -194 -25
6368 -25 30 32 -40 -132 49 39 -187 -124 -149 5 -41 70 95 -55 121 -28 -60 -18 149 -20 -77 12 -308 117 -82
6393 -82 -232 9 75 160 22 -92 162 112 130 -63 48 69 -99 106 0 21 103 -72 -197 -123 138 -38 -43 182
6417 182 -137 199 -111 160 -59 11 -165 19 -22 157 -204 108 -298 -111 -86 3 -161 -104 15 -52 107 -66
6439 -66 103 255 -92 -211 -143 -40 -161 -2 53 29 -89 15 38 -151 125 46 101 -162 -96 -165 -48 163 160 58
6463 58 23 123 327 -58 70 69 -5 -38 -24 73 19 50 58 -200 174 129 -67 62 -69 -74 168 246 180 109 83 -63
6489 -63 110 76 -115 -32 69 37 -54 -99 -47 -82 21 -65 -32 0 -2 -2 -201 -5 -210 -84 44 -19 -321 107 -68
6514 -68 136 59 -277 -163 100 8 101 -159 7 -309 -239 154 -121 -125 257 -167 111 60 -68 101 -128 130 126
6537 126 7 21 -143 -172 158 -26 1 -15 -68 136 -200 70 95 139 24 -25 -6 131 -48 157 191 93 -225 144
6561 144 124 47 -16 302 69 236 46 65 -78 128 63 -141 -101 -79 -208 82 -103 -19 -32 -39 302 310 -235 121
6585 121 60 -72 185 -68 260 -360 -245 64 20 -162 -115 -192 180 49 -155 100 -90 -120 102 -106 17 -72
6607 -72 -69 -24 -87 222 119 88 -146 242 -215 61 -81 -37 -3 34 158 85 204 261 203 201 -59 -43 42 84 -63 373
6633 373 -85 198 27 -25 -9 -16 327 23 112 64 62 -31 -240 217 -229 -172 -226 143 -109 102 -129 54 -299 -230
6657 -230 -93 40 -9 -246 14 -79 2 35 -40 3 -146 -231 92 125 -223 -174 210 -8 -271 -23 -100 117 -12
6680 -12 249 -1 183 131 -61 -145 2 -62 48 -65 101 302 100 -113 118 17 196 173 56 236 55 71
6702 71 -188 -176 -51 394 -56 -11 104 -182 -61 -50 -72 214 -156 -83 11 -116 204 80 -85 -54 -14 -64 -69 -277
6726 -277 -53 303 35 266 -105 -13 81 26 -341 57 46 -302 -133 -351 113 -14 -273 -225 -76 86 -231 -60
6748 -60 81 -21 -356 108 -131 160 157 -261 140 -11 180 161 -195 -33 -178 -174 225 -286 5 16 89 143 31
6771 31 -41 51 43 157 266 -53 250 178 160 108 105 134 256 134 160 131 31 222 38 -145 4 70 129 -259 -74
6796 -74 87 -100 -118 138 -150 205 -88 38 28 -151 63 10 -31 -171 43 -49 -3 -85 73 7 -149 -114 -96 -48
6820 -48 -67 -6 -67 194 24 84 102 -54 70 140 2 -130 -52 -111 231 -201 224 48 -121 147 -170 40 -92
6843 -92 -121 -89 239 -189 141 229 -14 23 -52 230 206 -76 58 228 158 257 3 -36 35 141 235 35 -61 133
6867 133 48 -129 70 93 -38 -40 62 152 283 -81 -275 -88 -124 -107 -258 -349 -151 16 -39 -298 -2 -211 86
6890 86 -93 66 -100 -288 -143 -36 -80 -155 -198 32 -19 24 -69 -242 34 -105 -81 14 -217 100 112 -14 69 297
6914 297 -23 71 -113 -103 44 57 -69 -89 90 -139 99 -189 70 -214 -17 -58 361 32 87 -44 156 180
6936 180 -64 236 31 404 -96 -94 59 -112 76 -152 100 33 -100 -76 -99 -243 209 -20 71 -259 -3 31
6958 31 -30 -255 -52 391 -141 -201 14 73 -214 359 -128 -178 181 -105 -39 -17 -229 63 -8 -112 87 -113 22
6981 22 -89 -144 -133 -165 -74 -165 -293 -97 26 158 54 20 -43 -258 213 101 62 -153 2 -13 -92 -11 55 -162
7005 -162 -15 118 134 -140 59 -74 212 209 143 65 0 112 -65 284 -6 -64 166 49 -109 11 106 151 96
7028 96 -100 -196 -126 -68 191 94 -162 -158 -224 48 -8 -41 121 39 -170 -23 -75 -186 134 -110 -202 86 72 -158 -12
7053 -12 -93 96 156 -112 213 -152 -151 -160 -156 -57 187 2 -127 12 5 0 76 -159 -45 26 -19 23 31 29 71 -60 -46 -34
7081 -34 135 -102 -14 69 76 47 -218 95 73 -41 -123 82 245 1 118 262 -4 -179 -243 -28 92 151 78 41
7105 41 -87 91 48 -105 60 11 40 86 -25 36 10 -192 -1 39 26 -169 436 19 -45 -70 -8 69 -36 -42 -28
7130 -28 -96 98 173 169 -193 -273 83 -143 285 62 -114 23 133 173 86 6 16 270 6 -51 153 -63 383 122
7154 122 139 76 220 7 59 51 -128 -174 -226 162 -83 0 105 276 207 -149 -132 -22 -116 -169 -112 136 -90 -168 118
7179 118 -1 6 -302 301 -106 -165 -26 -168 44 -24 -62 22 159 134 16 -196 25 -134 -147 66 97 2 184
7202 184 -1 -149 -283 26 188 -224 -24 94 -248 -58 68 -30 -203 32 -98 39 140 -199 -57 -177
7222 -177 157 -40 -94 193 -89 122 327 -42 23 239 -23 38 -4 -216 15 72 34 122 136 -65 -78 -116 267
7245 267 20 174 235 -218 -256 151 -77 7 95 35 -97 -83 -54 -63 11 -106 42 -220 20 -10 22 -36 -148 42
7269 42 -104 -153 12 -193 -33 -32 -127 67 20 -77 -113 80 -82 173 -32 -58 -77 31 -96 -113 14 390 180 115
7293 115 -44 259 53 -119 23 -57 180 -97 -205 107 253 -62 113 90 -80 -45 -152 71 227 137 39 154
7315 154 -77 -126 -41 -26 206 72 149 -111 106 70 45 12 -18 26 -75 159 -252 -153 -235 62 -45 -129 11 -131
7339 -131 -262 69 -43 -207 -92 101 -200 -67 37 -15 -38 5 -86 119 -8 73 24 -46 105 52 -127 -36 104
7362 104 263 -120 24 72 -232 -4 54 9 86 133 164 37 -281 -3 -22 56 -76 -62 222 64 -89 5 184
7385 184 -77 108 62 175 -156 39 64 89 -238 -164 139 15 24 66 -243 -78 -78 93 -8 120 91 256 -202
7408 -202 64 -47 68 -52 -141 165 -22 40 209 62 -100 -85 -27 53 -149 108 -99 137 -23 234 -223 -169
7430 -169 -65 137 173 -44 219 -5 -36 37 33 90 339 97 -27 -90 17 171 -17 -92 -63 11 -82 404 31 -10
7454 -10 -238 141 46 -1 295 -58 61 113 126 118 -68 -64 51 46 -109 192 22 63 175 -94 85 -37 -210 -174
7478 -174 36 -44 -21 -49 -184 -63 63 -187 36 -63 81 -24 -35 -107 34 -44 51 -107 4 -51 -217 57 -85
7501 -85 -94 -200 -53 168 -40 197 -39 -186 47 -123 114 -23 44 65 4 -73 -54 49 147 90 -120 144 -271
7524 -271 -76 148 -262 -28 -156 118 -90 273 100 40 70 119 66 169 74 171 -37 -109 25 -5 201 29 15
7547 15 -38 318 171 145 92 84 12 122 -102 -42 -73 -226 10 11 278 -89 73 -92 -45 -112 -18 48 -369 -89 41
7572 41 -75 -108 66 -399 -168 -34 7 -38 -44 -132 -56 22 -155 45 -115 10 29 -210 177 107 -208 -72 -46 -57
7596 -57 -7 -173 -118 -270 -95 89 343 211 37 128 20 181 -22 -210 98 -55 -125 -95 194 -43 -64 84
7618 84 296 62 61 -174 -39 59 87 -48 -35 26 129 -168 182 -61 49 -160 -66 -108 70 -199 254 -152 -149 31
7642 31 -79 191 -172 -23 -110 -237 154 104 -53 -251 -200 200 -53 53 212 -237 -70 -125 -87 331 -87 -54
7664 -54 23 -24 261 81 -76 -43 -45 44 -111 63 263 -28 162 65 294 262 -107 -164 112 168 61 197 160 81
7688 81 320 43 -158 148 -117 -88 -64 -181 -142 204 11 79 -202 -27 -219 115 -131 125 -42 -140 74 -94
7710 -94 -98 -226 360 -140 -146 -165 -68 -117 107 211 45 -214 -59 -133 9 -123 69 -64 86 37 -237 -253 38 135
7734 135 -164 -189 52 -67 -202 262 234 289 157 -215 -47 -47 275 112 32 51 170 -36 -61 150 -152 -138 24
7757 24 48 120 -59 -70 83 74 111 -86 5 -96 151 -334 35 65 143 28 147 205 -153 39 3 186 170 -58
7781 -58 -169 69 93 138 -150 -337 -226 -160 -235 -167 -161 -290 -15 104 -22 -142 122 -171 -134 -54 -183 292 -218
7804 -218 72 -94 131 270 149 264 -91 -171 417 -168 351 -113 206 177 36 82 -17 288 39 -202 2
7825 2 -119 9 263 237 274 93 151 -59 -92 244 176 27 -68 198 103 131 250 -100 72 82 109 -88 102 -78
7849 -78 -59 298 -280 77 174 -187 133 -103 65 -64 -73 120 -182 -157 -7 51 -4 -53 172 13 -134 102 -152
7872 -152 25 -56 -11 50 -25 -70 78 55 -310 23 359 -211 9 -281 33 -12 -16 -53 135 98 60 127 96 83 -44
7897 -44 125 -54 118 -136 257 -15 66 -24 149 -117 62 104 -51 149 23 225 207 88 -18 -29 151 -128
7919 -128 53 43 124 -206 -138 1 126 81 -11 -193 -169 -133 -157 -10 -179 80 -116 -306 -151 241 100 -144 -266
7942 -266 -28 50 -259 263 -158 -78 -190 -168 -99 -39 154 -97 95 -95 -34 214 14 -8 72 -25 367 53 57 33
7966 33 -54 29 28 -26 197 4 135 -26 62 246 21 28 -131 117 -121 88 36 -29 -279 3 -148 63 -16 63
7990 63 17 177 -316 -96 28 179 466 -46 8 155 -61 30 54 193 21 -150 61 -61 -106 -30 -65 114 171
8013 171 214 -9 -103 179 -98 -70 -155 -99 118 -43 169 2 -81 -142 -24 11 -2 15 -483 74 50 38 173 -279
8037 -279 -195 4 -85 70 61 163 -54 377 209 140 53 38 21 -61 44 -18 151 -56 94 -139 -86 114 -242 85
8061 85 5 -124 -78 106 -97 92 183 -140 -5 54 30 -80 88 14 113 -78 -59 84 -58 43 40 192 -50 -10
8085 -10 -88 -96 -51 117 -231 112 -16 35 38 23 -188 11 -114 22 -36 10 43 10 -144 -61 -328 28 93 91 10 122
8111 122 -140 -165 32 42 176 -189 92 -196 142 102 147 106 -184 -187 166 -149 44 159 -130 178 96 183 92
8134 92 98 -174 133 -150 258 -60 -98 -34 33 -239 32 -209 18 180 18 239 11 -105 -127 -195 -69 -26 43
8157 43 -104 -19 89 229 63 -190 -141 -139 -84 7 98 -89 -124 117 -66 -117 -105 -106 -46 -255 -44 16 -72 -47 -171 -297
8183 -297 -135 -48 44 115 -114 10 60 -104
8191a04
$$ Imaginary data points
##PAGE= N=2
##DATA TABLE= (X++(I..I)), XYDATA
0 0 0 0 0 0 0 0 0 0 -8 8 -8 8 -8 16 -16 24 -24 32 -40 48 -56 72 -81 96 -112 133 -153 177 -204 234 -267
31 -267 305 -346 391 -442 497 -557 623 -695 775 -863 958 -1060 1173 -1298 1432 -1579 1742
48 1742 -1919 2112 -2325 2563 -2826 3117 -3446 3816 -4240 4727 -5295 5965 -6775 7771
62 7771 -9029 10677 -12930 16202 -21384 30806 -53151 208837 76398 -247598 292756 -134303
74 -134303 -94249 173119 -144523 36765 94897 -86139 82754 -39475 -16003 59322 -52493
85 -52493 21376 34258 -30684 14146 5652 -10186 -3659 24307 -28786 1832 39208 -50893 21455
98 21455 20006 -49717 55859 -40396 -34642 67418 -58065 862 33785 -46008 27299 -11149
110 -11149 -21709 14952 -14875 15497 -19477 -8464 17820 -43025 -3282 1828 -8870 13092
122 13092 -7545 17605 -10531 -4529 9862 -47407 28825 1495 -37361 47486 -32862 4275
134 4275 32408 -60835 49613 3479 -34612 65386 -48642 7950 44373 -72854 49154
145 49154 12173 -42796 67829 -25385 -2845 51151 -46063 14931 20041 -27865 25992 -376
157 -376 -4467 23373 -4732 -823 10547 362 2934 11362 -9388 35 18554 -27649 2595
170 2595 19559 -34450 23828 5424 -29678 43194 -19796 -20585 35145 -42396 -1880 18176 -36642
183 -36642 24363 1874 -27814 18119 -14281 -12126 10294 -11143 3701 7911 -13091 -10692 -1284
196 -1284 -14292 -5345 14507 -8989 10106 15799 -29019 8521 215 -27750 24123 -8069 -7280
209 -7280 27000 -23792 7081 12050 -22180 24917 -3617 -8364 24710 -19338 3664 13232 -16911
222 -16911 17322 2438 -6143 18121 -3619 5326 10070 -2915 8028 -1223 -1472 5542 -2221 5360
236 5360 4748 1767 5323 1129 205 3816 6186 -1105 3309 2311 -14667 754 -2498 -11574 17039
251 17039 625 -3470 14044 -16836 -4839 1086 -20912 8719 -1264 -11442 14014 -12185 -7233
264 -7233 8700 -16570 731 4409 -13662 4023 -2849 -12290 4338 -4646 -7987 8359 -3201
277 -3201 -4855 11825 -7065 -4747 11455 -14010 -881 10265 -14465 9618 7244 -11089 14578
290 14578 -3060 -5545 15742 -7000 7958 13303 -9809 8936 13 -11676 10472 -496 598
303 598 14915 1987 3756 5854 -3943 416 1284 -1513 5208 3789 396 4564 222 -1936 4246
318 4246 -1026 1506 4081 -4232 2222 -2311 -8599 3769 -4336 -2122 10021 -4545 2406 3807
332 3807 -12097 -221 -6385 -9958 5418 -7055 -807 5111 -13563 1632 206 -13107 8808
345 8808 -1651 -9737 7994 -8749 -7741 5186 -10881 200 5000 -9020 6644 1346 -8469
358 -8469 9351 -3391 -7692 9954 -4800 -2439 12781 -4277 2144 9950 -8940 3976 6720
371 6720 -6014 13643 4702 -6439 13746 -7536 -7679 15486 -7269 5915 19595 -7751 9010
384 9010 6804 -14850 8006 -1213 -7991 13465 -4166 -1183 12264 -9282 1610 8444 -10736
397 -10736 3945 3994 -10303 6428 -225 -10347 5979 -3544 -6146 5446 -5822 -935 3872 -10047
411 -10047 576 277 -9068 1227 -2705 -4424 3260 -4150 -3654 -1269 -3007 -245 -2353 -761 1615
426 1615 -3901 -5486 -3535 -3167 -1920 1809 2526 2425 5008 -1738 -3141 510 -3504 792 -83 11 8799
443 8799 -2000 1636 8124 -4731 6382 2678 -6492 12840 23 -2575 12224 -5690 4196
456 4196 7496 -9876 11751 7351 -7672 11353 -1023 -5013 9660 -7927 -10 12518 -7050
469 -7050 2368 5220 -8944 6458 -820 -9193 12022 -2584 -8319 6740 -8810 -2923 3783 -11894
483 -11894 3178 5176 -7474 2719 -2215 -4583 984 -8532 -6195 3079 -2378 -4954 1883 -266
497 -266 -3467 1863 -6373 -3537 7768 -7972 -2015 5867 -7648 3849 -2705 -8446 12258 -3216
511 -3216 -3285 10857 -5153 2880 1585 -10079 7850 2115 -2522 7201 -373 4193 4433 -5777 4650
526 4650 6468 -2177 2446 3055 318 3548 -686 -975 7446 2150 -32 3132 1167 4751 -1944 -4615
542 -4615 6651 -1404 593 3398 -5121 8216 -1094 -9430 6912 -4437 178 5627 -10029 6353
556 6353 530 -13727 2253 -4696 -2820 3817 -6409 3388 2120 -6699 -2891 -4525 -1144 -1928 -5041
571 -5041 -1289 737 2790 -6487 -2633 5012 -7229 349 34 -7114 9750 -3559 -6461 9249
585 9249 -5918 1349 5215 -7379 9730 2145 -7537 8514 -1099 -3113 5177 -2877 4691 8150
599 8150 -3676 1990 5130 -1903 2512 1469 -189 10109 144 -5686 6896 -2747 -952 7584
613 7584 -5176 5756 6896 -6932 4154 -13 -2799 4939 -5285 2429 4220 -6325 2736 589
627 589 -2171 1822 -4455 -386 593 -2628 -1431 -3795 1676 -1030 -5205 725 -1965 288 302 -5355
643 -5355 1226 -2888 -4869 -908 -5131 1253 209 -3824 2499 -2948 -2082 -478 -4583 4941 -556
658 -556 -3122 5438 -4309 -409 1627 -6804 5452 2564 -2029 7187 -2386 1138 5415 -6897 3678
673 3678 5728 -3224 7379 2837 -2600 7126 -566 -1946 6840 -898 770 5816 -2470 2541 3640
688 3640 -5060 4157 3738 -4394 5788 1803 -3465 5154 -3781 -3723 3287 -4979 621 2259 -4365 3970
704 3970 -79 -5383 1870 -2855 -4207 1484 -1329 -1845 1080 -1895 -3938 -481 -3276 -3854 2322 -2564
720 -2564 -1367 1711 -6458 418 -227 -6363 5536 -1988 -3187 5268 -7126 -767 3122 -5670 5114
735 5114 213 -2237 5543 -5426 -98 3512 -4736 5446 2604 -779 5028 -376 1417 1062 -656
750 -656 3140 -773 1748 4390 -167 3441 2672 344 2104 497 1266 1095 1673 1794 738 2092 -894
767 -894 1261 1704 -1955 2652 363 -1184 2215 -3282 -483 958 -3613 2866 230 -2750 1381 -3508
783 -3508 -3096 -711 -3288 -119 975 -1848 -1753 -671 -4620 -3603 991 -3596 -434 2833 -5052 731
799 731 -599 -6296 3613 -3252 -3678 5533 -5294 104 3435 -5424 3969 268 -3422 5158 -3375
814 -3375 -211 4451 -3735 3006 2619 -2895 3441 1137 -1097 3697 1660 -45 2026 1163 -410 2327
830 2327 1839 1252 3855 -152 685 2686 -2059 2155 2313 -1259 4556 573 -1633 3084 -2291 -664
846 -664 2576 -1037 1562 1047 -1515 256 -2400 -1855 371 -1319 62 562 -1171 -1927 -1660 -1333 -2470
863 -2470 -1189 -167 -1504 -858 -1045 -2179 -2089 -1966 -1745 -1803 -455 -355 -1442 191 -413 -1414 -579 -1757
881 -1757 -354 -213 -1451 1853 157 -796 2082 -2135 -765 2827 -1543 1352 3421 21 1903 873
897 873 -1078 2818 1753 -130 3119 1043 293 2044 -829 1064 4061 -581 1696 4115 -1843 1588
913 1588 1610 -2309 4321 926 -826 3970 -2656 430 1178 -5140 3521 1091 -3011 3524 -2047 -571
929 -571 1665 -4770 1191 424 -4100 1460 -2134 -917 1502 -4359 -228 -91 -3683 -579 -2637 -1087
945 -1087 1578 -2936 -1093 318 -2074 -808 -1779 -1240 1422 -968 -1942 -833 -231 -737 -1359 462 2217
962 2217 367 -330 -275 -221 1064 324 248 2978 2110 922 -607 -212 2488 -89 -78 2902 1949 3467
980 3467 523 -666 4439 -924 -196 3402 -1499 4283 2129 -3893 4827 306 -3227 3129 -2439
995 -2439 1684 3299 -4809 3447 1288 -4141 2682 -3563 -882 4770 -5980 -264 3522 -5689 450
1010 450 -1267 -4871 4001 -2328 -3791 3840 -2964 -1373 16 -5203 1878 41 -4220 1501 -656
1025 -656 -678 -1194 -4076 1870 94 -2518 1402 -1078 669 82 -2883 1148 1014 665 -589 -1260 4048
1042 4048 -901 -2124 2716 -650 2651 1968 -2065 4376 1164 -1011 2180 -1165 3585 2252 -2334
1057 -2334 4522 1399 -1040 2264 -1682 1713 3538 -2415 2534 2977 -1510 1992 -1174 -1429 3774
1072 3774 -2710 -1356 4111 -1939 584 -63 -4418 2829 -1830 -3705 3313 -2971 699 883 -6795
1087 -6795 2926 -685 -5391 3572 -3148 -867 1817 -6837 1209 211 -5022 2694 -1651 -861 2463
1102 2463 -4518 -312 848 -2428 239 -822 527 1757 -1110 -720 287 568 -957 294 1312
1117 1312 176 2771 510 -1278 3469 -456 -1089 3421 -512 1252 2473 -648 2763 1648 -1542
1132 -1542 2048 1230 267 2601 -260 -303 3560 -986 -936 2783 -764 1605 1688 -2792 2833 -305 -2867
1149 -2867 3858 -1784 39 3730 -4055 1214 819 -4846 1481 -1282 -1972 2348 -3013 156 426 -4186
1165 -4186 151 -1796 -2199 1796 -2213 -1380 895 -2881 -1403 -1395 -2430 546 -527 -916 602 -1635
1181 -1635 -1025 -167 -2201 449 1091 -547 1233 810 -658 345 -624 427 1316 -289 1853 1798 -100
1198 -100 1092 330 -144 1507 1219 755 1394 2346 1060 135 1299 377 830 1861 708 1159 793 -47
1216 -47 960 -322 621 1162 -209 1532 630 -1311 224 -434 -1010 571 -350 153 560 -1389 -392 -1467
1234 -1467 -2170 589 -1260 -1367 1437 -1782 -738 -355 -2930 25 -1531 -2102 1659 -2087 -862 1069
1250 1069 -3043 -10 -353 -2668 1554 -835 -661 1355 -2244 327 406 -2047 1407 -131 -578 2068
1266 2068 -693 -387 955 -377 987 1293 513 1610 1050 431 1166 396 581 1829 1067 876 2103
1283 2103 621 325 1302 41 466 1506 1211 1540 1054 584 88 -321 -275 138 66 385 1179 -145 -580
1302 -580 331 -1435 -920 116 -1320 406 450 -1469 627 -1601 -2223 651 -2347 -535 671 -2317
1318 -2317 594 -1263 -2626 759 -2233 -657 799 -2319 770 -605 -2520 1525 -1813 -952 2100
1333 2100 -1672 575 867 -2200 684 -223 -876 1824 -187 515 1894 -914 814 1252 -987 960
1349 960 1212 183 1900 921 119 1306 104 707 1975 502 1319 1725 -652 940 1189 -861 971
1366 971 1782 -113 1680 722 -1000 836 -249 -1216 941 -652 497 1542 -2141 561 578 -3418
1382 -3418 528 -35 -2187 1764 -1690 -1890 1975 -3029 -1115 487 -3696 1517 -702 -3616 2289
1397 2289 -1952 -2445 1638 -2813 36 675 -3066 984 -461 -1936 1170 -1699 281 1916 -1605
1412 -1605 573 1224 -1050 29 -304 276 1374 385 986 912 905 715 -358 716 1463 924 669 1162 1664
1431 1664 562 -109 782 633 1356 1002 40 1886 916 -430 646 -306 900 1344 -1146 1404 1248
1448 1248 -1928 98 -695 -769 2033 -1676 -612 1646 -2297 -112 -958 -2216 2832 -1958 -2141 2914
1464 2914 -2727 -1032 379 -4222 1516 -320 -3759 1723 -975 -824 623 -3582 315 480 -3402
1479 -3402 1070 251 -510 1052 -2446 -360 984 -1935 30 716 231 1748 -913 -676 1578 112
1495 112 -598 713 1593 1358 700 -26 594 1440 593 -310 1711 2134 491 393 105 1008 1446 -1001 1033
1514 1033 2630 -196 1197 123 -657 2354 -1382 -984 2438 -860 830 9 -1877 2643 -1351 -2080
1530 -2080 1500 -1418 446 159 -2711 1644 -749 -2233 47 -1511 661 54 -3071 898 -724
1545 -724 -2565 -239 -1298 93 369 -2015 79 198 -1731 -301 -1285 -352 1469 -974 -717 1318
1561 1318 -1064 -738 209 -959 1742 633 -923 1415 258 -77 254 -719 1539 1536 -741 1185 1202
1578 1202 648 294 -89 1510 915 886 208 447 1726 -393 156 1261 -119 1808 -13 -641 2849
1595 2849 -1320 -395 1273 -2058 1436 202 -1791 2655 -740 -1081 756 -2555 467 194 -2837 1170
1611 1170 -141 -1545 258 -2029 -582 75 -1978 -372 114 -1115 -119 -1278 -1308 -183 -981 -799 507
1628 507 -753 -523 -248 -851 197 -241 -501 678 -320 499 44 -1280 611 696 -651 800 603 531
1646 531 110 -74 561 361 131 887 531 752 1364 263 580 363 919 -357 961 1433 -214 999
1664 999 842 -711 1726 -667 -17 2111 -637 1060 1067 -1861 1524 -757 -2046 2189 -982 -185 1729
1681 1729 -2437 -220 176 -2468 817 -680 -1591 1434 -1855 -893 1022 -2742 -248 654 -2343 489
1697 489 -203 -1916 485 -1169 -1423 247 -1055 50 729 -1307 -53 673 -1414 65 254 -856
1713 -856 587 705 -337 456 191 -266 1163 234 295 1378 -179 357 799 -558 843 1144 -153 1445
1731 1445 1137 7 1582 290 -92 1112 -403 828 1329 -459 923 514 -746 1156 -179 -287
1747 -287 1327 -313 428 443 -1246 466 -707 -894 1409 -1332 175 1013 -2183 -29 -176 -1882 748
1764 748 -1168 -857 504 -1907 -155 -236 -2148 769 -268 -1231 794 -1076 -1137 168 -1379 -753 128
1781 128 -895 49 537 -692 206 159 -1214 429 -46 -854 1319 -81 49 1129 -513 97 1164
1798 1164 190 1019 815 161 1117 526 -273 1126 337 84 1669 428 89 1473 231 -252 1399 -348
1816 -348 547 1257 -788 1157 516 -1181 1391 -217 -707 1730 -927 160 1069 -1755 351 -245 -959
1833 -959 767 -700 -369 660 -1440 -308 -338 -1681 245 -572 -1208 -67 -846 -842 -528 -738 -18 -740
1851 -740 -700 219 -805 -688 -471 -1058 -326 -94 -960 465 24 174 473 -626 144 646 -763 535 1003
1870 1003 -215 1245 -82 -216 1221 -119 388 1304 251 1305 187 -316 1174 347 232 1153 754
1887 754 896 572 185 415 500 682 -221 499 1223 -650 384 -10 -307 731 -777 -26 1476 -1038
1905 -1038 193 152 -1784 948 -775 -1432 1384 -599 -454 561 -1851 426 -222 -2390 819 -496
1921 -496 -1404 553 -1635 -861 704 -1885 -558 526 -832 -4 -1025 -837 795 -1285 -594 674
1937 674 -685 695 -109 -715 1241 -209 -540 483 -194 1462 123 -611 1744 -174 229 1102 -17
1954 -17 1518 975 -823 1584 259 119 890 -895 1579 1339 -853 1636 696 -86 676 -1124 258
1971 258 962 -330 233 403 310 383 -815 -222 538 81 -381 -396 188 -698 -1411 -90 -467 39 194 -1395
1991 -1395 343 335 -1530 -162 -734 -661 597 -1808 -481 955 -1870 -724 44 -1530 1384 -342 -1650
2008 -1650 2137 -1033 -988 717 -1761 772 687 -1754 2159 680 -879 1505 -855 377 1828 -1531
2024 -1531 814 1616 -295 1099 -63 324 1935 -381 216 1292 3 402 96 11 1220 338 -124
2041 -124 731 646 795 -72 -111 876 -49 -251 81 173 169 -178 -532 242 94 -105 -331 -288 521 -237 -886 -210
2063 -210 -307 -585 -612 -930 -41 -306 -467 -350 -670 -22 -736 -994 -69 -675 -496 -249 -811 621 -458 -930
2083 -930 881 -355 -194 820 -1210 368 545 -1441 503 565 -207 1413 -278 -141 1652 -795 268
2100 268 1186 -705 1018 841 -625 1876 545 -641 1659 371 154 1441 -654 575 1348 -1168
2116 -1168 912 287 -601 1253 220 7 1338 -575 -171 150 -634 370 -80 -462 210 -384 -416 335
2134 335 -365 -275 19 -385 -467 -248 -870 -857 -455 -683 -265 -67 -255 -211 -88 -781 -507 -725 -662 -574 -464 -361
2156 -361 -204 -302 -277 -288 34 -94 105 14 411 91 -719 308 123 -224 501 -59 705 723 137 482 73
2177 73 216 1122 -370 944 693 -413 1411 418 -38 1429 -292 269 1452 -785 858 597 -829
2194 -829 1108 -87 -311 1907 -597 -27 1133 -1017 309 172 -1245 978 -339 -763 965 -1187
2210 -1187 -152 493 -1139 283 129 -1133 -2 -652 -1024 -93 -843 -558 -155 -442 172 -251 -310 -363 -414
2229 -414 -734 -529 -353 -267 -341 227 -233 -203 241 -540 1 264 -170 258 87 -400 371 -282 25 783 3
2250 3 824 965 25 751 220 -51 869 -121 445 628 22 1384 237 2 1127 -245 529 787 -461
2269 -461 628 -44 -574 1110 -737 446 1083 -674 718 173 -1209 715 -773 -762 498 -1039 -9
2286 -9 97 -1269 475 -409 -1141 481 -897 -610 311 -1233 -406 369 -1181 -119 -167 -605 105 -249 -699
2305 -699 47 -623 -722 57 -183 -223 45 -201 -73 536 -82 16 783 -312 -113 635 -239 558 604 -477 909
2326 909 558 -23 1274 -154 284 1308 -707 539 850 -573 982 277 -228 1611 -192 308 1187
2343 1187 -366 564 392 -534 768 -270 -512 481 -154 498 137 -386 468 -163 -341 -24 -600 -253 -14
2362 -14 -740 169 -95 -533 -519 -576 31 -265 -814 -270 -528 -571 -566 -708 -273 -231 -224 -269 -72 53 -317 -512 -38
2385 -38 -76 -69 -203 -266 723 -252 -327 459 41 405 605 -273 671 636 -373 611 51 400 1064 -287 885
2406 885 1357 -184 610 371 -282 1256 -244 -87 1479 -428 301 1156 -426 1006 405 -733 1264
2423 1264 -16 -459 491 -591 537 378 -788 314 157 -185 -249 -423 -16 -313 -702 -495 -6 53 -719
2442 -719 -622 82 -395 -240 -523 -926 501 -354 -1443 210 -597 -379 -168 -844 372 228 -752 104 -434
2461 -434 -186 198 -888 268 790 -655 205 284 437 845 -387 275 1005 -254 460 224 -322 1055
2479 1055 -287 -93 1331 259 661 384 168 1417 -346 -292 990 -76 603 182 -464 1129 311
2496 311 -342 407 -111 217 435 -1092 664 217 -796 224 -259 17 476 -715 100 250 -694 -470
2514 -470 -744 -238 -231 -856 -439 176 -68 -515 -384 -53 -73 -721 -277 -407 -197 5 -957 12 151 -612 153
2535 153 -38 -226 802 -768 -363 239 -299 230 -260 -66 1195 -307 36 755 63 320 315 -607 1029
2554 1029 184 -35 478 184 538 418 -73 853 540 -148 466 165 308 199 -107 554 376 106 551 -138
2574 -138 344 403 -729 32 136 -656 54 -411 12 31 -480 -39 18 -541 376 -384 -733 -90 -827 -623 -102
2595 -102 -562 -59 -339 -490 62 -532 -576 -111 -412 -459 -333 -331 -73 -330 -197 -163 30 486 -247 70 387 -98
2617 -98 297 -305 -3 546 -67 154 725 -110 996 298 -247 878 198 211 866 -110 192 715 -276 870
2637 870 564 -12 924 -239 -18 628 -208 178 522 -405 227 358 -198 412 76 80 506 -464 -250 40
2657 40 -503 -66 -243 -324 -398 -252 -52 -351 -354 63 -227 -442 -367 -381 -285 -409 -377 71 -50 -388 -252 -557 41
2680 41 -368 -400 -233 -456 -316 -258 -275 107 300 -160 419 -51 320 116 -493 359 227 48 431 -69 416
2701 416 608 120 816 210 83 902 24 70 848 -27 104 258 28 567 414 -127 789 -101 96 570
2721 570 -574 154 588 -137 410 46 103 366 -413 -264 24 -413 212 -118 -552 -102 -402 -424 -125 -160 -125
2742 -125 -56 -26 -338 -305 -11 -530 -425 -113 -377 -135 -301 -338 34 -374 -465 245 -427 -183 301 -769 353
2763 353 -118 -787 595 -298 -65 688 -147 373 344 -478 717 85 -192 1005 -55 258 903 -382 599
2782 599 464 -22 785 -311 348 707 -486 259 274 -167 802 9 103 755 -332 112 148 -361 277 -301
2802 -301 -403 625 -273 -93 212 -440 121 -97 -635 74 -576 -554 -263 -704 -299 -99 -540 278 -414 -209
2822 -209 -137 -751 -33 -253 -595 -63 -585 -126 230 -662 127 -263 -584 242 -321 251 400 -820 565 180
2842 180 -333 617 -333 157 997 -484 377 457 -405 774 -61 3 1439 -337 453 849 -383 950 -155
2861 -155 -300 1154 -334 189 722 -442 1011 -21 -343 1003 -475 97 353 -488 641 -92 -554
2878 -554 567 -407 -185 430 -820 500 113 -829 359 -550 -277 -62 -1066 0 292 -804 112 -378
2896 -378 -428 269 -981 -190 397 -1088 -99 -436 -485 533 -825 -213 481 -502 355 -108 -263 868 -498
2915 -498 -112 595 -487 197 -174 -144 962 -253 108 675 -532 840 95 -592 1177 -324 142 639
2933 639 -324 1385 -18 -460 869 34 -84 531 -548 844 502 -862 435 0 -170 799 -483
2950 -483 372 568 -803 401 31 -339 456 -768 -3 602 -872 -41 -93 -396 248 -913 -401 395 -626
2969 -626 12 -217 -597 342 -545 -695 196 -651 238 -395 -568 880 -974 -617 387 -375 108 -300 -508
2988 -508 613 -144 -427 252 -482 481 197 -394 766 72 11 278 -160 599 425 -440 867 292 114
3007 114 647 -483 516 539 -409 666 123 129 697 -434 462 731 -475 109 84 -227 724 -532 78 649
3027 649 -383 75 49 -147 592 -253 -680 480 -279 -179 53 -729 -109 -341 -684 176 -213 -176 -186 -760
3047 -760 -87 -82 -658 -4 -255 -279 -134 -312 19 15 -284 -127 -92 68 -25 -268 142 61 -41 171 -126 9 -31
3070 -31 -53 430 -81 227 343 -65 358 519 -72 390 239 372 567 -43 311 267 -225 462 346 181 519
3091 519 -144 -74 308 -284 289 234 -251 199 50 -314 507 -282 -362 336 -317 -51 267 -718 -345 -77 -196
3112 -196 37 -158 -125 51 -332 -398 -148 -151 -213 -254 -445 -196 -89 -207 -294 -517 -96 -82 -324 -322 -182 -172 -66 -28
3136 -28 -270 -192 165 -263 317 203 -53 131 -91 88 204 -73 207 163 337 438 255 -33 379 123 134
3157 134 339 268 360 323 397 295 115 295 401 350 386 485 382 184 124 30 -33 244 -237 54 9 -101 164 -219
3181 -219 -76 104 -88 -327 -62 -447 -138 -52 -478 -65 -174 -480 -192 -272 -374 -84 -427 -352 -261 -392 -240
3202 -240 -235 -292 28 -121 -447 -133 -301 103 41 -213 80 -257 -20 319 -246 123 23 -146 91 220 -241
3223 -241 15 252 153 313 114 357 245 164 113 288 252 246 27 327 446 41 139 -67 226 79 241 208 34
3246 34 195 -257 -11 269 -84 141 144 -418 -202 -178 -258 -219 -295 -43 -31 -227 -100 -115 -136 -86 -136 -337 2 -100
3270 -100 -324 -148 -350 -100 -12 -230 -96 -314 -385 73 -215 -111 42 56 -177 0 -459 131 162 -161 114
3291 114 -162 12 159 -157 158 325 146 265 132 13 128 22 413 241 340 351 323 88 321 615 -10
3312 -10 146 436 119 493 -22 224 303 -127 -52 28 -18 364 111 -204 115 -39 -9 128 -181 -86 142 -272
3334 -272 -45 -29 -444 -112 -294 -275 -298 -464 -148 -47 -200 -135 -316 -463 228 -233 -344 -195 -70 -354 -395 -165
3356 -165 169 -27 -173 91 -160 95 -174 91 118 328 -97 13 -90 204 107 217 12 361 356 -133 213
3377 213 444 80 201 250 274 512 353 -190 795 223 215 364 -29 494 365 -166 116 304 -77 70 -76
3398 -76 10 528 -130 -185 207 -88 46 -274 -262 349 -457 -150 18 -318 -132 -361 -336 13 -229 -277 -207 -118 -133
3421 -133 -377 -236 27 -869 -498 706 -439 -103 -18 -454 12 118 178 -397 -31 -12 -64 -120 140 -41 318
3442 318 -98 -415 420 72 77 -185 115 224 155 -452 342 379 69 124 -99 449 390 -315 220 188 403 591
3464 591 -101 258 413 -209 9 268 5 349 -151 -143 384 -194 -42 -34 76 292 -60 -341 363 -194 -271 -41
3486 -41 -352 114 -242 -222 -82 -206 -337 260 -549 -202 -126 -521 -159 69 -58 -86 -389 -182 8 -371 28
3507 28 -291 45 -90 -136 -150 -4 114 -123 70 108 256 -171 45 19 213 203 221 165 275 379 287 266 406
3530 406 306 14 363 314 120 108 108 -72 336 290 17 188 41 42 232 -48 193 168 -95 84 -210 69 -129
3553 -129 -196 27 140 -1 -85 -8 -108 -107 -172 -191 -294 -382 -78 -134 -296 -56 -393 58 -214 -257 -451 -223 -182 -94
3577 -94 -248 -166 41 -241 96 -137 -74 -51 -96 -173 -161 -62 -133 191 82 89 51 27 127 129 45 140 117 70 136 41 -22
3604 -22 248 35 55 301 357 155 75 190 94 330 289 231 287 50 138 223 302 121 125 -150 177 45 408 203
3628 203 -345 157 52 -110 -45 -407 -137 7 -213 57 -211 -192 -197 -235 -52 -227 62 -370 -101 -356 -236 -76
3650 -76 -210 -41 33 -347 63 -73 -421 -56 -230 -9 340 -375 172 125 -109 117 77 -76 184 3 183
3671 183 425 -27 239 129 -135 183 300 128 403 206 203 44 -12 146 319 195 535 86 33 160 347
3692 347 197 -149 84 7 323 203 -49 27 -9 -115 63 344 -20 -9 -248 -128 -82 -342 62 -106 -358 -92
3714 -92 -265 -322 -36 -153 -13 -207 -400 -94 -171 -210 23 -437 -245 -103 -278 -12 -261 -118 20 -278 -90
3735 -90 155 -96 74 33 -194 -159 -29 -33 273 -27 88 229 -111 243 91 203 183 242 282 286 55 207 398
3758 398 256 44 -181 438 160 -3 184 85 -72 -7 -296 97 122 -141 192 -143 -145 368 -305 77 42 -98
3780 -98 -22 -103 -37 194 -228 -48 3 -363 21 139 -586 177 -397 86 -138 -437 107 -145 -353 128 -69 -268
3802 -268 157 -339 -79 3 -307 40 -154 -250 283 -370 223 73 -164 115 79 28 118 -195 112 377 -126 115
3824 115 -84 16 492 -120 187 267 -252 297 86 8 458 -215 435 413 -219 315 123 14 510 -270 -219
3845 -219 297 -127 411 256 44 436 -192 -14 272 -84 407 -46 -417 2 -404 -242 -33 -611 374 93
3865 93 -574 304 -328 -390 199 -386 -95 93 -545 -134 2 -446 154 -529 -121 391 -320 -108 -208 -136 456
3886 456 -389 175 446 -280 126 56 -140 401 -368 -124 185 -285 278 -16 -103 464 149 -307 393 82 210
3907 210 83 -263 538 143 -153 332 257 331 27 -343 519 363 -138 201 -174 458 359 -370 277 199 -304
3928 -304 225 -155 0 -82 -572 19 141 -110 139 -426 65 284 -696 -245 -154 -207 92 -436 -436 195 -98 6
3950 6 -176 -289 250 -215 -117 270 -368 -169 -475 -283 172 -48 -166 225 -360 205 366 -308 161 39 -180
3971 -180 341 65 146 268 -147 251 230 -73 326 87 121 296 -6 321 554 -105 322 177 62 368 -356
3992 -356 103 413 -80 336 87 47 234 123 69 207 -170 -169 -169 -15 288 -421 194 31 -247 -22 -177 -262
4014 -262 -112 -485 -101 50 -408 87 -311 -536 299 -83 -154 -82 -701 65 -100 -574 122 -186 -109 -7 -559
4035 -559 63 309 -199 -81 47 126 94 -202 -161 113 -137 271 249 30 184 -44 354 445 53 -20 144 321
4057 321 214 59 -78 411 -84 82 125 159 148 146 127 137 230 -97 -64 29 -37 -167 -28 -5 -105 -47 110 -210
4081 -210 -41 -93 -192 91 -398 -33 71 -235 143 -240 -251 72 -233 -42 -103 -308 63 -195 -434 166 -233
4102 -233 -115 93 -285 5 -41 -290 57 -60 -194 -100 -359 29 -64 -119 99 -102 -272 31 -176 -22 187
4123 187 -43 12 265 127 38 155 -212 87 120 -110 145 345 367 60 193 -93 213 -109 172 232 347 105
4145 105 66 225 146 -196 -136 -273 124 82 -93 144 -109 276 73 -158 42 -45 -39 -60 -29 47 38 -54 -218 -255 -41
4170 -41 -166 -233 46 26 -262 -179 -91 -193 -36 -174 -35 16 302 92 -84 -50 9 -314 80 -81 -208 -63 146
4193 146 246 133 198 119 202 239 87 74 -93 191 55 268 60 71 146 375 135 93 166 132 296 409 282
4216 282 -59 47 193 74 86 -73 95 45 86 -1 2 -258 -248 77 -56 73 -81 18 -87 -134 48 -159 -308
4239 -308 -28 -54 -134 -157 -287 -260 -176 -278 -41 -354 -138 -247 -185 -139 -137 -280 29 -162 -6 -308 94 55 -64
4262 -64 -105 -60 247 154 -175 -96 31 273 -143 261 -228 -123 309 152 182 204 25 93 -43 154 313 81 83
4285 83 244 15 44 31 -17 507 18 292 154 139 41 274 -24 105 -3 177 -35 -245 118 -8 -125 96
4307 96 -217 -111 165 -229 52 -101 -297 191 -131 -238 -169 -436 -73 -272 -217 -170 -252 46 -72 -559 -28 -57
4329 -57 -355 -151 -11 -284 32 -136 -59 209 -108 -161 -87 122 19 -52 10 294 -9 33 124 22 281 -114 -59
4352 -59 433 114 177 42 301 238 85 60 394 130 238 384 -99 390 89 80 164 -12 63 -4 -219 334 260
4375 260 -64 39 -88 -13 372 -271 108 68 45 172 -111 -92 125 -235 108 16 -13 220 -143 7 14 -356 109
4398 109 -172 -286 -62 -117 -373 -140 -355 14 -56 -123 255 -392 -385 439 176 -112 113 -195 229 -213 -143 205
4420 205 75 24 146 -173 144 367 -46 286 224 145 60 -268 265 62 79 244 278 111 199 37 -83 330
4442 330 294 183 27 139 92 -86 100 207 -88 323 -62 78 95 -214 -21 50 -83 58 -161 -195 59 -179
4464 -179 107 -202 -193 -157 -249 -187 48 -362 -6 -46 -373 -69 -190 -53 -116 2 21 -116 -262 43 -299 -238 10
4487 10 -296 187 146 -166 44 90 122 9 49 239 -44 -240 -35 155 -187 288 205 55 239 59 144 248
4509 248 132 87 59 117 190 -47 311 188 189 89 147 3 228 37 30 -77 114 217 20 -186 178 -35 88
4532 88 158 -2 172 -301 -137 161 -224 -19 -42 -334 232 -256 -120 11 -72 -142 -263 -244 -45 -115 -193 -14 -153
4555 -153 -117 -200 38 69 -42 -213 -8 -178 245 226 152 16 -201 16 16 -49 212 -21 -132 288 37 152 284
4578 284 152 199 88 -76 129 1 21 251 220 -15 178 -82 210 -129 -84 -30 -14 110 116 -88 -56 266 79
4601 79 205 -41 -104 -196 12 -163 -263 -28 58 -275 111 -24 -81 -73 -214 -59 32 -89 -120 -14 -180 -154 -10
4624 -10 -290 91 -98 -38 -113 -293 -39 -86 35 131 -209 30 -129 75 137 277 -106 -7 -131 67 217 -39
4646 -39 97 206 140 -82 186 83 51 56 106 81 13 329 100 -114 -5 106 24 485 34 216 210 97 115 46
4670 46 -22 312 -10 -25 -26 171 160 -231 -170 -118 62 -49 31 -132 -88 -105 -104 -71 -105 -178 -82 -216 -107 86 -130 -273
4696 -273 -125 -319 -92 -63 -93 -40 -195 -7 -83 -334 26 235 -182 111 -188 -210 -198 210 20 84 -132 62
4718 62 236 -13 164 -157 55 102 -75 166 45 134 -230 -5 208 200 178 55 71 144 392 127 -143 137 -286
4741 -286 -72 163 154 125 -130 94 35 32 118 37 49 26 -150 -26 135 48 -174 224 -30 104 -137 -26 -14 -137
4765 -137 -322 -132 -25 -67 -109 -319 -147 -165 -327 -190 -30 119 4 -304 -62 -278 -61 75 -133 -94 69
4786 69 -153 279 278 -119 12 -218 -72 128 -323 -54 -182 201 14 40 32 96 135 1 156 190 42 -120 169
4809 169 395 -22 137 159 95 192 -137 110 206 125 5 38 -88 -105 47 -91 32 166 -111 171 -160 181
4831 181 -125 -288 36 -166 -27 -125 -228 -66 -72 -129 -90 -146 -17 -204 -367 93 -372 -170 -77 -595 -217 -89
4853 -89 -281 -117 -36 -108 -49 -275 -239 140 -284 -18 152 -114 -142 25 -60 199 -167 -33 154 131 -55 -13 -117
4876 -117 311 201 90 373 81 308 -36 16 195 16 -112 -3 -70 74 69 74 85 23 121 20 77 -68 26 40
4900 40 91 -48 -240 -69 -198 113 200 -123 55 0 20 -50 -150 -176 8 7 -32 78 -34 55 -297 -288 180 -368
4924 -368 106 -136 -153 107 -166 250 -85 82 108 269 -237 51 -146 -94 112 -4 -49 184 141 137 -65 -205
4946 -205 183 135 342 257 -127 248 25 174 248 -39 260 198 221 183 154 -70 270 240 35 472 273 16 33
4969 33 90 111 -40 147 417 4 -72 219 -8 -71 -118 143 -25 -181 151 -218 -162 -10 -53 -183 194 -170 97
4992 97 224 -165 109 -2 -261 128 -79 -266 -85 -288 -82 -55 -330 -196 -52 -238 18 14 -43 93 -311 294
5014 294 1 -119 -43 5 172 0 117 -5 145 122 13 109 -123 -28 180 227 88 -60 235 230 51 258 58
5037 58 146 101 -73 259 -32 -23 -6 -94 -2 106 -16 298 108 -23 40 56 212 394 -86 -32 -30 -341 -83 -13 -6
5062 -6 99 -255 143 -100 -250 117 -249 -137 -86 -299 140 211 -73 -68 -133 -95 -60 -284 -245 178 -9 -110 -194 185
5086 185 266 -90 -111 138 -212 191 -128 -19 154 -176 186 -8 87 174 173 -2 320 111 102 293 24 35 169
5109 169 -122 79 -67 220 27 122 275 214 86 -213 82 110 106 -249 42 -48 -145 108 49 -19 313 -21 96
5132 96 140 -152 -153 -116 -159 -171 -200 -117 -2 -55 -209 91 -321 -217 -222 -269 -11 45 -70 46 -268 58 -112 -205 -156
5157 -156 -156 -127 -299 124 -118 -107 -210 32 5 213 129 -11 316 -58 151 214 43 196 -209 21 -77 -121 57
5180 57 206 -34 -105 134 -111 343 117 11 -18 0 238 51 36 -62 183 -46 53 -116 54 173 34 -281
5202 -281 -69 -37 52 -14 -57 -59 -77 -6 -179 -81 -164 -97 238 47 -169 106 -313 -201 -86 26 118 -5 -283 93
5226 93 -183 -196 -20 -183 -52 -42 4 -54 -178 144 113 -357 -22 82 28 190 -27 42 67 -145 144 -43 -76
5249 -76 347 -305 129 323 154 190 128 209 262 -54 99 45 -88 63 -216 -12 94 161 -150 98 -33 -22 147
5272 147 -233 114 87 -175 -127 -18 210 -25 44 229 150 -66 -4 -188 -3 -32 21 -72 -231 -79 103 -224 79
5295 79 107 -164 -169 138 150 85 -100 -103 265 -148 -154 -88 -130 225 -135 -68 69 95 73 54 58 325 -3 -102 277 176
5321 176 163 -98 -217 418 35 -49 177 104 38 415 8 4 116 -68 157 248 -21 290 -191 14 201 0
5343 0 104 -90 243 11 -67 147 302 -80 208 -333 94 414 -262 50 -88 -188 176 -403 187 45 -241
5364 -241 -15 194 -80 -82 -232 -246 218 -174 -291 -190 -19 -271 -25 -39 49 86 176 -107 -87 72 -161 -66 32
5387 32 -95 33 19 -74 37 -55 -69 -114 -55 76 -146 46 512 235 -144 -92 -21 204 -201 -264 269 -62 154
5410 154 150 -87 152 256 38 82 -7 -80 123 167 351 -89 -7 27 31 52 207 91 -139 166 -81 -81 48 -94
5434 -94 -85 -65 -164 -60 -192 -61 -21 -240 61 -117 -155 131 -266 -262 93 -191 -240 -101 -195 35 -167 -100 -120 -146 4
5459 4 -98 73 -142 -3 158 56 -114 39 -145 -162 226 -152 -128 62 11 -90 -148 246 11 -152 245 270
5481 270 56 70 117 -84 261 -61 10 267 138 182 235 211 103 110 -86 80 70 66 9 -15 -5 223 46 34 -110
5506 -110 -125 74 -86 -103 -306 -149 49 -256 -79 -213 -36 -179 -225 -191 -156 -139 156 -170 -72 87 -119 -401
5528 -401 -77 -131 -11 251 -19 -32 70 -224 -99 104 -395 -79 -30 25 179 -232 -85 -15 -75 72 40 126 128
5551 128 144 74 189 -61 -2 -92 82 87 253 132 132 123 74 -180 255 13 -51 269 85 91 207 35 -103 263 -181
5576 -181 9 -135 -226 156 -26 -20 -5 -124 -48 -175 -178 312 -40 -81 -104 -318 -161 -95 17 100 -170 -82 91 121
5600 121 -44 -71 -127 4 -269 -85 -24 11 1 60 -148 164 -22 -115 -32 53 107 133 86 -32 104 87 103 204 -55
5625 -55 242 -172 -85 84 -74 169 -170 -25 254 -87 82 215 39 73 218 182 42 93 178 -13 -92 350
5647 350 44 17 39 -68 110 -40 -136 202 -167 41 -98 -287 102 10 -231 -32 -42 13 -87 3 193 132 -81
5670 -81 -86 -68 -104 14 -278 -204 6 -263 -278 74 -161 -93 -18 145 119 -84 -189 66 22 279 20 234 166 -76
5694 -76 158 231 -79 74 6 176 380 202 -37 124 44 96 176 -25 225 -148 307 177 -170 -75 -42 -8 25
5717 25 -14 71 182 -187 141 163 -20 -12 110 122 110 -150 74 -146 -310 -152 -177 -13 58 -172 64 111 -135 176
5741 176 -80 -169 152 -93 -312 7 130 -61 -98 -202 -310 -60 97 -184 -205 -104 -39 -104 10 36 62 -158
5763 -158 -45 129 70 -278 37 120 16 269 -169 95 125 -286 -5 -94 -105 197 -154 331 140 113 -101 288
5785 288 107 -24 -103 16 11 -122 19 12 148 172 -27 112 103 135 136 -15 56 142 -77 44 7 -10 52 100 -210 138
5811 138 14 64 -198 -8 -96 -190 -66 70 93 -123 5 -167 73 60 -107 277 141 -42 -68 -119 -137 93 -100
5834 -100 -6 -76 26 82 121 -87 164 61 287 55 1 215 -120 198 -27 191 15 39 54 384 3 149
5856 149 336 61 -68 8 68 29 80 -54 144 91 -12 41 211 -66 51 -130 9 -87 -35 -152 113 122 -61
5879 -61 65 245 -44 79 -328 -471 25 -162 -270 152 -144 -77 -138 -53 -58 -9 -206 -141 74 129 -37 -23 135
5902 135 -98 -199 53 -119 4 231 -20 -103 -47 -47 -108 -111 -51 9 -104 19 27 -280 -164 -166 -309 61 -64 -10 157
5927 157 121 194 -33 -224 -32 -141 142 78 111 187 73 215 37 367 -1 -90 89 28 -148 -143 70 60 28 67
5951 67 5 -144 167 -15 -89 -172 -109 -82 -124 77 29 -4 -141 -78 -221 -69 -8 -276 -106 77 42 -309 -203 -50
5975 -50 117 -320 -67 -61 -301 -118 43 67 -8 143 -68 -39 -86 -99 -34 -168 178 73 -59 -91 124 111 54 291
5999 291 80 85 18 265 267 148 34 -10 -168 239 7 85 10 248 186 -206 236 -113 44 104 0 137 144 -324
6023 -324 -94 -16 91 -100 8 -100 181 -135 145 -239 -11 -27 -136 -22 -334 31 -184 13 202 -334 -60
6044 -60 -148 -188 -245 -5 -95 -137 -89 -56 -310 -138 -145 -4 -96 -14 2 -240 -19 -76 189 34 121 -219 76 71 -82 -4
6070 -4 153 83 137 301 148 203 -172 92 148 25 442 225 126 155 189 -120 110 44 182 14 325 263 48 232
6094 232 309 26 -56 153 128 83 -84 63 -218 -56 75 120 -108 47 59 -143 -22 -208 -162 -247 0 -210 7
6117 7 -8 -38 -15 -145 142 -67 -93 -189 71 -290 -165 130 29 220 135 58 64 93 -31 5 -13 41 -75 8 151
6142 151 115 60 -105 5 148 73 67 188 181 -14 162 120 112 -33 14 57 49 221 -175 152 129 12 101 41 16 185
6168 185 223 116 75 200 103 -19 -58 -96 25 -92 198 -49 -135 -144 -246 -198 -168 19 -53 -60 108 -36 -221 -167 -95
6193 -95 -74 -49 -338 -324 251 -194 -82 101 -110 -151 -220 -141 -182 -17 -191 23 -49 24 104 -76 -19 135 55 146 -39
6218 -39 34 -40 135 259 8 79 102 145 55 310 70 122 -21 102 238 105 -115 76 77 136 114 10 -48 -75 78
6243 78 -33 144 20 -191 31 124 35 113 70 16 -133 130 59 102 -205 2 -216 -176 -189 25 -68 -16 -354 26
6267 26 34 -259 -23 -154 76 -147 22 153 77 -173 -63 -212 114 127 -31 -48 -138 -284 -9 140 -112 -52 6
6290 6 38 -201 144 112 -81 -184 238 -149 223 193 239 155 -18 -349 335 225 -85 237 116 17 -28 -3 111
6313 111 304 -176 173 -18 406 -65 102 163 -209 107 197 130 0 -129 -70 75 -98 -129 -243 239 -25 2
6335 2 36 -14 -194 114 222 -243 -12 34 -268 -43 -111 113 -73 67 -19 -56 -86 21 -192 -110 -130 29 3 -120
6359 -120 67 -125 85 2 -80 101 34 225 130 31 1 -175 103 214 55 340 133 -210 142 70 82 33 119
6382 119 203 94 70 153 -6 -19 110 121 49 119 38 -117 90 -18 66 -188 -174 -120 142 189 -8 -92 -293 -103
6406 -103 -211 -32 -93 152 36 153 357 -146 -127 -139 -124 33 89 -169 121 -121 -6 85 -267 -21 -41 -255
6428 -255 -149 -122 -24 94 95 4 -67 -102 25 264 -55 137 70 164 83 1 -79 -82 135 48 105 341 -19 146 182 -62
6454 -62 45 37 306 147 119 175 -16 75 228 -169 -146 31 58 108 -48 -26 -173 57 -90 133 155 -146 79 0
6478 0 124 153 6 97 -57 -29 -127 -190 -86 -252 -218 -125 31 -306 -119 -214 -149 44 21 -36 93 -449 122 -101
6502 -101 -277 229 -311 94 252 -81 48 -252 67 -49 -112 -130 25 74 -164 -39 101 329 13 198 253
6523 253 146 -84 -53 13 16 165 145 131 -2 -118 203 -117 -143 26 -187 -21 -197 327 60 -87 95 13 -10
6546 -10 28 -55 231 45 137 -38 37 -187 7 81 -212 56 -3 11 -232 -251 72 -203 54 51 -82 108 6 43
6570 43 81 -299 -187 -50 -259 -48 54 -204 -28 -122 -178 -10 88 129 36 -112 30 21 -117 173 69 -70 -18
6593 -18 -22 302 56 108 24 60 68 160 122 227 23 89 125 306 11 75 132 -115 246 145 42 -21 -59 198 75
6618 75 -33 86 115 -50 -78 -96 -44 -156 76 -100 -168 -130 -12 17 216 -17 91 145 -159 -58 5 -5 -160 -9
6642 -9 -64 81 -124 138 86 183 -113 -301 -19 3 -61 64 -189 -126 53 -148 -76 -102 -12 184 -54 97 142 -95
6666 -95 90 126 -239 95 112 -31 -110 -50 -136 7 11 -20 147 17 -30 -90 -203 299 -77 -132 74 142 160 -180 24
6691 24 -44 49 146 18 -178 33 -226 -129 307 76 135 82 98 -10 63 -173 228 -222 47 128 -181 268 -224
6714 -224 69 -83 -165 -103 -89 68 -71 -11 -189 -63 -311 -81 78 -176 -167 -13 -60 -138 -83 -177 -43 -103 -38 308
6738 308 -78 256 -64 -6 62 -18 96 -75 -137 110 -29 -38 68 108 -95 202 34 50 192 87 155 -212 228
6761 228 135 -105 40 -16 193 4 -123 -20 35 -145 138 312 21 -25 -55 142 37 -221 -120 117 -64 118
6783 118 -129 62 88 110 105 43 -58 -78 -305 -244 -59 100 -120 -18 124 114 -74 -54 108 29 -88 -222 -419
6806 -419 72 -250 -131 -155 -53 17 -26 -228 130 98 -256 13 -60 5 -29 -78 166 127 90 299 25 70 -26 183
6830 183 29 87 33 -221 -158 19 -252 91 256 -66 -31 190 -14 44 -32 -160 110 229 79 16 -196 -262 46
6853 46 84 -229 6 -43 30 124 -312 134 -243 0 183 -20 39 63 -46 -131 -43 -20 -207 126 -89 -66 -79 -107
6877 -107 -214 -332 -49 -70 -160 -72 -178 111 -173 -129 45 -270 -243 234 -5 89 58 -216 174 256 204 161 56
6900 56 40 -237 144 292 71 52 -87 -230 112 -27 119 1 159 85 344 57 239 38 14 131 -97 94
6922 94 -62 -11 363 -24 140 61 -34 26 -124 -96 12 -16 -48 143 117 -96 -8 78 48 -225 -230 -112 -26 20 163
6947 163 -61 -89 46 -312 10 155 23 -55 257 -61 39 22 -53 197 -111 193 -146 -24 -38 -121 -162 30
6969 30 -85 -210 -37 35 10 -156 110 30 -167 5 119 249 57 -148 1 -85 3 159 -13 182 -139 169
6991 169 60 251 78 43 182 11 -57 53 149 94 58 84 131 253 -188 98 0 273 133 -49 172 -49 -238
7014 -238 -5 103 -29 202 -289 -180 -35 -231 -307 46 -179 -228 -203 -21 -27 -33 -174 -111 -93 -249 -60 133 118
7037 118 -137 -87 103 -161 82 17 102 -9 -5 49 -145 72 -81 -229 201 147 33 114 -32 264 207 -48 132
7060 132 60 -225 23 8 30 39 10 -225 -45 147 -185 -43 156 193 3 49 94 -175 -44 5 13 -79 -244 -146 -63
7085 -63 -323 -25 145 -115 -135 -187 -133 -111 -221 -158 -53 -150 23 -146 89 54 -15 -98 -131 -140 -241 28 -167 -154 30
7110 30 4 -35 -10 20 -17 -81 335 -52 -131 18 173 -93 10 -28 -8 57 -103 18 173 7 -19 53 43 291 -105
7135 -105 108 169 267 123 33 -45 -97 -250 72 -38 -169 276 267 -248 -48 -96 -26 254 226 -273 46 14 -38 -24
7159 -24 -132 -325 -144 -107 50 -102 -224 -23 -302 -103 247 99 -123 -268 -70 65 -178 -223 -173 -71 -118 15
7181 15 -40 -79 -79 -84 109 -7 -34 103 -78 -38 37 -44 -264 -31 3 15 138 87 -174 -112 135 37 150 172 91 53
7207 53 -118 139 32 -84 -157 -192 -8 -136 -30 2 82 77 193 -193 -50 -31 136 43 82 290 -81 -175 75 -16
7231 -16 -321 184 96 -52 -51 -49 -19 92 -20 -50 -162 3 133 -42 115 -47 -37 -335 25 -60 -198 101 -23
7254 -23 13 23 51 170 -1 -97 -30 69 24 133 104 -76 -148 208 -168 158 -113 115 190 172 47 45 199 -87 189
7279 189 -114 -17 41 137 121 -37 -189 172 -73 -14 93 67 242 46 -22 117 518 258 152 -28 48 43 -139
7302 -139 -99 -175 -27 164 274 -90 -56 227 -58 -44 -33 -77 97 64 12 133 172 -7 55 174 -105 -6 -124 54
7326 54 16 -182 -161 -44 -85 33 8 -80 45 -204 -63 -236 -124 -240 41 136 254 89 166 117 -75 176 68
7349 68 205 249 -25 145 279 -49 19 107 58 50 220 27 63 -27 -32 -87 1 -81 55 21 -55 63 -106 36 314
7374 314 -156 18 24 -78 -90 -165 -106 91 -135 30 144 13 134 -193 -229 1 172 38 97 -145 108 53 -47
7397 -47 54 -242 -91 -43 46 -99 -40 -178 369 -83 -102 146 159 117 0 168 76 5 -198 -93 64 141 -93
7420 -93 -113 100 92 87 130 -104 84 83 -31 94 30 183 134 -63 -35 16 121 214 286 90 234 -23 -223 -7 59
7445 59 180 -26 184 -283 -258 183 160 -157 54 240 2 179 144 42 64 -38 316 -24 -224 41 -32 32
7467 32 -120 33 40 59 -343 -20 58 -40 67 -211 241 -181 -182 147 51 131 37 -94 -210 -93 -68 -77 59 -168 80
7492 80 -40 44 92 181 -14 -81 64 -198 288 -71 55 -370 71 -25 -131 105 171 31 26 369 241 -3 -161
7515 -161 189 118 -165 213 168 125 170 -60 60 8 -124 -238 168 239 147 176 101 -105 -106 124 -94 65 -62 80
7539 80 113 -83 118 -49 65 -206 -285 -104 -31 39 -226 10 -37 -45 -25 -26 82 31 96 88 57 -2 54 -50 111 -55
7565 -55 294 280 123 55 124 29 27 158 -100 36 35 167 2 -274 -68 265 -126 6 -12 61 105 209 102 -215
7589 -215 193 -16 -2 -66 144 172 48 33 -34 -119 11 -278 90 -124 168 -4 69 -66 284 168 -332 50
7611 50 -153 99 -193 -59 12 -160 -138 -82 -56 -58 -57 -259 -96 113 115 -141 -123 223 40 135 -40 -300 -192 123
7635 123 -72 129 58 -76 -210 20 6 -196 -60 177 82 94 32 93 -167 -43 108 -63 -87 182 339 128
7657 128 144 62 5 47 3 -109 126 72 63 -124 115 135 -119 -103 147 -26 24 -361 179 32 -412 33 59 -124
7681 -124 -56 222 34 106 90 -41 -173 -21 6 -44 12 16 107 -179 53 240 156 -65 -357 -43 282 54 -215
7704 -215 -33 -163 119 107 1 13 -174 28 338 -296 35 -274 -140 90 44 18 70 -60 163 57 -15 105
7726 105 90 105 15 189 76 97 -106 -14 -50 -36 192 -60 20 73 -131 150 -81 -236 -24 50 -139 -151 223 -96
7750 -96 71 193 -228 40 -100 -210 -72 -10 0 -124 -191 -18 47 117 -124 435 30 42 99 -188 239 165 -77
7773 -77 -41 -241 -164 -36 -43 6 3 -166 158 66 -92 118 -105 72 141 71 18 -41 -57 276 28 -170 106 -80 -45
7798 -45 215 67 -56 140 15 -332 210 75 40 74 -74 10 -34 50 -44 193 -19 -51 264 121 -29 70 -25
7821 -25 106 -86 101 53 -117 43 98 211 102 -255 -104 63 -141 -46 -18 3 -47 11 119 172 -24 -17 -323 -54
7845 -54 -59 63 3 189 -104 -59 -27 157 159 -14 167 -11 222 324 -35 -159 -322 97 19 55 213 -115 50
7868 50 -145 -34 137 14 6 256 2 45 154 -137 223 -235 -171 -2 196 213 24 -100 74 -76 -18 315
7890 315 121 -107 -157 32 68 129 -22 -58 107 -84 150 79 200 73 -48 -35 286 -119 98 12 -124 17
7912 17 284 -131 -191 185 28 -25 -158 49 -201 -186 -301 16 -11 -200 -279 9 -178 258 -5 162 2 -108
7934 -108 -7 -240 -210 -263 -82 129 -196 -51 -70 -130 184 -83 213 -261 13 -40 -244 161 164 116 -10 76 -24
7957 -24 75 7 -113 -100 152 119 2 87 111 48 61 -3 152 -162 56 -278 -229 -189 223 223 -124 129 119 -38 -70
7982 -70 -107 -24 -310 -225 314 -306 -12 -48 138 -45 -171 185 -1 -53 28 -24 188 42 250 191 -112 55 90
8005 90 -126 82 123 -65 104 -129 -22 38 -196 -11 -20 -304 -8 1 52 -82 -122 -36 314 117 -18 -17 123 67
8029 67 227 49 57 28 -116 -45 101 111 -52 113 147 -161 -340 60 161 90 33 0 -82 51 127 92 -27 -149
8053 -149 161 -61 -70 -170 60 -245 44 -161 35 -196 -172 -25 2 -148 166 156 -143 -103 -203 -80 83 -19
8075 -19 140 -22 -84 8 -85 -36 173 78 -193 -115 -29 -68 67 17 -80 -207 101 123 73 -139 200 166 -70 -96 44
8100 44 -80 124 -143 140 233 140 -72 96 162 -197 -173 69 157 -33 95 21 9 -4 -42 -82 -162 256 -100 49
8124 49 -77 53 -32 -199 -19 24 142 -60 155 -100 -80 -225 -70 -25 32 70 59 -87 8 23 -26 123 -35 -345
8148 -345 -35 6 -93 59 -105 87 -17 -4 30 -27 -225 173 1 -67 -99 53 -31 -215 308 135 -76 -32 -243
8171 -243 -43 150 -123 -95 204 1 -48 90 -6 97 -131 105 91 274 -85 169 68 59 154 204
8191B04
##END NTUPLES=NMR FID
##END=
