##TITLE=1H_SAV-32-singlet-bat4
 CDCl3, 8 sc, 
 30.10.2020
##JCAMPDX= 6.0         $$ Bruker NMR JCAMP-DX V2.0
##DATA TYPE= NMR FID
##DATA CLASS= NTUPLES
##ORIGIN= UXNMR, Bruker Analytische Messtechnik GmbH
##OWNER= root
$$ XWIN-NMR		Version 3.5
$$ Fri Oct 30 10:10:10 2020 Russian Standard Time (UT+4h)  she@DPX200
##.OBSERVE FREQUENCY= 200.1315066352
##.OBSERVE NUCLEUS= ^1H
##.DELAY= (6, 6)
##.ACQUISITION MODE= SIMULTANEOUS
##.ACQUISITION SCHEME= undefined
##.AVERAGES= 8
##.DIGITISER RES= 18
##SPECTROMETER/DATA SYSTEM= spect
##.PULSE SEQUENCE= zg30
##.SOLVENT NAME= CDCl3
##.SHIFT REFERENCE= (INTERNAL, CDCl3, 0, 15.7039)
##AUDIT TRAIL= $$ (NUMBER, WHEN, WHO, WHERE, WHAT)
$$ ##TITLE= Audit trail, XWIN-NMR		Version 3.5
$$ ##JCAMPDX= 5.01
$$ ##ORIGIN= Bruker BioSpin GmbH
$$ ##OWNER= she
$$ F:/spectra/data/she/nmr/H-F/1/audita.txt
$$ ##AUDIT TRAIL=  $$ (NUMBER, WHEN, WHO, WHERE, WHAT)
(   1,<2020-10-30 10:09:03.82 +0400>,<she>,<DPX200>,
      <created by zg, POWCHK disabled, PULCHK disabled
       configuration hash MD5:
       00 E9 B6 7A A2 85 ED C7 34 08 36 98 17 FE 4E 26
       data hash MD5: 16K
       8B FC E6 89 6F D5 0A 27 4C C6 F1 95 EE 89 0F 30>)
$$ ##END=
$$ 
$$ hash MD5
$$ 82 93 C8 EE E9 53 AC E1 F2 F7 E1 37 27 DD B4 02
##$RELAX= 
##$RELAX= 
##$RELAX= 
##$RELAX= 
##$RELAX= 
##$RELAX= 
$$ Bruker specific parameters
$$ --------------------------
##$DU= <F:/spectra>
##$EXPNO= 1
##$NAME= <H-F>
##$PROCNO= 1
##$TYPE= <nmr>
##$USER= <she>
##$AMP= (0..31)
100 100 100 100 100 100 100 100 100 100 100 100 100 100 100 100 100 100 
100 100 100 100 100 100 100 100 100 100 100 100 100 100 
##$AQSEQ= 0
##$AQ_mod= 1
##$AUNM= <au_zg>
##$AUTOPOS= <>
##$BF1= 200.13
##$BF2= 200.13
##$BF3= 200.13
##$BF4= 200.13
##$BF5= 200.13
##$BF6= 200.13
##$BF7= 200.13
##$BF8= 200.13
##$BYTORDA= 1
##$CFDGTYP= 0
##$CFRGTYP= 5
##$CHEMSTR= <none>
##$CNST= (0..31)
1 1 145 1 1 1 1 1 1 1 1 1 1 1 1 1 1 1 1 1 1 1 1 1 1 1 1 1 1 1 1 1 
##$CPDPRG= <>
##$CPDPRG1= <>
##$CPDPRG2= <>
##$CPDPRG3= <>
##$CPDPRG4= <mlev>
##$CPDPRG5= <mlev>
##$CPDPRG6= <mlev>
##$CPDPRG7= <mlev>
##$CPDPRG8= <mlev>
##$CPDPRGB= <>
##$CPDPRGT= <>
##$D= (0..31)
0 1.2 0 0 0 0 0 0 0 0.06 0 0.03 0 0 0 0 0.0002 0 0 0 0 0 0 0 0 0 0 0 0 
0 0 0 
##$DATE= 1604038143
##$DBL= (0..7)
120 120 120 120 120 120 120 120 
##$DBP= (0..7)
150 150 150 150 150 150 150 150 
##$DBP07= 0
##$DBPNAM0= <>
##$DBPNAM1= <>
##$DBPNAM2= <>
##$DBPNAM3= <>
##$DBPNAM4= <>
##$DBPNAM5= <>
##$DBPNAM6= <>
##$DBPNAM7= <>
##$DBPOAL= (0..7)
0.5 0.5 0.5 0.5 0.5 0.5 0.5 0.5 
##$DBPOFFS= (0..7)
0 0 0 0 0 0 0 0 
##$DE= 6
##$DECBNUC= <off>
##$DECIM= 32
##$DECNUC= <off>
##$DECSTAT= 4
##$DIGMOD= 1
##$DIGTYP= 9
##$DL= (0..7)
0 120 120 120 120 120 120 120 
##$DP= (0..7)
150 150 150 150 150 150 150 150 
##$DP07= 0
##$DPNAME0= <>
##$DPNAME1= <>
##$DPNAME2= <>
##$DPNAME3= <>
##$DPNAME4= <>
##$DPNAME5= <>
##$DPNAME6= <>
##$DPNAME7= <>
##$DPOAL= (0..7)
0.5 0.5 0.5 0.5 0.5 0.5 0.5 0.5 
##$DPOFFS= (0..7)
0 0 0 0 0 0 0 0 
##$DQDMODE= 0
##$DR= 18
##$DS= 0
$$ [...]
##$SUBNAM2= <"">
##$SUBNAM3= <"">
##$SUBNAM4= <"">
##$SUBNAM5= <"">
##$SUBNAM6= <"">
##$SUBNAM7= <"">
##$SUBNAM8= <"">
##$SUBNAM9= <"">
##$SW= 16.880792210976
##$SWIBOX= (0..15)
0 0 2 0 0 0 0 0 0 0 0 0 0 0 0 0 
##$SW_h= 3378.37837837838
##$TD= 16384
##$TD0= 1
##$TE= 0
##$TE2= 300
##$TE3= 300
##$TEG= 300
##$TL= (0..7)
0 120 120 120 120 120 120 120 
##$TP= (0..7)
150 150 150 150 150 150 150 150 
##$TP07= 0
##$TPNAME0= <>
##$TPNAME1= <>
##$TPNAME2= <>
##$TPNAME3= <>
##$TPNAME4= <>
##$TPNAME5= <>
##$TPNAME6= <>
##$TPNAME7= <>
##$TPOAL= (0..7)
0.5 0.5 0.5 0.5 0.5 0.5 0.5 0.5 
##$TPOFFS= (0..7)
0 0 0 0 0 0 0 0 
##$TUNHIN= 0
##$TUNHOUT= 0
##$TUNXOUT= 0
##$USERA1= <user>
##$USERA2= <user>
##$USERA3= <user>
##$USERA4= <user>
##$USERA5= <user>
##$V9= 5
##$VALIST= <valist>
##$VCLIST= <CCCCCCCCCCCCCCC>
##$VD= 0
##$VDLIST= <DDDDDDDDDDDDDDD>
##$VPLIST= <PPPPPPPPPPPPPPP>
##$VTLIST= <TTTTTTTTTTTTTTT>
##$WBST= 1024
##$WBSW= 4
##$XGAIN= (0..3)
0 0 0 0 
##$XL= 0
##$YL= 0
##$YMAX_a= 168260
##$YMIN_a= -163075
##$ZGOPTNS= <>
##$ZL1= 120
##$ZL2= 120
##$ZL3= 120
##$ZL4= 120
##$ABSF1= 10
##$ABSF2= 0
##$ABSG= 5
##$ABSL= 3
##$ALPHA= 0
##$AQORDER= 0
##$ASSFAC= 0
##$ASSFACI= 0
##$ASSFACX= 0
##$ASSWID= 0
##$AUNMP= <proc_1d>
##$AZFE= 0.1
##$AZFW= 0.1
##$BCFW= 1
##$BC_mod= 2
##$BYTORDP= 1
##$COROFFS= 0
##$CY= 11.3945322036743
##$DATMOD= 1
##$DC= 2
##$DFILT= <>
##$DTYPP= 0
##$F1P= 15.9154993809931
##$F2P= -4.1035820241983
##$FCOR= 0.5
##$FTSIZE= 0
##$FT_mod= 4
##$GAMMA= 1
##$GB= 0.15
##$INTBC= 1
##$INTSCL= 1
##$ISEN= 128
##$LB= 0.24
##$LEV0= 0
##$LPBIN= 0
##$MAXI= 10000
##$MC2= 0
##$MEAN= 0
##$ME_mod= 0
##$MI= 1.114404
##$NCOEF= 0
##$NC_proc= 0
##$NLEV= 6
##$NOISF1= 3.799351
##$NOISF2= 2.8
##$NSP= 1
##$NTH_PI= 0
##$NZP= 0
##$OFFSET= 15.70392
##$PC= 1
##$PHC0= -10689.25
##$PHC1= 11.80088
##$PH_mod= 1
##$PKNL= yes
##$PPARMOD= 0
##$PSCAL= 0
##$PSIGN= 0
##$REVERSE= no
##$SF= 200.130013532006
##$SI= 16384
##$SIGF1= 3
##$SIGF2= 2
##$SINO= 400
##$SIOLD= 16384
##$SREGLST= <1H.CDCl3>
##$SSB= 0
##$STSI= 0
##$STSR= 0
##$SW_p= 3612.71676300578
##$SYMM= 0
##$S_DEV= 0
##$TDeff= 0
##$TDoff= 0
##$TI= <>
##$TILT= no
##$TM1= 0
##$TM2= 0
##$TOPLEV= 0
##$USERP1= <user>
##$USERP2= <user>
##$USERP3= <user>
##$USERP4= <user>
##$USERP5= <user>
##$WDW= 1
##$XDIM= 8192
##$YMAX_p= 0
##$YMIN_p= 0
$$ End of Bruker specific parameters
$$ ---------------------------------
##NTUPLES= NMR FID
##VAR_NAME=  TIME,          FID/REAL,        FID/IMAG
##SYMBOL=    X,             R,               I
##VAR_TYPE=  INDEPENDENT,   DEPENDENT,       DEPENDENT
##VAR_FORM=  AFFN,          ASDF,            ASDF
##VAR_DIM=   8192,          8192,            8192
##UNITS=     SECONDS,       ARBITRARY UNITS, ARBITRARY UNITS
##FACTOR=    0.000296,      1,               1
##FIRST=     0,             0,               0
##LAST=      2.424536,      0,               0
##MIN=       0,             -163075,         0
##MAX=       2.424536,      168260,          0
$$ Real data points
##PAGE= N=1
##DATA TABLE= (X++(R..R)), XYDATA
$$ [...]
2228B065k236k330K511J722l137l55K666K56l007J55K950o22k788J299K653k050
$$ 2065 -171 -2501 10 1732 -1405 -1760 906 1162 -1845 -1690 1260 638 -2150 -851 1802 -248
2244b48j904K417J431k770p59K559O66l114N46K873q34k597J444K158j865j926
$$ -248 -2152 265 1696 -1074 -1833 726 1392 -1722 -1176 1697 863 -1734 -290 1868 3 -1923
2260a923K632J260k676p16K713K09k786N68K820j207k318J601J797j652j825K109
$$ -1923 709 1969 -707 -1423 1290 1499 -1287 -719 2101 894 -1424 177 1974 322 -1503 606
2276F06J289k219q06K530J27k364j7K688j168k239J569J739j914j463K199P37
$$ 606 1895 -324 -1130 1400 1527 -837 -854 1834 666 -1573 -4 1735 -179 -1642 557 1294
2292A294k137m62K134J99k377K57K327o28k184R86J897j683j371J848R28j960
$$ 1294 -843 -1305 829 1028 -1349 -1092 1235 607 -1577 -591 1306 -377 -1748 100 1028 -932
2308i32q23K388K02k350M26J910n26j989J076K008j645j499K072R35k034p03K145
$$ -932 -1755 633 835 -1515 -1089 821 295 -1694 -618 1390 -255 -1754 318 1253 -781 -1484 661
2325F61M21k173J25K463j111j638R63J824j506j352J846J142j969r58K456P9k174
$$ 661 1082 -1091 -966 1497 386 -1252 -289 1535 29 -1323 523 1665 -304 -1262 1194 1273 -901
2342i01J20K292o59k137J139J913j581j071J596Q93k074p92K647r1k118M15J663
$$ -901 -781 1511 852 -1285 -146 1767 186 -885 711 1604 -470 -1262 1385 1294 -824 -409 1254
2359A254m80k143P57K336j622j617J751J191k324m59K107K58k210p2K221m94k246
$$ 1254 774 -1369 -612 1724 102 -1515 236 1427 -897 -1356 751 1009 -1201 -1273 948 454 -1792
2376a792J372J737j443j532J443J440j893r33K187J76k001L63J779n68j850R44
$$ -1792 -420 1317 -126 -1658 -215 1225 -668 -1601 586 762 -1239 -876 903 335 -1515 -571
2392e71J237q09j771K148P81j717m64J777L41k036M23K146j101j804J406J131
$$ -571 666 -143 -1914 234 1015 -702 -1166 611 952 -1084 -661 1485 384 -1420 -14 1117
2408A117q22j405J383R07j654k16J637R0j743J24J754j79j874Q90J616j595r47
$$ 1117 295 -1110 273 1180 -474 -690 947 1037 -706 -582 1172 993 -881 9 1625 30 -917
2425i17J564O97j617m03J712J93j983N3J774n24j479Q54J349j093j435J458Q43
$$ -917 647 1344 -273 -676 1036 1229 -754 -701 1073 549 -930 -76 1273 180 -1255 203 1046
2442A046j448q32K047j75j450J58J497o32j433O96J340r39j199J142J019j379
$$ 1046 -402 -1234 813 638 -812 -654 843 211 -1222 -526 814 -125 -1324 -182 837 -542
2458e42q54J589O34k011M12J514o25j329M55J592o66j342O55J471j316r47J545
$$ -542 -1396 193 827 -1184 -772 742 117 -1212 -757 835 169 -1173 -518 953 -363 -1310 235
2475B35Q71j843k66J757O8j668M08J627q23j511J165J356j108j210J592N17j679
$$ 235 1106 -737 -1003 754 822 -846 -438 1189 366 -1145 20 1376 268 -942 650 1167 -512
2492e12M4J327j15j105O2J603o88j514R63J415j314j137J747L27j743j16J647
$$ -512 -468 859 744 -361 -299 1304 616 -898 65 1480 166 -971 776 1103 -640 -756 891
2509H91j57j410J91J679p66j455R96J342j669o00J170P19j570k26J592j34j979
$$ 891 734 -676 -485 1194 428 -1027 -31 1311 -358 -958 212 931 -639 -865 727 593 -1386
2526a386O21J577p16j508J185J376j309j549J738Q28j687n36J948P4k015O48J547
$$ -1386 -765 812 96 -1412 -227 1149 -160 -1709 29 857 -830 -1366 582 656 -1359 -711 836
2543H36q38j517J110J356j078j201J657O29j738l43J688J71j699N13J724r72j328
$$ 836 -2 -1519 -409 947 -131 -1332 325 954 -784 -1127 561 732 -967 -454 1270 298 -1030
2560a030J021J233j059j108J507O72j653k68J871j89j943N40J529p97j341J166
$$ -1030 -9 1224 165 -943 564 1236 -417 -685 1186 997 -946 -406 1123 326 -1015 151
2576A51J220j057j676K097P24k162p3K062k94k116R27J430q19j573J126J313j335
$$ 151 1371 314 -1362 735 1459 -703 -776 1286 992 -1124 -197 1233 414 -1159 -33 1280 -55
2593e5j189J630M74j543o92J978K34j945K44K082q41j776J003J162r88j224J519
$$ -55 -1244 386 860 -683 -1375 603 837 -1108 -864 1218 377 -1399 -396 766 -222 -1446 73
2610G3O10j624m17K073l7j635j70K098q70j601J255J146q38j381J364R82j704
$$ 73 683 -941 -1358 715 678 -957 -1127 971 101 -1500 -245 901 63 -1318 46 1028 -676
2627f76m54J880j45j542J97J766k35k021J316J269j406j054J802Q28j866k76J958
$$ -676 -1130 750 605 -937 -740 1026 791 -1230 86 1355 -51 -1105 697 1525 -341 -617 1341
2644A341k45j805K66J757p40j572Q08J619j177j317J564J268k111l66J945j92
$$ 1341 1096 -709 -443 1314 574 -998 -190 1429 252 -1065 499 1767 -344 -710 1235 1043
2660A043k037L44J861o56j839J285J338j705q32J493P57j581o45J820K93k172
$$ 1043 -994 -650 1211 555 -1284 1 1339 -366 -1198 295 1052 -529 -1174 646 939 -1233
2676a233N91J937j159j719R63J629j378q47J494L45j510k23J458M01k239R61J418
$$ -1233 -642 1295 136 -1583 -620 1009 -369 -1216 278 623 -887 -1110 348 749 -1490 -529 889
2693H89o76j435J095J398j462j303J843R72k369j6J696j20j649O71J711q07j377
$$ 889 213 -1222 -127 1271 -191 -1494 349 1321 -1048 -1064 632 512 -1137 -466 1245 438 -939
2710i39Q41J386j124j131J563R28k007%J611k55j720L42J991j216j545J775R06
$$ -939 -98 1288 164 -967 596 1524 -483 -483 1128 873 -847 -505 1486 270 -1275 500 1406
2727A406j475o65J473M05j650m58K087q4j883M58J784j064j557J228J339j530
$$ 1406 -69 -734 739 1144 -506 -964 1123 1039 -844 -386 1398 334 -1223 5 1344 -186
2743a86j228J872M44j795r5K052m65j790M63J671r67j507J320J169j267r71J475
$$ -186 -1414 458 902 -893 -988 1064 599 -1191 -728 943 -24 -1531 -211 958 -309 -1280 195
2760A95O16j789l17J816o1j828N60J742o98j524J175J009j207j200J933N60j872
$$ 195 811 -978 -1295 521 460 -1368 -808 934 236 -1288 -113 896 -311 -1511 422 982 -890
2777h90J79J695n62j579Q90J564j036j256J070J018j329q90J732O08j671k76J878
$$ -890 -711 984 422 -1157 -267 1297 261 -995 75 1093 -236 -1126 606 1214 -457 -733 1145
2794A145j89j571N56J433p70j590J140J034j174m74J031N97j539k48J779m19j510
$$ 1145 956 -615 -59 1374 604 -986 154 1188 14 -460 571 1168 -371 -619 1160 741 -769
2811g69M56J422p24j306J107J034j380q22J296N98j611m02J700k52j429N78J377
$$ -769 -313 1109 385 -921 186 1220 -160 -982 314 912 -699 -1101 599 347 -1082 -504 873
2828H73j071j056J105J055j345r26J595N94j611j50J611j47j577N56J481r60j146
$$ 873 -198 -1254 -149 906 -439 -1365 230 824 -787 -937 674 527 -1050 -494 987 27 -1119
2845a119J125O11r96o54J639K14j414j99J586L9j814P34J265r01j071R64J188
$$ -1119 6 617 -379 -1033 606 820 -594 -793 793 832 -982 -248 1017 116 -955 9 1197
2862A197j018j029J519K91j649L88J357m39j312N94J248r64q14J169O67j277o90
$$ 1197 179 -850 669 960 -689 -301 1056 617 -695 -101 1147 183 -631 538 1205 -72 -762
2879g62J380N49j603MJ319m32j247M40J177o38r76O26J273j291p82J321L20j294
$$ -762 618 1167 -436 -432 887 455 -792 -352 825 187 -789 -163 1110 -181 -963 358 678 -616
2897f16m35J607m8j475K82J368o65j262J150P23r26q22J199N55j307l29J483k74
$$ -616 -1051 556 508 -967 -685 683 18 -1244 -94 629 -297 -1119 80 635 -672 -1001 482 208
2915B08j288O24J098m01j439R66Q92r08p49J113N62j080k69J376m5j847Q99J352
$$ 208 -1080 -456 642 241 -1198 -232 660 -248 -997 116 678 -402 -671 705 660 -1187 -288 1064
2933A064q31j388J527N87j185l79J198M01j224k72J241k83j321N31J359m82j266
$$ 1064 233 -1155 372 959 -226 -605 593 994 -230 -502 739 456 -865 -334 1025 543 -723
2950g23Q81Q54j205o06J397N67j366k85J266l01j238N49J270q88j132R74Q91j093
$$ -723 158 1012 -193 -799 598 1165 -201 -486 780 479 -759 -210 1060 172 -960 14 905 -188
2968a88q06J350L86j130m03J529j11j485J94J513p85j228Q61O58n58q87R22Q30
$$ -188 -994 356 742 -388 -791 738 627 -858 -664 849 64 -1164 -303 355 -203 -1090 -168 662
2986F62j434r2J369k40j025K21J076n30j042P71R60p45j274J412M79j172K0J163
$$ 662 -772 -864 505 265 -760 -539 537 7 -1035 -264 696 -49 -1323 89 568 -604 -584 579
3004E79K47j388L08J041n94j023Q41R33q77q26J044Q39j293j42J028k70o85q4
$$ 579 826 -562 -254 787 193 -830 11 944 67 -759 285 1124 -169 -311 717 447 -238 -322
3022c22J308o40r05N66Q67p64p37R15N58q78n82J289q1j073J89J016m43r10O04
$$ -322 986 346 -559 7 874 110 -627 288 846 -32 -614 675 594 -479 -290 726 283 -627 -23
3041b3Q02p42r49J071O07j039m95J043J14j163K09J402n85j149O42Q21p18q02
$$ -23 779 37 -912 159 766 -273 -768 275 389 -774 -565 837 252 -897 -255 566 -152 -954
3059i54J108K77r20k41J104J8r43j31J152m98j077P31J279j182p28J105N34j021
$$ -954 154 431 -489 -730 374 392 -551 -682 470 -28 -1105 -374 905 -277 -1005 100 634 -387
3077c87j98Q25L11j204J50J255l84j187P20J148r12r68R95Q39j227j69J232O6
$$ -387 -585 240 551 -653 -503 752 368 -819 -99 1049 137 -831 164 1003 -224 -393 839 905
3095I05j009j71J353n78j247P57R15o32j047J141N79j270m83J441Jj153j16J194
$$ 905 -104 -275 1078 500 -747 10 925 293 -754 387 966 -304 -787 654 655 -498 -614 580
3113E80j36j101N64J062r48q27Q82P85j336j69J075J42r74l52J470o45j108O80
$$ 580 444 -657 -93 969 21 -806 76 861 -475 -644 431 573 -401 -753 717 72 -1036 -356
3131c56J199r17q95J142M77j042l92J306O7j445M13R96o09p60N58P12p00o11J121
$$ -356 843 -74 -969 173 650 -392 -784 522 589 -856 -443 553 -56 -816 -258 454 -246 -857 264
3150B64P75j337o07J463j9j136N0J249l10j002P04O87o52q27J000M74j054j96
$$ 264 1039 -298 -905 558 539 -597 -547 702 392 -610 94 781 129 -698 302 776 -278 -474
3168d74J055K84j235k72J381k01j218Q75O76p99n38Q94M08r48n13R89N26j460
$$ -474 581 865 -370 -642 739 538 -680 195 871 72 -466 428 836 -112 -625 364 890 -570
3186e70M8J291k92j030K73J043o28j067J065O75r71n66J157k4j112J61J089j76
$$ -570 -522 769 477 -553 -280 763 135 -932 133 808 -163 -729 428 404 -708 -547 542 366
3204C66j429P21Q32m34q97P86O74j164k48R24M94j416k9J351m59r45M70J175j011
$$ 366 -1063 -342 490 56 -841 -55 619 -545 -793 131 625 -791 -820 531 72 -873 -403 772 -239
3223b39n70P64Q23j539j90J210K05j093J95J147j93j306P87J148j047q83J103
$$ -239 -809 -45 778 -761 -951 259 464 -629 -434 713 520 -786 1 1149 102 -781 322
3240C22P58j243m28J264m4j140K59J259o71j128P89J136j137o04Q12N34j099l06
$$ 322 1080 -163 -591 673 629 -511 -252 1007 336 -792 -3 1133 -4 -608 204 738 -361 -667
3258f67J276j24j102M11R71n01j056P18R21j165o63J259M63j218k56J167j36j088
$$ -667 609 485 -617 -206 765 264 -792 -74 847 -318 -981 278 741 -477 -733 434 298 -790
3276g90L84R95m75r07P33P60j177m06R79M34j219m70J322J96j266M24J002n18
$$ -790 -406 589 114 -793 -60 700 -477 -883 96 530 -689 -1159 163 359 -907 -483 519 1
3294Aj005R01O00n99p44R46K57r17k5J179O1j357K99J146j51j367N97J244r97
$$ 1 -1004 -103 497 -102 -846 100 357 -560 -585 594 655 -702 -403 743 592 -775 -178 1066 69
3313F9o84Q78N89r22o19J062J71q98L5J187k62j021K76J110o18j029Q90P75j042
$$ 69 -615 263 852 -70 -689 373 544 -354 -319 868 606 -415 -139 971 353 -676 214 989 -53
3332e3l70R09J08p12l50R37O5j060M73L43l35p19Q09O06r03l68J053l4j048j3
$$ -53 -423 486 594 -118 -468 469 534 -526 -53 290 -45 -764 45 651 -252 -620 433 399 -649 -662
3352f62J290m41q28K16R83p78r49J142M29o62n30R35O50j421J30J021l31j270
$$ -662 628 187 -641 -425 558 -220 -1169 -27 402 -260 -790 145 795 -626 -496 525 194 -1076
3370a076O06J000n98n70P67O21j158l35R32M00j285P7J423l71j012M54R75r01
$$ -1076 -470 530 -68 -638 129 750 -408 -743 189 589 -696 -619 804 433 -579 -125 850 -51
3388e1n70Q40P11j186m31J470p3j018J11Q17nj231O22R91o08q64O98O68j102m11
$$ -51 -621 219 930 -256 -687 783 710 -308 -197 620 615 -616 6 997 389 -475 223 891 -211 -622
3408f22J185J23r38k49J351n32j209P52Q11q75o59R63O90j226j56R85j07r81L98
$$ -622 563 686 -252 -501 850 318 -891 -139 672 -203 -862 101 791 -435 -591 394 287 -694 -296
3427b96Q55m61q57M55Q11p62o61J010J30q49r9J146r8j087L50Q38l83n92M82M94
$$ -296 559 98 -759 -304 507 -255 -916 94 224 -625 -724 422 324 -763 -413 425 42 -550 -68 426
3447D26m96o49J054L64j071j75P32L55j144L56R76l18p65K39P72p43m80Q24O88
$$ 426 -70 -719 335 699 -372 -547 185 540 -604 -248 728 410 -355 -116 656 -87 -567 257 945
3466I45r60l43N87M39p65k94Q23m02n71N62L95l60o30Q58J97n20m35O75M78j020
$$ 945 -15 -358 229 668 -97 -391 432 30 -541 21 416 56 -574 284 481 -39 -474 201 679 -341
3486c41P8P68o0r57K94R89m68r63M41O29m58n22P98K67r94jP44J83r51k06J361
$$ -341 -263 505 445 -512 -218 771 303 -660 -219 410 -48 -570 228 495 -499 -500 244 427 -524 -730 631
3507F31o01q82P86M97p23l99O86O16j145j85R76M0r37k9J190m52q27P09R07j273
$$ 631 30 -852 -66 431 -292 -691 -5 611 -534 -719 257 297 -640 -669 521 69 -758 -49 858 -415
3527d15k64Q32K85p93j44R82n6r96J96J134n53o71M37R49q35o14R31rq86M4R78
$$ -415 -679 153 438 -355 -499 483 427 -569 -373 761 208 -463 -26 923 88 -526 405 396 -490 -446 532
3548E32Nr36L47J010q97p29Q66O26j002k82R14K22j034k0R89l13r01L64J037j124
$$ 532 537 -399 -52 958 61 -668 198 824 -178 -460 454 676 -358 -378 611 298 -603 -239 798 -326
3568c26k50N98M74o21n52Q27M89j300J84P67n7p49J26Q66m24j087P43J100j240
$$ -326 -576 22 496 -125 -677 150 639 -661 -477 290 233 -516 -390 476 52 -1035 -292 808 -432
3587d32m8Q75k4j277O18M93j7p89K80Q28n09o18P08O17r53o5Q36o2q17K12M88
$$ -432 -480 395 371 -906 -288 205 188 -601 -321 507 -2 -620 88 705 -248 -313 523 461 -356 -144 344
3608C44j67o54M76O39m90n04N85K03n54k97O91J7o31KR92n00m09L12N54k56o34
$$ 344 177 -477 -1 638 148 -356 229 432 -122 -419 272 289 -342 -340 652 152 -257 55 609 353 -281
3629b81L87O87q11j14N98O7q56qQ68k30p87J98P24m71o39N08R29p22p31P70L63
$$ -281 106 793 -18 -132 466 533 -323 -331 537 307 -480 -282 442 -29 -668 -160 769 47 -684 86 449
3650D49n87l29O81k05p22M48Q44n64n00J15R49n75o88N31N07p28j89P38J16q89
$$ 449 -138 -467 214 9 -713 -265 579 15 -485 -370 579 4 -684 -153 354 -374 -563 175 291 -598
3670e98J71P72j57j083Q08N29o00m59P68N62r76j23Q34j51p32J86P71m38q79R53
$$ -598 -427 345 188 -895 -87 442 -158 -617 151 713 -263 -386 448 297 -435 -249 522 84 -795 158
3690A58P86p39p05Q37N47q95m84R54J77q80M3J094o39q68P47O67p99n38Q02L81
$$ 158 944 205 -500 337 884 -11 -495 459 636 -244 -201 893 254 -614 133 800 1 -537 265 646
3710F46r43q1J034m49q52M98P58n70o21N64N95q33l74J004j1p81k24J148l51n08
$$ 646 -297 -378 656 207 -645 -147 611 41 -580 -16 579 -254 -628 376 365 -416 -640 508 157 -351
3730c51L81K94m46l64N45N27q62k92R15or30L6Q83l66m07K94O05o70l64O54M56
$$ -351 30 324 -122 -486 59 586 -276 -568 347 341 -589 -553 330 -36 -443 -149 456 -214 -578 76 532
3751E32q01k83R77j1o07L8O44l08m94K41O97n29n78M88M89o95k66R49J09m90n68
$$ 532 -269 -552 425 414 -193 -155 489 181 -313 -72 625 96 -482 6 495 -200 -466 483 592 102 -466
3772d66R60j48n90K19N61k60n70N93J83q02M4O98J75q18j55P35O0r45L30P58m73
$$ -466 494 346 -244 -25 536 276 -294 299 482 -320 -276 422 597 -221 -376 359 419 -526 -196 562 89
3793H9m50N1P81n65j65L01M07p29l65Q28j68m18K59M85o50l13K25R11p12n47P79
$$ 89 -361 -310 471 -94 -259 42 449 -280 -645 183 15 -403 -144 341 -309 -622 -397 514 -198 -745 34
3814C4J10o05j76O34K61o59Q6N85k89m92N09P16n16q54P36O41j017r8Q54j71o12
$$ 34 144 -461 -637 -3 258 -401 -315 270 -19 -511 -2 714 198 -656 80 721 -296 -394 460 289 -323
3835c23J71P65m31o39M70N32k69o78P81J50p41p4P92L5p33j02R65m16p62N65N32
$$ -323 -152 613 182 -457 13 545 276 -402 379 529 -212 -286 506 541 -192 -294 671 255 -507 58 590
3856E90o74o84J035K73q26j22Q35J47j141K36Q04k69p54N42M19p41k23P44O3n03
$$ 590 -84 -768 267 540 -286 -408 427 574 -567 -331 473 204 -550 -8 411 -330 -553 191 254 -249
3876b49r3N55J10p33J69N84l29o56M13M66m91k36P33K6q02N0J048k68r00K02Q11
$$ -249 -342 213 323 -410 -241 343 14 -642 -229 237 -254 -490 243 269 -533 -483 565 297 -603 -401 410
3897D10n28l16K40N72m42m44P58K08n56QK83o4l31J82L31j45o11Q52J62o36k19
$$ 410 -118 -434 -194 378 -64 -508 250 458 -98 -90 193 129 -202 -20 311 166 -445 407 569 -67 -286
3918b86O95J8n88J57N36j09o75N5N29j87k85K98M49l55m90N05l1l76k03O51L9
$$ -286 409 427 -161 -4 532 423 -252 -197 332 145 -140 158 607 252 -238 267 236 -140 -343 308 347
3939C47n23j8M43q3n56J24N15m38k16K07M91l30k78N47J22m64l34O99O0q67M18
$$ 347 -176 -194 249 166 -390 -266 249 -189 -405 -198 293 -37 -315 232 354 -110 -444 255 315 -552 -134
3960a34N06m71n87P91L19p70j35N98J79p54K14O16k71q28O55N35n57m54M80N98
$$ -134 372 -99 -686 105 424 -346 -481 117 296 -458 -244 372 101 -727 -72 463 -94 -548 -68 530
3980E30p85j47O97R0p73K34M65R4o83L59P96q47l30N16K90p95j9P83r4m99J35
$$ 530 -255 -402 295 385 -388 -154 311 405 -278 81 877 30 -300 216 506 -289 -308 475 381 -118 17
4001A7M28p9r16N40P23n74p50Q36L20q33J08P19O1r88N1N16K50q78M85N21q56
$$ 17 445 366 -550 -10 713 139 -611 225 545 -288 -180 539 600 -388 -337 179 429 -449 36 557 -299
4022b99j76O52K09p06k26Q32J0r97J94Q04j84n10K40O66n87l18N13J83o04j33
$$ -299 -475 177 386 -320 -546 286 296 -701 -507 297 113 -397 -157 509 -78 -396 117 300 -304 -437
4042d37O92K37p63N1O33m21n50L85O46q08k03M39N01n85P8L64J5o04J86O53n31
$$ -437 255 492 -271 -220 413 -8 -558 -173 473 -335 -538 -99 402 -183 -105 259 274 -330 -144 509 -22
4063b2l99O20J95n43o0N39L6j92k59P39l88m60K08M96l16m88L75L40l59k29M39
$$ -22 -421 199 394 -149 -209 330 366 174 -85 654 266 -194 14 510 194 -294 81 421 62 -167 272
4084B72J28k75o66P54K45r19M26M02m30m39N53K81l89l73M50M55o77j25N04j05
$$ 272 400 125 -541 213 458 -461 -35 367 -63 -502 51 332 -57 -430 20 475 -202 -327 177 72
4104G2m85K19M13j21o96K79R11p32m30L94L72j01n66M74J81m63P7O12j95p94L95
$$ 72 -413 -194 219 98 -598 -319 592 -140 -570 -176 196 95 -471 3 184 -279 -202 410 215 -579 -184
4125a84N89n40l47O72J81o10m06O83K02q71K80N67k40k86K49O64o83n46N36M67
$$ -184 405 -135 -482 190 371 -239 -645 38 240 -631 -351 216 -24 -310 -61 603 -80 -626 -90 377
4145C77j49m27O34lo10k6M16J41n55K36M59n49l2L72K49q85J10M67K26p89J81
$$ 377 228 -199 435 432 -178 -204 212 353 -202 34 493 -56 -88 284 533 -352 -242 225 451 -338 -157
4166a57M84k47o75P47J58k14o09N27L99q00J00K68J68o14J24M07Ro76O61J94l90
$$ -157 327 80 -595 152 310 96 -513 14 413 -387 -287 -19 149 -465 -341 66 75 -601 60 254 -136
4187a36k11M31M20p07o2M69k97k36K01L94l7o41J87O75o93QM54k8l44m53J037
$$ -136 -347 84 504 -203 -265 204 -93 -329 -128 266 229 -412 -225 450 -243 -235 219 191 -153 -606 431
4208D31n6q30j6P79J64r23M12O84r35r1P52J79n39j19M13J9m13Q7N20m53m20J92
$$ 431 375 -455 -471 308 472 -451 -39 645 -290 -381 371 550 11 -108 305 324 -89 -2 518 65 -355 -163
4230a63O97o26l23M55L45l27l17M11R5l23P8K45j88l27L43l5k33j27K21R7l90
$$ -163 534 -92 -415 40 385 58 -259 152 247 -76 2 247 59 -268 75 40 -193 -320 -99 -2 -392
4251c92J56K4M87m16l4L90j80l54j1L91p3m97L42M15m09l78O33j1k48p5L41J42
$$ -392 -236 -212 275 -141 -175 215 35 -319 -330 61 -12 -509 -167 248 -161 -539 94 83 -165 -240 101 243
4273B43n45J12M04p9m01L89K36k46m83L25L88n20o6O57j73m49J45L97o3n17J50
$$ 243 -302 -190 214 135 -266 123 359 113 -370 -45 343 -177 -243 414 241 -208 -63 334 271 -246 -96
4294i6M32l01k76M05J84n79M6O39j25n81L39M53m22n34M31K53k46o37Q98k6n81
$$ -96 336 35 -241 164 348 -231 -185 454 329 -252 87 540 118 -416 15 268 22 -615 283 257 -324
4315c24l7P85o2q28M25K43l23k96L47L00m95k17L40J10l72L12K95n8q92N10N58
$$ -324 -361 424 362 -466 -41 202 -121 -417 -70 230 -265 -482 -142 -32 -404 -92 203 145 -747 -237 321
4336C21m11m08K91M78p27P0N03L5l77j14O39k39o20O16J74k03m61M61J87m69o8
$$ 321 -90 -498 -207 271 -456 -386 117 152 -225 -339 300 61 -559 57 231 28 -433 28 215 -254 -322
4357c22M16J52m71J54L76O4p00N57P0m17k8J01N09l22m04M86r3k42L57j34J31
$$ -322 94 246 -225 -71 305 369 -331 226 296 -121 -149 -48 461 139 -265 221 128 -114 243 109 240
4378B40l88K77P9l09j04M34qn28J37N60j80l10q9L54m8j44O9J27R2n28J21M47
$$ 240 -148 129 208 -101 -205 229 221 -307 -170 390 210 -100 -189 165 117 -27 42 169 261 -267 -146 301
4400C01o67l3O72J01p96P3K40J46m50J80L93k51l26K45L54k09p05N18L68o03J86
$$ 301 -366 -399 273 374 -422 -349 -109 37 -413 -233 160 -91 -417 -172 182 -27 -732 -214 154 -449 -263
4421b63J69L93m87R7K60p0l18J58L24k52k71N91K36q83j05O76L5n44L8N00J53
$$ -263 -94 299 -188 -91 169 99 -219 -61 263 11 -260 331 567 -316 -421 255 290 -254 -216 284 437
4442D37r23O60L64m18l56N00L49n66k58N58J18p81K72O64l18n98N92J2l35j27
$$ 437 -486 174 538 120 -236 264 613 47 -211 347 465 -316 -44 620 302 -296 296 308 -27 -154
4462a54L09J36m59j3N68l06k64R1L81k78k63O2L53m16k0K17N84o57q4L88k11l43
$$ -154 155 291 -168 -181 387 81 -183 -92 289 11 -252 -190 163 -253 -273 -56 528 -129 -213 175 -36 -379
4484c79O5P28m58l10J8N95k32m84N65J66o70R9L15K09n59J9O86m01l78L65L87
$$ -379 -314 414 -44 -354 -336 259 27 -457 108 274 -396 -297 18 227 -332 -313 373 -28 -406 -41 346
4505C46n14n3K24J73j35k90N60j45l82L16K04k02l21K40L41n11l93P79M84o39
$$ 346 -168 -221 3 176 41 -249 311 166 -216 100 304 102 -219 21 362 -149 -542 237 721 82
4525H2k38M94p0k67K81M42q87m6Q5M91m44R2J60J78n61K5L39rn42K63O18m30n02
$$ 82 -156 338 268 1 282 724 -163 -209 -124 367 -77 15 175 353 -208 -183 156 147 -395 -132 486 56 -446
4548d46M13L44n60o0O32j44n95N8P20k85l68J29M82j84n44M32J63m45k39N89J43
$$ -446 -33 311 -249 -309 323 179 -416 -358 362 77 -291 -162 320 136 -408 24 187 -258 -497 92 235
4569B35n12O1M99j89j51j56N01k08k40L11J75m57l78N34L01l43l52P08l75j68
$$ 235 -277 -216 283 94 -57 -213 288 80 -160 151 326 -131 -509 25 326 -17 -369 339 -36 -204
4589b04L1N56m58p8K01L74m33k82M56K1P9m80O27o0n84L36J43j88k10J3M88j40
$$ -204 -173 383 -75 -153 48 422 -11 -293 163 184 263 -217 410 350 -234 102 245 57 -153 -140 348 208
4611B08m82M71J13m60J6N54p4n50J58L23k36l40K26M86j34q61O20M01r47K07O78
$$ 208 -274 197 310 -150 -134 420 346 -204 -46 277 41 -299 -73 413 279 -582 38 439 -508 -301 377
4632C77k70m44J28N03r6m71L9M92k65l60N71q0m79k95R29k71k18J67L73l45l88
$$ 377 107 -337 -209 294 198 -273 -234 258 -7 -367 204 124 -355 -650 279 8 -210 -43 330 -15 -403
4653d03M93L14m56q5K10K61m55l77Q58R6p33K68M14n21k16M87M41o23j14N66j73
$$ -403 90 404 -52 -137 73 334 -121 -498 360 456 -277 -9 405 -116 -332 155 596 -27 -141 425 252
4674B52l15r6N35m6k58P9M67m74l38K37R2k93J37L64j3m21l38O85j58k46P9K30
$$ 252 -63 -159 376 330 72 151 618 144 -194 43 135 -158 -21 343 330 -91 -429 256 98 -148 -69 161
4696A61k81n4J01K86k80j99M17K6k24j47K97k55J7p9L42Nl68j86O35k03k80L50
$$ 161 -120 -174 -73 213 -67 -266 151 177 -47 -194 103 -152 -135 -214 128 133 -235 -421 214 11 -269 81
4718H1L2k63j30L86k5l84J35M01k62l89K69J82j59j47J55N11n69j52N19K7n45
$$ 81 113 -150 -280 106 81 -303 -168 233 -29 -418 -149 33 -126 -273 -118 393 -176 -328 191 218 -327
4739c27L02K74l9m29N4M89r3l92L05K23k72k73L48K56o04J58M79k76l79K61L41
$$ -327 -25 249 210 -219 -165 324 231 -161 144 367 95 -178 170 426 -178 -20 459 183 -196 65 406
4760D06l38j35K65J67m02k45M33K37o61J76N31k34m79K76K55l26r9M05o8l52m3
$$ 406 68 -67 198 365 -37 -282 151 388 -273 -97 434 200 -279 -3 252 -74 -173 232 164 -188 -231
4781b31K74J54p21M69J6k3l58N70j32l02Q9J29J32k07j45M70q6m38L91L66o30
$$ -231 43 197 -524 -55 -39 -62 -420 150 18 -284 -195 -66 66 -141 -286 184 98 -340 51 417 -213
4802b13R7J20L29k37k82K43J41n14J82M50k48j1j07L47k52k60M69J68l22j08J51
$$ -213 -116 4 333 96 -186 57 198 -316 -134 316 68 57 -50 297 45 -215 254 422 100 -8 143
4823A43J06m68q3N72k65k55J31M77l16J25r0K63j62m56N00O9m60q6N44k24j80
$$ 143 249 -219 -302 270 5 -250 -119 358 42 167 77 340 178 -278 222 291 -169 -255 289 65 -115
4844a15k98L06J06n10N44Q1j10m21P13J6n57Q7M15j98m75L02K44j25m72J90J41
$$ -115 -413 -107 -1 -511 33 114 4 -417 296 312 -245 -158 257 59 -416 -114 130 5 -467 -277 -136
4865a36J64l08L9K62k81K4K59j3k21L5L63j47l58M00L63l25j77L71l14j81M1L00
$$ -136 28 -280 -241 21 -260 -236 23 10 -211 -176 187 40 -318 82 445 120 -57 314 0 -181 -140 160
4887A60J0l36J79j52J96r7R7L5Pl02J66J62p6m36K66L76k6J8Q8j70m31K74N16
$$ 160 170 -166 13 -139 57 -40 57 92 99 -203 -37 125 49 -387 -121 255 229 247 335 165 -266 8 524
4910E24k86m46N36j81k5k98K78O2k98l8M69q7m25OK64Pm55L54M24m28j32J43K16
$$ 524 238 -208 328 147 122 -176 102 164 -134 -172 297 210 -215 -209 55 62 -393 -39 385 -43 -175 -32 184
4933A84n20k3K95jj71p7L55k23k1oM10k22j57P6J91m07J82J58J84l22J04J02l7
$$ 184 -336 -359 -64 -65 -236 -313 42 -181 -202 -208 202 -20 -177 -101 90 -317 -135 23 207 -115 -11 91 54
4956E4k50L11Q1m44o5N10j26k40J81J87j02k09J90R9J38m43J51J87k49j09L63
$$ 54 -196 115 196 -248 -313 197 71 -169 12 199 97 -112 78 177 315 -128 23 210 -39 -148 215
4977B15j31l77J20L84j21k1N4J24j65k59K38K69l20l10M94j10j09j53L91l25j08
$$ 215 84 -293 -173 211 90 69 123 247 82 -177 61 330 10 -300 194 84 -25 -178 213 -112 -220
4998b20k0M58j21l07L38J12j94l08L59k29L1j18L80L1m69J84J85j84k25M18K99
$$ -220 -240 218 97 -210 128 240 46 -262 97 -132 -101 -219 161 192 -277 -93 92 -92 -317 101 400
5019D00l58n17K16M16k81j68L09K11m46J06K67l6l24L8L27j78q4J13L78o58J24
$$ 400 42 -475 -259 157 -124 -292 17 228 -218 -112 155 119 -205 -167 160 -18 -102 11 389 -269 -145
5040a45M17L2m56J20L78k45k97K25K52k94r1J26K43n14j66M13K87o01J81N27l87
$$ -145 272 304 -152 -32 346 101 -196 29 281 -13 -104 22 265 -249 -415 -2 285 -316 -135 392 5
5061El82K72M11j67l92N81L2l80k74L29R1m43K86k9O3l09M99m2o8m03L18J15m53
$$ 5 -377 -105 306 139 -253 328 360 -20 -294 35 126 -317 -31 -60 3 -306 193 151 83 -320 -2 113 -340
5084c40j36M11K48k64Q4J33l07j18L05J30k89p6L03m6k10J9Q7L92l89J19K28k84
$$ -340 -476 -65 183 -81 3 136 -171 -289 16 146 -143 -219 84 38 -172 -153 -66 326 -63 56 284 0
5106@l08M48J3l19oL26J40o17K80L90R9q57N04Q9j49k78k6N69l03j63J19L03m96
$$ 0 -308 140 153 -166 -172 154 294 -323 -43 347 446 -411 93 182 33 -245 -271 298 -5 -168 -49 254 -242
5129b42L07J83j22m03L63M0L0k02J27L73o20k03N36j06k80J76J54N5m29Q5L09
$$ -242 65 248 126 -277 86 126 156 -46 81 454 -166 -369 167 61 -219 -43 111 166 -263 -178 131
5150A31k61k21K72J54k09j01L56m9l50LM81l13m14O04K22k99k78L83j42k28p7
$$ 131 -130 -351 -79 75 -134 -235 121 72 -278 -275 206 -107 -521 83 305 6 -272 111 -31 -259 -336
5171c36L78K12n90P1M28j84k6pK93q2k82J11K07k65j58M46L0j85j05K15n8l28
$$ -336 42 254 -336 -265 163 -21 -47 -54 239 157 -125 -14 193 -72 -230 216 246 61 -44 171 113 -215
5193b15K17K49l93j63L03J43Q3l06M40k32k19lO7J65l80K48K02r5p1J28p1K8j00
$$ -215 2 251 -142 -305 -2 141 224 -82 358 126 -93 -96 -29 136 -244 4 206 111 40 168 97 125 25
5216B5J26J10l15O7K41O9l64m5J85J23k73RK70l00k25K40O9m17K79K64j49k49
$$ 25 151 261 -54 13 254 323 -41 -86 99 222 -51 -42 228 -72 -297 -57 12 -405 -126 138 -11 -260
5238b60j43L56M1n08M02J23P5l83K9L95j48k56J93K83l01j25L74k08j87M02k12
$$ -260 -403 -47 -6 -514 -112 11 86 -297 -268 127 -21 -277 -84 199 -102 -227 147 -61 -248 154 -58
5259e8l4r0L51J33m63l8J50K96m72L44J61j78k20L44K7n36K14N6L07k83J26Mq2
$$ -58 -92 -182 169 302 -161 -199 -49 247 -225 119 280 102 -118 226 253 -283 -69 -13 294 11 137 141 59
5282E9k1K3J49r6j53k5K48m77J8L31k32J87j39K77l6k41q5M20j39m82M74k2j72
$$ 59 38 61 210 114 -39 -64 184 -293 -275 56 -176 11 -128 149 113 -128 -213 207 68 -414 60 38 -134
5305a34k19M24j96k24K97N5K05l79P2K09o5l68N63j68j25NK00l57k4N2J16K01
$$ -134 -353 71 -125 -349 -52 3 208 -171 -99 110 45 -323 240 72 -53 -48 152 -205 -229 -177 -61 140
5327A40j5k30K16j73j47L05J54l09j76N41j23l32J63Q4K0l32Q2K36M7j08j25J31
$$ 140 125 -105 111 -62 -209 96 250 -59 -235 306 183 -149 14 98 118 -214 -132 104 151 43 -82 49
5349D9o1k63N38j66K0k19O2L98l51p4L25l55m3J01K01l30K75k33L89j78k14J50
$$ 49 -12 -275 263 97 117 -102 -40 358 7 -67 258 -97 -140 -39 162 -168 107 -126 263 85 -129 21
5371B1o0O5r8K18j6m05K20L53l90j63J54J45j69p0L54j87k39J85K05ml28J20J78
$$ 21 -39 26 -72 146 130 -275 -55 298 -92 -255 -101 44 -125 -195 159 -28 -267 -82 123 119 -209 -89 89
5394H9k12k30O59j25l81O7L44p3l67L6J69P8k54j00K90M1j59K10J89n30R0K45
$$ 89 -123 -353 306 181 -200 -133 211 138 -229 -193 -24 54 -200 -300 -10 31 -128 82 271 -259 -169 76
5416G6j23k7L1J47N5j62j8Ko2j57N42r8l12J57k33L18j23j68L12K2j11k49J12
$$ 76 -47 -74 -43 104 159 -3 -21 -19 -81 -238 304 206 -106 51 -182 136 13 -155 157 179 68 -181 -69
5439f9N98n69J37J45q2l57J79K85o62K52J07j39k2K84L2k43J62J47k36k02J74
$$ -69 529 -40 97 242 160 -197 -18 267 -395 -143 -36 -175 -197 87 119 -124 38 185 -51 -253 -79
5460g9m3K04n7j80J20q8j94K78Lj01j53K54J3k29L14j53L1j57J12K40j65p0J27
$$ -79 -122 82 25 -155 -35 -123 -317 -39 -36 -137 -290 -36 -23 -252 62 -91 -60 -217 -105 135 -30 -100 27
5483B7K1r1o1L98l66p2m3K37P4K9p2J26j73p6J03J16J44l14n2N8q1P4o7J15r1
$$ 27 48 -43 -104 294 -72 -144 -187 50 124 153 81 207 34 -42 61 177 321 7 -45 13 -68 6 -61 54 -37
5508c7J85n6Q4l05J66K64j65k12J89K8j78J3L2m2K49J9j31j35N1j25K30j5l43
$$ -37 148 92 176 -129 37 301 136 -76 113 141 -37 -24 8 -34 215 234 103 -32 19 -106 124 109 -234
5531b34L80L2k20k94L42J17j02j24J65j25n1kJ55qM7o5qR0m02K58L79m27j1J02
$$ -234 146 178 -42 -336 6 123 21 -103 62 -63 -114 -116 39 31 78 13 5 95 -307 -49 330 -97 -108 -6
5555fJ12k16n9L23k86j63K85Q9k02j68M07M3l82m9L47K56m29m2N16l12m2L90j34
$$ -6 106 -110 -169 154 -132 -295 -10 79 -123 -291 116 159 -223 -272 75 331 -98 -140 376 64 22 412 278
5578B78q4k55L07j5l32O2J93j92k9n4K43j33np9K04q6l11N59l84p5J38J98J57
$$ 278 194 -61 246 231 -101 -39 154 -38 -67 -121 122 -11 -16 -95 109 23 -288 271 -113 -188 -50 148 305
5601C05m88K89j95N8n4L5L42k88J00k2j18j34j57K33K34l24J43L23l24j32P8L29
$$ 305 -183 106 -89 -31 -85 -50 292 4 104 82 -36 -170 -327 -94 140 -184 -41 282 -42 -174 -96 233
5623B33k59k05K71r4J78j66k9R2j78K49j9j6l92L40K65j61k28LK80q5%j00L2m7
$$ 233 -26 -231 40 -54 124 -42 -71 21 -157 92 73 57 -335 5 270 109 -119 -116 164 79 79 -21 11 -36
5647c6j2L19k29j7q6L00l03K14p3M3k63K94O6K3j34l22L87k66%L07j10M6k93K12
$$ -36 -48 271 42 25 -61 239 -64 150 77 120 -143 151 217 240 106 -216 171 -95 -95 212 102 148 -145 67
5671F7J19m15J30j72M36r4n0J14j35j43K34L9j64j73M56m20Jj01L55k48j50J33
$$ 67 186 -229 -99 -271 165 71 21 135 0 -143 91 130 -34 -207 249 -171 -170 -271 84 -164 -314 -181
5693a81J73L33n42L56l51L8J15J98L3l79k6L15N3l03K79K86l89k77K41J17k05
$$ -181 -8 325 -217 139 -212 -174 -59 139 172 -207 -233 82 135 -168 111 397 8 -269 -28 89 -116
5714a16jL73j75k09J1M81k35k08J51j3k6j29L14j50l7k2j1R0j88j47N33j96k37
$$ -116 -117 256 81 -128 -117 364 129 -79 72 59 33 -96 218 68 31 9 -2 88 -100 -247 286 90 -147
5737a47J93R0n1j16J13k47o8o6O32k60k47l6K93k27J43j52L25j7l68R6K88k02
$$ -147 46 136 85 -31 82 -165 -233 -299 333 73 -174 -210 83 -144 -1 -153 172 155 -213 -117 171 -31
5759c1R8k30K06o6j45J37J85k20k53O60l78J56j78K07m32L9K16L05o40M38O0k17
$$ -31 67 -163 43 -23 -168 -31 154 -66 -319 341 -37 119 -59 148 -284 -245 -29 276 -364 74 134 -83
5781h3P2j63K29J82m62L92L8M6k61O0K82m34Q7O2N5j22K63N0l24L1L03m04K84
$$ -83 -11 -174 55 237 -225 167 205 251 -10 50 332 -102 -15 47 102 -20 243 293 -31 0 303 -101 183
5804A83j62J58p2J09l55K03J18k69L33l27J57Q9rl25L68l40K79P3m09K64JK9j47
$$ 183 21 179 107 216 -139 64 182 -87 246 -81 76 165 156 -169 199 -141 138 211 -198 66 67 96 -51
5827e1P4J99l04n9j13N14n71K81o9j79K06j26J10K71l27J15L89k20k87P7J9P1
$$ -51 23 222 -82 -141 -254 260 -311 -30 -99 -278 -72 -198 -88 183 -144 -29 360 140 -147 -70 -51 20
5849B0m6m8J10j98k27O80k80M3k54K47k10L3q5K62j10N1K34k84Lk10K46J33m06
$$ 20 -26 -74 36 -162 -389 291 11 54 -200 47 -163 -130 -215 47 -63 -12 222 -62 -59 -269 -23 110 -296
5872b96M10L8N0l17J92lj56J74k6q0o9K27kM5m65J73J49J53l37K99j0l28J22j07
$$ -296 114 152 202 -115 77 74 -82 92 66 -14 -83 144 142 187 -278 -105 44 197 -140 159 149 -179 -57 -164
5896a64L06l91L64j82J5N9l50L07M3O7j46K68l19N7L6J1J49k13k01L26q2L0O3
$$ -164 142 -249 115 -67 -52 7 -343 -36 7 74 -72 196 -123 -66 -30 -19 130 -83 -284 42 -40 -10 53
5919E3O9k69K45q9j24J03R2L2k54L54k85L2m03L72R7M4k77K74M4k30j4J94J26
$$ 53 122 -147 98 9 -115 -12 80 112 -142 212 -73 -41 -444 -72 25 69 -208 66 110 -120 -134 60 186
5942A86l21K25O3k86K2J9J65Q8k45J54k1j10n7OK39k00k20L00P6k93K51J01Jj12
$$ 186 -135 90 153 -133 -111 -92 73 161 -84 70 49 -61 -118 -112 127 -73 -293 7 83 -210 41 142 143 31
5966C1O9j37Rj81J72j13K51j13O2o5j4L19k91qj58J58M36m22k3Q1K31k73Qk10
$$ 31 100 -37 -28 -209 -37 -150 101 -12 50 -15 -29 290 -1 -9 -167 -9 427 5 -18 63 294 21 29 -181
5990a81K59m8k18L64j00k12%L49k53M4K02k76O7j34R5J05J25j02j46O1J2k67L31
$$ -181 78 30 -188 176 76 -136 -136 213 -40 4 206 -70 -3 -137 -42 63 188 86 -60 1 13 -254 77
6013G7Q1k67O3K73k38J1K8Pj13n8M35q0j23o4J42j62k18J77K57l65P3L58R1l73
$$ 77 158 -109 -46 227 -11 0 28 35 -78 -136 299 219 96 32 174 12 -206 -29 228 -137 -64 294 385 12
6037A2m8J42j63R2L4M7j09p5Q8j6m4m6J02j07m22M55p0J20Lk88J51J16r8R1J43
$$ 12 -36 106 -57 35 69 116 7 -68 20 4 -40 -86 16 -91 -513 -58 -128 -8 -5 -293 -142 -26 -124 -33 110
6062A10P8k40O8K09l80P9K22l76p0M23J7j87k33L73j20j4Q5J04J69m38J23J10
$$ 110 188 -52 16 225 -155 -76 146 -230 -300 123 140 -47 -280 93 -27 -41 44 148 317 -121 2 112
6084A12j57N3Q4j03l6m9j4K19k22j00N86l76q4K7J7K63j77M1J53k68j45K96j26
$$ 112 -45 8 92 -11 -47 -96 -110 109 -113 -213 373 -3 -87 -60 -43 220 43 84 237 -31 -176 120 -6
6107fo0P7J56j63q5K09q3k0n1J0L85j34l61n6L61J14n01R6J55j39K30q5r8J0j88
$$ -6 -66 11 167 4 -81 128 45 25 -26 -16 369 235 -126 -182 179 293 -208 -112 43 -96 134 49 -49 -39 -227
6132b27K24L01l66J2K91k79K0J51l58J35o3L36k77q1Q7K27j26O6j02J09j97M0
$$ -227 -3 298 -68 -56 235 -44 -24 127 -231 -96 -159 177 -100 -181 -94 133 7 73 -29 80 -117 -77
6154g7K83m2k25j12K86m4k95K37P6n7k37K71K69k17m98O21r4j54j99N00k50k08
$$ -77 206 164 -61 -173 113 69 -226 11 87 30 -207 64 333 116 -382 239 145 -9 -208 292 42 -166
6176a66K33J91pl04K90J20l07p1J14K65l23j00J49P6k51N0K53O1m07J82J10j33
$$ -166 67 258 251 -53 237 357 50 -21 93 358 35 -65 84 160 -91 -41 212 273 -134 48 158 25
6198B5J02l0%k96K42j52J05l79N75j03qj00J09J01m77J43K26J88l68Q9q7K16j31
$$ 25 127 97 97 -199 43 -109 -4 -383 192 89 81 -19 90 191 -286 -143 83 271 -97 -8 -95 121 -10
6221a0k00J85p9J75l36J26J07nP3q6n7j3M58l80J3j46J81K15k36P4l4j02J96j26
$$ -10 -210 -25 -104 71 -265 -139 -32 -37 36 -50 -107 -120 338 -42 -29 -175 6 221 -15 59 25 -77 119 -7
6245gk74L74j81M0J11o5n4J76j91K02k6J10m01j10M15J42j41j27J95P3j77l5O4
$$ -7 -281 93 -88 -48 63 -2 -56 120 -71 131 105 215 -186 -296 119 261 120 -7 188 261 84 49 113
6268A13L3j84o2K25q7L8L5p6r5J3J71j3j18J97m1j64J1j78K13j45j36N01m46Q5
$$ 113 146 -38 -100 125 38 76 111 35 -60 -47 124 111 -7 190 149 -15 -4 -182 31 -114 -250 251 -195 -110
6292a10J52j4j58K3K81l28J05j49L24k40N9O7j50K92j90M0k2P9m9J94j81r4JK52
$$ -110 42 28 -130 -107 174 -154 -49 -198 126 -114 -55 12 -138 154 -36 4 -18 61 12 206 25 -69 -68 184
6316A84k89M1N6K58j7l32K37j34o7N4L8J31m5j09p7L43n73N02j74J69j56J21J58
$$ 184 -105 -64 -8 250 233 -99 138 4 -63 -9 29 160 115 6 -71 272 -301 201 27 196 40 161 319
6339C19k32o2L5R4j77j60J39K11l62M3R2J05k10K55j16L07n80K78K12l32r8L5
$$ 319 87 25 60 154 -23 -183 -44 167 -195 -152 -60 45 -165 90 -26 281 -299 -21 191 -141 -239 -204
6361b04J86J58j92n0J5O2k6n1k05N5K03j62J74p8J22J45k13J41qoj02J21L0j14
$$ -204 -18 140 -52 -102 -87 -25 -51 -102 -307 -252 -49 -211 -37 -115 7 152 -61 80 72 66 -36 85 115 1
6385AK49k39O8j69j19L35Q3k54J1J22m8J25l15L25k48rK5J66K28m61L16l2p9k74
$$ 1 250 11 79 -90 -209 126 209 -45 -34 88 40 165 -150 175 -73 -82 -57 109 337 -124 192 160 81 -193
6409a93K91J80l03J0j0k2L5l7n4n7J85k3Q1k39NL82j86O9j85L9O3J9j30J73j57
$$ -193 98 278 -25 -15 -25 -47 -12 -49 -103 -160 25 2 83 -156 -151 231 45 114 -71 -32 31 50 -80 93 -64
6434f4L5J88m39K23R7R1n4j85m5J90M0k50J64m5o6k3J15L9l3R8L7Jm0k05kJ06
$$ -64 -29 159 -280 -57 40 131 77 -108 -153 37 77 -173 -9 -54 -120 -143 -28 11 -22 76 113 114 74 -131 -133 -27
6460b7l8j63J31K68j20k0j5N6j12J9j10MR7P1j21K0o5K46j95K13j20j30L5N4K46
$$ -27 -65 -228 -97 171 51 31 16 72 -40 -21 -131 -127 -30 41 -80 -60 -125 121 -74 139 19 -111 -76 -22 224
6485B24k35r0R5p7K16l70L16Qk0j76R8J57k21p2K55l2L4k53J78O9j80k8L7K92
$$ 224 -11 -101 -6 -83 133 -237 79 87 67 -109 -11 146 -75 -147 108 76 110 -143 35 104 -76 -104 -67 225
6509B25k69K78l86q6J79N5R9l65K69j29K54k04J71K33l29J49n0L5l30Q9J32j15
$$ 225 -44 234 -152 -238 -59 -4 95 -270 -1 -130 124 -80 91 324 -5 144 94 129 -201 -112 20 -95
6531i5j49J58K62j08l03J49K1L2j71J92pj01R5K55l50K77j58K7K31j66p0J58j8
$$ -95 -244 -86 176 68 -235 -86 -65 -33 -204 -12 -19 -120 -25 230 -120 157 -1 26 257 91 21 179 161
6554A61j47J36p9OR5m0j04k7Q0P2m1j72J99Lj08J11m2j24j9kM1J55l26K22M5J0
$$ 161 14 150 71 77 172 132 28 1 81 153 112 -60 139 142 34 145 103 -21 -40 -42 -1 154 -172 50 95 105
6580A05O9j87J42J35k99rR0O0k98P3J73k01J09j27K85j41j37K04j97o9J36N5k57
$$ 105 174 -13 129 264 -35 -44 46 106 -192 -119 54 -147 -38 -165 120 -21 -158 46 -151 -220 -84 -29 -286
6603b86J93pK28j10j97J08J61j77J38j27J66m2p3K7j28K62m3l6k77J88k64L96
$$ -286 -93 -100 128 18 -179 -71 90 -87 51 -76 90 48 -25 2 -126 136 93 57 -220 -32 -296 100
6625A00q0L1O2J14k47o5L17j43j58M6O6j24J43J4M9j5j90K63J1j38l1J58k92r1
$$ 100 20 51 113 227 -20 -85 232 89 -69 -23 43 -81 62 76 125 110 -80 183 194 56 25 183 -109 -200
6649b00M36n15K28l9J23K77k12j51K6L8j3Q4K26l19o6J36M2k32J44o6k5J7j82
$$ -200 236 -279 -51 -90 33 310 98 -53 -27 11 -2 82 308 -11 -77 59 101 -131 13 -53 -78 -61 -243
6672b43M46k18P1J5n5J72j59r5q2J80l3L3l5j00M5R8j86J78J78k9k68L51k97L0
$$ -243 203 -15 56 71 16 188 29 -66 -148 32 -1 32 -3 -103 -58 40 -146 32 210 181 -87 264 -33 -3
6696cj77N5J28Q4J33R2l76K4m5J78j48K36n1j31J45j2M7l6N3k63J62ql3L0j33
$$ -3 -180 -125 3 87 220 312 -64 -40 -85 93 -55 181 130 -1 144 132 179 143 196 -67 95 87 54 84 -49
6721d9J18j73k9K60J19k66K9M3l12j19J20K57r4J95L5p2k4J8J10l1j39lR6j50
$$ -49 69 -104 -133 127 246 -20 9 52 -260 -379 -259 -2 -96 99 134 62 38 56 166 135 -4 -7 89 -61
6745f1j00L8M26l54O7M8q4J35k00M02j40j88q4q0J68k29J05L12l51l0OL02k15
$$ -61 -161 -123 303 -51 16 64 -20 115 -85 317 177 -11 -95 -175 -7 -236 -131 181 -170 -200 -194 108 -107
6768a07k8J81ok19J6M30pl69L2J20J7L1j20o1J01j9j54P3J69j27R0O9N8R8j69
$$ -107 -135 46 40 -179 -163 267 260 -109 -77 43 60 91 -29 -90 11 -8 -162 -89 80 -47 43 112 170 268 99
6793I9N8m41K64j39n2P3R5J37l54K45K89l37j54R8N7J41k26J43L7m02K78J90j46
$$ 99 157 -284 -20 -159 -211 -138 -43 94 -260 -15 274 -63 -217 -119 -62 79 -147 -4 33 -369 -91 99 -47
6816d7J39m5K1p4j44J3m3p0j0K82k12J74q4K32k66J24K19j67j14j6J95q9j82K23
$$ -47 92 47 68 -6 -150 -137 -180 -250 -260 22 -190 -16 -100 132 -134 -10 209 42 -72 -88 107 18 -164 59
6840E9j56J27J4J52k65L55m42K75J6k72J93J00k23J42rK31J37n76J27J00J89k04
$$ 59 -97 30 44 196 -69 286 -156 119 135 -137 56 156 -67 75 66 297 434 -142 -15 85 274 70
6862G0j43nJ81k37L49k72K87k19k5j7Q1Jm9m3k32K75K22j41o2j69K29j06J0l7
$$ 70 -73 -78 103 -134 215 -57 230 11 -14 -31 50 51 2 -41 -273 2 224 83 21 -148 81 -25 -15 -52
6886e2j14J15j30K0J53J3j67R4K96k01j25J86k56J19Pj02P3M7N1p1k61K24L85
$$ -52 -166 -51 -181 -161 -8 5 -162 -68 228 27 -98 88 -168 -49 -42 -144 -71 -24 27 -44 -305 -81 304
6909C04l38r2L45l89M59l36J63q8p7J45N2k07j05J26o5n6J96J65n9r3j44J93J10
$$ 304 -34 -126 219 -170 289 -47 116 28 -49 96 148 -59 -164 -38 -103 -159 37 202 143 50 -94 99 209
6932B09P8l65O8LRj58M50j82r0l8P3j4Q0j56K61k88J61m3k8l0k5Q1k7J34q1j7
$$ 209 287 -78 -10 -7 2 -156 294 112 22 -16 57 43 123 -33 228 -60 101 58 30 0 -25 56 29 163 82 65
6958F5j86j47L17J73k35OJ59l47J34Q8N1j0J35k22J63j70j0j07K06k25L65q7J6
$$ 65 -121 -268 49 222 -13 -7 152 -195 -61 27 78 68 203 -19 144 -26 -36 -143 63 -162 203 116 132
6981A32j4p7J35j69J18K7l49K78n0k6L97l74k84K96j25jK28j95m2J40Qm6J03k02
$$ 132 118 41 176 7 125 152 -197 81 31 5 402 28 -256 40 -85 -86 142 -53 -95 45 53 7 110 -92
7005i2L8J87K9j05r1K07Q4j84q3K1J83k46nL6Pl7J28P7k75J88j92J48l00K72J58
$$ -92 -54 133 162 57 -34 173 257 73 -10 11 194 -52 -57 -21 -14 -51 77 154 -121 67 -125 23 -277 -5 153
7030A53j65q6J73k5p5l4o4J03k03M6L90m85J58J25J16k07K35k51j01M68m26K2
$$ 153 -12 -98 75 50 -25 -59 -123 -20 -223 -177 213 -272 -114 11 127 -80 155 -96 -197 271 -155 -133
7052a33L07k98K68k84k02K72J25K3K01j22k32J72l14K48Q4j68j53K31j1q8l3L38
$$ -133 174 -124 144 -140 -342 -70 55 78 279 157 -75 97 -217 31 115 -53 -206 25 14 -74 -107 231
7074B31Rk06j19J18K2Q9o4R2k57J11l6J3R8r8K06K0m59J07J69j06L0j55L50l8
$$ 231 240 34 -85 33 55 144 80 172 -85 26 -10 3 101 3 209 229 -230 -123 46 -60 -30 -185 165 127
7098A27R1k05j1j15p1J41J02J60k66J77l17J56j3L24j31k10K30j75j91K28J32
$$ 127 218 13 2 -113 -184 -43 59 219 -47 130 -187 -31 -44 280 149 -61 169 -6 -197 31 163
7119A63n1j42j52R7P5l31K86L44j32l39J96j34L7nK8L18M7m04K8Q5n6N4P3j06
$$ 163 112 -30 -182 -85 -10 -341 -55 289 157 -182 14 -120 -83 -88 -60 258 305 -99 -71 14 -42 12 85 -21
7143b1j97K71J33k52N1j15L98k48O4j46L5J9Q3L7M3QQ6k01j20j85J88M1n1o1q9
$$ -21 -218 53 186 -66 -15 -130 268 20 84 -62 -27 -8 75 112 155 163 249 48 -72 -257 -69 -28 -79 -140 -229
7168b29L24l00K02K38k77j68K48J13k42K10j43K57k71J21p5K6l1R3Q4q9r8J28
$$ -229 95 -205 -3 235 -42 -210 38 151 -91 119 -24 233 -38 83 8 34 3 96 180 91 -7 121
7190A21l4k60J25J01r7n0l6M5J77J38q0k25pl8J62j46P6K5Pk83K11O4j44L35l81
$$ 121 87 -173 -48 53 -44 -94 -130 -85 92 230 150 -75 -82 -120 42 -104 -28 -3 4 -279 -68 -4 -148 187 -194
7215a94J79j64M12l07j05K70nk90J08j6L94m43J18J45j49J70q4Oj66r2K52m37
$$ -194 -15 -179 233 -74 -179 91 86 -204 -96 -112 282 -161 -43 102 -47 123 39 45 -121 -213 39 -398
7237c98L89O4r1J04oJ7j59O6k0K10k40J50j29L23j89j51j85K22p5J71j36J70j5
$$ -398 -9 55 -36 68 62 79 -80 -14 -34 176 -64 86 -43 280 91 -60 -245 -23 -98 73 -63 107 92
7260I2j75P7n5K10l28J12P5l2l4j79J60L9J88n5j83j58J56K14k42j47Q8K04r1
$$ 92 -83 -6 -61 149 -179 -67 8 -24 -58 -237 -77 -38 150 95 -88 -246 -90 124 -118 -265 -177 27 -64
7283f4R3p6l9K89M6j65o7J22j21O4N1m9l8M5j7p3JN7J10K7j87l9J6r5J63l8n3
$$ -64 29 -47 -86 203 249 84 17 139 18 82 133 84 46 91 74 1 2 59 169 196 9 -30 -14 -109 54 16 -37
7310c7k26L68j1l66L06j35K89l97K15Nj28P6J72J0k44n5J35qO4Q0j57L0m5K15
$$ -37 -263 105 94 -272 34 -101 188 -209 6 11 -117 -41 131 141 -103 -158 -23 -31 33 113 -44 -14 -59 156
7334A56m79K79j24RJ12J05o1K35k71O8j0q4k05K50n9k38M2L48j4k72K64l0J4k07
$$ 156 -323 -44 -168 -159 -47 58 -3 232 -39 29 19 -65 -270 -20 -79 -317 -275 73 59 -213 51 21 35 -172
7358a72L89Pj11j34p2R1oL8J30k75K50k52q8J65L8L10l59j69M52l55J85j00N6
$$ -172 217 224 113 -21 -93 -2 -8 30 160 -115 135 -117 -205 -40 -2 308 -51 -220 232 -123 62 -38 18
7381A8K37l84J98k49L85p9k15K97l42J19J14n8k04J50j25M04j62j9nJ70l22n2
$$ 18 255 -129 69 -180 205 126 -89 208 -134 -15 99 41 -163 -13 -138 266 104 85 80 250 -72 -124
7403a24K25l0qJ28m39R7K39k29J86j68K14o6K1J85m17J38J44l42N6K90q2p1j89
$$ -124 101 71 63 191 -248 -151 88 -141 45 -123 91 25 46 231 -186 -48 96 -246 -190 100 18 -53 -242
7426b42J96K07k71J36n7m1M0j18J71J20j8q9K5M0j29j10L31k06j17q8K02l8j21
$$ -242 -46 161 -110 26 -31 -72 -32 -150 21 141 123 34 59 99 -30 -140 191 -15 -132 -220 -18 -56 -177
7449a77L28j02n2K01n9l51J94L08p4k64J27NK40n16P7K00jj01N5j75J87K13k93
$$ -177 151 49 -3 198 139 -212 -18 290 216 -48 79 84 324 -192 -115 85 84 -17 38 -137 50 263 -30
7472c0J14J41k18L6L7j5j17P0k19K28j19J69j59K7n8K07k20L55j43k04j35K83
$$ -30 84 225 7 43 80 65 -52 18 -201 27 -92 77 -82 -55 -113 94 -126 229 86 -118 -253 30
7494C0r0J19J71l51M1p8N4K94o7r6j3j09L6k30M21j11J66m79L55R3j8k15l3J87
$$ 30 -60 59 230 -121 -80 -158 -104 190 123 27 14 -95 -59 -289 132 21 187 -292 63 156 138 -77 -110 77
7518G7j21J04K8j28j24J30K9j30N8J35N1k4j98R5Q0r6P0r3r7O0M04k21k43J49
$$ 77 -44 60 88 -40 -164 -34 -5 -135 -77 58 109 85 -113 -18 62 -34 36 -57 -154 -94 310 89 -154 -5
7542eq0J96k54P2M89l79Q4Q7l64P1j1J75r5K06k01K23j01k37O0K7K7j02n7K55
$$ -5 -85 111 -143 -71 418 39 123 210 -154 -83 -94 81 -14 192 -9 214 113 -124 -64 -37 -10 -112 -169 86
7566H6j18JJ68l17J88K8j01M3j44J91l2k20K11N9oj6j91J80k6r9K14oO7j56J95
$$ 86 -32 -31 137 -180 8 36 -65 -22 -166 25 -7 -227 -16 43 37 21 -170 10 -16 -115 99 93 160 4 199
7591A99k72J80j04j02o1K37P0j37J68l82P1L43o2jm13K30J44o1J3j55K57k65R1
$$ 199 -73 107 3 -99 -160 77 147 10 178 -204 -133 210 148 147 -266 -36 108 47 60 -95 162 -103 -12
7614a2J90k85J58j03L9K19j61m9k75J87K24k33J03J20j26n6K64l23L47l84k8J17
$$ -12 178 -107 51 -52 -13 206 45 -4 -279 -92 132 -101 2 122 -4 -60 204 -119 228 -156 -184 -67
7636f7R4j18J16j51J09Q0n5j80K36lL4j30p0K4K61l56J39l2J21o7j9m3J6p4L84
$$ -67 27 -91 25 -126 -17 63 8 -172 64 61 95 -35 -105 -81 180 -176 -37 -69 52 -15 -34 -77 -61 -135 249
7661B49q9l94K78l6N8l08J80m3J98Jk20K74o5k40K15o8K97k80j18O2M5K25o9k68
$$ 249 160 -234 44 8 66 -242 -62 -105 93 94 -126 148 83 -157 58 -10 287 7 -111 -49 -4 221 152 -116
7685a16J53Q9l7R3j07J8l2J37r9k6K8j72K69K95n93R2o4J80j17n6J57j46Q2M4
$$ -116 37 126 89 182 75 93 61 198 99 73 101 -71 198 493 -100 -8 -72 108 -9 -65 92 -54 28 72
7709G2k87J66P7J7N0k79K75N7o7p5j41L95j37o3M9j57P7J29l9j89J34J44k49j9
$$ 72 -215 -49 28 45 95 -184 91 148 81 6 -135 260 123 60 109 -48 29 158 119 -70 64 208 -41 -60
7733f0k3J97l82P9K30L34m62j48M74l04Q9qK12k25j12j59J81L10r9k30J9J34n5
$$ -60 -83 114 -268 -189 41 375 -87 -235 239 -65 24 16 228 3 -109 -268 -87 223 124 -106 -87 47 -8
7756hj5j2N4%K8k13Q0R8M2L8o5J3n3q1Q5n8j6N8j44L44k19j18K34K25n01L04q2
$$ -8 -23 -35 19 19 47 -166 -86 12 54 92 27 40 -13 -94 -9 -67 -83 -25 -169 175 -44 -162 72 297 -204 100 18
7783A8L1k53L36l1Rj39j40L04k50K04n1J03k45p0K25l06K43o5O4j0Q1n2L6J43
$$ 18 49 -204 132 101 110 -29 -169 135 -115 89 38 141 -104 -174 51 -255 -12 -77 -13 -23 58 6 42 185
7807A85k34n6J59k14L71k38k55L61k32j55N26l03M8q6j77M46%p7J82j74j01K3
$$ 185 -49 -105 54 -160 211 -27 -282 79 -153 -308 218 -85 -37 -123 -300 146 146 69 251 77 -24 -1
7829aKJ28j35j05N0J00j71N1Q0Q5k29KL62k60j06L38l52Q2l2K09k12K22Qk4j07
$$ -1 1 129 -6 -111 -61 39 -132 -81 -1 84 -145 -143 219 -41 -147 191 -161 -79 -111 98 -114 108 116 92 -15
7854a5p4P3J7J25k36MP6PK22r3r1N3k6j47M8K66j27k24J3M8J61l32K49K3k45L99
$$ -15 -89 -16 1 126 -110 -106 -30 -23 199 106 15 68 42 -105 -57 209 82 -142 -129 -81 80 -252 -3 20 -225 174
7880A74l89KJ96O4kM8q7M4j34O2r4K83m06J67K25J30k33M3M34r27M11k3m1R0o5
$$ 174 -215 -213 -17 47 45 93 6 50 -84 -22 -116 167 -239 -72 153 283 50 93 527 -400 11 -12 -53 37 -28
7905b8J17q9J46k41J93j15N8n9l9O4JJ32j22j08J8Pl1K23k0j80R5p2r0J67j55
$$ -28 89 0 146 -95 98 -17 41 -18 -57 7 8 140 18 -90 -72 -65 -96 127 107 -73 22 -50 -140 27 -128
7930a28K57j04l06j35L65O5R0J60l27K00j76j47K61k96K66j74K00p6j59q7J76
$$ -128 129 25 -281 -416 -51 14 104 264 -63 137 -39 -186 75 -221 45 -129 71 -5 -164 -251 -75
7951g5n4K5J03j75N3Q3j29J39J48k83J10L5k58M14k65J00L8j1l26K65J83q9L97
$$ -75 -129 -104 -1 -176 -123 -40 -169 -30 118 -165 -55 -20 -278 136 -129 -29 9 -2 -328 -63 120 31 428
7974D28m53N7J9Q5J66k81l1P6J05o1l32N15l50J89jK5j41k7n4P5P0L9j59o7m5
$$ 428 -25 32 51 136 302 21 -10 66 171 110 -222 293 -57 132 131 156 15 -12 -66 9 79 118 -41 -108 -153
7999a53K69l90L03N2k95L21Lm17J81K21lm01M71l78p5K47K10r0qk65K25J08n1
$$ -153 116 -274 29 81 -214 107 110 -307 -126 95 92 -309 162 -216 -291 -44 166 76 68 -197 28 136 85
8022H5j48J59j0p0m8J51M4j6r1N5k38m4J43J32p9n5J27rj87K95l32Rk5J14K70
$$ 85 -63 96 86 16 -32 119 163 147 56 111 -127 -171 -28 104 25 -30 97 88 -99 196 -136 -127 -152 -38 232
8047B32n0j30r0M2J87j82O1k43j69K14J0J89l04M0J05J06K3N3q3o2q3K05m2Oj33
$$ 232 182 52 -38 4 191 9 70 -173 -342 -128 -118 71 -233 -193 -88 18 41 94 11 -51 -134 71 29 35 -98
8072i8Q2J07j99K41l69J62L1J78j55P4k43J76j66N7q8J2L00k99K34N1r6j41J81
$$ -98 -16 91 -108 133 -236 -74 -43 135 -20 54 -189 -13 -179 -122 -210 -198 102 -197 37 88 -8 -149 32
8095C2j74M13k72o4Q8l7N0p1J1l6O6O9l03L61k55M20l85J20j05J36O5n2j23J71
$$ 32 -142 271 -1 -65 23 -14 36 -35 -24 -60 6 75 -228 133 -122 298 -87 33 -72 64 129 77 -46 125
8119A25j55j01L75l61K85k54K95l59M5K16j97J99l35K86r3J59k00J9J8J75o1q4
$$ 125 -30 -131 244 -117 168 -86 209 -150 -105 111 -86 113 -222 64 -29 130 -70 -51 -33 142 81 -3
8141cN2M6Q7l67N34l96J55p1k29K18j16j3K63j4r8P3j28j8J18J48k46k71L31J88
$$ -3 49 95 182 -185 349 -47 108 37 -192 26 -90 -103 160 146 48 121 -7 -25 93 241 -5 -276 55 243
8165B43j39j50k7j8p9K67n8kK33j43Oj56K47k44K42JL2l42N0J16K3j08r3K8o2
$$ 243 104 -46 -73 -91 -170 97 39 37 270 127 133 -23 224 -20 222 223 255 -87 -37 79 102 -6 -99 -71 -133
8190a33J6
$$ -133 -117
8191a17
$$ Imaginary data points
##PAGE= N=2
##DATA TABLE= (X++(I..I)), XYDATA
0@%%%%%%%%%%%Qj6J6j6J9k7L2m0M8n6P2q6J00j18J36j52J76k08K40k72L07l48
$$ 0 0 0 0 0 0 0 0 0 0 0 0 8 -8 8 -8 11 -16 16 -24 24 -32 40 -46 54 -64 72 -80 96 -112 128 -144 163 -185
33a85L94m46N03n65O35p10P90q79R78j085J201j329J468j620J786j966K166k387
$$ -185 209 -237 266 -299 336 -374 416 -463 515 -570 631 -698 770 -850 936 -1030 1136 -1251
51a251K629k897L194l529L907m333M822n389O056o852P823r039J0606j2712J5704
$$ -1251 1378 -1519 1675 -1854 2053 -2280 2542 -2847 3209 -3643 4180 -4859 5747 -6965 8739
66H739k0303K8313m6013J49312n1395k31728K67177r3452l1483L4726o5755J19984
$$ 8739 -11564 16749 -29264 120048 68653 -163075 104102 10650 -20833 13893 -51862 68122
78F8122n0569j04193J48178m0672n4167K4775J2709L1899o5781j511R1927o9303
$$ 68122 17553 -86640 61538 20866 -33301 -8526 4183 36082 -29699 -31210 60717 -8586
90h586k9463O7211p678m2027R657K8132J291l9835L548N6702l0668n5965O5284
$$ -8586 -38049 29162 21484 -20543 -10886 17246 18537 -21298 -17750 38952 8284 -47681 17603
103A7603J3196n4779L562K6965K4894n4186k4892R1909l7208o1864N6319J5752
$$ 17603 30799 -23980 -20418 6547 31441 -22745 -47637 44272 7064 -54800 1519 17271
115A7271j7568l5362K1857N6737o8474j0298N7267j6806p880k4218L4067L9430
$$ 17271 -297 -35659 -13802 42935 -25539 -35837 21430 4624 -3256 -27474 6593 46023
127D6023q7765K8944O1642o6878O065J7980k45J2309m6353L4490L0906o3467K3428
$$ 46023 -41742 -12798 48844 -18034 -11969 6011 5766 18075 -28278 6212 37118 -26349 -2921
140b921K0946k4278J1803j8879J9614J8750n3315K8275K8882m5673J0576J7443
$$ -2921 18025 -6253 5550 -13329 6285 25035 -28280 -5 28877 -16796 -6220 11223
152A1223n814k210j7068K6966O971m1802K5666J9178k5940L161j04J3624K680
$$ 11223 5409 3199 -13869 13097 20068 -21734 3932 23110 -2830 331 227 13851 16531
165A6531m1102K8683K7978n2073N291L4235j4229j3960o191K4680N559m5553K0617
$$ 16531 -24571 4112 32090 -19983 -14692 19543 5314 -8646 -14837 9843 15402 -30151 -9534
178i534L1223l1919m051J0113J2244q87l9183L1957K7245n3530J1740L0768j4921
$$ -9534 21689 -10230 -14281 -4168 8076 7189 -31994 -37 27208 -26322 -14582 16186 1265
191A265r731o482K9939l504l9836L4343J1767k9509N835L637J7160j7228k6090
$$ 1265 -8466 -14948 14991 11487 -28349 5994 17761 -11748 -5913 -2276 14884 -2344 -28434
204b8434M9960j0411m2116L5185R399j6998j0075P048L1688l4750j8070N3745
$$ -28434 21526 11115 -31001 4184 13583 -3415 -13490 -6442 25246 -9504 -27574 26171
216B6171j5840k9053K2511P727J006k3140l265M5820k6948l4012M9109L659l4605
$$ 26171 10331 -18722 3789 11516 12522 -10618 -13883 31937 4989 -29023 20086 23745 -10860
229a0860N268J7256Q017k9951p085M6724k1994l2474L5489K282j5342n562J126
$$ -10860 -5592 11664 19681 -10270 -17355 29369 7375 -25099 10390 12672 -2670 -8232 -7106
242g106K8002k7379k1342M9683j4580l0500K6510M694n967j3637M043K9624k9912
$$ -7106 20896 -6483 -27825 21858 7278 -23222 3288 7982 2015 -11622 -7579 22045 -7867
255g867j1943L8415j6270j4888J1365K497P645k1235M87L1954k5477j4147K7100
$$ -7867 -19810 18605 2335 -12553 -1188 1309 8954 -12281 -11794 20160 -5317 -19464 7636
268G636l233j2095m191J3170J1112k9156O798K5982k2550m684J1355n07M176j5321
$$ 7636 4403 -7692 -11883 1287 12399 -16757 -9959 16023 -6527 -11211 144 -363 3813 -11508
282a1508P118K1372k3216j484J9230q393l696k823Q123O710k0327J1318J1687
$$ -11508 -4390 16982 -6234 -7718 11512 3119 -577 -3400 4723 11433 -8894 2424 14111
295A4111j8112O966K46m477J0570j5489M888J4173j8677N604O703q570O779q237
$$ 14111 -4001 2965 3211 -1266 9304 -6185 -1297 12876 -5801 -197 6506 -2064 4715 -3522
309c522L393J0805j9115P890R907j5587Q701j577l446J2875j6224K430J8123k0053
$$ -3522 -129 10676 -8439 -549 9358 -6229 2472 895 -2551 10324 -5900 -3470 14653 -5400
323e400k70J2818o492p8n889O583R662k3345P181J5448j7999J547L404J752N132
$$ -5400 -5670 7148 656 578 -5311 1272 10934 -12411 -5230 10218 -7781 -6234 -2830 -1078 4054
338D054j8566R907J8055k4638J71J7545m974p917l745J6773K44k3854J7013J2444
$$ 4054 -14512 -4605 13450 -11188 -11017 6528 1554 -6363 -10108 6665 6909 -16945 68 12512
352A2512j8844J133O113O343o365j4910K2814L951k6330J2096J3448j0375q024
$$ 12512 -6332 -5199 914 7257 892 -14018 8796 12747 -13583 -1487 11961 1586 -6438
365f438L086J7104j2900j7993K7807j42k3477J1879Q685l164p265m496K1607p031
$$ -6438 -3352 13752 852 -17141 10666 10524 -12953 -1074 7611 4447 -2818 -7314 14293 7262
379G262k3160K2943P014j9960J199J0374O988j5860p951K8666j1336k2206K1850
$$ 7262 -15898 7045 14059 -5901 -4702 5672 12660 -3200 -11151 17515 6179 -16027 5823
392E823L851j1961j269J131J4600j2478j5681K6492k685k0867J0042P695k795
$$ 5823 9674 -2287 -3556 -2425 12175 -303 -15984 10508 7823 -13044 -3002 4693 1898
405A898j0534l13K1483j5698j3567K4571m362j1767N712J445P485j1464n364K1412
$$ 1898 -8636 -8949 12534 -3164 -16731 7840 3478 -8289 -2577 -1132 6353 -5111 -10475 10937
419A0937r760j1954J3264N16l100p728L831J4756j7430l638K0038r329o365N633
$$ 10937 1177 -10777 2487 3003 -97 -7825 -3994 10762 -6668 -10306 9732 403 -5962 -329
433c29R11M216j1056N58J4965j0006o320R879K390l632o894O340R815j5071p80
$$ -329 582 4798 -6258 -5700 9265 -741 -7061 2818 5208 1576 -5318 1022 10837 -4234 -5014
448e014J5564p219n259L851K443L610j0684p60J5977j1069q871J2391N57m576
$$ -5014 10550 3331 -1928 1923 4366 7976 -2708 -3468 12509 1440 -7431 4960 5517 941
462I41p301P214J1838k0878L08K0484j3537n234N968K168M237j6716O195J9302
$$ 941 -6360 854 12692 -8186 -7878 12606 -931 -6165 -197 1971 6208 -10508 -4313 14989
476A4989k1371l427J6536l205o453p441J4007P674k6350R994J9855j9139n834
$$ 14989 -6382 -9809 6727 3522 -2931 -10372 3635 11309 -15041 -5047 14808 -4331 -10165
489a0165J1513M901q107j2203J6459Q448k2647J455K0135o757j5975O499J8076
$$ -10165 1348 6249 -1858 -14061 2398 10846 -11801 -10346 9789 3032 -12943 -6444 11632
502A1632j0295j9620K0435J3334k5290j286K1506l063j5251M40J8673k104k3841
$$ 11632 1337 -18283 2152 15486 -9804 -11090 10416 7353 -7898 -7458 11215 9111 -14730
515a4730J3042J9205j9615q810J6565Q238j6766j0241K6207kk8143J3379J6931
$$ -14730 -1688 17517 -2098 -10908 5657 13895 -2871 -13112 13095 13093 -15050 -1671 15260
528A5260j4102j1241Q802J6507j5666j5893K7119J713k3596N777J4323m37j8195
$$ 15260 1158 -10083 -1281 15226 -440 -16333 10786 12499 -11097 -5320 9003 8566 -9629
541i629J299K7332j5621k1321K5436N503k0156j878J4155O326k0948j434K5358
$$ -9629 -8330 19002 3381 -17940 7496 12999 -7157 -9035 5120 11446 -9502 -10936 14422
554A4422j1462j7309J3662Q976q421j3005J1218J6327k3001o760K6365o241j8359
$$ 14422 2960 -14349 -687 8289 -132 -13137 -1919 14408 -8593 -15353 11012 4771 -13588
567a3588Q937J1904n197j4687P797J7001j5333j0691J9051K765j3910p42J0925
$$ -13588 -4651 7253 2056 -12631 -4834 12167 -3166 -13857 5194 7959 -5951 -6693 4232
580D232M555j6014j932K2170r937j6528J7204M988j1242k899O168R465j3844n805
$$ 4232 8787 -7227 -9159 13011 3074 -13454 3750 8738 -2504 -5403 765 10230 -3614 -9419
594i419J9615n336j1734O311N721J636j3576K910J8467j5839q085J6311j22q507
$$ -9419 10196 4860 -6874 -563 5158 6794 -6782 -3872 14595 -1244 -9329 6982 6860 -1647
608a647l982J0546N354j6452L557J1852o655o679J136J0591k957j5434J2333Q820
$$ -1647 -5629 4917 10271 -6181 -2624 9228 2573 -4106 -2970 7621 4664 -10770 1563 10383
622A0383j4906k625J0818K100j0506l442J3823k282j3256O508J0957p994q083
$$ 10383 -4523 -7148 3670 5770 -4736 -8178 5645 3363 -9893 -3385 7572 -422 -8505
635h505P661P136p685r344J1182R351j8384j023J9384p447j1897O535R521l632
$$ -8505 -844 6292 -1393 -10737 445 9796 -8588 -9611 9773 2326 -9571 -3036 6485 2853
649B853j4637J0266J3467j7799l079J4453J94r312o132J6475K897k4119J1226
$$ 2853 -11784 -1518 11949 -5850 -8929 5524 5718 -3594 -9726 6749 9646 -14473 -3247
662c247J6974j6058o775J1249P551j1065r314J9133K145j9781O332J2511m570
$$ -3247 13727 -2331 -9106 2143 9694 -1371 -10685 8448 10593 -9188 -2856 9655 5085
675E085j1678L041J6747j0043j5668J8109P304j8407j442J4911Q30j6579J641
$$ 5085 -6593 -3552 13195 3152 -12516 5593 12897 -5510 -6952 7959 8789 -7790 -6149
688f149J8514q571j5682J3119R320j2719o919J1299P304j5162n481K0018j744
$$ -6149 12365 3794 -11888 1231 10551 -2168 -9087 2212 9516 -5646 -11127 8891 7147
701G147j8719Q211J4068j0061j1430J0289J0821j4420p362J8032k39j5068L575
$$ 7147 -11572 -3361 10707 646 -10784 -495 10326 -4094 -11456 6576 6337 -8731 -5156
714e156J0048j157j2713K099J6992j0630j2671J6936K872j2676m88R004M241j4370
$$ -5156 4892 3735 -8978 -6879 10113 -517 -13188 3748 6620 -6056 -6544 2460 6701 -7669
728g669M09J6730r488r031J0555L094m272o217N238J0157j3164l337J5063m476
$$ -7669 -7260 9470 -18 -9049 1506 4600 328 -5889 -651 9506 -3658 -6995 8068 3592
742C592p953L201O627k61j0860N150R920j1018l128R323p19m677k056N482L693
$$ 3592 -4361 -1160 5467 5206 -5654 -504 9416 -1602 -4730 4593 3874 -803 -2859 2623 6316
757F316r385l15R988m096o973M773M484m003m710N328L978p240j129O107j473
$$ 6316 -3069 -3384 6604 2508 -4465 308 4792 789 -3921 1407 5385 -1855 -2984 3123 1650
772A650k998q58L080K976p186M6Q202n019m170L412K713j574o092M539N544q474
$$ 1650 -1348 -2206 874 3850 -3336 -3290 4912 -107 -4277 -865 1848 274 -5818 -1279 4265 -4209
788d209k90O285j698k101k304N344K473r742L008P858n885l589M121M662l987
$$ -4209 -4499 1786 88 -2013 -4317 1027 3500 -6242 -3234 4624 -1261 -4850 -729 3933 -54
803e4o455Q674L046j0649K899O398k680l424n43P084l93r844N798P503r116k605
$$ -54 -6509 2165 5211 -5438 -2539 3859 1179 -2245 -2788 4296 3903 -5941 -143 7360 -1756 -4361
819d361P212K286o724k903R987l81j1006N365P694o622l823M094N317m808o974
$$ -4361 2851 5137 -1587 -4490 5497 5116 -5890 -525 7169 547 -3276 818 6135 1327 -5647
834e647R628L301j1564J805Q336k663p221J790R300n435r133J0153L347j0073
$$ -5647 3981 7282 -4282 -2477 5859 3196 -4025 -2235 7065 1630 -7503 2650 5997 -4076
848d076N73O485L16o722j559R299j755r952N950O692o569m965O491M594q846k413
$$ -4076 -3503 2982 3298 -3424 -4983 4316 2561 -7391 -1441 5251 -1318 -6283 208 4802 -4044 -6457
864f457J0470k289p734M530M627k489m788J466P436n762n548Q811P05o388M94
$$ -6457 4013 1724 -6010 -1480 3147 658 -4130 -2664 4772 -990 -6538 2273 2978 -3410 -2916
879b916M335J671p336L92R171n646m491O781N34k749j995K170M355n441j696O864
$$ -2916 1419 3090 -4246 -3854 5317 -329 -4820 1961 2495 -254 -2249 -79 4276 -1165 -2861 4003
895D003j995l332J164K402J159n461J420O455n495k127N293j348j759k81K0L341
$$ 4003 2008 -1324 -160 2242 3401 -2060 -640 5815 320 -1807 3486 2138 379 98 118 3459
911C459l444k477N102j49m028O18K386M50m648Q93N452m130k526M100K49j294
$$ 3459 15 -2462 2640 2491 -1537 -919 1467 1917 -2731 -1838 3614 -516 -3042 1058 1307 13
927A3k218J229M422n387k428O493o76n238J521M392k12o906K752O974o454l595
$$ 13 -2205 -976 3446 -1941 -4369 2124 1448 -3790 -2269 2123 1911 -4995 -2243 4731 -1723 -5318
943e318O037J426m344k510N516L014q337K87Q467l360n935L138O098l263p481
$$ -5318 719 2145 -2199 -4709 807 3821 -4516 -4229 4238 878 -5057 -1919 4179 916 -6565
958f565P763N701j0690j30R151k457o371J129P413j698q807N653P612q123m533
$$ -6565 1198 6899 -3791 -3921 5230 2773 -3598 -2469 4944 3246 -5561 92 7704 -419 -4952
973d952P571M068q736l429J1624p19j1671N083R079p176n870O252N006o443n612
$$ -4952 2619 6687 -2049 -5478 6146 5427 -6244 -1161 7918 742 -5128 1124 6130 -313 -5925
988e925R129L617j1119K21J0816l506q514L412Q362n024r512R499N944j2093o61
$$ -5925 3204 6821 -4298 -4077 6739 3233 -5281 -1869 6493 1469 -8043 1456 7400 -4693 -5354
1003e354R755j236p850Q3R590k667j0209O400O896p014n304O804N997r781l379
$$ -5354 4401 3165 -4685 -4602 4988 2321 -7888 -1488 5408 -1606 -6910 -106 5891 -3890 -7269
1018g269J1925j699r976L954P417l725o917N019O980p346l775P283K476o993k275
$$ -7269 4656 2957 -7019 -3065 4352 627 -6290 -1271 5709 -1637 -5412 1871 4347 -2646 -4921
1033d921Q383J168r776K686Q904n367o784O780M484o549l265O348L047o832k262
$$ -4921 3462 4630 -5146 -2460 6444 1077 -5707 1073 5557 -992 -4257 2091 5138 -1694 -3956
1048c956Q378l11p845K843N209j721o142K513P527o254n304Q832Q21o734N66M212
$$ -3956 4422 4111 -3734 -891 4318 2597 -3545 -1032 6495 241 -5063 3769 4590 -2144 -1578 2634
1064B634J347o691O5P998l767n763M399L445k539n466L722O649q629l065R024
$$ 2634 3981 -2710 -2645 5353 1586 -4177 222 3667 1128 -4338 -616 6033 -2596 -5661 3363
1079C363r35o615J453N170k19o893J843P461n100n413N711L679n433l369O269
$$ 3363 2428 -4187 -2734 2436 2217 -4676 -2833 4628 -472 -5885 -174 3505 -1928 -5297 972
1094I72L338q609m78R197k481p864M140O578m840n743N613N497p036l982Q578
$$ 972 4310 -4299 -4777 4420 1939 -5925 -1785 4793 -47 -5790 -177 5320 -1716 -5698 2880
1109B880J835q390p67R010p25r921L933R601p067o519Q446L746p822l103Q733
$$ 2880 4715 -3675 -4442 4568 3843 -6078 -2145 7456 389 -6130 2316 6062 -1760 -4863 3870
1124C870K215j0554J828R241l549p487L329P967m867r112R393O166j2346n08R697
$$ 3870 6085 -4469 -2641 6600 3051 -4436 -1107 6860 1993 -7119 2274 8440 -3906 -4414 5283
1139E283j081q288N13J0249l720j0908Q438O585q943l891P388M241r075l436J2111
$$ 5283 4202 -4086 -3573 6676 2956 -7952 486 7071 -1872 -5763 1625 5866 -3209 -6645 5466
1154E466r78j1923M612Q841n870p277P080O057q718m039R522J925j0152N58R513
$$ 5466 4488 -7435 -2823 6018 148 -7129 -49 6008 -2710 -6749 2773 4698 -5454 -4896 4617
1169D617k430q569L527Q432n199p654P666N751r714k441R563L12q553R64R238
$$ 4617 2187 -6382 -2855 5577 378 -7276 390 6141 -3573 -6014 3549 3861 -4692 -3728 5510
1184E510l288q148N646N685n746m448N717M832p331l194R846q86q112K676O140
$$ 5510 2222 -5926 -280 5405 -341 -4789 928 5760 -1571 -4765 5081 4195 -3917 -1241 4899
1199D899k351o740L988O651o989l538P140P73m999j545N279J885p665R17P864
$$ 4899 2548 -4192 -204 6447 -542 -4080 3060 3833 -1166 -2711 2568 4453 -3212 -2295 5569
1214E569m303m799L814L836l536m509N061L462p155r60O413j180m156N76M041
$$ 5569 1266 -3533 281 4117 581 -3928 1133 4595 -2560 -3520 2893 1713 -2443 -1867 2174
1229B174l64n432J868N655m509m230N370K080m557j722M552J663n808k57O014
$$ 2174 1810 -3622 -1754 3901 -608 -4838 532 2612 -1945 -3667 885 2548 -3260 -3517 2497
1244B497j832m285K230L229j071m738K746N206n018l346O083J071n251r0M901
$$ 2497 665 -3620 -1390 1839 768 -3970 -1224 3982 -1036 -4382 1701 2772 -2479 -2569 2332
1259B332j33n594J862N521l499l576L550L097l297l917M997L224o505n67O306
$$ 2332 2199 -3395 -1533 3988 489 -3087 463 3560 263 -3654 1343 4567 -1938 -2505 3801
1274C801p73n625Q75O379k495o315N000M140n635j933M513K001n009j999O647
$$ 3801 3028 -2597 -1722 4657 2162 -4153 847 4987 -648 -2581 1932 3933 -1076 -3075 3572
1289C572p7p151K576N665l588n259M212M588n585l408O726J132o839R24N373j494
$$ 3572 3495 -3656 -1080 4585 997 -4262 -50 4538 -1047 -4455 2271 3403 -3436 -2512 2861 1367
1305A367m912J555N681l053o037N330M194o776j506N524J014n523q71P272j793
$$ 1367 -3545 -1990 3691 638 -5399 -69 4125 -2651 -4157 1367 2381 -3142 -4013 3259 1466
1320A466o567M471M088m884k472L906K723m456k485O550p9n660J321M952j631
$$ 1466 -5101 -630 3458 -1426 -3898 8 2731 -1725 -4210 2340 2261 -3399 -2078 2874 1243
1335A243m598K614M563m205l372O021L33m140M1L663L51m280N30M479j514m230
$$ 1243 -3355 -741 3822 -383 -3755 2266 2599 -1541 -1500 2163 2514 -1766 -1236 3243 1729 -2501
1351b501L169K954l234k439L568J739m265l51M105q07l679J503K370j039k536
$$ -2501 668 3622 388 -2051 1517 3256 -1009 -1360 2745 1938 -1741 -238 2132 1093 -1443
1366a443J216K728k465k060K822Q51k464j095K445J146l608N94L062j563k221
$$ -1443 -227 2501 36 -2024 798 1649 -815 -1910 535 1681 -1927 -1333 1729 166 -2055
1381b055J375J181l99k131J167K248k001j568K208P90j949r48K395O93l232M99
$$ -2055 -680 501 102 -2029 -862 1386 -615 -2183 25 815 -1134 -2082 313 1006 -2226 -1727
1397a727L124j617k010J521J482n72k239J056L067k643k132L701Q64k832p10L077
$$ -1727 1397 -220 -2230 -709 773 201 -2038 -982 2085 -558 -2690 1011 1875 -957 -1667 1410
1413A410P29m012N10M262k209k661K292K177j841k564K905K386m111j318M401
$$ 1410 2139 -1873 -1363 2899 690 -1971 321 2498 657 -1907 998 3384 -727 -2045 2356
1428B356J38m103Q26M202j868m130K892L242l674k494M184J346m072r26M358K69
$$ 2356 2494 -1609 -783 3419 1551 -2579 313 3555 -119 -2613 1571 2917 -1155 -2081 2277 2546
1444B546m850P99M551k106m126K728L779m212k783M905J673n346j85M970j194
$$ 2546 -2304 -1505 3046 940 -3186 -458 3321 -891 -3674 1231 2904 -2442 -2627 2343 1149
1459A149m133J292L717j915l952L495L202m481j675M152J207m597m61N289p49
$$ 1149 -2984 -1692 2025 110 -3842 -347 2855 -1626 -3301 851 2058 -2539 -3000 2289 1540
1474A540n754L226M245l916k792L430K700l652k443M978R54m798Q21L910j037
$$ 1540 -4214 -988 3257 -659 -3451 -21 2679 -973 -3416 1562 2516 -2282 -1461 2449 1412
1489A412l744J327M176k360m332M837J904m417o37L790L13l426m1M035r97m020
$$ 1412 -2332 -1005 3171 811 -3521 1316 3220 -1197 -1834 1956 2269 -1157 -1198 2837 1840 -2180
1505b180K011L306k619k573K601K954l826j938M540J09m004L95L423q81l312J231
$$ -2180 -169 3137 518 -2055 546 3500 -326 -2264 2276 2385 -1619 -1224 2199 1318 -1994 -763
1521g63L030j414l249K571K175k573k295K988J412l510q15L981o01l638J254L025
$$ -763 2267 853 -2396 175 2350 -223 -2518 470 1882 -1628 -2443 1538 937 -2701 -1447 1578
1537A578j445l036K039K981k951k215L159J402k563j444L197J433n287O69N327
$$ 1578 133 -2903 -864 2117 -834 -3049 110 1512 -1051 -2495 702 2135 -3152 -2483 2844
1552B844k745l386L014K564j912l371K921L148m520j398M741J13m028K71M473
$$ 2844 99 -3287 -273 2291 379 -2992 -71 3077 -1443 -2841 1900 2013 -2015 -1744 2729
1567B729p43n206K726M463m159k743M356J914m487j221N043L18n189N90N547k429
$$ 2729 1986 -3220 -494 3969 -190 -2933 1423 3337 -1150 -2371 2672 2990 -2199 -1609 3938 1509
1583A509m608L007L867l302l914M417L527o219j563O491r48n211J429M818j854
$$ 1509 -3099 -92 3775 473 -3441 976 4503 -1716 -3279 3212 2264 -2947 -1518 3300 1446
1598A446n145L701L960m939k630M861J648m791j833O317m26o425K590N437l668
$$ 1446 -3699 2 3962 -977 -3607 1254 2902 -1889 -3722 2595 2169 -4256 -1666 3771 103
1613A03m284L970L663n148k697N963R81n755R7N466o51n427J931N495l618m566
$$ 103 -4181 -211 3452 -1696 -4393 1570 2551 -3204 -3107 2359 1708 -3719 -1788 3707 89 -4477
1629d477M775L319n416j541N373P20n452K48N754j897m898L330L836l445l336
$$ -4477 298 3617 -1799 -3340 2033 2753 -2699 -2451 3303 1406 -3492 -162 3674 229 -3107
1644c107L890K993m647k254O087J71n833J551M892k533m016K688L908l343l333
$$ -3107 783 3776 -871 -3125 2962 3133 -2700 -1149 3743 1210 -2806 -118 3790 447 -2886
1659b886M443J914m755n25L817N80m213o9M799j829m453L173L068l437k344L359
$$ -2886 1557 3471 -1284 -1809 2008 2588 -1625 -1694 3105 1276 -3177 -4 3064 -373 -2717 642
1675F42J985m102r28M155k21m056Q02L501q24m343K303L634l292k550L348K082
$$ 642 2627 -1475 -2403 1752 1531 -2525 -1723 1778 954 -3389 -1086 2548 -744 -3294 54 2136
1691B136l747j595M537M75m835J220L734j463l418J792L375k341k994L175K687
$$ 2136 -1611 -3206 1331 1806 -3029 -1809 1925 462 -2956 -1164 2211 -130 -3124 51 2738
1706B738l943j376M003P31m287K58M380j073l646J596L633k813k896L674J792
$$ 2738 -1205 -2581 1422 2153 -2134 -1876 2504 1431 -2215 -619 3014 201 -2695 979 2771
1721B771l249j581L333J782m780j5N095j713l952K001L460k118l583L036L258
$$ 2771 -478 -2059 1274 3056 -1724 -1739 3356 1643 -2309 -308 3152 1034 -2549 487 3745
1736C745m778r98M068M01l876l37M519q47n008K278M030l026l252L562K518m452
$$ 3745 -1033 -2031 2037 2438 -1438 -1775 2744 1897 -3111 -833 3197 171 -3081 481 2999 -1453
1752a453j382M731O12n318O52M900j965m361K876L452l139k964L668K601m757
$$ -1453 -2835 1896 2508 -2810 -2158 2742 777 -3584 -708 2744 -395 -3359 309 2910 -1847
1767a847j245M781R4n017J076M593k073l890K669L442l260k202L685J604m026
$$ -1847 -3092 1689 1783 -3234 -2158 2435 362 -3528 -859 2583 -677 -2879 806 2410 -1616
1782a616j126M712M7m743J515L904k028l360K610L237l644k147M490M91l916J80
$$ -1616 -2742 1970 2017 -2726 -1211 2693 665 -2695 -85 3152 -492 -2639 1851 2342 -1574 -1394
1798a394L499l43l435Q54L874k140l197K757K504l302j695L416J019l699l43M243
$$ -1394 2105 1762 -1673 -819 3055 915 -2282 475 2979 -323 -2018 1398 2417 -1282 -1625 2618
1814B618j092l638K006K444j736k547K101J909k291j924L135P17l300L61K735
$$ 2618 1526 -2112 -106 2338 602 -1945 156 2065 -226 -2150 985 1702 -1598 -1237 1498
1829A498o34k866P63L011j698k342K180J386k028j157K125Q73k565l90K643j7
$$ 1498 864 -2002 -1239 1772 74 -2268 -88 1298 -730 -1887 238 1111 -1454 -1844 799 782
1845G82k783J017K233j356j911J681J582j838j475K476R33k376l39K143K54k262
$$ 782 -2001 -984 1249 -107 -2018 -337 1245 -593 -2068 408 1341 -1035 -1374 769 1023 -1239
1861a239K61K337n83k089J002K039j415j885K057J752k645m37K352k99j692m69
$$ -1239 -978 1359 776 -1313 -311 1728 313 -1572 485 2237 -408 -845 1507 1208 -484 -953
1877i53K279K89k757J122K238j541j939J578J658j857j458K240J275l163O5K781
$$ -953 1326 1615 -1142 -20 2218 677 -1262 316 1974 117 -1341 899 2174 -989 -924 1857
1893A857q27k225Q02J968q42k612J852J971k786j163K940M17k510n12L006k64
$$ 1857 1030 -1195 -393 1575 733 -1879 -27 1944 -842 -2005 935 1352 -1158 -1670 1336 1072
1909A072l424J435K747k200j926K155J548k053j394K491Q65l068j45L105o19k716
$$ 1072 -2352 -917 1830 -370 -2296 -141 1407 -646 -2040 451 1316 -1752 -1897 1208 589 -2127
1925b127J171K661j958j939K033J810k684r82L029M37k729J16K683j47l064J409
$$ -2127 -956 1705 -253 -2192 -159 1651 -1033 -2015 1014 1451 -1278 -1162 1521 1374 -1690 -281
1941b81K241j597k325K487J924k717j180K935K95k956O48K133n86j939O34K356
$$ -281 1960 363 -1962 525 2449 -268 -1448 1487 1782 -1174 -526 1607 1021 -918 -284 2072
1957B072j624j807K178J011k123o07J886Q58k573k05K825r93k505J604J486j473
$$ 2072 448 -1359 819 1830 -293 -900 986 1844 -729 -934 1891 898 -1607 -3 1483 10
1973A0j222J028J626k049j210K459K35k148L5J876L1k516N09K639j347j801J517
$$ 10 -1212 -184 1442 -607 -1817 642 877 -1271 -1236 640 671 -1845 -1336 1303 -44 -1845 -328
1990c28J348j548j278J874Q98k064l74K016K72k311M47K111o42j926Q35K053j374
$$ -328 1020 -528 -1806 68 966 -1098 -1472 544 816 -1495 -1048 1063 421 -1505 -670 1383 9
2007Ij710K026J106k193m57J774N96k191K74K481p11k431J209J934j099k237J926
$$ 9 -1701 325 1431 -762 -1219 555 1151 -1040 -766 1715 1004 -1427 -218 1716 617 -1620 306
2024C06J918k578p63K228N96k292m59K620j65k830J253K198j597j659J400K083
$$ 306 2224 -354 -1117 1111 1707 -585 -1044 1576 1411 -1419 -166 2032 435 -1224 176 2259
2040B259k341j725L315N17l692M53K709q04k609J463K153j671k114K203J853l072
$$ 2259 -82 -1807 1508 2025 -1667 -1214 1495 691 -1918 -455 1698 27 -2087 116 1969 -1103
2056a103j080L013N10k996j09L287p34l091J552K763k530j986K814J110k298j343
$$ -1103 -2183 830 1340 -1656 -1765 1522 788 -2303 -751 2012 -518 -2504 310 1420 -878 -2221
2072b221L006K94l170Q99L145j507k765J843K569k493k116L155J403l478k87L384
$$ -2221 785 1079 -2091 -1192 1953 446 -2319 -476 2093 -400 -2516 639 2042 -1436 -1723 1661
2088A661j88l367J076L390j843k636K053K155j988k092K545J666l044r19L563
$$ 1661 1473 -1894 -818 2572 729 -1907 146 2301 313 -1779 766 2432 -612 -1531 2032
2103B032n68l015P55K986r65l218K325K196k846j310K587J000k688o84L030J29
$$ 2032 1464 -1551 -796 2190 1225 -1993 332 2528 -318 -1628 959 1959 -729 -1413 1617 1746
2119A746l114L97L082j435k960K330J988k613j525K582R83k831o53L125o1l199
$$ 1746 -1368 -971 2111 676 -2284 46 2034 -579 -2104 478 1461 -1370 -2023 1102 1041 -2158
2135b158J239K202j261k269J742K328k372j953L021P23k799l00K946l41k725Q73
$$ -2158 -919 1283 22 -2247 -505 1823 -549 -2502 519 1242 -1557 -1857 1089 748 -1977 -1104
2151a104K899j797k004J762J824j642j944K440J118k466m89K837J58l257Q72K746
$$ -1104 1795 -2 -2006 -244 1580 -62 -2006 434 1552 -914 -1403 1434 1592 -1665 -793 1953
2167A953j383k339J884K041k082j861K804P92k429l11K695l28k625N20K599p92
$$ 1953 570 -1769 115 2156 74 -1787 1017 1809 -620 -931 1764 1436 -1189 -669 1930 1138
2183A138k787J748K214k188j940K694J264l214k89K819j24k895N36L021j225k905
$$ 1138 -1649 99 2313 125 -1815 879 2143 -1071 -1360 1459 1335 -1560 -1024 1997 772 -2133
2199b133K078K237k624j607K756J164l024p00L256j08l507J163K760j607k478
$$ -2133 -55 2182 -442 -2049 707 1871 -1153 -1853 1403 1295 -2212 -1049 1711 104 -2374
2214b374K026J988k129j943K941J092l286o2L033m78k794J006K880j587k592J991
$$ -2374 -348 1640 -489 -2432 509 1601 -1685 -1747 1286 808 -1986 -980 1900 313 -2279 -288
2230b88K283k679j335K995L70k620l0K915n83k725Q81L002j907k197K340K012
$$ -288 1995 -684 -2019 976 1346 -1274 -1304 1611 1028 -1697 -816 2186 279 -1918 422 2434
2246B434k947j444L041Q10k936N9L156j074k409J128K542j892k383K727J403k510
$$ 2434 -513 -1957 1084 1894 -1042 -983 2173 1099 -1310 -182 2360 468 -1915 812 2215 -295
2262b95j206K750M03k819J1L001q35k841J828J809j797j614J934J262k257j036
$$ -295 -1501 1249 1652 -1167 -1156 1845 1010 -1831 -3 1806 9 -1605 329 1591 -666 -1702
2278a702K765L7k628M94K169l89k778J292K203j707j757K273J000k136q72K463
$$ -1702 1063 1100 -1528 -1034 1135 746 -2032 -740 1463 -244 -2001 272 1272 -864 -1736 727
2294G27L3k277L72K281n38k465J520J712j485j790J889J425k230n76K343N8k037
$$ 727 760 -1517 -1145 1136 598 -1867 -347 1365 -120 -1910 -21 1404 -826 -1402 941 999 -1038
2311a038MK217m55j894P00K017j033k004K016J131j757j057J921O79k233P1K154
$$ -1038 -1034 1183 728 -1166 -466 1551 518 -1486 530 1661 -96 -1153 768 1447 -786 -715 1439
2328A439m27k138J066J616j171j324J279J660k292o42J986N26k427J9K240n85
$$ 1439 1012 -1126 -60 1556 385 -939 340 2000 -292 -934 1052 1578 -849 -830 1410 825
2344H25k101J038J804j589j300J321J436j990r74K247N57k444K6K032j37k173
$$ 825 -1276 -238 1566 -23 -1323 -2 1434 -556 -1530 717 1274 -1170 -1144 888 751 -1422
2360a422N68K133j135j998J688J386j979q23J939M35j907j14K072l11k151Q47
$$ -1422 -854 1279 144 -1854 -166 1220 -759 -1582 357 792 -1115 -1229 843 532 -1619 -772
2376g72J924j121j647J616J191j465j168J914P01k389M81J961m60j921Q64J554
$$ -772 1152 31 -1616 0 1191 -274 -1442 472 1173 -1216 -735 1226 766 -1155 -291 1263
2392A263p91j714J634J027j705o78J887O08k066n21K381m88j705Q40J566j074
$$ 1263 472 -1242 392 1419 -286 -964 923 1531 -535 -1056 1325 837 -868 -28 1538 464
2408D64j525J481J082j547p31J720R7j888M4J934k32k030O79J533r44j543J587
$$ 464 -1061 420 1502 -45 -776 944 1041 -847 -803 1131 899 -1131 -452 1081 137 -1406 181
2425A81Q56j575p06J508N18j797j70J947l91j714P50J630j137j444J364Q77j682
$$ 181 1037 -538 -1244 264 782 -1015 -1185 762 371 -1343 -593 1037 -100 -1544 -180 697 -985
2442i85k33J529M80j895K21J371j51j667N98J599j058j112J121J057j097q86J246
$$ -985 -1218 311 791 -1104 -883 488 337 -1330 -732 867 -191 -1303 -182 875 -222 -1108 138
2459A38Q20j736L7J709l70j322M39J234l33j422R82J254j326j102J370R58j577
$$ 138 958 -778 -741 968 598 -724 -285 949 616 -806 176 1430 104 -998 372 1330 -247
2476b47m00J674K4j768L78J744o62j585J146J031j112r69J263P23j577m54J615
$$ -247 -647 1027 1051 -717 -339 1405 743 -842 304 1335 223 -746 517 1240 -337 -791 824
2493H24L23j859J2J772p08j409O33J444j077j232J617M36j488o55J717K33j508
$$ 824 1147 -712 -700 1072 364 -1045 -412 1032 -45 -1277 340 776 -712 -1367 350 583 -925
2510i25J34J586l62j854R37J424j083j351J623O21j353q29J807M89j834k05J847
$$ -925 -791 795 433 -1421 -484 940 -143 -1494 129 750 -603 -1432 375 864 -970 -1175 672
2527F72l38j742J178J163r47j303J345J174j860l64J777K90j982Q2K342r39j503
$$ 672 334 -1408 -230 933 -14 -1317 28 1202 -658 -1022 755 1045 -937 -855 1487 548 -955
2544i55P93J524j105j232J507Q19j634m90J651M32j713j37K071n38j895Q74J358
$$ -955 -162 1362 257 -975 532 1351 -283 -773 878 1310 -403 -540 1531 993 -902 -28 1330
2561A330j057j191J383Q29j559p00K071k2j981J57J908o61j693Q42J438j195j267
$$ 1330 273 -918 465 1294 -265 -965 1106 1084 -897 -740 1168 507 -1186 -344 1094 -101 -1368
2578a368J400J069j919m33J776J03j771L59J503l58k004P79J663j098j311J683
$$ -1368 32 1101 -818 -1251 525 628 -1143 -784 719 361 -1643 -864 799 -299 -1610 73
2594G3O46j316o24J735N64k215J81J892o56j517P61J659j443r28J213J123j919
$$ 73 719 -597 -1221 514 1078 -1137 -956 936 280 -1237 -476 1183 -260 -1188 25 1148 -771
2611g71m33J797L00j516k00J801l12j616O09J628q66j379J217J192j735n49J799
$$ -771 -1204 593 893 -623 -823 978 666 -950 -341 1287 421 -958 259 1451 -284 -833 966
2628I66J95j922J27J980m88j797R10J644j268j386J420J204j840n42J645M7j798
$$ 966 1161 -761 -634 1346 858 -939 -29 1615 347 -1039 381 1585 -255 -797 848 895 -903
2645i03R3K051o11j659R72J368j421j140J242J157j571r71K162qj873l8K149r73
$$ -903 -810 1241 630 -1029 -57 1311 -110 -1250 -8 1149 -422 -1393 769 761 -1112 -1150 999 26
2663B6j290P06J638j431j141J448R92j816j89J498K34j931J49K069j63k245J038
$$ 26 -1264 -558 1080 -351 -1492 -44 948 -868 -1057 441 675 -1256 -1107 962 799 -1446 -408
2680d08J377j144j057J595R82j981k74J800K56k231K87K193p72j704P75J400o95
$$ -408 969 -175 -1232 363 1345 -636 -910 890 1146 -1085 -798 1395 623 -1081 -306 1094 399
2697C99j386J329R40j701m53K182p5j883K85J499m25j568Q89J410j423j137J631
$$ 399 -987 342 1282 -419 -872 1310 1235 -648 -363 1136 711 -857 32 1442 19 -1118 513
2714E13P28j682o53J821J23j999N33J771m95k111J118J455j142r46J257R04j836
$$ 513 1241 -441 -1094 727 850 -1149 -616 1155 660 -1451 -333 1122 -20 -966 291 1195 -641
2731f41q65K236j64k104P77J896j013j579J155J355j128j357J736O26j771j42
$$ -641 -1506 730 566 -1538 -761 1135 122 -1457 -302 1053 -75 -1432 304 930 -841 -983
2747i83J507N7j729J82J864n90j768J281J292j322j220J675R73j930k25J819J93
$$ -983 524 581 -1148 -966 898 308 -1460 -179 1113 -209 -1429 246 1219 -711 -936 883 1076
2764A076k317Q47J648o54j539J198J230j340j077J420R64k098k71K005j27j835
$$ 1076 -1241 -394 1254 600 -939 259 1489 149 -928 492 1456 -642 -913 1092 965 -870
2780h70O62J729r24j495J181J157j431j031J343P69j662m35J914Q0k077L59J791
$$ -870 -208 1521 597 -898 283 1440 9 -1022 321 1090 -572 -1007 907 987 -1090 -731 1060
2797A060n60j654J191J111j569p88J486N46j593l28J602o0j531N64J443q86j179
$$ 1060 500 -1154 37 1148 -421 -1209 277 823 -770 -1098 504 444 -1087 -523 920 34 -1145
2814a145R56R30j079j005J676M48j675m66J803K17j825N97J569r64j299J119J090
$$ -1145 -189 741 -338 -1343 333 781 -894 -1360 443 660 -1165 -568 1001 37 -1262 -143 947
2831I47j073j087J622Q61j857l61J673j73j426N25J475o57j403P82J291j213o50
$$ 947 -126 -1213 409 1270 -587 -948 725 552 -874 -349 1126 469 -934 -152 1139 -74 -724
2848g24J414L71j285m35J592j06j594M63J616q15j067P82P35q22r65J404N27j395
$$ -724 690 1061 -224 -659 933 827 -767 -304 1312 497 -570 212 947 125 -840 564 1091 -304
2866c04l92J489kj528L27J270n58j321P89J099j265o82J363N54j493l31J505j68
$$ -304 -696 793 791 -737 -410 860 302 -1019 -230 869 -396 -1078 285 839 -654 -985 520 352
2884C52j323n9J877o17j361P91J113j263p74J203R57j413n22J629j43j313J10
$$ 352 -971 -1030 847 230 -1131 -340 773 -490 -1264 -61 896 -517 -1039 590 447 -866 -756
2901g56J677p07j117N79J109j028o35J073P31j254n57J626j8j448L66J220l82
$$ -756 921 214 -903 -324 785 -243 -878 195 926 -328 -885 741 723 -725 -359 861 479
2918D79j263P75J188j145q40J395M25j262k11J297Q3j324RJ387k80j533P56J315
$$ 479 -784 -9 1179 34 -806 589 1014 -248 -459 838 921 -403 -394 993 713 -820 -64 1251
2936A251j209q83J244N93j184n13J501Rj753O58J076o38j160J058P00r06o99J101
$$ 1251 42 -841 403 996 -188 -701 800 809 -944 -286 790 152 -1008 50 750 -156 -855 246
2954B46O45j408l76J473j5j533L55J251n87j127O54J068r46o78P16Q60j110k83
$$ 246 891 -517 -893 580 565 -968 -613 638 51 -1076 -422 646 -300 -978 -262 598 -512 -795
2972g95J072M3j014l7J387m98j029P93P23j047m41J072M41q54n46J322o3j038
$$ -795 277 320 -694 -731 656 158 -871 -78 645 -402 -843 229 670 -184 -730 592 529 -509
2990e09J06J198m53j153O61J210j385l08R91M41p83m14P80K89p78l18J558m87
$$ -509 -403 795 342 -811 -150 1060 -325 -633 358 799 16 -398 382 671 -107 -425 1133 646
3008F46j509R28Q11n28j000R65O35j000n67J128n8r23r3J272k59j275N67J090
$$ 646 -863 65 876 348 -652 313 948 -52 -619 509 451 -472 -565 707 448 -827 -260 830
3026H30o32q92R42M45r06o87J274J33j315L56R10k73r37L77R82p32q30Q28N18
$$ 830 198 -694 248 693 -213 -900 374 507 -808 -452 458 185 -752 -375 607 -125 -955 -127 391
3045C91p85n59J307J37j189j28J466m61j245K54J450n24r45P88Q89j049p28J181
$$ 391 -394 -953 354 491 -698 -826 640 179 -1066 -812 638 114 -831 -43 846 -203 -931 250
3063B50M27j162r9J361N0j528N84R18n57j154J333O77j255l35J016Q9j002o9J444
$$ 250 677 -485 -584 777 827 -701 -117 801 244 -910 423 1100 -155 -490 526 615 -387 -456 988
3082I88m45j210N93J210j000r14Q26Q59j051o88J365L12j543J53J205l42j130
$$ 988 543 -667 -74 1136 136 -778 48 907 -144 -832 533 845 -698 -545 660 318 -812
3099h12O38J200r40q70Q71O43j382j20J132J63j139M6J295l84j557Q36J151p85
$$ -812 -174 1026 86 -784 87 730 -652 -772 360 523 -616 -570 725 341 -1216 -380 771 -14
3117a4r40J029N14j259j44J163N3j128J67R35j27j116L50J169l61j197R35N77
$$ -14 -954 75 589 -670 -814 349 402 -726 -559 376 249 -867 -517 652 291 -906 29 606
3135F06q47m89R12M76j346K33J394o56r69P25Q01o03o99O50P80j118m42J184q2
$$ 606 -241 -730 182 658 -688 -455 939 283 -686 39 840 237 -462 188 968 -150 -592 592 510
3154E10r49R9J126k18r71L27J248q94q32P84O81j135n00J203J90r68l44J393m58
$$ 510 -439 -340 786 568 -403 -76 1172 278 -554 230 911 -224 -724 479 669 -299 -643 750 292
3173B92j044L48J234n73j041Q45N39q41p18J334L01j235o2J253m70j141O50Q73
$$ 292 -752 -404 830 257 -784 61 600 -241 -959 375 676 -559 -621 632 162 -979 -329 544
3191E44o86q30J045N45o18j020J064K64j020M6J200j71j140K56J245n48j098R55
$$ 544 -142 -972 73 618 0 -1020 44 308 -712 -666 534 363 -777 -521 724 176 -922 33
3209C3Q67j026m58R48L77j188k35J371j65j142L90J044m38j139J047P90j060p85
$$ 33 900 -126 -584 364 741 -447 -682 689 524 -618 -228 816 378 -761 286 1076 16 -769
3227g69J291L60j302j39J390j80j531P90J135r61r09J024Q96j496n6R86M06j466
$$ -769 522 882 -420 -559 831 651 -880 -90 1045 84 -825 199 1095 -401 -457 529 935 -531
3245e31L8J225m60r33N02R22o57j087J008P22j157m45J321N7j164K34J168p28
$$ -531 -493 732 272 -661 -159 763 106 -981 27 749 -408 -853 468 525 -639 -405 763 35
3263C5j219P57R02p06o62J058K93o85m75J086J47j211J02J272k86j421P76R47
$$ 35 -1184 -427 475 -231 -893 165 458 -227 -702 384 531 -680 -578 694 408 -1013 -237 710
3281G10o34r36J064N68j165k63J089K53j099NR29j94r88L78J028m44j070J143
$$ 710 76 -860 204 772 -393 -656 433 686 -413 -408 521 327 -661 -283 745 301 -769 374
3299C74N57r80l80Q71J96o62j12P93j59q02J94R24p92n86J068J95p88m51P98L80
$$ 374 931 -49 -429 442 638 -24 -136 657 498 -304 -110 814 22 -564 504 699 -89 -540 258 638
3319F38j163K30R02n34p10L77P23l50r89P98R49j040n57J108J3r11n3R55j66j171
$$ 638 -525 -295 607 73 -637 -260 463 113 -876 -78 871 -169 -726 382 395 -516 -569 386 220 -951
3339i51L48Q17k95o36M19R51q17n97R26L26j110NJ087j26j207K39J330q08n66
$$ -951 -603 214 -81 -717 -298 653 -164 -761 165 491 -619 -614 473 347 -860 -621 709 -99 -665
3358f65P34N39o83q36J491L18j227j44J093j64j016K81R61m22q21Q14P40r57m86
$$ -665 69 608 -75 -911 580 898 -329 -473 620 456 -560 -279 682 260 -561 253 993 36 -450
3377d50P64N53j071k47J117j5j414N52R05n94r25J089M64r59l85J114J38j308
$$ -450 314 867 -204 -451 666 651 -763 -211 694 100 -825 264 728 -231 -616 498 636 -672
3395f72L27J012l98r92L80J043n55p06M48Q80q72r07J304J12j058jJ038l77q66
$$ -672 -345 667 269 -723 -343 700 145 -561 -113 767 -105 -1012 292 404 -654 -655 383 6 -860
3414h60N60R35p20p34Q58M43q04l78J144P2j148P0J199o66o76M81J023q92p36
$$ -860 -300 635 -85 -819 39 482 -322 -700 444 516 -632 -562 637 -29 -705 -224 799 -93 -829
3433h29R16N98q38l65J056J29j151J50J120m84r05O62N37n40m15N10O37r50n01
$$ -829 87 685 -153 -518 538 667 -484 -334 786 302 -603 59 596 56 -359 151 788 -162 -663
3452f63J102J91q83LR11l50p66P22N53m39q86N48N03p64k75J084%q03L8N24m0
$$ -663 439 630 -253 -250 661 311 -455 267 820 381 -505 43 546 -218 -493 591 591 -212 -174 350 310
3473C10r72K93O35j92n34L59O50p84l79P81K53q94q1J114j30p36k02R07k96q65
$$ 310 -662 -369 266 74 -460 -101 549 -235 -614 167 420 -474 -555 559 429 -307 -509 398 102 -763
3493g63N27O69q79m98R82K72q21q7Q30n2p08K2J048n31j040R79N36n73l92M45
$$ -763 -236 433 -446 -944 38 310 -511 -598 232 180 -528 -506 542 11 -1029 -50 486 -87 -479 -34
3513c4M70p41m29J106K2q77M44O20l39p87L84J093p87o16R16K93j069j1J122P1
$$ -34 436 -305 -734 372 394 -483 -39 581 242 -545 -161 932 145 -471 445 738 -331 -342 780 851
3533H51j285K63Q24l58q17O44O48p77m12R18J64j005q7J144l43r28R9J199o51
$$ 851 -434 -171 653 295 -522 122 770 -7 -419 499 663 -342 -429 715 372 -556 -457 742 91
3552I1q35R16O18q05o23P70N45j288R3R11k06j122N33J040p18j007R17O35q07
$$ 91 -744 172 790 -15 -638 132 677 -611 -518 393 187 -935 -402 638 -80 -1087 -170 465 -342
3571c42m85J013J26q66k0J120r4j396L88J173n49o51K01R18o70k70P85K93j043
$$ -342 -827 186 312 -554 -574 546 452 -944 -556 617 68 -583 -382 536 -134 -404 381 674 -369
3590c69m3J053k48j055N61O60n24m63N53N94o60m66P99K94r54K59M60M9p81M00
$$ -369 -412 641 393 -662 -101 559 35 -428 125 719 59 -407 392 686 -268 -9 451 500 -281 119
3610A19N23o11n31K19Q85o27o34J007J35p98k26R79J04j105L28O65o7j015N34
$$ 119 642 31 -500 -281 604 -23 -657 350 485 -313 -539 440 544 -561 -233 432 365 -650 -116
3629a16P21r52j09N40L38p37k83Q99j23p91K55O65l69m72K15P62p19o17P68M88
$$ -116 605 -347 -456 84 422 -315 -598 301 178 -613 -358 307 -62 -534 -319 443 -276 -893 -125 363
3649C63o64k03R35m3r66Q8P74l17o12L20N40l9o01O51K48r13q3Q75K49r46R3R07
$$ 363 -301 -504 431 388 -578 -490 284 -33 -645 -325 215 176 -425 226 474 -439 -522 353 602 -344 -251 656
3671F56l03o94L53Q14n74q19J024L62p85n23J085R0j143J17J059m84p06M21R93
$$ 656 353 -341 12 826 252 -567 457 819 34 -489 596 686 -457 -340 719 235 -471 -50 943
3690I43q43n76Q58J57j042M1J151m43q22J69Q67n7r27K40Q14o01n74P42K54o57
$$ 943 100 -476 382 539 -503 -462 689 246 -576 -407 460 403 -524 -284 530 -71 -645 97 351 -306
3710c06k56J168m48q93L05Q66o72m29N42M13n03p81J250P5p94n5J063m45j140
$$ -306 -562 606 158 -735 -430 436 -236 -665 -123 290 -213 -994 256 331 -463 -518 545 100 -1040
3729a040O25Q58l67q38Q39N43q06l63Q70J67o15k67Q08j44q38O34P83o67p19P01
$$ -1040 -415 443 76 -762 77 620 -186 -549 321 488 -127 -394 414 270 -568 66 849 182 -537 164
3749A64K19n17l68R40K46q40k07J072m42o44L40N68k31o76N44K96o84r3N54L95
$$ 164 383 -134 -502 438 684 -156 -363 709 267 -377 -37 531 300 -376 168 464 -220 -313 241 636
3769F36q14k06Q84j82o95L47L01j80o41N11L49l66l13L32N23r46j3O16K98p59
$$ 636 -178 -384 500 318 -377 -30 271 91 -550 -39 310 -56 -369 -37 486 -460 -473 143 441 -318
3789c18K03O69n49l63Q3M66l52n17N37N15o51k44Q29j79m70M6O58l33o82O46N35
$$ -318 -115 554 5 -358 -275 191 -161 -678 -141 374 -277 -521 308 129 -341 -295 363 30 -652 -6 529
3810E29n90m91N80L09l48m51J083l58q64M58P19j39q88K41R00m22n83N26L94n36
$$ 529 -61 -552 28 337 -11 -462 621 263 -601 -143 576 437 -451 -210 690 268 -315 211 605 69
3830F9n35Q19L76r08l93J058J08j047M93M51m27n02N20M52o61k23P91r9q32J72
$$ 69 -466 353 729 -179 -572 486 594 -453 40 491 64 -438 82 534 -127 -350 441 342 -490 -318
3850c18O08l7p56L59O01o52o31Q58N56r41n62J357k91q55N43O80m54o35K20R01
$$ -318 290 253 -503 -144 457 -195 -826 32 588 -353 -915 442 151 -704 -161 519 65 -570 -350 551
3870E51o67m88N73L76p77j84Q92J2p13J44O12j74p24M71O63p70l27Q40J06o53
$$ 551 -116 -604 -31 345 -432 -616 276 288 -425 -281 331 157 -567 -96 567 -203 -530 310 416 -237
3890b37R3N38P5q43L32M92j33o68M77N17o46m00N97M87p24k61P59j4n53O3N10
$$ -237 -144 394 469 -374 -42 450 317 -351 126 643 -3 -403 194 681 -43 -304 455 441 -112 -49 461
3911D61k04m73K92M52m05n01M19M65m57m00N28K63p49j53R35l82p68L33Q39m61
$$ 461 257 -216 76 528 123 -378 41 506 49 -351 177 440 -309 -462 473 91 -677 -344 495 34
3931C4p96O95L37n72j55N51q9l45M3N81j00q59K03O00k39l84L48M79n54m3N18
$$ 34 -762 -67 270 -302 -457 94 5 -340 -297 284 184 -675 -472 128 -111 -495 -147 332 -222 -265 253
3952B53k22k71j19O26j25o62L10P37o12l37N14K61o20l56P53L77o72j72R67k01
$$ 253 31 -240 -359 267 142 -520 -210 527 -85 -422 92 353 -267 -623 130 507 -165 -337 630 429
3972D29p55L06M57k54p51P27L22n58n63J053L0l71n50R10j17p53K12R22m43q19
$$ 429 -326 -20 437 183 -568 159 481 -77 -640 413 443 72 -478 432 315 -438 -226 696 253 -566
3992e66N07N79o72k53P50K07q28k16Q35l30m60P9R80p52n41O91L68n18n72R03
$$ -566 -59 520 -152 -405 345 552 -276 -492 343 13 -447 -368 612 -140 -681 10 378 -140 -712 191
4012A91j25p12J68Q91l89o01N75L72m20n15O73J11m77l36R05K1o80k20Q73m15
$$ 191 66 -646 -478 413 24 -577 -2 370 -50 -565 108 219 -258 -594 311 332 -348 -568 305 -110
4032a10n48N50O54o03n31Q90J52n65p01J143k95m16L07N47p9o68L28L25n44k82
$$ -110 -658 -108 546 -57 -588 302 454 -111 -812 331 36 -380 -73 474 395 -273 55 380 -164 -446
4052d46O49J63m21j26R60l63p41L13L90j89m60L36M40o41j98N68J74p78K5O91
$$ -446 203 366 -55 -181 779 416 -325 -12 378 189 -271 65 505 -136 -334 234 408 -370 -345 346
4072C46J23m48l35N21n0n53J55P12m31n80P86K34p34l45Q09j71k88qM80j39n54
$$ 346 469 21 -314 207 157 -396 -241 471 40 -540 246 480 -254 -599 210 39 -249 -257 223 84 -470
4093d70K04O71n24m35M38J44j21l94P14P7o01j64O69K5o57L27K67k34l73N88L92
$$ -470 -266 405 -119 -554 -116 28 -93 -487 227 304 -297 -461 208 233 -424 -97 170 -64 -437 151 543
4114E43m12n05N61L44q25n2N76K10p01R0N14k54l59O51J52l36m74L40N36n54l34
$$ 543 131 -374 187 531 -294 -346 230 440 -261 -171 343 89 -270 381 533 197 -277 63 599 45 -289
4135b89O85n4o58K34N63k81n97M69O88p63m59P51K96j021K01P19l86m79o8O73
$$ -289 396 342 -316 -82 481 200 -397 72 760 -3 -462 289 585 -436 -235 484 98 -381 -449 224
4155B24l35n10Q42J35m84n48P50Pm17j37Q83m37n75N90K32n37l26P25L18q78J7
$$ 224 -111 -621 221 356 -128 -676 74 81 -336 -473 410 -27 -602 -12 220 -317 -643 82 400 -478 -461
4176d61O71J82q60N8N07j63k91J55O58m23m36N96L42o10n94R06K99o37qL59O3
$$ -461 210 392 -468 -410 97 -66 -357 -202 456 33 -403 193 535 -75 -669 237 536 -101 -109 250 313
4197C13o50N49K79j33o62M00L47o09k14P37N0o53P0N87j47l56J93K6k39k29O01
$$ 313 -337 212 491 358 -304 96 443 -166 -380 357 407 -246 -176 411 264 -92 101 127 -112 -341 260
4218B60M18q19j63M44k04l94K50O49l31m64M09K76j06k82J09P5l78j37P13j88
$$ 260 678 -141 -304 140 -64 -458 -208 441 110 -354 55 331 225 -57 52 127 -251 -388 325 137
4238A37m74K33K73j20l91O3L59q3j60K09K20m22m50O39L40p10K33L91k55o74N74
$$ 137 -337 -104 169 49 -342 -279 80 -3 -163 46 266 -156 -606 33 373 -337 -104 287 32 -642 -68
4259f8N15n05l19N96o9m79J80L86M06p44m7Q51n18m33R1P94m38m28M69L22l73
$$ -68 447 -58 -377 219 150 -329 -149 237 643 -101 -148 703 185 -248 -157 637 199 -229 240 562 189
4280A89m07M88J69n15k0L61j14l88n0O93k40n31M94K77m77k91L80K27n60K71M26
$$ 189 -218 270 439 -76 -96 265 151 -237 -287 406 166 -365 129 406 -71 -362 18 245 -315 -44 382
4301C82M7p72J69N50k45o30L91L29l08l20O20n9l60k29N26J74q46M17L78k27o82
$$ 382 429 -343 -174 376 131 -499 -108 221 -87 -407 213 154 -206 -435 91 265 -581 -164 214 -13 -695
4322f95P27J11l64l48N18N30p89q9Q93m90l46N9N24k80k79M52K38n12j12N00N6
$$ -695 32 143 -221 -569 -51 479 -310 -399 494 4 -342 -283 241 -39 -318 134 372 -140 -252 248 304
4343C04m21p9Q04n38l96N75J83l37l00L92O3j81l24K52L18o42rP38k72k73K46
$$ 304 -117 -196 608 70 -326 249 432 95 -205 187 250 69 -255 -3 315 -327 -336 402 130 -143 103
4364A03K35k43m73L66M02o28k06N48L64o11o7L31j76r3L8L12k43n33N55K62n16
$$ 103 338 95 -378 -12 390 -238 -444 104 468 -143 -210 121 -55 -148 -110 202 -41 -574 -19 243 -273
4385b73k45N39J77k53j97J46J85l45P0N06k73k10P4K75l74k40L65L74p15J56K84
$$ -273 -518 21 198 -55 -252 -106 79 -266 -196 310 37 -173 -99 176 -198 -438 -73 301 -414 -258 26
4406B6K6m46M15K71k6m97K98N61n25k89J60K50n95K31J58L06n66q3N27Q4o04K34
$$ 26 52 -394 21 292 266 -231 67 628 103 -186 -26 224 -371 -140 18 324 -242 -325 202 286 -318 -84
4428h4M13k28l30K85L86o07J26K72L17p56O2N45k18n71K60N18l85l30M78J19k68
$$ -84 329 101 -229 56 442 -165 -39 233 550 -206 -144 401 183 -388 -128 390 5 -325 153 272 4
4449Dn01N78J45p11J70N60J63p26K25K61k45k15M36P8n58M4M37j68l91J9P15k46
$$ 4 -497 81 226 -485 -315 245 408 -318 -93 168 -77 -292 144 222 -336 -292 145 -23 -414 -395 320 74
4471G4m87M46M21o09l37N21R5l41n15Q81%l13M9O02l61m91L14L95l66j19J43J81
$$ 74 -413 33 454 -155 -492 29 124 -217 -732 149 149 -164 -115 487 126 -365 -51 344 -22 -141 2 183
4493A83o44K57L51M12r41K74M96m63j09R4L70l10n7J79L14n13j17Q79o8r55J56
$$ 183 -461 -204 147 559 -382 -108 388 -75 -184 -90 280 -30 -87 92 406 -107 -224 655 587 -368 -212
4514b12M76l43j95M38J46j27m55L52L42o62j34O99k40k73J88N10n32l87O7O13
$$ -212 264 -79 -274 164 310 183 -272 80 422 -240 -374 325 85 -188 0 510 -22 -409 -342 271
4534B71l81l33O14J73o94L2L45j21p5o3N98k84m13k03N60r6j92K63L8j55l63L46
$$ 271 -110 -443 171 344 -350 -318 27 -94 -169 -232 366 82 -331 -534 26 -70 -262 1 39 -116 -479 -133
4556a33K70j51l05P38l71k71M64n7J4l41K07K21k65j19M41m2n86NQ01o1p11J17
$$ -133 137 -14 -319 419 48 -223 241 184 198 -143 64 285 20 -99 342 300 -286 -281 520 459 -252 -135
4578a35M38l34m25M83M47n23j69O65k72j46k02N56j66n70M63J88l38k43M34K74
$$ -135 303 -31 -456 27 474 -49 -218 447 175 29 -173 383 217 -353 110 298 -40 -283 151 425
4598D25n45mM35K35q19j66N25j37l66L87K44l42j82K47L89o30q0N21k5m17m6P45
$$ 425 -120 -124 311 546 -273 -439 86 -51 -417 -30 214 -128 -310 -63 326 -304 -384 137 112 -305 -351 394
4620C94l74m33J02N44r4m87M22J09n00j41P59R6o21k21P89k56l73K99M50n82k68
$$ 394 20 -413 -311 233 139 -348 74 183 -317 -458 301 397 -224 -445 344 88 -285 14 464 -118 -386
4641c86O28K84q01R6N86j40m35oN59m00j82L16M83n21k62K47L19k48k98M54on65
$$ -386 242 526 -275 -179 407 267 -168 -174 385 -15 -197 119 602 81 -181 66 385 137 -161 293 287 -278
4663b78N7Q53n19k25L56j01k46j35J88M05n16p7M70j00l90k26O82m8o21K61K61
$$ -278 -221 632 113 -112 244 143 -103 -238 -50 355 -161 -238 232 132 -258 -484 198 150 -471 -210 51
4684E1l7l71N32J29o51k2M57q0n01M79K49q6n37J88L49j07l26M59j06l52k8L77
$$ 51 14 -357 175 304 -347 -369 88 8 -493 -14 235 149 -388 -200 149 42 -284 175 69 -283 -311 66
4706F6R9l60qJ39J78m70L24K99j49k59K20J28l92J31K91P0n06K04K89k67k07K34
$$ 66 165 -195 -203 -64 114 -356 -32 267 118 -141 79 207 -185 -54 237 307 -199 5 294 27 -180 54
4728E4J12j09l02J95K71k67j31K86K79m89n2M36r8k03Q6MQ1l06K10K05m08k26
$$ 54 166 57 -245 -50 221 -46 -177 109 388 -101 -153 283 185 -18 68 72 153 -153 57 262 -146 -372
4750c72N24K05m54j10K63k9m03K79J51l6l60K62N3k01j29O23k47l07%M95j0o79
$$ -372 152 357 -97 -207 56 27 -376 -97 54 18 -342 -80 -27 -228 -357 266 19 -288 -288 207 197 -482
4772d82K83K78q3l40K00L99o00j04N74o5k58n1N10n7m60K23M21m61m7J61K88l77
$$ -482 -199 79 -4 -344 -144 255 -345 -449 125 60 -198 -249 261 204 -256 -33 388 -73 -120 41 329 -48
4794d8k99O98j26k32J80j6j41k95L73N2k22k0L48K26o55J9L23J86n21J50M67m41
$$ -48 -347 351 225 -7 173 157 16 -279 94 146 -76 -96 252 478 -177 -158 165 351 -170 -20 447 6
4816Fj7Q2J47k50j20M23o9j7l46R7J25m84K41M86k87l47K49L88l40l38L71P6n00
$$ 6 -11 71 218 -32 -152 271 202 185 -161 -64 61 -423 -182 304 17 -330 -81 307 -33 -371 0 76 -424
4839d24K60K09K67o92L13L54l08m39K71L49k21l74L61K94m61j12J41K25o4j30
$$ -424 -164 45 312 -380 -67 287 -21 -460 -189 160 -61 -435 -74 220 -241 -353 -212 13 -51 -181
4859a81J13l0m0K2J69k9k73K29K9j00N4J38J04m43K24M57j94k97j62N75j95l50
$$ -181 -68 -98 -138 -116 53 24 -249 -20 9 -91 -37 101 205 -238 -14 443 249 -48 -210 365 170 -180
4881a80L61J50j59l28P0N55m23j74M85j44l96k2K55n0l15K81M07n24O0J89K96
$$ -180 181 331 172 -156 -86 469 46 -128 357 213 -183 -205 50 0 -315 -34 373 -151 -91 98 394
4902C94n99q1N75j57k78m4N83m14M1q3K08j76l19M03P9l42j37L05K41n90K86M29
$$ 394 -205 -286 289 132 -146 -190 393 -21 20 -63 145 -31 -350 53 132 -210 -347 -42 199 -391 -105 324
4924C24j66n59L60J20j87j26J89K57m62J31K96O4n68M18J5j9m69M04K81j81j81
$$ 324 158 -401 -41 79 -108 -234 -45 212 -250 -119 177 241 -327 91 106 87 -382 22 303 122 -59
4945e9K09j22l07P7K91M2j46j70O31l30j64K95J9l17K22k6K89k88k01M79j85k81
$$ -59 150 28 -279 -202 89 131 -15 -185 446 116 -48 247 266 -51 171 145 434 146 -55 424 239 -42
4967d2J25J64l88k30K88M38l26q7K9J58l23O5J42M42p44K79n0m0k78L24K99n00
$$ -42 83 247 -141 -371 -83 355 29 -58 -29 129 -194 -129 13 455 -289 -10 -60 -100 -378 -54 245 -255
4989b55J30R8j00m0p5L88k58k5N5K92j70j41J81R2k18n26O75R9j86l25M69k16
$$ -255 -125 -27 -127 -167 -242 146 -112 -137 -82 210 40 -101 80 172 -46 -572 103 202 16 -309 160 -56
$$ [...]
8191h9
##END NTUPLES=NMR FID
##END=
